nmaven-commits

This forum is an archive for the mailing list nmaven-commits@incubator.apache.org (more options) Messages posted here will be sent to this mailing list.
123456 ... 28
Topics (964)
Replies Last Post Views
[continuum] BUILD SUCCESSFUL: NMaven - Apache NMaven: maven-dotnet-compiler - default maven2 buildDefinition by Continuum@vmbuild.ap...
0
by Continuum@vmbuild.ap...
[continuum] BUILD SUCCESSFUL: NMaven - Apache NMaven: maven-dotnet-assembler - default maven2 buildDefinition by Continuum@vmbuild.ap...
0
by Continuum@vmbuild.ap...
[continuum] BUILD SUCCESSFUL: NMaven - Apache NMaven: maven-archetype-dotnet-windows-control - default maven2 buildDefinition by Continuum@vmbuild.ap...
0
by Continuum@vmbuild.ap...
[continuum] BUILD SUCCESSFUL: NMaven - Apache NMaven: maven-archetype-dotnet-windows-application - default maven2 buildDefinition by Continuum@vmbuild.ap...
0
by Continuum@vmbuild.ap...
[continuum] BUILD SUCCESSFUL: NMaven - Apache NMaven: maven-archetype-dotnet-console-application - default maven2 buildDefinition by Continuum@vmbuild.ap...
0
by Continuum@vmbuild.ap...
[continuum] BUILD SUCCESSFUL: NMaven - Apache NMaven: maven-archetype-dotnet-class-library - default maven2 buildDefinition by Continuum@vmbuild.ap...
0
by Continuum@vmbuild.ap...
[continuum] BUILD SUCCESSFUL: NMaven - Apache NMaven: dotnet-archetypes - default maven2 buildDefinition by Continuum@vmbuild.ap...
0
by Continuum@vmbuild.ap...
[continuum] BUILD SUCCESSFUL: NMaven - Apache NMaven: core-integration-tests - default maven2 buildDefinition by Continuum@vmbuild.ap...
0
by Continuum@vmbuild.ap...
[continuum] BUILD ERROR: NMaven - Apache NMaven: maven-dotnet-wix-plugin - default maven2 buildDefinition by Continuum@vmbuild.ap...
0
by Continuum@vmbuild.ap...
[continuum] BUILD ERROR: NMaven - Apache NMaven: maven-dotnet-toolchain - default maven2 buildDefinition by Continuum@vmbuild.ap...
0
by Continuum@vmbuild.ap...
[continuum] BUILD ERROR: NMaven - Apache NMaven: maven-dotnet-test-plugin - default maven2 buildDefinition by Continuum@vmbuild.ap...
0
by Continuum@vmbuild.ap...
[continuum] BUILD ERROR: NMaven - Apache NMaven: maven-dotnet-plugins - default maven2 buildDefinition by Continuum@vmbuild.ap...
0
by Continuum@vmbuild.ap...
[continuum] BUILD ERROR: NMaven - Apache NMaven: maven-dotnet-plugin-api - default maven2 buildDefinition by Continuum@vmbuild.ap...
0
by Continuum@vmbuild.ap...
[continuum] BUILD ERROR: NMaven - Apache NMaven: maven-dotnet-parent - default maven2 buildDefinition by Continuum@vmbuild.ap...
0
by Continuum@vmbuild.ap...
[continuum] BUILD ERROR: NMaven - Apache NMaven: maven-dotnet-extensions - default maven2 buildDefinition by Continuum@vmbuild.ap...
0
by Continuum@vmbuild.ap...
[continuum] BUILD ERROR: NMaven - Apache NMaven: maven-dotnet-core-it-runner - default maven2 buildDefinition by Continuum@vmbuild.ap...
0
by Continuum@vmbuild.ap...
[continuum] BUILD ERROR: NMaven - Apache NMaven: maven-dotnet-core - default maven2 buildDefinition by Continuum@vmbuild.ap...
0
by Continuum@vmbuild.ap...
[continuum] BUILD ERROR: NMaven - Apache NMaven: maven-dotnet-components - default maven2 buildDefinition by Continuum@vmbuild.ap...
0
by Continuum@vmbuild.ap...
[continuum] BUILD ERROR: NMaven - Apache NMaven: maven-dotnet-compiler-plugin - default maven2 buildDefinition by Continuum@vmbuild.ap...
0
by Continuum@vmbuild.ap...
[continuum] BUILD ERROR: NMaven - Apache NMaven: maven-dotnet-compiler - default maven2 buildDefinition by Continuum@vmbuild.ap...
0
by Continuum@vmbuild.ap...
[continuum] BUILD ERROR: NMaven - Apache NMaven: maven-dotnet-assembler - default maven2 buildDefinition by Continuum@vmbuild.ap...
0
by Continuum@vmbuild.ap...
[continuum] BUILD ERROR: NMaven - Apache NMaven: maven-archetype-dotnet-windows-control - default maven2 buildDefinition by Continuum@vmbuild.ap...
0
by Continuum@vmbuild.ap...
[continuum] BUILD ERROR: NMaven - Apache NMaven: maven-archetype-dotnet-windows-application - default maven2 buildDefinition by Continuum@vmbuild.ap...
0
by Continuum@vmbuild.ap...
[continuum] BUILD ERROR: NMaven - Apache NMaven: maven-archetype-dotnet-console-application - default maven2 buildDefinition by Continuum@vmbuild.ap...
0
by Continuum@vmbuild.ap...
[continuum] BUILD ERROR: NMaven - Apache NMaven: maven-archetype-dotnet-class-library - default maven2 buildDefinition by Continuum@vmbuild.ap...
0
by Continuum@vmbuild.ap...
[continuum] BUILD ERROR: NMaven - Apache NMaven: dotnet-archetypes - default maven2 buildDefinition by Continuum@vmbuild.ap...
0
by Continuum@vmbuild.ap...
[continuum] BUILD ERROR: NMaven - Apache NMaven: core-integration-tests - default maven2 buildDefinition by Continuum@vmbuild.ap...
0
by Continuum@vmbuild.ap...
[continuum] BUILD FAILURE: NMaven - Apache NMaven: maven-dotnet-core-it-runner - default maven2 buildDefinition by Continuum@vmbuild.ap...
0
by Continuum@vmbuild.ap...
[continuum] BUILD SUCCESSFUL: NMaven - Apache NMaven: core-integration-tests - default maven2 buildDefinition by Continuum@vmbuild.ap...
0
by Continuum@vmbuild.ap...
[continuum] BUILD ERROR: NMaven - Apache NMaven: core-integration-tests - default maven2 buildDefinition by Continuum@vmbuild.ap...
0
by Continuum@vmbuild.ap...
[continuum] BUILD FAILURE: NMaven - Apache NMaven: maven-dotnet-core-it-runner - default maven2 buildDefinition by Continuum@vmbuild.ap...
0
by Continuum@vmbuild.ap...
[continuum] BUILD FAILURE: NMaven - Apache NMaven: maven-dotnet-core-it-runner - default maven2 buildDefinition by Continuum@vmbuild.ap...
0
by Continuum@vmbuild.ap...
[continuum] BUILD FAILURE: NMaven - Apache NMaven: maven-dotnet-core-it-runner - default maven2 buildDefinition by Continuum@vmbuild.ap...
0
by Continuum@vmbuild.ap...
[continuum] BUILD FAILURE: NMaven - Apache NMaven: maven-dotnet-core-it-runner - default maven2 buildDefinition by Continuum@vmbuild.ap...
0
by Continuum@vmbuild.ap...
svn commit: r701338 - /incubator/nmaven/trunk/pom.xml by brettporter
0
by brettporter
123456 ... 28