nmaven-commits

This forum is an archive for the mailing list nmaven-commits@incubator.apache.org (more options) Messages posted here will be sent to this mailing list.
12345 ... 28
Topics (965)
Replies Last Post Views
[continuum] BUILD ERROR: NMaven - Apache NMaven: maven-dotnet-compiler-plugin - default maven2 buildDefinition by Continuum@vmbuild.ap...
0
by Continuum@vmbuild.ap...
[continuum] BUILD ERROR: NMaven - Apache NMaven: maven-dotnet-compiler - default maven2 buildDefinition by Continuum@vmbuild.ap...
0
by Continuum@vmbuild.ap...
[continuum] BUILD ERROR: NMaven - Apache NMaven: maven-dotnet-assembler - default maven2 buildDefinition by Continuum@vmbuild.ap...
0
by Continuum@vmbuild.ap...
[continuum] BUILD ERROR: NMaven - Apache NMaven: maven-archetype-dotnet-windows-control - default maven2 buildDefinition by Continuum@vmbuild.ap...
0
by Continuum@vmbuild.ap...
[continuum] BUILD ERROR: NMaven - Apache NMaven: maven-archetype-dotnet-windows-application - default maven2 buildDefinition by Continuum@vmbuild.ap...
0
by Continuum@vmbuild.ap...
[continuum] BUILD ERROR: NMaven - Apache NMaven: maven-archetype-dotnet-console-application - default maven2 buildDefinition by Continuum@vmbuild.ap...
0
by Continuum@vmbuild.ap...
[continuum] BUILD ERROR: NMaven - Apache NMaven: maven-archetype-dotnet-class-library - default maven2 buildDefinition by Continuum@vmbuild.ap...
0
by Continuum@vmbuild.ap...
[continuum] BUILD ERROR: NMaven - Apache NMaven: dotnet-archetypes - default maven2 buildDefinition by Continuum@vmbuild.ap...
0
by Continuum@vmbuild.ap...
[continuum] BUILD ERROR: NMaven - Apache NMaven: core-integration-tests - default maven2 buildDefinition by Continuum@vmbuild.ap...
0
by Continuum@vmbuild.ap...
svn commit: r714159 - /incubator/nmaven/trunk/site/general/src/site/apt/index.apt by sisbell
0
by sisbell
svn commit: r707339 - /incubator/nmaven/trunk/site/versioned/src/site/apt/user-guide/dependencies.apt by brettporter
0
by brettporter
svn commit: r707335 - in /incubator/nmaven/trunk/core-integration-tests/src/test/resources: MavenITmng-0007-CSharpCompileTestLibrary/ MavenITmng-0018-CSharpSynchronizeTargetWithSource/ MavenITmng-0019-BuildFailureOnNUnitFailure/ MavenITmng-0020-ShareTe... by brettporter
0
by brettporter
svn commit: r706015 - in /incubator/nmaven/trunk/site: src/site/site.xml versioned/src/site/site.xml by brettporter
0
by brettporter
svn commit: r706014 [1/2] - in /incubator/nmaven/www/0.16: ./ css/ developer-guide/ images/ images/logos/ installation-guide/ user-guide/ by brettporter
0
by brettporter
svn commit: r706014 [2/2] - in /incubator/nmaven/www/0.16: ./ css/ developer-guide/ images/ images/logos/ installation-guide/ user-guide/ by brettporter
0
by brettporter
svn commit: r706012 - in /incubator/nmaven/www: ./ css/ images/ images/logos/ by brettporter
0
by brettporter
svn commit: r706011 [2/2] - in /incubator/nmaven/www/0.16: ./ css/ developer-guide/ images/ images/logos/ installation-guide/ user-guide/ by brettporter
0
by brettporter
svn commit: r706011 [1/2] - in /incubator/nmaven/www/0.16: ./ css/ developer-guide/ images/ images/logos/ installation-guide/ user-guide/ by brettporter
0
by brettporter
svn commit: r706010 - /incubator/nmaven/trunk/site/versioned/pom.xml by brettporter
0
by brettporter
svn commit: r706009 - in /incubator/nmaven/www: ./ css/ images/ images/logos/ by brettporter
0
by brettporter
svn commit: r706008 - /incubator/nmaven/trunk/site/versioned/src/site/apt/installation-guide/building.apt by brettporter
0
by brettporter
svn commit: r706006 - in /incubator/nmaven/trunk/site: general/pom.xml general/src/site/apt/index.apt general/src/site/site.xml src/site/site.xml versioned/pom.xml by brettporter
0
by brettporter
[continuum] BUILD SUCCESSFUL: NMaven - Apache NMaven: maven-dotnet-core-it-runner - default maven2 buildDefinition by Continuum@vmbuild.ap...
0
by Continuum@vmbuild.ap...
[continuum] BUILD FAILURE: NMaven - Apache NMaven: maven-dotnet-core-it-runner - default maven2 buildDefinition by Continuum@vmbuild.ap...
0
by Continuum@vmbuild.ap...
[continuum] BUILD FAILURE: NMaven - Apache NMaven: maven-dotnet-core-it-runner - default maven2 buildDefinition by Continuum@vmbuild.ap...
0
by Continuum@vmbuild.ap...
[continuum] BUILD SUCCESSFUL: NMaven - Apache NMaven: maven-dotnet-wix-plugin - default maven2 buildDefinition by Continuum@vmbuild.ap...
0
by Continuum@vmbuild.ap...
[continuum] BUILD SUCCESSFUL: NMaven - Apache NMaven: maven-dotnet-toolchain - default maven2 buildDefinition by Continuum@vmbuild.ap...
0
by Continuum@vmbuild.ap...
[continuum] BUILD SUCCESSFUL: NMaven - Apache NMaven: maven-dotnet-test-plugin - default maven2 buildDefinition by Continuum@vmbuild.ap...
0
by Continuum@vmbuild.ap...
[continuum] BUILD SUCCESSFUL: NMaven - Apache NMaven: maven-dotnet-plugins - default maven2 buildDefinition by Continuum@vmbuild.ap...
0
by Continuum@vmbuild.ap...
[continuum] BUILD SUCCESSFUL: NMaven - Apache NMaven: maven-dotnet-plugin-api - default maven2 buildDefinition by Continuum@vmbuild.ap...
0
by Continuum@vmbuild.ap...
[continuum] BUILD SUCCESSFUL: NMaven - Apache NMaven: maven-dotnet-parent - default maven2 buildDefinition by Continuum@vmbuild.ap...
0
by Continuum@vmbuild.ap...
[continuum] BUILD SUCCESSFUL: NMaven - Apache NMaven: maven-dotnet-extensions - default maven2 buildDefinition by Continuum@vmbuild.ap...
0
by Continuum@vmbuild.ap...
[continuum] BUILD FAILURE: NMaven - Apache NMaven: maven-dotnet-core-it-runner - default maven2 buildDefinition by Continuum@vmbuild.ap...
0
by Continuum@vmbuild.ap...
[continuum] BUILD SUCCESSFUL: NMaven - Apache NMaven: maven-dotnet-core - default maven2 buildDefinition by Continuum@vmbuild.ap...
0
by Continuum@vmbuild.ap...
[continuum] BUILD SUCCESSFUL: NMaven - Apache NMaven: maven-dotnet-components - default maven2 buildDefinition by Continuum@vmbuild.ap...
0
by Continuum@vmbuild.ap...
12345 ... 28