Quantcast

Strange surefire error

classic Classic list List threaded Threaded
8 messages Options
Reply | Threaded
Open this post in threaded view
|  
Report Content as Inappropriate

Strange surefire error

Joacim J
Hello,

We have recently upgraded to a new version of IBM's message broker
(WMB) and its Toolkit. This upgrade also includes a new JVM:
################################
C:\v008789\Projects\ADT-I\.ws\WMB7Test\PlNnnnSampleDescriptionFlows>java
-version
java version "1.6.0"
Java(TM) SE Runtime Environment (build
pwi3260sr5ifix-20090824_02(SR5+IZ53892+IZ58949+IZ53194+IZ43801+IZ58796+IZ51441))
IBM J9 VM (build 2.4, J2RE 1.6.0 IBM J9 2.4 Windows XP x86-32
jvmwi3260sr5ifx-20090821_41076 (JIT enabled, AOT enabled)
J9VM - 20090821_041076_lHdSMr
JIT  - r9_20090518_2017
GC   - 20090417_AA)
JCL  - 20090824_02
################################

When running tests we get errors
"org.apache.maven.surefire.booter.shade.org.codehaus.plexus.util.cli.CommandLineException:
Error while executing external command, process killed." when Maven
runs the command below.

If I however run the command directly it works.

Do you know where to look to find a solution to this?

Best Regards
Joacim


##################################################################
Cutted down trace (More complete trace below)
##################################################################
[INFO] Surefire report directory:
C:\v008789\Projects\ADT-I\.ws\WMB7Test\PlNnnnSampleDescriptionFlows\target\surefire-reports
Forking command line: cmd.exe /X /C ""C:\Program
Files\IBM\WMBT700\jdk\jre\bin\java" -jar
C:\DOCUME~1\v008789\LOCALS~1\Temp\surefirebooter2356740905539978999.jar
C:\DOCUME~1\v008789\LOCALS~1\Temp\surefire25851443
23184620103tmp C:\DOCUME~1\v008789\LOCALS~1\Temp\surefire4150186505744356578tmp"
killed.
[INFO] ------------------------------------------------------------------------
[ERROR] BUILD ERROR
[INFO] ------------------------------------------------------------------------
[INFO] Error while executing forked tests.; nested exception is
org.apache.maven.surefire.booter.shade.org.codehaus.plexus.util.cli.CommandLineException:
Error while executing external command, process killed.

[INFO] ------------------------------------------------------------------------
[DEBUG] Trace
org.apache.maven.lifecycle.LifecycleExecutionException: Error while
executing forked tests.; nested exception is
org.apache.maven.surefire.booter.shade.org.codehaus.plexus.util.cli.CommandLineException:
Error whi
le executing external command, process killed.
        at org.apache.maven.lifecycle.DefaultLifecycleExecutor.executeGoals(DefaultLifecycleExecutor.java:719)
        at org.apache.maven.lifecycle.DefaultLifecycleExecutor.executeGoalWithLifecycle(DefaultLifecycleExecutor.java:556)
        at org.apache.maven.lifecycle.DefaultLifecycleExecutor.executeGoal(DefaultLifecycleExecutor.java:535)
        at org.apache.maven.lifecycle.DefaultLifecycleExecutor.executeGoalAndHandleFailures(DefaultLifecycleExecutor.java:387)
        at org.apache.maven.lifecycle.DefaultLifecycleExecutor.executeTaskSegments(DefaultLifecycleExecutor.java:348)
        at org.apache.maven.lifecycle.DefaultLifecycleExecutor.execute(DefaultLifecycleExecutor.java:180)
        at org.apache.maven.DefaultMaven.doExecute(DefaultMaven.java:328)
        at org.apache.maven.DefaultMaven.execute(DefaultMaven.java:138)
        at org.apache.maven.cli.MavenCli.main(MavenCli.java:362)
        at org.apache.maven.cli.compat.CompatibleMain.main(CompatibleMain.java:60)
        at sun.reflect.NativeMethodAccessorImpl.invoke0(Native Method)
        at sun.reflect.NativeMethodAccessorImpl.invoke(NativeMethodAccessorImpl.java:39)
        at sun.reflect.DelegatingMethodAccessorImpl.invoke(DelegatingMethodAccessorImpl.java:37)
        at java.lang.reflect.Method.invoke(Method.java:599)
        at org.codehaus.classworlds.Launcher.launchEnhanced(Launcher.java:315)
        at org.codehaus.classworlds.Launcher.launch(Launcher.java:255)
        at org.codehaus.classworlds.Launcher.mainWithExitCode(Launcher.java:430)
        at org.codehaus.classworlds.Launcher.main(Launcher.java:375)
Caused by: org.apache.maven.plugin.MojoExecutionException: Error while
executing forked tests.; nested exception is
org.apache.maven.surefire.booter.shade.org.codehaus.plexus.util.cli.CommandLineException:
Error
while executing external command, process killed.
        at org.apache.maven.plugin.surefire.SurefirePlugin.execute(SurefirePlugin.java:541)
        at org.apache.maven.plugin.DefaultPluginManager.executeMojo(DefaultPluginManager.java:490)
        at org.apache.maven.lifecycle.DefaultLifecycleExecutor.executeGoals(DefaultLifecycleExecutor.java:694)
        ... 17 more
Caused by: org.apache.maven.surefire.booter.SurefireBooterForkException:
Error while executing forked tests.; nested exception is
org.apache.maven.surefire.booter.shade.org.codehaus.plexus.util.cli.CommandLineExc
eption: Error while executing external command, process killed.
        at org.apache.maven.surefire.booter.SurefireBooter.fork(SurefireBooter.java:677)
        at org.apache.maven.surefire.booter.SurefireBooter.forkSuites(SurefireBooter.java:479)
        at org.apache.maven.surefire.booter.SurefireBooter.runSuitesForkOnce(SurefireBooter.java:379)
        at org.apache.maven.surefire.booter.SurefireBooter.run(SurefireBooter.java:245)
        at org.apache.maven.plugin.surefire.SurefirePlugin.execute(SurefirePlugin.java:537)
        ... 19 more
Caused by: org.apache.maven.surefire.booter.shade.org.codehaus.plexus.util.cli.CommandLineException:
Error while executing external command, process killed.
        at org.apache.maven.surefire.booter.shade.org.codehaus.plexus.util.cli.CommandLineUtils.executeCommandLine(CommandLineUtils.java:198)
        at org.apache.maven.surefire.booter.shade.org.codehaus.plexus.util.cli.CommandLineUtils.executeCommandLine(CommandLineUtils.java:98)
        at org.apache.maven.surefire.booter.SurefireBooter.fork(SurefireBooter.java:673)
        ... 23 more
Caused by: java.lang.InterruptedException
        at java.lang.ProcessImpl.waitFor(Native Method)
        at org.apache.maven.surefire.booter.shade.org.codehaus.plexus.util.cli.CommandLineUtils.executeCommandLine(CommandLineUtils.java:146)
        ... 25 more





##################################################################
More complete trace
##################################################################
C:\v008789\Projects\ADT-I\.ws\WMB7Test\PlNnnnSampleDescriptionFlows>mvn
-X install
+ Error stacktraces are turned on.
Apache Maven 2.2.1 (r801777; 2009-08-06 21:16:01+0200)
Java version: 1.6.0
Java home: C:\Program Files\IBM\WMBT700\jdk\jre
Default locale: sv_SE, platform encoding: Cp1252
OS name: "windows xp" version: "5.1 build 2600 service pack 3" arch:
"x86" Family: "windows"
...
...
... <clip>
...
...
[DEBUG] Configuring mojo
'com.company.gim.maven.plugins:gim-maven-plugin:2.0.0-SNAPSHOT:test-check'
-->
[DEBUG]   (f) testClassesFolder =
C:\v008789\Projects\ADT-I\.ws\WMB7Test\PlNnnnSampleDescriptionFlows\target\test-classes
[DEBUG]   (f) testFolder =
C:\v008789\Projects\ADT-I\.ws\WMB7Test\PlNnnnSampleDescriptionFlows\target\test
[DEBUG] -- end configuration --
[INFO] [gim:test-check {execution: default-test-check}]
[DEBUG] com.company.parts.plnnnn:PlNnnnSampleDescriptionFlows:zip:1.0.0
(selected for null)
[DEBUG]   com.company.gim:PlCommonGlobalMsgset_1_1_6:zip:1.1.6:compile
(selected for compile)
[DEBUG]   com.company.gim:PlCommonGlobalMsgset_1_2_0:zip:1.2.0:compile
(selected for compile)
[DEBUG]   com.company.gim:GimWmbFlows:zip:1.0.2:compile (selected for compile)
[DEBUG]   com.company.gim:VIT_Framework:zip:1.1.1:compile (selected for compile)
[DEBUG]   com.company.gim:GimWmbJavaApi:zip:1.2.0:compile (selected for compile)
[DEBUG]   com.company.gim:GimTestFramework:jar:1.1.1:test (selected for test)
[DEBUG]     com.googlecode.wmqutil:wmq-util:jar:0.5:test (selected for test)
[DEBUG]       org.apache.geronimo.specs:geronimo-jms_1.1_spec:jar:1.1:test
(selected for test)
[DEBUG]       org.apache.geronimo.specs:geronimo-j2ee-connector_1.5_spec:jar:1.1.1:test
(selected for test)
[DEBUG]       org.apache.geronimo.specs:geronimo-jta_1.0.1B_spec:jar:1.1.1:test
(selected for test)
[DEBUG] While downloading mq:com.ibm.mq:6.0.2.0
  This artifact has been relocated to com.ibm.wmq:com.ibm.mq:6.0.2.0.


[DEBUG]       com.ibm.wmq:com.ibm.mq:jar:6.0.2.0:test (selected for test)
[DEBUG] While downloading mq:com.ibm.mqjms:6.0.2.0
  This artifact has been relocated to com.ibm.wmq:com.ibm.mqjms:6.0.2.0.


[DEBUG]       com.ibm.wmq:com.ibm.mqjms:jar:6.0.2.0:test (selected for test)
[DEBUG] While downloading mq:dhbcore:6.0.2.0
  This artifact has been relocated to com.ibm.wmq:dhbcore:6.0.2.0.


[DEBUG]       com.ibm.wmq:dhbcore:jar:6.0.2.0:test (selected for test)
[DEBUG]     junit:junit:jar:4.8.1:test (selected for test)
[DEBUG]     asm:asm:jar:3.1:test (selected for test)
[DEBUG]     asm:asm-util:jar:3.1:test (selected for test)
[DEBUG]       asm:asm-tree:jar:3.1:test (selected for test)
[DEBUG]     asm:asm-tree:jar:3.1:test (selected for test)
[DEBUG]     asm:asm-analysis:jar:3.1:test (selected for test)
[DEBUG]     com.ibm.xsdbeans:xsdbeans:jar:1.0.0:test (selected for test)
[DEBUG]     com.ibm.wmq:jms:jar:6.0.2.0:test (selected for test)
[DEBUG]     com.ibm.wmq:com.ibm.mq:jar:6.0.2.0:test (selected for test)
[DEBUG]     com.ibm.wmq:com.ibm.mqjms:jar:6.0.2.0:test (selected for test)
[DEBUG]     com.ibm.wmq:connector:jar:6.0.2.0:test (selected for test)
[DEBUG]     com.ibm.wmq:dhbcore:jar:6.0.2.0:test (selected for test)
[DEBUG]     javax.transaction:jta:jar:1.0.1B:test (selected for test)
[DEBUG]     xerces:xercesImpl:jar:2.6.2:test (selected for test)
[DEBUG]     xerces:xmlParserAPIs:jar:2.6.2:test (selected for test)
[DEBUG]     commons-httpclient:commons-httpclient:jar:3.0.1:test
(selected for test)
[DEBUG]       junit:junit:jar:3.8.1:test (removed - nearer found: 4.8.1)
[DEBUG]       commons-logging:commons-logging:jar:1.0.3:test (selected for test)
[DEBUG]       commons-codec:commons-codec:jar:1.2:test (selected for test)
[DEBUG]     commons-logging:commons-logging:jar:1.0.3:test (removed -
nearer found: 1.1)
[DEBUG]     commons-logging:commons-logging:jar:1.1:test (selected for test)
[DEBUG]       log4j:log4j:jar:1.2.12:test (selected for test)
[DEBUG]       logkit:logkit:jar:1.0.1:test (selected for test)
[DEBUG]       avalon-framework:avalon-framework:jar:4.1.3:test
(selected for test)
[DEBUG]       javax.servlet:servlet-api:jar:2.3:test (selected for test)
[DEBUG]     commons-codec:commons-codec:jar:1.2:test (removed - nearer
found: 1.3)
[DEBUG]     commons-codec:commons-codec:jar:1.3:test (selected for test)
[DEBUG]     org.dbunit:dbunit:jar:2.2:test (selected for test)
[DEBUG]       junit:junit:jar:3.8.2:test (removed - nearer found: 4.8.1)
[DEBUG]       junit-addons:junit-addons:jar:1.4:test (selected for test)
[DEBUG]         junit:junit:jar:3.8.1:test (removed - nearer found: 4.8.1)
[DEBUG]       poi:poi:jar:2.5.1-final-20040804:test (selected for test)
[DEBUG]       commons-collections:commons-collections:jar:3.1:test
(selected for test)
[DEBUG]       commons-lang:commons-lang:jar:2.1:test (selected for test)
[DEBUG]       commons-logging:commons-logging:jar:1.0.4:test (removed
- nearer found: 1.1)
[DEBUG]     org.apache.derby:derby:jar:10.2.1.6:test (selected for test)
[DEBUG]     org.apache.derby:derbyclient:jar:10.2.1.6:test (selected for test)
[DEBUG]     log4j:log4j:jar:1.2.12:test (removed - nearer found: 1.2.14)
[DEBUG]     log4j:log4j:jar:1.2.14:test (selected for test)
[DEBUG]     com.ibm.db2:db2java:jar:8.1.7:test (selected for test)
[DEBUG]     com.ibm.db2:db2jcc_license_cisuz:jar:8.1.7:test (selected for test)
[DEBUG]     com.ibm.db2:db2jcc:jar:8.1.7:test (selected for test)
[DEBUG]     com.ibm.db2:db2jcc_license_cu:jar:8.1.7:test (selected for test)
[DEBUG]     oracle:ojdbc14:jar:10.2.0.3.0:test (selected for test)
[DEBUG]     com.company.gim:wbiaorawrapper:jar:1.0.0:test (selected for test)
[DEBUG] Plugin dependencies for:

org.apache.maven.plugins:maven-surefire-plugin:2.4.3

are:

org.apache.maven:maven-plugin-api:jar:2.0.6:runtime
org.apache.maven.surefire:surefire-booter:jar:2.4.3:runtime
org.codehaus.plexus:plexus-utils:jar:1.5.1:runtime
org.apache.maven:maven-artifact:jar:2.0.6:runtime
org.apache.maven:maven-project:jar:2.0.6:runtime
org.apache.maven:maven-core:jar:2.0.6:runtime
org.apache.maven:maven-toolchain:jar:1.0:runtime


[DEBUG] org.apache.maven.plugins:maven-surefire-plugin:maven-plugin:2.4.3:runtime
(selected for runtime)
[DEBUG] Adding managed dependencies for unknown:maven-plugin-api
[DEBUG]   org.apache.maven:maven-model:jar:2.0.6
[DEBUG]   org.apache.maven:maven-project:jar:2.0.6
[DEBUG]   org.apache.maven.reporting:maven-reporting-api:jar:2.0.6
[DEBUG]   org.apache.maven:maven-repository-metadata:jar:2.0.6
[DEBUG]   org.apache.maven:maven-artifact:jar:2.0.6
[DEBUG]   org.apache.maven:maven-artifact-manager:jar:2.0.6
[DEBUG]   org.apache.maven:maven-artifact-test:jar:2.0.6
[DEBUG]   org.apache.maven:maven-settings:jar:2.0.6
[DEBUG]   org.apache.maven:maven-plugin-parameter-documenter:jar:2.0.6
[DEBUG]   org.apache.maven:maven-profile:jar:2.0.6
[DEBUG]   org.apache.maven:maven-plugin-registry:jar:2.0.6
[DEBUG]   org.apache.maven:maven-plugin-api:jar:2.0.6
[DEBUG]   org.apache.maven:maven-monitor:jar:2.0.6
[DEBUG]   org.codehaus.plexus:plexus-container-default:jar:1.0-alpha-9-stable-1
[DEBUG]   org.codehaus.plexus:plexus-utils:jar:1.4.1
[DEBUG]   org.apache.maven.wagon:wagon-provider-api:jar:1.0-beta-2
[DEBUG]   org.apache.maven.wagon:wagon-ssh:jar:1.0-beta-2
[DEBUG]   org.apache.maven.wagon:wagon-ssh-external:jar:1.0-beta-2
[DEBUG]   org.apache.maven.wagon:wagon-file:jar:1.0-beta-2
[DEBUG]   org.apache.maven.wagon:wagon-http-lightweight:jar:1.0-beta-2
[DEBUG]   easymock:easymock:jar:1.2_Java1.3:test
[DEBUG]   classworlds:classworlds:jar:1.1
[DEBUG]   org.apache.maven:maven-plugin-api:jar:2.0.6:runtime
(selected for runtime)
[DEBUG] Adding managed dependencies for unknown:surefire-booter
[DEBUG]   org.apache.maven.surefire:surefire-api:jar:2.4.3
[DEBUG]   org.apache.maven.surefire:surefire-booter:jar:2.4.3
[DEBUG]   org.codehaus.plexus:plexus-utils:jar:1.5.1
[DEBUG]   org.apache.maven.surefire:surefire-booter:jar:2.4.3:runtime
(selected for runtime)
[DEBUG] Adding managed dependencies for unknown:surefire-api
[DEBUG]   org.apache.maven.surefire:surefire-api:jar:2.4.3
[DEBUG]   org.apache.maven.surefire:surefire-booter:jar:2.4.3
[DEBUG]   org.codehaus.plexus:plexus-utils:jar:1.5.1
[DEBUG]     org.apache.maven.surefire:surefire-api:jar:2.4.3:runtime
(selected for runtime)
[DEBUG]   org.codehaus.plexus:plexus-utils:jar:1.5.1:runtime (selected
for runtime)
[DEBUG] Adding managed dependencies for unknown:maven-artifact
[DEBUG]   org.apache.maven:maven-model:jar:2.0.6
[DEBUG]   org.apache.maven:maven-project:jar:2.0.6
[DEBUG]   org.apache.maven.reporting:maven-reporting-api:jar:2.0.6
[DEBUG]   org.apache.maven:maven-repository-metadata:jar:2.0.6
[DEBUG]   org.apache.maven:maven-artifact:jar:2.0.6
[DEBUG]   org.apache.maven:maven-artifact-manager:jar:2.0.6
[DEBUG]   org.apache.maven:maven-artifact-test:jar:2.0.6
[DEBUG]   org.apache.maven:maven-settings:jar:2.0.6
[DEBUG]   org.apache.maven:maven-plugin-parameter-documenter:jar:2.0.6
[DEBUG]   org.apache.maven:maven-profile:jar:2.0.6
[DEBUG]   org.apache.maven:maven-plugin-registry:jar:2.0.6
[DEBUG]   org.apache.maven:maven-plugin-api:jar:2.0.6
[DEBUG]   org.apache.maven:maven-monitor:jar:2.0.6
[DEBUG]   org.codehaus.plexus:plexus-container-default:jar:1.0-alpha-9-stable-1
[DEBUG]   org.codehaus.plexus:plexus-utils:jar:1.4.1
[DEBUG]   org.apache.maven.wagon:wagon-provider-api:jar:1.0-beta-2
[DEBUG]   org.apache.maven.wagon:wagon-ssh:jar:1.0-beta-2
[DEBUG]   org.apache.maven.wagon:wagon-ssh-external:jar:1.0-beta-2
[DEBUG]   org.apache.maven.wagon:wagon-file:jar:1.0-beta-2
[DEBUG]   org.apache.maven.wagon:wagon-http-lightweight:jar:1.0-beta-2
[DEBUG]   easymock:easymock:jar:1.2_Java1.3:test
[DEBUG]   classworlds:classworlds:jar:1.1
[DEBUG]   org.apache.maven:maven-artifact:jar:2.0.6:runtime (selected
for runtime)
[DEBUG]     org.codehaus.plexus:plexus-utils:jar:1.4.1:runtime
(applying version: 1.5.1)
[DEBUG]   org.apache.maven:maven-project:jar:2.0.6:runtime (selected
for runtime)
[DEBUG] Adding managed dependencies for unknown:maven-settings
[DEBUG]   org.apache.maven:maven-model:jar:2.0.6
[DEBUG]   org.apache.maven:maven-project:jar:2.0.6
[DEBUG]   org.apache.maven.reporting:maven-reporting-api:jar:2.0.6
[DEBUG]   org.apache.maven:maven-repository-metadata:jar:2.0.6
[DEBUG]   org.apache.maven:maven-artifact:jar:2.0.6
[DEBUG]   org.apache.maven:maven-artifact-manager:jar:2.0.6
[DEBUG]   org.apache.maven:maven-artifact-test:jar:2.0.6
[DEBUG]   org.apache.maven:maven-settings:jar:2.0.6
[DEBUG]   org.apache.maven:maven-plugin-parameter-documenter:jar:2.0.6
[DEBUG]   org.apache.maven:maven-profile:jar:2.0.6
[DEBUG]   org.apache.maven:maven-plugin-registry:jar:2.0.6
[DEBUG]   org.apache.maven:maven-plugin-api:jar:2.0.6
[DEBUG]   org.apache.maven:maven-monitor:jar:2.0.6
[DEBUG]   org.codehaus.plexus:plexus-container-default:jar:1.0-alpha-9-stable-1
[DEBUG]   org.codehaus.plexus:plexus-utils:jar:1.4.1
[DEBUG]   org.apache.maven.wagon:wagon-provider-api:jar:1.0-beta-2
[DEBUG]   org.apache.maven.wagon:wagon-ssh:jar:1.0-beta-2
[DEBUG]   org.apache.maven.wagon:wagon-ssh-external:jar:1.0-beta-2
[DEBUG]   org.apache.maven.wagon:wagon-file:jar:1.0-beta-2
[DEBUG]   org.apache.maven.wagon:wagon-http-lightweight:jar:1.0-beta-2
[DEBUG]   easymock:easymock:jar:1.2_Java1.3:test
[DEBUG]   classworlds:classworlds:jar:1.1
[DEBUG]     org.apache.maven:maven-settings:jar:2.0.6:runtime
(selected for runtime)
[DEBUG] Adding managed dependencies for unknown:maven-model
[DEBUG]   org.apache.maven:maven-model:jar:2.0.6
[DEBUG]   org.apache.maven:maven-project:jar:2.0.6
[DEBUG]   org.apache.maven.reporting:maven-reporting-api:jar:2.0.6
[DEBUG]   org.apache.maven:maven-repository-metadata:jar:2.0.6
[DEBUG]   org.apache.maven:maven-artifact:jar:2.0.6
[DEBUG]   org.apache.maven:maven-artifact-manager:jar:2.0.6
[DEBUG]   org.apache.maven:maven-artifact-test:jar:2.0.6
[DEBUG]   org.apache.maven:maven-settings:jar:2.0.6
[DEBUG]   org.apache.maven:maven-plugin-parameter-documenter:jar:2.0.6
[DEBUG]   org.apache.maven:maven-profile:jar:2.0.6
[DEBUG]   org.apache.maven:maven-plugin-registry:jar:2.0.6
[DEBUG]   org.apache.maven:maven-plugin-api:jar:2.0.6
[DEBUG]   org.apache.maven:maven-monitor:jar:2.0.6
[DEBUG]   org.codehaus.plexus:plexus-container-default:jar:1.0-alpha-9-stable-1
[DEBUG]   org.codehaus.plexus:plexus-utils:jar:1.4.1
[DEBUG]   org.apache.maven.wagon:wagon-provider-api:jar:1.0-beta-2
[DEBUG]   org.apache.maven.wagon:wagon-ssh:jar:1.0-beta-2
[DEBUG]   org.apache.maven.wagon:wagon-ssh-external:jar:1.0-beta-2
[DEBUG]   org.apache.maven.wagon:wagon-file:jar:1.0-beta-2
[DEBUG]   org.apache.maven.wagon:wagon-http-lightweight:jar:1.0-beta-2
[DEBUG]   easymock:easymock:jar:1.2_Java1.3:test
[DEBUG]   classworlds:classworlds:jar:1.1
[DEBUG]       org.apache.maven:maven-model:jar:2.0.6:runtime (selected
for runtime)
[DEBUG]         org.codehaus.plexus:plexus-utils:jar:1.4.1:runtime
(applying version: 1.5.1)
[DEBUG]       org.codehaus.plexus:plexus-utils:jar:1.4.1:runtime
(applying version: 1.5.1)
[DEBUG]       org.codehaus.plexus:plexus-container-default:jar:1.0-alpha-9-stable-1:runtime
(selected for runtime)
[DEBUG]         junit:junit:jar:3.8.1:runtime (selected for runtime)
[DEBUG]         org.codehaus.plexus:plexus-utils:jar:1.0.4:runtime
(applying version: 1.5.1)
[DEBUG]         classworlds:classworlds:jar:1.1-alpha-2:runtime
(selected for runtime)
[DEBUG] Adding managed dependencies for unknown:maven-profile
[DEBUG]   org.apache.maven:maven-model:jar:2.0.6
[DEBUG]   org.apache.maven:maven-project:jar:2.0.6
[DEBUG]   org.apache.maven.reporting:maven-reporting-api:jar:2.0.6
[DEBUG]   org.apache.maven:maven-repository-metadata:jar:2.0.6
[DEBUG]   org.apache.maven:maven-artifact:jar:2.0.6
[DEBUG]   org.apache.maven:maven-artifact-manager:jar:2.0.6
[DEBUG]   org.apache.maven:maven-artifact-test:jar:2.0.6
[DEBUG]   org.apache.maven:maven-settings:jar:2.0.6
[DEBUG]   org.apache.maven:maven-plugin-parameter-documenter:jar:2.0.6
[DEBUG]   org.apache.maven:maven-profile:jar:2.0.6
[DEBUG]   org.apache.maven:maven-plugin-registry:jar:2.0.6
[DEBUG]   org.apache.maven:maven-plugin-api:jar:2.0.6
[DEBUG]   org.apache.maven:maven-monitor:jar:2.0.6
[DEBUG]   org.codehaus.plexus:plexus-container-default:jar:1.0-alpha-9-stable-1
[DEBUG]   org.codehaus.plexus:plexus-utils:jar:1.4.1
[DEBUG]   org.apache.maven.wagon:wagon-provider-api:jar:1.0-beta-2
[DEBUG]   org.apache.maven.wagon:wagon-ssh:jar:1.0-beta-2
[DEBUG]   org.apache.maven.wagon:wagon-ssh-external:jar:1.0-beta-2
[DEBUG]   org.apache.maven.wagon:wagon-file:jar:1.0-beta-2
[DEBUG]   org.apache.maven.wagon:wagon-http-lightweight:jar:1.0-beta-2
[DEBUG]   easymock:easymock:jar:1.2_Java1.3:test
[DEBUG]   classworlds:classworlds:jar:1.1
[DEBUG]     org.apache.maven:maven-profile:jar:2.0.6:runtime (selected
for runtime)
[DEBUG]       org.codehaus.plexus:plexus-utils:jar:1.4.1:runtime
(applying version: 1.5.1)
[DEBUG]     org.apache.maven:maven-model:jar:2.0.6:runtime (selected
for runtime)
[DEBUG]       org.codehaus.plexus:plexus-utils:jar:1.4.1:runtime
(applying version: 1.5.1)
[DEBUG] Adding managed dependencies for unknown:maven-artifact-manager
[DEBUG]   org.apache.maven:maven-model:jar:2.0.6
[DEBUG]   org.apache.maven:maven-project:jar:2.0.6
[DEBUG]   org.apache.maven.reporting:maven-reporting-api:jar:2.0.6
[DEBUG]   org.apache.maven:maven-repository-metadata:jar:2.0.6
[DEBUG]   org.apache.maven:maven-artifact:jar:2.0.6
[DEBUG]   org.apache.maven:maven-artifact-manager:jar:2.0.6
[DEBUG]   org.apache.maven:maven-artifact-test:jar:2.0.6
[DEBUG]   org.apache.maven:maven-settings:jar:2.0.6
[DEBUG]   org.apache.maven:maven-plugin-parameter-documenter:jar:2.0.6
[DEBUG]   org.apache.maven:maven-profile:jar:2.0.6
[DEBUG]   org.apache.maven:maven-plugin-registry:jar:2.0.6
[DEBUG]   org.apache.maven:maven-plugin-api:jar:2.0.6
[DEBUG]   org.apache.maven:maven-monitor:jar:2.0.6
[DEBUG]   org.codehaus.plexus:plexus-container-default:jar:1.0-alpha-9-stable-1
[DEBUG]   org.codehaus.plexus:plexus-utils:jar:1.4.1
[DEBUG]   org.apache.maven.wagon:wagon-provider-api:jar:1.0-beta-2
[DEBUG]   org.apache.maven.wagon:wagon-ssh:jar:1.0-beta-2
[DEBUG]   org.apache.maven.wagon:wagon-ssh-external:jar:1.0-beta-2
[DEBUG]   org.apache.maven.wagon:wagon-file:jar:1.0-beta-2
[DEBUG]   org.apache.maven.wagon:wagon-http-lightweight:jar:1.0-beta-2
[DEBUG]   easymock:easymock:jar:1.2_Java1.3:test
[DEBUG]   classworlds:classworlds:jar:1.1
[DEBUG]     org.apache.maven:maven-artifact-manager:jar:2.0.6:runtime
(selected for runtime)
[DEBUG] Adding managed dependencies for unknown:maven-repository-metadata
[DEBUG]   org.apache.maven:maven-model:jar:2.0.6
[DEBUG]   org.apache.maven:maven-project:jar:2.0.6
[DEBUG]   org.apache.maven.reporting:maven-reporting-api:jar:2.0.6
[DEBUG]   org.apache.maven:maven-repository-metadata:jar:2.0.6
[DEBUG]   org.apache.maven:maven-artifact:jar:2.0.6
[DEBUG]   org.apache.maven:maven-artifact-manager:jar:2.0.6
[DEBUG]   org.apache.maven:maven-artifact-test:jar:2.0.6
[DEBUG]   org.apache.maven:maven-settings:jar:2.0.6
[DEBUG]   org.apache.maven:maven-plugin-parameter-documenter:jar:2.0.6
[DEBUG]   org.apache.maven:maven-profile:jar:2.0.6
[DEBUG]   org.apache.maven:maven-plugin-registry:jar:2.0.6
[DEBUG]   org.apache.maven:maven-plugin-api:jar:2.0.6
[DEBUG]   org.apache.maven:maven-monitor:jar:2.0.6
[DEBUG]   org.codehaus.plexus:plexus-container-default:jar:1.0-alpha-9-stable-1
[DEBUG]   org.codehaus.plexus:plexus-utils:jar:1.4.1
[DEBUG]   org.apache.maven.wagon:wagon-provider-api:jar:1.0-beta-2
[DEBUG]   org.apache.maven.wagon:wagon-ssh:jar:1.0-beta-2
[DEBUG]   org.apache.maven.wagon:wagon-ssh-external:jar:1.0-beta-2
[DEBUG]   org.apache.maven.wagon:wagon-file:jar:1.0-beta-2
[DEBUG]   org.apache.maven.wagon:wagon-http-lightweight:jar:1.0-beta-2
[DEBUG]   easymock:easymock:jar:1.2_Java1.3:test
[DEBUG]   classworlds:classworlds:jar:1.1
[DEBUG]       org.apache.maven:maven-repository-metadata:jar:2.0.6:runtime
(selected for runtime)
[DEBUG]         org.codehaus.plexus:plexus-utils:jar:1.4.1:runtime
(applying version: 1.5.1)
[DEBUG]       org.codehaus.plexus:plexus-utils:jar:1.4.1:runtime
(applying version: 1.5.1)
[DEBUG]       org.apache.maven.wagon:wagon-provider-api:jar:1.0-beta-2:runtime
(selected for runtime)
[DEBUG]         org.codehaus.plexus:plexus-utils:jar:1.0.4:runtime
(applying version: 1.5.1)
[DEBUG] Adding managed dependencies for org.apache.maven:maven-plugin-registry
[DEBUG]   org.apache.maven:maven-model:jar:2.0.6
[DEBUG]   org.apache.maven:maven-project:jar:2.0.6
[DEBUG]   org.apache.maven.reporting:maven-reporting-api:jar:2.0.6
[DEBUG]   org.apache.maven:maven-repository-metadata:jar:2.0.6
[DEBUG]   org.apache.maven:maven-artifact:jar:2.0.6
[DEBUG]   org.apache.maven:maven-artifact-manager:jar:2.0.6
[DEBUG]   org.apache.maven:maven-artifact-test:jar:2.0.6
[DEBUG]   org.apache.maven:maven-settings:jar:2.0.6
[DEBUG]   org.apache.maven:maven-plugin-parameter-documenter:jar:2.0.6
[DEBUG]   org.apache.maven:maven-profile:jar:2.0.6
[DEBUG]   org.apache.maven:maven-plugin-registry:jar:2.0.6
[DEBUG]   org.apache.maven:maven-plugin-api:jar:2.0.6
[DEBUG]   org.apache.maven:maven-monitor:jar:2.0.6
[DEBUG]   org.codehaus.plexus:plexus-container-default:jar:1.0-alpha-9-stable-1
[DEBUG]   org.codehaus.plexus:plexus-utils:jar:1.4.1
[DEBUG]   org.apache.maven.wagon:wagon-provider-api:jar:1.0-beta-2
[DEBUG]   org.apache.maven.wagon:wagon-ssh:jar:1.0-beta-2
[DEBUG]   org.apache.maven.wagon:wagon-ssh-external:jar:1.0-beta-2
[DEBUG]   org.apache.maven.wagon:wagon-file:jar:1.0-beta-2
[DEBUG]   org.apache.maven.wagon:wagon-http-lightweight:jar:1.0-beta-2
[DEBUG]   easymock:easymock:jar:1.2_Java1.3:test
[DEBUG]   classworlds:classworlds:jar:1.1
[DEBUG]     org.apache.maven:maven-plugin-registry:jar:2.0.6:runtime
(selected for runtime)
[DEBUG]       org.codehaus.plexus:plexus-utils:jar:1.4.1:runtime
(applying version: 1.5.1)
[DEBUG]     org.codehaus.plexus:plexus-utils:jar:1.4.1:runtime
(applying version: 1.5.1)
[DEBUG]     org.codehaus.plexus:plexus-container-default:jar:1.0-alpha-9-stable-1:runtime
(selected for runtime)
[DEBUG]       junit:junit:jar:3.8.1:runtime (selected for runtime)
[DEBUG]       org.codehaus.plexus:plexus-utils:jar:1.0.4:runtime
(applying version: 1.5.1)
[DEBUG]       classworlds:classworlds:jar:1.1-alpha-2:runtime
(selected for runtime)
[DEBUG] Adding managed dependencies for unknown:maven-core
[DEBUG]   org.apache.maven:maven-model:jar:2.0.6
[DEBUG]   org.apache.maven:maven-project:jar:2.0.6
[DEBUG]   org.apache.maven.reporting:maven-reporting-api:jar:2.0.6
[DEBUG]   org.apache.maven:maven-repository-metadata:jar:2.0.6
[DEBUG]   org.apache.maven:maven-artifact:jar:2.0.6
[DEBUG]   org.apache.maven:maven-artifact-manager:jar:2.0.6
[DEBUG]   org.apache.maven:maven-artifact-test:jar:2.0.6
[DEBUG]   org.apache.maven:maven-settings:jar:2.0.6
[DEBUG]   org.apache.maven:maven-plugin-parameter-documenter:jar:2.0.6
[DEBUG]   org.apache.maven:maven-profile:jar:2.0.6
[DEBUG]   org.apache.maven:maven-plugin-registry:jar:2.0.6
[DEBUG]   org.apache.maven:maven-plugin-api:jar:2.0.6
[DEBUG]   org.apache.maven:maven-monitor:jar:2.0.6
[DEBUG]   org.codehaus.plexus:plexus-container-default:jar:1.0-alpha-9-stable-1
[DEBUG]   org.codehaus.plexus:plexus-utils:jar:1.4.1
[DEBUG]   org.apache.maven.wagon:wagon-provider-api:jar:1.0-beta-2
[DEBUG]   org.apache.maven.wagon:wagon-ssh:jar:1.0-beta-2
[DEBUG]   org.apache.maven.wagon:wagon-ssh-external:jar:1.0-beta-2
[DEBUG]   org.apache.maven.wagon:wagon-file:jar:1.0-beta-2
[DEBUG]   org.apache.maven.wagon:wagon-http-lightweight:jar:1.0-beta-2
[DEBUG]   easymock:easymock:jar:1.2_Java1.3:test
[DEBUG]   classworlds:classworlds:jar:1.1
[DEBUG]   org.apache.maven:maven-core:jar:2.0.6:runtime (selected for runtime)
[DEBUG]     org.apache.maven.wagon:wagon-file:jar:1.0-beta-2:runtime
(selected for runtime)
[DEBUG] Adding managed dependencies for
unknown:maven-plugin-parameter-documenter
[DEBUG]   org.apache.maven:maven-model:jar:2.0.6
[DEBUG]   org.apache.maven:maven-project:jar:2.0.6
[DEBUG]   org.apache.maven.reporting:maven-reporting-api:jar:2.0.6
[DEBUG]   org.apache.maven:maven-repository-metadata:jar:2.0.6
[DEBUG]   org.apache.maven:maven-artifact:jar:2.0.6
[DEBUG]   org.apache.maven:maven-artifact-manager:jar:2.0.6
[DEBUG]   org.apache.maven:maven-artifact-test:jar:2.0.6
[DEBUG]   org.apache.maven:maven-settings:jar:2.0.6
[DEBUG]   org.apache.maven:maven-plugin-parameter-documenter:jar:2.0.6
[DEBUG]   org.apache.maven:maven-profile:jar:2.0.6
[DEBUG]   org.apache.maven:maven-plugin-registry:jar:2.0.6
[DEBUG]   org.apache.maven:maven-plugin-api:jar:2.0.6
[DEBUG]   org.apache.maven:maven-monitor:jar:2.0.6
[DEBUG]   org.codehaus.plexus:plexus-container-default:jar:1.0-alpha-9-stable-1
[DEBUG]   org.codehaus.plexus:plexus-utils:jar:1.4.1
[DEBUG]   org.apache.maven.wagon:wagon-provider-api:jar:1.0-beta-2
[DEBUG]   org.apache.maven.wagon:wagon-ssh:jar:1.0-beta-2
[DEBUG]   org.apache.maven.wagon:wagon-ssh-external:jar:1.0-beta-2
[DEBUG]   org.apache.maven.wagon:wagon-file:jar:1.0-beta-2
[DEBUG]   org.apache.maven.wagon:wagon-http-lightweight:jar:1.0-beta-2
[DEBUG]   easymock:easymock:jar:1.2_Java1.3:test
[DEBUG]   classworlds:classworlds:jar:1.1
[DEBUG]     org.apache.maven:maven-plugin-parameter-documenter:jar:2.0.6:runtime
(selected for runtime)
[DEBUG]       org.codehaus.plexus:plexus-utils:jar:1.4.1:runtime
(applying version: 1.5.1)
[DEBUG]     org.apache.maven.wagon:wagon-http-lightweight:jar:1.0-beta-2:runtime
(selected for runtime)
[DEBUG]       org.apache.maven.wagon:wagon-http-shared:jar:1.0-beta-2:runtime
(selected for runtime)
[DEBUG]         jtidy:jtidy:jar:4aug2000r7-dev:runtime (selected for runtime)
[DEBUG]       xml-apis:xml-apis:jar:1.0.b2:runtime (selected for runtime)
[DEBUG]     org.apache.maven.reporting:maven-reporting-api:jar:2.0.6:runtime
(selected for runtime)
[DEBUG]       org.apache.maven.doxia:doxia-sink-api:jar:1.0-alpha-7:runtime
(selected for runtime)
[DEBUG]     org.apache.maven.wagon:wagon-provider-api:jar:1.0-beta-2:runtime
(selected for runtime)
[DEBUG]       org.codehaus.plexus:plexus-utils:jar:1.0.4:runtime
(applying version: 1.5.1)
[DEBUG]     org.apache.maven:maven-repository-metadata:jar:2.0.6:runtime
(selected for runtime)
[DEBUG]       org.codehaus.plexus:plexus-utils:jar:1.4.1:runtime
(applying version: 1.5.1)
[DEBUG] Adding managed dependencies for unknown:maven-error-diagnostics
[DEBUG]   org.apache.maven:maven-model:jar:2.0.6
[DEBUG]   org.apache.maven:maven-project:jar:2.0.6
[DEBUG]   org.apache.maven.reporting:maven-reporting-api:jar:2.0.6
[DEBUG]   org.apache.maven:maven-repository-metadata:jar:2.0.6
[DEBUG]   org.apache.maven:maven-artifact:jar:2.0.6
[DEBUG]   org.apache.maven:maven-artifact-manager:jar:2.0.6
[DEBUG]   org.apache.maven:maven-artifact-test:jar:2.0.6
[DEBUG]   org.apache.maven:maven-settings:jar:2.0.6
[DEBUG]   org.apache.maven:maven-plugin-parameter-documenter:jar:2.0.6
[DEBUG]   org.apache.maven:maven-profile:jar:2.0.6
[DEBUG]   org.apache.maven:maven-plugin-registry:jar:2.0.6
[DEBUG]   org.apache.maven:maven-plugin-api:jar:2.0.6
[DEBUG]   org.apache.maven:maven-monitor:jar:2.0.6
[DEBUG]   org.codehaus.plexus:plexus-container-default:jar:1.0-alpha-9-stable-1
[DEBUG]   org.codehaus.plexus:plexus-utils:jar:1.4.1
[DEBUG]   org.apache.maven.wagon:wagon-provider-api:jar:1.0-beta-2
[DEBUG]   org.apache.maven.wagon:wagon-ssh:jar:1.0-beta-2
[DEBUG]   org.apache.maven.wagon:wagon-ssh-external:jar:1.0-beta-2
[DEBUG]   org.apache.maven.wagon:wagon-file:jar:1.0-beta-2
[DEBUG]   org.apache.maven.wagon:wagon-http-lightweight:jar:1.0-beta-2
[DEBUG]   easymock:easymock:jar:1.2_Java1.3:test
[DEBUG]   classworlds:classworlds:jar:1.1
[DEBUG]     org.apache.maven:maven-error-diagnostics:jar:2.0.6:runtime
(selected for runtime)
[DEBUG]     commons-cli:commons-cli:jar:1.0:runtime (selected for runtime)
[DEBUG]     org.apache.maven.wagon:wagon-ssh-external:jar:1.0-beta-2:runtime
(selected for runtime)
[DEBUG]       org.codehaus.plexus:plexus-utils:jar:1.0.4:runtime
(applying version: 1.5.1)
[DEBUG]       org.apache.maven.wagon:wagon-ssh-common:jar:1.0-beta-2:runtime
(selected for runtime)
[DEBUG]         org.codehaus.plexus:plexus-utils:jar:1.0.4:runtime
(applying version: 1.5.1)
[DEBUG]
org.codehaus.plexus:plexus-interactivity-api:jar:1.0-alpha-4:runtime
(selected for runtime)
[DEBUG]
org.codehaus.plexus:plexus-container-default:jar:1.0-alpha-7:runtime
(removed - nearer found: 1.0-alpha-9-stable-1)
[DEBUG]           plexus:plexus-utils:jar:1.0.2:runtime (selected for runtime)
[DEBUG] Adding managed dependencies for unknown:maven-plugin-descriptor
[DEBUG]   org.apache.maven:maven-model:jar:2.0.6
[DEBUG]   org.apache.maven:maven-project:jar:2.0.6
[DEBUG]   org.apache.maven.reporting:maven-reporting-api:jar:2.0.6
[DEBUG]   org.apache.maven:maven-repository-metadata:jar:2.0.6
[DEBUG]   org.apache.maven:maven-artifact:jar:2.0.6
[DEBUG]   org.apache.maven:maven-artifact-manager:jar:2.0.6
[DEBUG]   org.apache.maven:maven-artifact-test:jar:2.0.6
[DEBUG]   org.apache.maven:maven-settings:jar:2.0.6
[DEBUG]   org.apache.maven:maven-plugin-parameter-documenter:jar:2.0.6
[DEBUG]   org.apache.maven:maven-profile:jar:2.0.6
[DEBUG]   org.apache.maven:maven-plugin-registry:jar:2.0.6
[DEBUG]   org.apache.maven:maven-plugin-api:jar:2.0.6
[DEBUG]   org.apache.maven:maven-monitor:jar:2.0.6
[DEBUG]   org.codehaus.plexus:plexus-container-default:jar:1.0-alpha-9-stable-1
[DEBUG]   org.codehaus.plexus:plexus-utils:jar:1.4.1
[DEBUG]   org.apache.maven.wagon:wagon-provider-api:jar:1.0-beta-2
[DEBUG]   org.apache.maven.wagon:wagon-ssh:jar:1.0-beta-2
[DEBUG]   org.apache.maven.wagon:wagon-ssh-external:jar:1.0-beta-2
[DEBUG]   org.apache.maven.wagon:wagon-file:jar:1.0-beta-2
[DEBUG]   org.apache.maven.wagon:wagon-http-lightweight:jar:1.0-beta-2
[DEBUG]   easymock:easymock:jar:1.2_Java1.3:test
[DEBUG]   classworlds:classworlds:jar:1.1
[DEBUG]     org.apache.maven:maven-plugin-descriptor:jar:2.0.6:runtime
(selected for runtime)
[DEBUG]     org.codehaus.plexus:plexus-interactivity-api:jar:1.0-alpha-4:runtime
(selected for runtime)
[DEBUG] Adding managed dependencies for unknown:maven-monitor
[DEBUG]   org.apache.maven:maven-model:jar:2.0.6
[DEBUG]   org.apache.maven:maven-project:jar:2.0.6
[DEBUG]   org.apache.maven.reporting:maven-reporting-api:jar:2.0.6
[DEBUG]   org.apache.maven:maven-repository-metadata:jar:2.0.6
[DEBUG]   org.apache.maven:maven-artifact:jar:2.0.6
[DEBUG]   org.apache.maven:maven-artifact-manager:jar:2.0.6
[DEBUG]   org.apache.maven:maven-artifact-test:jar:2.0.6
[DEBUG]   org.apache.maven:maven-settings:jar:2.0.6
[DEBUG]   org.apache.maven:maven-plugin-parameter-documenter:jar:2.0.6
[DEBUG]   org.apache.maven:maven-profile:jar:2.0.6
[DEBUG]   org.apache.maven:maven-plugin-registry:jar:2.0.6
[DEBUG]   org.apache.maven:maven-plugin-api:jar:2.0.6
[DEBUG]   org.apache.maven:maven-monitor:jar:2.0.6
[DEBUG]   org.codehaus.plexus:plexus-container-default:jar:1.0-alpha-9-stable-1
[DEBUG]   org.codehaus.plexus:plexus-utils:jar:1.4.1
[DEBUG]   org.apache.maven.wagon:wagon-provider-api:jar:1.0-beta-2
[DEBUG]   org.apache.maven.wagon:wagon-ssh:jar:1.0-beta-2
[DEBUG]   org.apache.maven.wagon:wagon-ssh-external:jar:1.0-beta-2
[DEBUG]   org.apache.maven.wagon:wagon-file:jar:1.0-beta-2
[DEBUG]   org.apache.maven.wagon:wagon-http-lightweight:jar:1.0-beta-2
[DEBUG]   easymock:easymock:jar:1.2_Java1.3:test
[DEBUG]   classworlds:classworlds:jar:1.1
[DEBUG]     org.apache.maven:maven-monitor:jar:2.0.6:runtime (selected
for runtime)
[DEBUG]     org.apache.maven.wagon:wagon-ssh:jar:1.0-beta-2:runtime
(selected for runtime)
[DEBUG]       com.jcraft:jsch:jar:0.1.27:runtime (selected for runtime)
[DEBUG]       org.codehaus.plexus:plexus-utils:jar:1.0.4:runtime
(applying version: 1.5.1)
[DEBUG]     org.codehaus.plexus:plexus-utils:jar:1.4.1:runtime
(applying version: 1.5.1)
[DEBUG]     classworlds:classworlds:jar:1.1-alpha-2:runtime (removed -
nearer found: 1.1)
[DEBUG]     classworlds:classworlds:jar:1.1:runtime (selected for runtime)
[DEBUG] Adding managed dependencies for unknown:maven-toolchain
[DEBUG]   org.apache.maven:maven-model:jar:2.0.6
[DEBUG]   org.apache.maven:maven-project:jar:2.0.6
[DEBUG]   org.apache.maven.reporting:maven-reporting-api:jar:2.0.6
[DEBUG]   org.apache.maven:maven-repository-metadata:jar:2.0.6
[DEBUG]   org.apache.maven:maven-artifact:jar:2.0.6
[DEBUG]   org.apache.maven:maven-artifact-manager:jar:2.0.6
[DEBUG]   org.apache.maven:maven-artifact-test:jar:2.0.6
[DEBUG]   org.apache.maven:maven-settings:jar:2.0.6
[DEBUG]   org.apache.maven:maven-plugin-parameter-documenter:jar:2.0.6
[DEBUG]   org.apache.maven:maven-profile:jar:2.0.6
[DEBUG]   org.apache.maven:maven-plugin-registry:jar:2.0.6
[DEBUG]   org.apache.maven:maven-plugin-api:jar:2.0.6
[DEBUG]   org.apache.maven:maven-monitor:jar:2.0.6
[DEBUG]   org.codehaus.plexus:plexus-container-default:jar:1.0-alpha-9-stable-1
[DEBUG]   org.codehaus.plexus:plexus-utils:jar:1.4.1
[DEBUG]   org.apache.maven.wagon:wagon-provider-api:jar:1.0-beta-2
[DEBUG]   org.apache.maven.wagon:wagon-ssh:jar:1.0-beta-2
[DEBUG]   org.apache.maven.wagon:wagon-ssh-external:jar:1.0-beta-2
[DEBUG]   org.apache.maven.wagon:wagon-file:jar:1.0-beta-2
[DEBUG]   org.apache.maven.wagon:wagon-http-lightweight:jar:1.0-beta-2
[DEBUG]   easymock:easymock:jar:1.2_Java1.3:test
[DEBUG]   classworlds:classworlds:jar:1.1
[DEBUG]   org.apache.maven:maven-toolchain:jar:1.0:runtime (selected
for runtime)
[DEBUG]  The following artifacts were filtered out for plugin:
org.apache.maven.plugins:maven-surefire-plugin:2.4.3 because they're
already in the core of Maven:

org.apache.maven:maven-plugin-api:jar:2.0.6:runtime
org.apache.maven:maven-artifact:jar:2.0.6:runtime
org.apache.maven:maven-project:jar:2.0.6:runtime
org.apache.maven:maven-core:jar:2.0.6:runtime
org.apache.maven:maven-toolchain:jar:1.0:runtime

These will use the artifact files already in the core ClassRealm
instead, to allow them to be included in
PluginDescriptor.getArtifacts().


[DEBUG] Configuring mojo
'org.apache.maven.plugins:maven-surefire-plugin:2.4.3:test' -->
[DEBUG]   (f) basedir =
C:\v008789\Projects\ADT-I\.ws\WMB7Test\PlNnnnSampleDescriptionFlows
[DEBUG]   (f) childDelegation = false
[DEBUG]   (f) classesDirectory =
C:\v008789\Projects\ADT-I\.ws\WMB7Test\PlNnnnSampleDescriptionFlows\target\classes
[DEBUG]   (f) classpathElements =
[C:\v008789\Projects\ADT-I\.ws\WMB7Test\PlNnnnSampleDescriptionFlows\target\test-classes,
C:\v008789\Projects\ADT-I\.ws\WMB7Test\PlNnnnSampleDescriptionFlows\target\classes,
c:\t
ools\.m2\repository\com\company\gim\GimTestFramework\1.1.1\GimTestFramework-1.1.1.jar,
c:\tools\.m2\repository\com\googlecode\wmqutil\wmq-util\0.5\wmq-util-0.5.jar,
c:\tools\.m2\repository\org\apache\geronimo\specs
\geronimo-jms_1.1_spec\1.1\geronimo-jms_1.1_spec-1.1.jar,
c:\tools\.m2\repository\org\apache\geronimo\specs\geronimo-j2ee-connector_1.5_spec\1.1.1\geronimo-j2ee-connector_1.5_spec-1.1.1.jar,
c:\tools\.m2\reposito
ry\org\apache\geronimo\specs\geronimo-jta_1.0.1B_spec\1.1.1\geronimo-jta_1.0.1B_spec-1.1.1.jar,
c:\tools\.m2\repository\com\ibm\wmq\com.ibm.mq\6.0.2.0\com.ibm.mq-6.0.2.0.jar,
c:\tools\.m2\repository\com\ibm\wmq\c
om.ibm.mqjms\6.0.2.0\com.ibm.mqjms-6.0.2.0.jar,
c:\tools\.m2\repository\com\ibm\wmq\dhbcore\6.0.2.0\dhbcore-6.0.2.0.jar,
c:\tools\.m2\repository\junit\junit\4.8.1\junit-4.8.1.jar,
c:\tools\.m2\repository\asm\asm\
3.1\asm-3.1.jar,
c:\tools\.m2\repository\asm\asm-util\3.1\asm-util-3.1.jar,
c:\tools\.m2\repository\asm\asm-tree\3.1\asm-tree-3.1.jar,
c:\tools\.m2\repository\asm\asm-analysis\3.1\asm-analysis-3.1.jar,
c:\tools\.
m2\repository\com\ibm\xsdbeans\xsdbeans\1.0.0\xsdbeans-1.0.0.jar,
c:\tools\.m2\repository\com\ibm\wmq\jms\6.0.2.0\jms-6.0.2.0.jar,
c:\tools\.m2\repository\com\ibm\wmq\connector\6.0.2.0\connector-6.0.2.0.jar,
c:\t
ools\.m2\repository\javax\transaction\jta\1.0.1B\jta-1.0.1B.jar,
c:\tools\.m2\repository\xerces\xercesImpl\2.6.2\xercesImpl-2.6.2.jar,
c:\tools\.m2\repository\xerces\xmlParserAPIs\2.6.2\xmlParserAPIs-2.6.2.jar,
c
:\tools\.m2\repository\commons-httpclient\commons-httpclient\3.0.1\commons-httpclient-3.0.1.jar,
c:\tools\.m2\repository\commons-logging\commons-logging\1.1\commons-logging-1.1.jar,
c:\tools\.m2\repository\common
s-codec\commons-codec\1.3\commons-codec-1.3.jar,
c:\tools\.m2\repository\log4j\log4j\1.2.14\log4j-1.2.14.jar,
c:\tools\.m2\repository\logkit\logkit\1.0.1\logkit-1.0.1.jar,
c:\tools\.m2\repository\avalon-framework
\avalon-framework\4.1.3\avalon-framework-4.1.3.jar,
c:\tools\.m2\repository\javax\servlet\servlet-api\2.3\servlet-api-2.3.jar,
c:\tools\.m2\repository\org\dbunit\dbunit\2.2\dbunit-2.2.jar,
c:\tools\.m2\repository
\junit-addons\junit-addons\1.4\junit-addons-1.4.jar,
c:\tools\.m2\repository\poi\poi\2.5.1-final-20040804\poi-2.5.1-final-20040804.jar,
c:\tools\.m2\repository\commons-collections\commons-collections\3.1\commons-
collections-3.1.jar,
c:\tools\.m2\repository\commons-lang\commons-lang\2.1\commons-lang-2.1.jar,
c:\tools\.m2\repository\org\apache\derby\derby\10.2.1.6\derby-10.2.1.6.jar,
c:\tools\.m2\repository\org\apache\derb
y\derbyclient\10.2.1.6\derbyclient-10.2.1.6.jar,
c:\tools\.m2\repository\com\ibm\db2\db2java\8.1.7\db2java-8.1.7.jar,
c:\tools\.m2\repository\com\ibm\db2\db2jcc_license_cisuz\8.1.7\db2jcc_license_cisuz-8.1.7.jar,
 c:\tools\.m2\repository\com\ibm\db2\db2jcc\8.1.7\db2jcc-8.1.7.jar,
c:\tools\.m2\repository\com\ibm\db2\db2jcc_license_cu\8.1.7\db2jcc_license_cu-8.1.7.jar,
c:\tools\.m2\repository\oracle\ojdbc14\10.2.0.3.0\ojdbc
14-10.2.0.3.0.jar,
c:\tools\.m2\repository\com\company\gim\wbiaorawrapper\1.0.0\wbiaorawrapper-1.0.0.jar]
[DEBUG]   (f) disableXmlReport = false
[DEBUG]   (f) enableAssertions = true
[DEBUG]   (f) forkMode = once
[DEBUG]   (f) junitArtifactName = junit:junit
[DEBUG]   (f) localRepository =
Repository[local|file://c:/tools/.m2/repository/
<file:///tools/.m2/repository/>]
[DEBUG]   (f) pluginArtifactMap =
{org.apache.maven.surefire:surefire-booter=org.apache.maven.surefire:surefire-booter:jar:2.4.3:runtime,
org.apache.maven.surefire:surefire-api=org.apache.maven.surefire:surefire-
api:jar:2.4.3:runtime,
org.codehaus.plexus:plexus-utils=org.codehaus.plexus:plexus-utils:jar:1.5.1:runtime,
org.apache.maven:maven-plugin-api=org.apache.maven:maven-plugin-api:jar:2.0.6:runtime,
org.apache.maven:
maven-artifact=org.apache.maven:maven-artifact:jar:2.0.6:runtime,
org.apache.maven:maven-project=org.apache.maven:maven-project:jar:2.0.6:runtime,
org.apache.maven:maven-core=org.apache.maven:maven-core:jar:2.0.6
:runtime, org.apache.maven:maven-toolchain=org.apache.maven:maven-toolchain:jar:1.0:runtime}
[DEBUG]   (f) printSummary = true
[DEBUG]   (f) project = MavenProject:
com.company.parts.plnnnn:PlNnnnSampleDescriptionFlows:1.0.0 @
C:\v008789\Projects\ADT-I\.ws\WMB7Test\PlNnnnSampleDescriptionFlows\pom.xml
[DEBUG]   (f) projectArtifactMap =
{com.company.gim:PlCommonGlobalMsgset_1_1_6=com.company.gim:PlCommonGlobalMsgset_1_1_6:zip:1.1.6:compile,
com.company.gim:PlCommonGlobalMsgset_1_2_0=com.company.gim:PlCommonGlobalMsgset
_1_2_0:zip:1.2.0:compile,
com.company.gim:GimWmbFlows=com.company.gim:GimWmbFlows:zip:1.0.2:compile,
com.company.gim:VIT_Framework=com.company.gim:VIT_Framework:zip:1.1.1:compile,
com.company.gim:GimWmbJavaApi=com.company.gi
m:GimWmbJavaApi:zip:1.2.0:compile,
com.company.gim:GimTestFramework=com.company.gim:GimTestFramework:jar:1.1.1:test,
com.googlecode.wmqutil:wmq-util=com.googlecode.wmqutil:wmq-util:jar:0.5:test,
org.apache.geronimo.s
pecs:geronimo-jms_1.1_spec=org.apache.geronimo.specs:geronimo-jms_1.1_spec:jar:1.1:test,
org.apache.geronimo.specs:geronimo-j2ee-connector_1.5_spec=org.apache.geronimo.specs:geronimo-j2ee-connector_1.5_spec:jar:1
.1.1:test, org.apache.geronimo.specs:geronimo-jta_1.0.1B_spec=org.apache.geronimo.specs:geronimo-jta_1.0.1B_spec:jar:1.1.1:test,
com.ibm.wmq:com.ibm.mq=com.ibm.wmq:com.ibm.mq:jar:6.0.2.0:test,
com.ibm.wmq:com.ibm
.mqjms=com.ibm.wmq:com.ibm.mqjms:jar:6.0.2.0:test,
com.ibm.wmq:dhbcore=com.ibm.wmq:dhbcore:jar:6.0.2.0:test,
junit:junit=junit:junit:jar:4.8.1:test, asm:asm=asm:asm:jar:3.1:test,
asm:asm-util=asm:asm-util:jar:3.1
:test, asm:asm-tree=asm:asm-tree:jar:3.1:test,
asm:asm-analysis=asm:asm-analysis:jar:3.1:test,
com.ibm.xsdbeans:xsdbeans=com.ibm.xsdbeans:xsdbeans:jar:1.0.0:test,
com.ibm.wmq:jms=com.ibm.wmq:jms:jar:6.0.2.0:test,
 com.ibm.wmq:connector=com.ibm.wmq:connector:jar:6.0.2.0:test,
javax.transaction:jta=javax.transaction:jta:jar:1.0.1B:test,
xerces:xercesImpl=xerces:xercesImpl:jar:2.6.2:test,
xerces:xmlParserAPIs=xerces:xmlParse
rAPIs:jar:2.6.2:test,
commons-httpclient:commons-httpclient=commons-httpclient:commons-httpclient:jar:3.0.1:test,
commons-logging:commons-logging=commons-logging:commons-logging:jar:1.1:test,
commons-codec:common
s-codec=commons-codec:commons-codec:jar:1.3:test,
log4j:log4j=log4j:log4j:jar:1.2.14:test,
logkit:logkit=logkit:logkit:jar:1.0.1:test,
avalon-framework:avalon-framework=avalon-framework:avalon-framework:jar:4.1.3
:test, javax.servlet:servlet-api=javax.servlet:servlet-api:jar:2.3:test,
org.dbunit:dbunit=org.dbunit:dbunit:jar:2.2:test,
junit-addons:junit-addons=junit-addons:junit-addons:jar:1.4:test,
poi:poi=poi:poi:jar:2.5
.1-final-20040804:test,
commons-collections:commons-collections=commons-collections:commons-collections:jar:3.1:test,
commons-lang:commons-lang=commons-lang:commons-lang:jar:2.1:test,
org.apache.derby:derby=org.a
pache.derby:derby:jar:10.2.1.6:test,
org.apache.derby:derbyclient=org.apache.derby:derbyclient:jar:10.2.1.6:test,
com.ibm.db2:db2java=com.ibm.db2:db2java:jar:8.1.7:test,
com.ibm.db2:db2jcc_license_cisuz=com.ibm.d
b2:db2jcc_license_cisuz:jar:8.1.7:test,
com.ibm.db2:db2jcc=com.ibm.db2:db2jcc:jar:8.1.7:test,
com.ibm.db2:db2jcc_license_cu=com.ibm.db2:db2jcc_license_cu:jar:8.1.7:test,
oracle:ojdbc14=oracle:ojdbc14:jar:10.2.0.3
.0:test, com.company.gim:wbiaorawrapper=com.company.gim:wbiaorawrapper:jar:1.0.0:test}
[DEBUG]   (f) redirectTestOutputToFile = false
[DEBUG]   (f) remoteRepositories =
[Repository[repository.maven2.it.company.net|http://maven2.it.company.net/repository],
Repository[snapshots.maven2.it.company.net|http://maven2.it.company.net/snapshots],
Repository[cen
tral|http://repo1.maven.org/maven2]]
[DEBUG]   (f) reportFormat = brief
[DEBUG]   (f) reportsDirectory =
C:\v008789\Projects\ADT-I\.ws\WMB7Test\PlNnnnSampleDescriptionFlows\target\surefire-reports
[DEBUG]   (f) session = org.apache.maven.execution.MavenSession@6f026f02
[DEBUG]   (f) skip = false
[DEBUG]   (f) systemProperties = {brokertest.xmlfile=target/test}
[DEBUG]   (f) test = com/company/gim/testframework/BrokerTest
[DEBUG]   (f) testClassesDirectory =
C:\v008789\Projects\ADT-I\.ws\WMB7Test\PlNnnnSampleDescriptionFlows\target\test-classes
[DEBUG]   (f) testNGArtifactName = org.testng:testng
[DEBUG]   (f) testSourceDirectory =
C:\v008789\Projects\ADT-I\.ws\WMB7Test\PlNnnnSampleDescriptionFlows\src\test\java
[DEBUG]   (f) trimStackTrace = true
[DEBUG]   (f) useFile = true
[DEBUG]   (f) useManifestOnlyJar = true
[DEBUG]   (f) workingDirectory =
C:\v008789\Projects\ADT-I\.ws\WMB7Test\PlNnnnSampleDescriptionFlows
[DEBUG] -- end configuration --
[INFO] [surefire:test {execution: surefire-it}]
[DEBUG] dummy:dummy:jar:1.0 (selected for null)
[DEBUG]   org.apache.maven.surefire:surefire-booter:jar:2.4.3:runtime
(selected for runtime)
[DEBUG]     org.apache.maven.surefire:surefire-api:jar:2.4.3:runtime
(selected for runtime)
[DEBUG] Adding to surefire booter test classpath:
c:\tools\.m2\repository\org\apache\maven\surefire\surefire-booter\2.4.3\surefire-booter-2.4.3.jar
[DEBUG] Adding to surefire booter test classpath:
c:\tools\.m2\repository\org\apache\maven\surefire\surefire-api\2.4.3\surefire-api-2.4.3.jar
[DEBUG] dummy:dummy:jar:1.0 (selected for null)
[DEBUG] Trying repository repository.maven2.it.company.net
[DEBUG] Using Wagon implementation lightweight from default mapping
for protocol http
[DEBUG] Checking for pre-existing User-Agent configuration.
[DEBUG] Adding User-Agent configuration.
[DEBUG] Connecting to repository: 'repository.maven2.it.company.net'
with url: 'http://maven2.it.company.net/repository'.
Downloading: http://maven2.it.company.net/repository/org/apache/maven/surefire/surefire-junit4/2.4.3/surefire-junit4-2.4.3.pom
[DEBUG] attempting to create parent directories for destination:
surefire-junit4-2.4.3.pom.tmp
1K downloaded  (surefire-junit4-2.4.3.pom)
[DEBUG] Using Wagon implementation lightweight from default mapping
for protocol http
[DEBUG]   Artifact resolved
[DEBUG] Retrieving parent-POM:
org.apache.maven.surefire:surefire-providers:pom:2.4.3 for project:
null:surefire-junit4:jar:null from the repository.
[DEBUG] Adding managed dependencies for unknown:surefire-junit4
[DEBUG]   org.apache.maven.surefire:surefire-api:jar:2.4.3
[DEBUG]   org.apache.maven.surefire:surefire-booter:jar:2.4.3
[DEBUG]   org.codehaus.plexus:plexus-utils:jar:1.5.1
[DEBUG]   org.apache.maven.surefire:surefire-junit4:jar:2.4.3:test
(selected for test)
[DEBUG] Trying repository repository.maven2.it.company.net
[DEBUG] Using Wagon implementation lightweight from default mapping
for protocol http
[DEBUG] Checking for pre-existing User-Agent configuration.
[DEBUG] Adding User-Agent configuration.
[DEBUG] Connecting to repository: 'repository.maven2.it.company.net'
with url: 'http://maven2.it.company.net/repository'.
Downloading: http://maven2.it.company.net/repository/junit/junit/4.0/junit-4.0.pom
[DEBUG] attempting to create parent directories for destination:
junit-4.0.pom.tmp
210b downloaded  (junit-4.0.pom)
[DEBUG] Using Wagon implementation lightweight from default mapping
for protocol http
[DEBUG]   Artifact resolved
[DEBUG]     junit:junit:jar:4.0:test (selected for test)
[DEBUG]     org.apache.maven.surefire:surefire-api:jar:2.4.3:test
(selected for test)
[DEBUG] Trying repository repository.maven2.it.company.net
[DEBUG] Using Wagon implementation lightweight from default mapping
for protocol http
[DEBUG] Trying repository repository.maven2.it.company.net
[DEBUG] Using Wagon implementation lightweight from default mapping
for protocol http
[DEBUG] Checking for pre-existing User-Agent configuration.
[DEBUG] Adding User-Agent configuration.
[DEBUG] Checking for pre-existing User-Agent configuration.
[DEBUG] Adding User-Agent configuration.
[DEBUG] Connecting to repository: 'repository.maven2.it.company.net'
with url: 'http://maven2.it.company.net/repository'.
[DEBUG] Connecting to repository: 'repository.maven2.it.company.net'
with url: 'http://maven2.it.company.net/repository'.
Downloading: http://maven2.it.company.net/repository/org/apache/maven/surefire/surefire-junit4/2.4.3/surefire-junit4-2.4.3.jar
Downloading: http://maven2.it.company.net/repository/junit/junit/4.0/junit-4.0.jar
[DEBUG] attempting to create parent directories for destination:
surefire-junit4-2.4.3.jar.tmp
[DEBUG] attempting to create parent directories for destination:
junit-4.0.jar.tmp
11K downloaded  (surefire-junit4-2.4.3.jar)
[DEBUG] Using Wagon implementation lightweight from default mapping
for protocol http
[DEBUG]   Artifact resolved
103K downloaded  (junit-4.0.jar)
[DEBUG] Using Wagon implementation lightweight from default mapping
for protocol http
[DEBUG]   Artifact resolved
[DEBUG] Adding to surefire test classpath:
c:\tools\.m2\repository\org\apache\maven\surefire\surefire-junit4\2.4.3\surefire-junit4-2.4.3.jar
[DEBUG] Adding to surefire test classpath:
c:\tools\.m2\repository\junit\junit\4.0\junit-4.0.jar
[DEBUG] Adding to surefire test classpath:
c:\tools\.m2\repository\org\apache\maven\surefire\surefire-api\2.4.3\surefire-api-2.4.3.jar
[DEBUG] Test Classpath :
[DEBUG]   C:\v008789\Projects\ADT-I\.ws\WMB7Test\PlNnnnSampleDescriptionFlows\target\test-classes
[DEBUG]   C:\v008789\Projects\ADT-I\.ws\WMB7Test\PlNnnnSampleDescriptionFlows\target\classes
[DEBUG]   c:\tools\.m2\repository\com\company\gim\GimTestFramework\1.1.1\GimTestFramework-1.1.1.jar
[DEBUG]   c:\tools\.m2\repository\com\googlecode\wmqutil\wmq-util\0.5\wmq-util-0.5.jar
[DEBUG]   c:\tools\.m2\repository\org\apache\geronimo\specs\geronimo-jms_1.1_spec\1.1\geronimo-jms_1.1_spec-1.1.jar
[DEBUG]   c:\tools\.m2\repository\org\apache\geronimo\specs\geronimo-j2ee-connector_1.5_spec\1.1.1\geronimo-j2ee-connector_1.5_spec-1.1.1.jar
[DEBUG]   c:\tools\.m2\repository\org\apache\geronimo\specs\geronimo-jta_1.0.1B_spec\1.1.1\geronimo-jta_1.0.1B_spec-1.1.1.jar
[DEBUG]   c:\tools\.m2\repository\com\ibm\wmq\com.ibm.mq\6.0.2.0\com.ibm.mq-6.0.2.0.jar
[DEBUG]   c:\tools\.m2\repository\com\ibm\wmq\com.ibm.mqjms\6.0.2.0\com.ibm.mqjms-6.0.2.0.jar
[DEBUG]   c:\tools\.m2\repository\com\ibm\wmq\dhbcore\6.0.2.0\dhbcore-6.0.2.0.jar
[DEBUG]   c:\tools\.m2\repository\junit\junit\4.8.1\junit-4.8.1.jar
[DEBUG]   c:\tools\.m2\repository\asm\asm\3.1\asm-3.1.jar
[DEBUG]   c:\tools\.m2\repository\asm\asm-util\3.1\asm-util-3.1.jar
[DEBUG]   c:\tools\.m2\repository\asm\asm-tree\3.1\asm-tree-3.1.jar
[DEBUG]   c:\tools\.m2\repository\asm\asm-analysis\3.1\asm-analysis-3.1.jar
[DEBUG]   c:\tools\.m2\repository\com\ibm\xsdbeans\xsdbeans\1.0.0\xsdbeans-1.0.0.jar
[DEBUG]   c:\tools\.m2\repository\com\ibm\wmq\jms\6.0.2.0\jms-6.0.2.0.jar
[DEBUG]   c:\tools\.m2\repository\com\ibm\wmq\connector\6.0.2.0\connector-6.0.2.0.jar
[DEBUG]   c:\tools\.m2\repository\javax\transaction\jta\1.0.1B\jta-1.0.1B.jar
[DEBUG]   c:\tools\.m2\repository\xerces\xercesImpl\2.6.2\xercesImpl-2.6.2.jar
[DEBUG]   c:\tools\.m2\repository\xerces\xmlParserAPIs\2.6.2\xmlParserAPIs-2.6.2.jar
[DEBUG]   c:\tools\.m2\repository\commons-httpclient\commons-httpclient\3.0.1\commons-httpclient-3.0.1.jar
[DEBUG]   c:\tools\.m2\repository\commons-logging\commons-logging\1.1\commons-logging-1.1.jar
[DEBUG]   c:\tools\.m2\repository\commons-codec\commons-codec\1.3\commons-codec-1.3.jar
[DEBUG]   c:\tools\.m2\repository\log4j\log4j\1.2.14\log4j-1.2.14.jar
[DEBUG]   c:\tools\.m2\repository\logkit\logkit\1.0.1\logkit-1.0.1.jar
[DEBUG]   c:\tools\.m2\repository\avalon-framework\avalon-framework\4.1.3\avalon-framework-4.1.3.jar
[DEBUG]   c:\tools\.m2\repository\javax\servlet\servlet-api\2.3\servlet-api-2.3.jar
[DEBUG]   c:\tools\.m2\repository\org\dbunit\dbunit\2.2\dbunit-2.2.jar
[DEBUG]   c:\tools\.m2\repository\junit-addons\junit-addons\1.4\junit-addons-1.4.jar
[DEBUG]   c:\tools\.m2\repository\poi\poi\2.5.1-final-20040804\poi-2.5.1-final-20040804.jar
[DEBUG]   c:\tools\.m2\repository\commons-collections\commons-collections\3.1\commons-collections-3.1.jar
[DEBUG]   c:\tools\.m2\repository\commons-lang\commons-lang\2.1\commons-lang-2.1.jar
[DEBUG]   c:\tools\.m2\repository\org\apache\derby\derby\10.2.1.6\derby-10.2.1.6.jar
[DEBUG]   c:\tools\.m2\repository\org\apache\derby\derbyclient\10.2.1.6\derbyclient-10.2.1.6.jar
[DEBUG]   c:\tools\.m2\repository\com\ibm\db2\db2java\8.1.7\db2java-8.1.7.jar
[DEBUG]   c:\tools\.m2\repository\com\ibm\db2\db2jcc_license_cisuz\8.1.7\db2jcc_license_cisuz-8.1.7.jar
[DEBUG]   c:\tools\.m2\repository\com\ibm\db2\db2jcc\8.1.7\db2jcc-8.1.7.jar
[DEBUG]   c:\tools\.m2\repository\com\ibm\db2\db2jcc_license_cu\8.1.7\db2jcc_license_cu-8.1.7.jar
[DEBUG]   c:\tools\.m2\repository\oracle\ojdbc14\10.2.0.3.0\ojdbc14-10.2.0.3.0.jar
[DEBUG]   c:\tools\.m2\repository\com\company\gim\wbiaorawrapper\1.0.0\wbiaorawrapper-1.0.0.jar
[DEBUG] Setting system property [brokertest.xmlfile]=[target/test]
[DEBUG] Setting system property
[user.dir]=[C:\v008789\Projects\ADT-I\.ws\WMB7Test\PlNnnnSampleDescriptionFlows]
[DEBUG] Setting system property [localRepository]=[c:*/tools/*.m2/repository/]
[DEBUG] Setting system property
[basedir]=[C:\v008789\Projects\ADT-I\.ws\WMB7Test\PlNnnnSampleDescriptionFlows]
[DEBUG] Using JVM: C:\Program Files\IBM\WMBT700\jdk\jre\bin\java
[INFO] Surefire report directory:
C:\v008789\Projects\ADT-I\.ws\WMB7Test\PlNnnnSampleDescriptionFlows\target\surefire-reports
Forking command line: cmd.exe /X /C ""C:\Program
Files\IBM\WMBT700\jdk\jre\bin\java" -jar
C:\DOCUME~1\v008789\LOCALS~1\Temp\surefirebooter2356740905539978999.jar
C:\DOCUME~1\v008789\LOCALS~1\Temp\surefire25851443
23184620103tmp C:\DOCUME~1\v008789\LOCALS~1\Temp\surefire4150186505744356578tmp"
killed.
[INFO] ------------------------------------------------------------------------
[ERROR] BUILD ERROR
[INFO] ------------------------------------------------------------------------
[INFO] Error while executing forked tests.; nested exception is
org.apache.maven.surefire.booter.shade.org.codehaus.plexus.util.cli.CommandLineException:
Error while executing external command, process killed.

[INFO] ------------------------------------------------------------------------
[DEBUG] Trace
org.apache.maven.lifecycle.LifecycleExecutionException: Error while
executing forked tests.; nested exception is
org.apache.maven.surefire.booter.shade.org.codehaus.plexus.util.cli.CommandLineException:
Error whi
le executing external command, process killed.
        at org.apache.maven.lifecycle.DefaultLifecycleExecutor.executeGoals(DefaultLifecycleExecutor.java:719)
        at org.apache.maven.lifecycle.DefaultLifecycleExecutor.executeGoalWithLifecycle(DefaultLifecycleExecutor.java:556)
        at org.apache.maven.lifecycle.DefaultLifecycleExecutor.executeGoal(DefaultLifecycleExecutor.java:535)
        at org.apache.maven.lifecycle.DefaultLifecycleExecutor.executeGoalAndHandleFailures(DefaultLifecycleExecutor.java:387)
        at org.apache.maven.lifecycle.DefaultLifecycleExecutor.executeTaskSegments(DefaultLifecycleExecutor.java:348)
        at org.apache.maven.lifecycle.DefaultLifecycleExecutor.execute(DefaultLifecycleExecutor.java:180)
        at org.apache.maven.DefaultMaven.doExecute(DefaultMaven.java:328)
        at org.apache.maven.DefaultMaven.execute(DefaultMaven.java:138)
        at org.apache.maven.cli.MavenCli.main(MavenCli.java:362)
        at org.apache.maven.cli.compat.CompatibleMain.main(CompatibleMain.java:60)
        at sun.reflect.NativeMethodAccessorImpl.invoke0(Native Method)
        at sun.reflect.NativeMethodAccessorImpl.invoke(NativeMethodAccessorImpl.java:39)
        at sun.reflect.DelegatingMethodAccessorImpl.invoke(DelegatingMethodAccessorImpl.java:37)
        at java.lang.reflect.Method.invoke(Method.java:599)
        at org.codehaus.classworlds.Launcher.launchEnhanced(Launcher.java:315)
        at org.codehaus.classworlds.Launcher.launch(Launcher.java:255)
        at org.codehaus.classworlds.Launcher.mainWithExitCode(Launcher.java:430)
        at org.codehaus.classworlds.Launcher.main(Launcher.java:375)
Caused by: org.apache.maven.plugin.MojoExecutionException: Error while
executing forked tests.; nested exception is
org.apache.maven.surefire.booter.shade.org.codehaus.plexus.util.cli.CommandLineException:
Error
while executing external command, process killed.
        at org.apache.maven.plugin.surefire.SurefirePlugin.execute(SurefirePlugin.java:541)
        at org.apache.maven.plugin.DefaultPluginManager.executeMojo(DefaultPluginManager.java:490)
        at org.apache.maven.lifecycle.DefaultLifecycleExecutor.executeGoals(DefaultLifecycleExecutor.java:694)
        ... 17 more
Caused by: org.apache.maven.surefire.booter.SurefireBooterForkException:
Error while executing forked tests.; nested exception is
org.apache.maven.surefire.booter.shade.org.codehaus.plexus.util.cli.CommandLineExc
eption: Error while executing external command, process killed.
        at org.apache.maven.surefire.booter.SurefireBooter.fork(SurefireBooter.java:677)
        at org.apache.maven.surefire.booter.SurefireBooter.forkSuites(SurefireBooter.java:479)
        at org.apache.maven.surefire.booter.SurefireBooter.runSuitesForkOnce(SurefireBooter.java:379)
        at org.apache.maven.surefire.booter.SurefireBooter.run(SurefireBooter.java:245)
        at org.apache.maven.plugin.surefire.SurefirePlugin.execute(SurefirePlugin.java:537)
        ... 19 more
Caused by: org.apache.maven.surefire.booter.shade.org.codehaus.plexus.util.cli.CommandLineException:
Error while executing external command, process killed.
        at org.apache.maven.surefire.booter.shade.org.codehaus.plexus.util.cli.CommandLineUtils.executeCommandLine(CommandLineUtils.java:198)
        at org.apache.maven.surefire.booter.shade.org.codehaus.plexus.util.cli.CommandLineUtils.executeCommandLine(CommandLineUtils.java:98)
        at org.apache.maven.surefire.booter.SurefireBooter.fork(SurefireBooter.java:673)
        ... 23 more
Caused by: java.lang.InterruptedException
        at java.lang.ProcessImpl.waitFor(Native Method)
        at org.apache.maven.surefire.booter.shade.org.codehaus.plexus.util.cli.CommandLineUtils.executeCommandLine(CommandLineUtils.java:146)
        ... 25 more
[INFO] ------------------------------------------------------------------------
[INFO] Total time: 1 minute 45 seconds
[INFO] Finished at: Mon Jun 14 15:33:05 CEST 2010
[INFO] Final Memory: 26M/76M
[INFO] ------------------------------------------------------------------------
C:\v008789\Projects\ADT-I\.ws\WMB7Test\PlNnnnSampleDescriptionFlows>
Reply | Threaded
Open this post in threaded view
|  
Report Content as Inappropriate

Re: Strange surefire error

Wayne Fay
> When running tests we get errors
> "org.apache.maven.surefire.booter.shade.org.codehaus.plexus.util.cli.CommandLineException:
> Error while executing external command, process killed." when Maven
> runs the command below.

What happens when you run this from the same directory? Literally open
a MS-DOS prompt and copy/paste starting at cmd.exe through to the last
double quote.

Forking command line: cmd.exe /X /C ""C:\Program
Files\IBM\WMBT700\jdk\jre\bin\java" -jar
C:\DOCUME~1\v008789\LOCALS~1\Temp\surefirebooter2356740905539978999.jar
C:\DOCUME~1\v008789\LOCALS~1\Temp\surefire25851443
23184620103tmp C:\DOCUME~1\v008789\LOCALS~1\Temp\surefire4150186505744356578tmp"

Wayne

---------------------------------------------------------------------
To unsubscribe, e-mail: [hidden email]
For additional commands, e-mail: [hidden email]

Reply | Threaded
Open this post in threaded view
|  
Report Content as Inappropriate

Re: Strange surefire error

Joacim J
> What happens when you run this from the same directory? Literally open
> a MS-DOS prompt and copy/paste starting at cmd.exe through to the last
> double quote.
>
> Forking command line: cmd.exe /X /C ""C:\Program
> Files\IBM\WMBT700\jdk\jre\bin\java" -jar
> C:\DOCUME~1\v008789\LOCALS~1\Temp\surefirebooter2356740905539978999.jar
> C:\DOCUME~1\v008789\LOCALS~1\Temp\surefire25851443
> 23184620103tmp
> C:\DOCUME~1\v008789\LOCALS~1\Temp\surefire4150186505744356578tmp"
>
>
Hello,

As I wrote in the previous mail: "If I however run the command directly it
works."



--
Regards
Joacim
Reply | Threaded
Open this post in threaded view
|  
Report Content as Inappropriate

Re: Strange surefire error

Wayne Fay
> As I wrote in the previous mail: "If I however run the command directly it
> works."

Yea, I saw that, but didn't actually believe that you were executing
the right command. We get a lot of hmmm confused people on this list
at times.

Most likely there is something going on related to plexus.util.cli and
your new IBM JVM that no one has encountered previously (how new is
it?). If you really want it fixed in a reasonable timeline, you'll
probably need to take an active role in fixing it. As the trace shows,
Surefire is using plexus-utils 1.5.1. Pull the source and start poking
around near CommandLineUtils.java:146.

Wayne

---------------------------------------------------------------------
To unsubscribe, e-mail: [hidden email]
For additional commands, e-mail: [hidden email]

Reply | Threaded
Open this post in threaded view
|  
Report Content as Inappropriate

Re: Strange surefire error

Joacim J
On Mon, Jun 14, 2010 at 5:04 PM, Wayne Fay <[hidden email]> wrote:

> > As I wrote in the previous mail: "If I however run the command directly
> it
> > works."
>
> Yea, I saw that, but didn't actually believe that you were executing
> the right command. We get a lot of hmmm confused people on this list
> at times.
>
> Most likely there is something going on related to plexus.util.cli and
> your new IBM JVM that no one has encountered previously (how new is
> it?). If you really want it fixed in a reasonable timeline, you'll
> probably need to take an active role in fixing it. As the trace shows,
> Surefire is using plexus-utils 1.5.1. Pull the source and start poking
> around near CommandLineUtils.java:146.
>
> Wayne
>
>
Ok, thanks for your fast reply.

I will see/hope I have time to dig into the source.

I am not sure about the age of IBM's JVM but it should be at least 6 months
old.


--
Regards
Joacim
Reply | Threaded
Open this post in threaded view
|  
Report Content as Inappropriate

Re: Strange surefire error

Kristian Rosenvold-4
Does it fail "immediately" or does it run the tests first ?

Is the plugin configured with forkedProcessTimeoutInSeconds ?

Kristian

---------------------------------------------------------------------
To unsubscribe, e-mail: [hidden email]
For additional commands, e-mail: [hidden email]

Reply | Threaded
Open this post in threaded view
|  
Report Content as Inappropriate

Re: Strange surefire error

Joacim J
On Tue, Jun 15, 2010 at 8:02 AM, Kristian Rosenvold <
[hidden email]> wrote:

> Does it fail "immediately" or does it run the tests first ?
>
> Is the plugin configured with forkedProcessTimeoutInSeconds ?
>
> Kristian
>
>

Yes, it fails directly.
I have configured to use plexus-utils v.1.5.9 and surefire plugin 2.5 now,
still not working.
Tested with different JVMs to build the plexus-util

Sun's JVM 1.5.0 => OK
Sun's JVM 1.6.0 => OK
IBM's JVM 1.5.0 => NOK (3 tests failed)
IBM's JVM 1.6.0 => NOK (33 tests failed)


With IBM's JVM 1.5.0 it still works for us so our "problem" with IBM's JVM
1.6.0 should be in the new 33 failed test.

The approach we have right now is to define Sun's JVM on surefire-plugin and
to use:
forkMode=always
forkedProcessTimeoutInSeconds=60

The team have executed once and succeeded so will do som more tests. Still
it's a workaround and it would be best if plexus-util would work with IBM
JVM :)


--
Regards
Joacim
Reply | Threaded
Open this post in threaded view
|  
Report Content as Inappropriate

Re: Strange surefire error

Joacim J
Update:
We are currently using
forkMode=never

and it works

Regards Joacim



On Fri, Jun 18, 2010 at 7:20 AM, Joacim J <[hidden email]> wrote:

>
>
> On Tue, Jun 15, 2010 at 8:02 AM, Kristian Rosenvold <
> [hidden email]> wrote:
>
>> Does it fail "immediately" or does it run the tests first ?
>>
>> Is the plugin configured with forkedProcessTimeoutInSeconds ?
>>
>> Kristian
>>
>>
>
> Yes, it fails directly.
> I have configured to use plexus-utils v.1.5.9 and surefire plugin 2.5 now,
> still not working.
> Tested with different JVMs to build the plexus-util
>
> Sun's JVM 1.5.0 => OK
> Sun's JVM 1.6.0 => OK
> IBM's JVM 1.5.0 => NOK (3 tests failed)
> IBM's JVM 1.6.0 => NOK (33 tests failed)
>
>
> With IBM's JVM 1.5.0 it still works for us so our "problem" with IBM's JVM
> 1.6.0 should be in the new 33 failed test.
>
> The approach we have right now is to define Sun's JVM on surefire-plugin
> and to use:
> forkMode=always
> forkedProcessTimeoutInSeconds=60
>
> The team have executed once and succeeded so will do som more tests. Still
> it's a workaround and it would be best if plexus-util would work with IBM
> JVM :)
>
>
> --
> Regards
> Joacim
>



--
Regards
Joacim
Loading...