NMaven

NMaven develops plugins and integration for Maven to make building and using .NET languages a first-class citizen in Maven.
1234567 ... 35
Topics (1213)
Replies Last Post Views Sub Forum
[continuum] BUILD ERROR: NMaven - Apache NMaven: maven-dotnet-toolchain - default maven2 buildDefinition by Continuum@vmbuild.ap...
0
by Continuum@vmbuild.ap...
nmaven-commits
[continuum] BUILD ERROR: NMaven - Apache NMaven: maven-dotnet-test-plugin - default maven2 buildDefinition by Continuum@vmbuild.ap...
0
by Continuum@vmbuild.ap...
nmaven-commits
[continuum] BUILD ERROR: NMaven - Apache NMaven: maven-dotnet-plugins - default maven2 buildDefinition by Continuum@vmbuild.ap...
0
by Continuum@vmbuild.ap...
nmaven-commits
[continuum] BUILD ERROR: NMaven - Apache NMaven: maven-dotnet-plugin-api - default maven2 buildDefinition by Continuum@vmbuild.ap...
0
by Continuum@vmbuild.ap...
nmaven-commits
[continuum] BUILD ERROR: NMaven - Apache NMaven: maven-dotnet-parent - default maven2 buildDefinition by Continuum@vmbuild.ap...
0
by Continuum@vmbuild.ap...
nmaven-commits
[continuum] BUILD ERROR: NMaven - Apache NMaven: maven-dotnet-extensions - default maven2 buildDefinition by Continuum@vmbuild.ap...
0
by Continuum@vmbuild.ap...
nmaven-commits
[continuum] BUILD ERROR: NMaven - Apache NMaven: maven-dotnet-core-it-runner - default maven2 buildDefinition by Continuum@vmbuild.ap...
0
by Continuum@vmbuild.ap...
nmaven-commits
[continuum] BUILD ERROR: NMaven - Apache NMaven: maven-dotnet-core - default maven2 buildDefinition by Continuum@vmbuild.ap...
0
by Continuum@vmbuild.ap...
nmaven-commits
[continuum] BUILD ERROR: NMaven - Apache NMaven: maven-dotnet-components - default maven2 buildDefinition by Continuum@vmbuild.ap...
0
by Continuum@vmbuild.ap...
nmaven-commits
[continuum] BUILD ERROR: NMaven - Apache NMaven: maven-dotnet-compiler-plugin - default maven2 buildDefinition by Continuum@vmbuild.ap...
0
by Continuum@vmbuild.ap...
nmaven-commits
[continuum] BUILD ERROR: NMaven - Apache NMaven: maven-dotnet-compiler - default maven2 buildDefinition by Continuum@vmbuild.ap...
0
by Continuum@vmbuild.ap...
nmaven-commits
[continuum] BUILD ERROR: NMaven - Apache NMaven: maven-dotnet-assembler - default maven2 buildDefinition by Continuum@vmbuild.ap...
0
by Continuum@vmbuild.ap...
nmaven-commits
[continuum] BUILD ERROR: NMaven - Apache NMaven: maven-archetype-dotnet-windows-control - default maven2 buildDefinition by Continuum@vmbuild.ap...
0
by Continuum@vmbuild.ap...
nmaven-commits
[continuum] BUILD ERROR: NMaven - Apache NMaven: maven-archetype-dotnet-windows-application - default maven2 buildDefinition by Continuum@vmbuild.ap...
0
by Continuum@vmbuild.ap...
nmaven-commits
[continuum] BUILD ERROR: NMaven - Apache NMaven: maven-archetype-dotnet-console-application - default maven2 buildDefinition by Continuum@vmbuild.ap...
0
by Continuum@vmbuild.ap...
nmaven-commits
[continuum] BUILD ERROR: NMaven - Apache NMaven: maven-archetype-dotnet-class-library - default maven2 buildDefinition by Continuum@vmbuild.ap...
0
by Continuum@vmbuild.ap...
nmaven-commits
[continuum] BUILD ERROR: NMaven - Apache NMaven: dotnet-archetypes - default maven2 buildDefinition by Continuum@vmbuild.ap...
0
by Continuum@vmbuild.ap...
nmaven-commits
[continuum] BUILD ERROR: NMaven - Apache NMaven: core-integration-tests - default maven2 buildDefinition by Continuum@vmbuild.ap...
0
by Continuum@vmbuild.ap...
nmaven-commits
Directory structure conventions by Wendy Smoak
24
by Wendy Smoak
nmaven-dev
[continuum] BUILD FAILURE: NMaven - Apache NMaven: maven-dotnet-core-it-runner - default maven2 buildDefinition by Continuum@vmbuild.ap...
0
by Continuum@vmbuild.ap...
nmaven-commits
[continuum] BUILD SUCCESSFUL: NMaven - Apache NMaven: core-integration-tests - default maven2 buildDefinition by Continuum@vmbuild.ap...
0
by Continuum@vmbuild.ap...
nmaven-commits
[continuum] BUILD ERROR: NMaven - Apache NMaven: core-integration-tests - default maven2 buildDefinition by Continuum@vmbuild.ap...
0
by Continuum@vmbuild.ap...
nmaven-commits
[continuum] BUILD FAILURE: NMaven - Apache NMaven: maven-dotnet-core-it-runner - default maven2 buildDefinition by Continuum@vmbuild.ap...
0
by Continuum@vmbuild.ap...
nmaven-commits
[continuum] BUILD FAILURE: NMaven - Apache NMaven: maven-dotnet-core-it-runner - default maven2 buildDefinition by Continuum@vmbuild.ap...
0
by Continuum@vmbuild.ap...
nmaven-commits
[continuum] BUILD FAILURE: NMaven - Apache NMaven: maven-dotnet-core-it-runner - default maven2 buildDefinition by Continuum@vmbuild.ap...
0
by Continuum@vmbuild.ap...
nmaven-commits
[continuum] BUILD FAILURE: NMaven - Apache NMaven: maven-dotnet-core-it-runner - default maven2 buildDefinition by Continuum@vmbuild.ap...
0
by Continuum@vmbuild.ap...
nmaven-commits
svn commit: r701338 - /incubator/nmaven/trunk/pom.xml by brettporter
0
by brettporter
nmaven-commits
svn commit: r701332 - /incubator/nmaven/trunk/pom.xml by brettporter
0
by brettporter
nmaven-commits
svn commit: r701327 - /incubator/nmaven/trunk/pom.xml by brettporter
0
by brettporter
nmaven-commits
svn commit: r700802 - /incubator/nmaven/trunk/core-integration-tests/src/test/java/org/apache/maven/dotnet/integrationtests/IntegrationTestSuite.java by brettporter
0
by brettporter
nmaven-commits
svn commit: r700791 - in /incubator/nmaven/trunk: ./ components/maven-dotnet-assembler/ components/maven-dotnet-compiler/src/main/java/org/apache/maven/dotnet/compiler/ components/maven-dotnet-compiler/src/main/java/org/apache/maven/dotnet/compiler/imp... by brettporter
0
by brettporter
nmaven-commits
svn commit: r700774 - /incubator/nmaven/branches/NMAVEN-8-nunit/core-integration-tests/src/test/java/org/apache/maven/dotnet/integrationtests/MavenITVersionedAssemblies.java by brettporter
0
by brettporter
nmaven-commits
svn commit: r700773 - in /incubator/nmaven/branches/NMAVEN-8-nunit/core-integration-tests/src/test/resources/VersionedAssemblies: B/pom.xml C/pom.xml by brettporter
0
by brettporter
nmaven-commits
svn commit: r700750 - /incubator/nmaven/branches/NMAVEN-8-nunit/core-integration-tests/src/test/java/org/apache/maven/dotnet/integrationtests/IntegrationTestSuite.java by brettporter
0
by brettporter
nmaven-commits
working around the local repository / filename limitation by brettporter
4
by brettporter
nmaven-dev
1234567 ... 35