I am getting exception with running mvn -X archetype:generate -DgroupId command

Previous Topic Next Topic
 
classic Classic list List threaded Threaded
1 message Options
Reply | Threaded
Open this post in threaded view
|

I am getting exception with running mvn -X archetype:generate -DgroupId command

SAMYAM
This post has NOT been accepted by the mailing list yet.
Apache Maven 3.0.5 (r01de14724cdef164cd33c7c8c2fe155faf9602da; 2013-02-19 19:21:28+0530) Maven home: C:\Toro Softwares\apache-maven-3.0.5\bin\.. Java version: 1.6.0_37, vendor: Oracle Corporation Java home: C:\Toro Softwares\Java\jrockit-jdk1.6.0_37\jre Default locale: en_US, platform encoding: Cp1252 OS name: "windows 7", version: "6.1", arch: "x86", family: "windows" [INFO] Error stacktraces are turned on. [DEBUG] Reading global settings from C:\Toro Softwares\apache-maven-3.0.5\bin\..\conf\settings.xml [DEBUG] Reading user settings from C:\Users\zkfiibm\.m2\settings.xml [DEBUG] Using local repository at C:\Toro Softwares\ToroRepo [DEBUG] Using manager EnhancedLocalRepositoryManager with priority 10 for C:\Toro Softwares\ToroRepo [INFO] Scanning for projects... [DEBUG] Extension realms for project org.apache.maven:standalone-pom:pom:1: (none) [DEBUG] Looking up lifecyle mappings for packaging pom from ClassRealm[plexus.core, parent: null] [DEBUG] Resolving plugin prefix archetype from [org.apache.maven.plugins, org.codehaus.mojo] [DEBUG] Using connector WagonRepositoryConnector with priority 0 for http://repo.maven.apache.org/maven2 via 171.147.63.2:8080 as zkfiibm Downloading: http://repo.maven.apache.org/maven2/org/apache/maven/plugins/maven-clean-plugin/2.4.1/maven-clean-plugin-2.4.1.pom [DEBUG] Writing resolution tracking file C:\Toro Softwares\ToroRepo\org\apache\maven\plugins\maven-clean-plugin\2.4.1\maven-clean-plugin-2.4.1.pom.lastUpdated [WARNING] Failed to retrieve plugin descriptor for org.apache.maven.plugins:maven-clean-plugin:2.4.1: Plugin org.apache.maven.plugins:maven-clean-plugin:2.4.1 or one of its dependencies could not be resolved: Failed to read artifact descriptor for org.apache.maven.plugins:maven-clean-plugin:jar:2.4.1 org.apache.maven.plugin.PluginResolutionException: Plugin org.apache.maven.plugins:maven-clean-plugin:2.4.1 or one of its dependencies could not be resolved: Failed to read artifact descriptor for org.apache.maven.plugins:maven-clean-plugin:jar:2.4.1 at org.apache.maven.plugin.internal.DefaultPluginDependenciesResolver.resolve(DefaultPluginDependenciesResolver.java:129) at org.apache.maven.plugin.internal.DefaultMavenPluginManager.getPluginDescriptor(DefaultMavenPluginManager.java:142) at org.apache.maven.plugin.DefaultBuildPluginManager.loadPlugin(DefaultBuildPluginManager.java:59) at org.apache.maven.plugin.prefix.internal.DefaultPluginPrefixResolver.resolveFromProject(DefaultPluginPrefixResolver.java:139) at org.apache.maven.plugin.prefix.internal.DefaultPluginPrefixResolver.resolveFromProject(DefaultPluginPrefixResolver.java:122) at org.apache.maven.plugin.prefix.internal.DefaultPluginPrefixResolver.resolve(DefaultPluginPrefixResolver.java:86) at org.apache.maven.lifecycle.internal.MojoDescriptorCreator.findPluginForPrefix(MojoDescriptorCreator.java:262) at org.apache.maven.lifecycle.internal.MojoDescriptorCreator.getMojoDescriptor(MojoDescriptorCreator.java:222) at org.apache.maven.lifecycle.internal.DefaultLifecycleTaskSegmentCalculator.calculateTaskSegments(DefaultLifecycleTaskSegmentCalculator.java:106) at org.apache.maven.lifecycle.internal.DefaultLifecycleTaskSegmentCalculator.calculateTaskSegments(DefaultLifecycleTaskSegmentCalculator.java:86) at org.apache.maven.lifecycle.internal.LifecycleStarter.execute(LifecycleStarter.java:98) at org.apache.maven.DefaultMaven.doExecute(DefaultMaven.java:320) at org.apache.maven.DefaultMaven.execute(DefaultMaven.java:156) at org.apache.maven.cli.MavenCli.execute(MavenCli.java:537) at org.apache.maven.cli.MavenCli.doMain(MavenCli.java:196) at org.apache.maven.cli.MavenCli.main(MavenCli.java:141) at sun.reflect.NativeMethodAccessorImpl.invoke0(Native Method) at sun.reflect.NativeMethodAccessorImpl.invoke(NativeMethodAccessorImpl.java:39) at sun.reflect.DelegatingMethodAccessorImpl.invoke(DelegatingMethodAccessorImpl.java:25) at java.lang.reflect.Method.invoke(Method.java:597) at org.codehaus.plexus.classworlds.launcher.Launcher.launchEnhanced(Launcher.java:290) at org.codehaus.plexus.classworlds.launcher.Launcher.launch(Launcher.java:230) at org.codehaus.plexus.classworlds.launcher.Launcher.mainWithExitCode(Launcher.java:409) at org.codehaus.plexus.classworlds.launcher.Launcher.main(Launcher.java:354) Caused by: org.sonatype.aether.resolution.ArtifactDescriptorException: Failed to read artifact descriptor for org.apache.maven.plugins:maven-clean-plugin:jar:2.4.1 at org.apache.maven.repository.internal.DefaultArtifactDescriptorReader.loadPom(DefaultArtifactDescriptorReader.java:296) at org.apache.maven.repository.internal.DefaultArtifactDescriptorReader.readArtifactDescriptor(DefaultArtifactDescriptorReader.java:186) at org.sonatype.aether.impl.internal.DefaultRepositorySystem.readArtifactDescriptor(DefaultRepositorySystem.java:279) at org.apache.maven.plugin.internal.DefaultPluginDependenciesResolver.resolve(DefaultPluginDependenciesResolver.java:115) ... 23 more Caused by: org.sonatype.aether.resolution.ArtifactResolutionException: Could not transfer artifact org.apache.maven.plugins:maven-clean-plugin:pom:2.4.1 from/to central (http://repo.maven.apache.org/maven2): Access denied to: http://repo.maven.apache.org/maven2/org/apache/maven/plugins/maven-clean-plugin/2.4.1/maven-clean-plugin-2.4.1.pom , ReasonPhrase:Forbidden. at org.sonatype.aether.impl.internal.DefaultArtifactResolver.resolve(DefaultArtifactResolver.java:538) at org.sonatype.aether.impl.internal.DefaultArtifactResolver.resolveArtifacts(DefaultArtifactResolver.java:216) at org.sonatype.aether.impl.internal.DefaultArtifactResolver.resolveArtifact(DefaultArtifactResolver.java:193) at org.apache.maven.repository.internal.DefaultArtifactDescriptorReader.loadPom(DefaultArtifactDescriptorReader.java:281) ... 26 more Caused by: org.sonatype.aether.transfer.ArtifactTransferException: Could not transfer artifact org.apache.maven.plugins:maven-clean-plugin:pom:2.4.1 from/to central (http://repo.maven.apache.org/maven2): Access denied to: http://repo.maven.apache.org/maven2/org/apache/maven/plugins/maven-clean-plugin/2.4.1/maven-clean-plugin-2.4.1.pom , ReasonPhrase:Forbidden. at org.sonatype.aether.connector.wagon.WagonRepositoryConnector$4.wrap(WagonRepositoryConnector.java:951) at org.sonatype.aether.connector.wagon.WagonRepositoryConnector$4.wrap(WagonRepositoryConnector.java:941) at org.sonatype.aether.connector.wagon.WagonRepositoryConnector$GetTask.run(WagonRepositoryConnector.java:669) at org.sonatype.aether.util.concurrency.RunnableErrorForwarder$1.run(RunnableErrorForwarder.java:60) at java.util.concurrent.ThreadPoolExecutor$Worker.runTask(ThreadPoolExecutor.java:886) at java.util.concurrent.ThreadPoolExecutor$Worker.run(ThreadPoolExecutor.java:908) at java.lang.Thread.run(Thread.java:662) Caused by: org.apache.maven.wagon.authorization.AuthorizationException: Access denied to: http://repo.maven.apache.org/maven2/org/apache/maven/plugins/maven-clean-plugin/2.4.1/maven-clean-plugin-2.4.1.pom , ReasonPhrase:Forbidden. at org.apache.maven.wagon.shared.http4.AbstractHttpClientWagon.fillInputData(AbstractHttpClientWagon.java:928) at org.apache.maven.wagon.StreamWagon.getInputStream(StreamWagon.java:116) at org.apache.maven.wagon.StreamWagon.getIfNewer(StreamWagon.java:88) at org.apache.maven.wagon.StreamWagon.get(StreamWagon.java:62) at org.sonatype.aether.connector.wagon.WagonRepositoryConnector$GetTask.run(WagonRepositoryConnector.java:601) at org.sonatype.aether.util.concurrency.RunnableErrorForwarder$1.run(RunnableErrorForwarder.java:60) at java.util.concurrent.ThreadPoolExecutor$Worker.runTask(ThreadPoolExecutor.java:886) at java.util.concurrent.ThreadPoolExecutor$Worker.run(ThreadPoolExecutor.java:909) ... 1 more [DEBUG] Using connector WagonRepositoryConnector with priority 0 for http://repo.maven.apache.org/maven2 via 171.147.63.2:8080 as zkfiibm Downloading: http://repo.maven.apache.org/maven2/org/apache/maven/plugins/maven-install-plugin/2.3.1/maven-install-plugin-2.3.1.pom [DEBUG] Writing resolution tracking file C:\Toro Softwares\ToroRepo\org\apache\maven\plugins\maven-install-plugin\2.3.1\maven-install-plugin-2.3.1.pom.lastUpdated [WARNING] Failed to retrieve plugin descriptor for org.apache.maven.plugins:maven-install-plugin:2.3.1: Plugin org.apache.maven.plugins:maven-install-plugin:2.3.1 or one of its dependencies could not be resolved: Failed to read artifact descriptor for org.apache.maven.plugins:maven-install-plugin:jar:2.3.1 org.apache.maven.plugin.PluginResolutionException: Plugin org.apache.maven.plugins:maven-install-plugin:2.3.1 or one of its dependencies could not be resolved: Failed to read artifact descriptor for org.apache.maven.plugins:maven-install-plugin:jar:2.3.1 at org.apache.maven.plugin.internal.DefaultPluginDependenciesResolver.resolve(DefaultPluginDependenciesResolver.java:129) at org.apache.maven.plugin.internal.DefaultMavenPluginManager.getPluginDescriptor(DefaultMavenPluginManager.java:142) at org.apache.maven.plugin.DefaultBuildPluginManager.loadPlugin(DefaultBuildPluginManager.java:59) at org.apache.maven.plugin.prefix.internal.DefaultPluginPrefixResolver.resolveFromProject(DefaultPluginPrefixResolver.java:139) at org.apache.maven.plugin.prefix.internal.DefaultPluginPrefixResolver.resolveFromProject(DefaultPluginPrefixResolver.java:122) at org.apache.maven.plugin.prefix.internal.DefaultPluginPrefixResolver.resolve(DefaultPluginPrefixResolver.java:86) at org.apache.maven.lifecycle.internal.MojoDescriptorCreator.findPluginForPrefix(MojoDescriptorCreator.java:262) at org.apache.maven.lifecycle.internal.MojoDescriptorCreator.getMojoDescriptor(MojoDescriptorCreator.java:222) at org.apache.maven.lifecycle.internal.DefaultLifecycleTaskSegmentCalculator.calculateTaskSegments(DefaultLifecycleTaskSegmentCalculator.java:106) at org.apache.maven.lifecycle.internal.DefaultLifecycleTaskSegmentCalculator.calculateTaskSegments(DefaultLifecycleTaskSegmentCalculator.java:86) at org.apache.maven.lifecycle.internal.LifecycleStarter.execute(LifecycleStarter.java:98) at org.apache.maven.DefaultMaven.doExecute(DefaultMaven.java:320) at org.apache.maven.DefaultMaven.execute(DefaultMaven.java:156) at org.apache.maven.cli.MavenCli.execute(MavenCli.java:537) at org.apache.maven.cli.MavenCli.doMain(MavenCli.java:196) at org.apache.maven.cli.MavenCli.main(MavenCli.java:141) at sun.reflect.NativeMethodAccessorImpl.invoke0(Native Method) at sun.reflect.NativeMethodAccessorImpl.invoke(NativeMethodAccessorImpl.java:39) at sun.reflect.DelegatingMethodAccessorImpl.invoke(DelegatingMethodAccessorImpl.java:25) at java.lang.reflect.Method.invoke(Method.java:597) at org.codehaus.plexus.classworlds.launcher.Launcher.launchEnhanced(Launcher.java:290) at org.codehaus.plexus.classworlds.launcher.Launcher.launch(Launcher.java:230) at org.codehaus.plexus.classworlds.launcher.Launcher.mainWithExitCode(Launcher.java:409) at org.codehaus.plexus.classworlds.launcher.Launcher.main(Launcher.java:354) Caused by: org.sonatype.aether.resolution.ArtifactDescriptorException: Failed to read artifact descriptor for org.apache.maven.plugins:maven-install-plugin:jar:2.3.1 at org.apache.maven.repository.internal.DefaultArtifactDescriptorReader.loadPom(DefaultArtifactDescriptorReader.java:296) at org.apache.maven.repository.internal.DefaultArtifactDescriptorReader.readArtifactDescriptor(DefaultArtifactDescriptorReader.java:186) at org.sonatype.aether.impl.internal.DefaultRepositorySystem.readArtifactDescriptor(DefaultRepositorySystem.java:279) at org.apache.maven.plugin.internal.DefaultPluginDependenciesResolver.resolve(DefaultPluginDependenciesResolver.java:115) ... 23 more Caused by: org.sonatype.aether.resolution.ArtifactResolutionException: Could not transfer artifact org.apache.maven.plugins:maven-install-plugin:pom:2.3.1 from/to central (http://repo.maven.apache.org/maven2): Access denied to: http://repo.maven.apache.org/maven2/org/apache/maven/plugins/maven-install-plugin/2.3.1/maven-install-plugin-2.3.1.pom , ReasonPhrase:Forbidden. at org.sonatype.aether.impl.internal.DefaultArtifactResolver.resolve(DefaultArtifactResolver.java:538) at org.sonatype.aether.impl.internal.DefaultArtifactResolver.resolveArtifacts(DefaultArtifactResolver.java:216) at org.sonatype.aether.impl.internal.DefaultArtifactResolver.resolveArtifact(DefaultArtifactResolver.java:193) at org.apache.maven.repository.internal.DefaultArtifactDescriptorReader.loadPom(DefaultArtifactDescriptorReader.java:281) ... 26 more Caused by: org.sonatype.aether.transfer.ArtifactTransferException: Could not transfer artifact org.apache.maven.plugins:maven-install-plugin:pom:2.3.1 from/to central (http://repo.maven.apache.org/maven2): Access denied to: http://repo.maven.apache.org/maven2/org/apache/maven/plugins/maven-install-plugin/2.3.1/maven-install-plugin-2.3.1.pom , ReasonPhrase:Forbidden. at org.sonatype.aether.connector.wagon.WagonRepositoryConnector$4.wrap(WagonRepositoryConnector.java:951) at org.sonatype.aether.connector.wagon.WagonRepositoryConnector$4.wrap(WagonRepositoryConnector.java:941) at org.sonatype.aether.connector.wagon.WagonRepositoryConnector$GetTask.run(WagonRepositoryConnector.java:669) at org.sonatype.aether.util.concurrency.RunnableErrorForwarder$1.run(RunnableErrorForwarder.java:60) at java.util.concurrent.ThreadPoolExecutor$Worker.runTask(ThreadPoolExecutor.java:886) at java.util.concurrent.ThreadPoolExecutor$Worker.run(ThreadPoolExecutor.java:908) at java.lang.Thread.run(Thread.java:662) Caused by: org.apache.maven.wagon.authorization.AuthorizationException: Access denied to: http://repo.maven.apache.org/maven2/org/apache/maven/plugins/maven-install-plugin/2.3.1/maven-install-plugin-2.3.1.pom , ReasonPhrase:Forbidden. at org.apache.maven.wagon.shared.http4.AbstractHttpClientWagon.fillInputData(AbstractHttpClientWagon.java:928) at org.apache.maven.wagon.StreamWagon.getInputStream(StreamWagon.java:116) at org.apache.maven.wagon.StreamWagon.getIfNewer(StreamWagon.java:88) at org.apache.maven.wagon.StreamWagon.get(StreamWagon.java:62) at org.sonatype.aether.connector.wagon.WagonRepositoryConnector$GetTask.run(WagonRepositoryConnector.java:601) at org.sonatype.aether.util.concurrency.RunnableErrorForwarder$1.run(RunnableErrorForwarder.java:60) at java.util.concurrent.ThreadPoolExecutor$Worker.runTask(ThreadPoolExecutor.java:886) at java.util.concurrent.ThreadPoolExecutor$Worker.run(ThreadPoolExecutor.java:909) ... 1 more [DEBUG] Using connector WagonRepositoryConnector with priority 0 for http://repo.maven.apache.org/maven2 via 171.147.63.2:8080 as zkfiibm Downloading: http://repo.maven.apache.org/maven2/org/apache/maven/plugins/maven-deploy-plugin/2.7/maven-deploy-plugin-2.7.pom [DEBUG] Writing resolution tracking file C:\Toro Softwares\ToroRepo\org\apache\maven\plugins\maven-deploy-plugin\2.7\maven-deploy-plugin-2.7.pom.lastUpdated [WARNING] Failed to retrieve plugin descriptor for org.apache.maven.plugins:maven-deploy-plugin:2.7: Plugin org.apache.maven.plugins:maven-deploy-plugin:2.7 or one of its dependencies could not be resolved: Failed to read artifact descriptor for org.apache.maven.plugins:maven-deploy-plugin:jar:2.7 org.apache.maven.plugin.PluginResolutionException: Plugin org.apache.maven.plugins:maven-deploy-plugin:2.7 or one of its dependencies could not be resolved: Failed to read artifact descriptor for org.apache.maven.plugins:maven-deploy-plugin:jar:2.7 at org.apache.maven.plugin.internal.DefaultPluginDependenciesResolver.resolve(DefaultPluginDependenciesResolver.java:129) at org.apache.maven.plugin.internal.DefaultMavenPluginManager.getPluginDescriptor(DefaultMavenPluginManager.java:142) at org.apache.maven.plugin.DefaultBuildPluginManager.loadPlugin(DefaultBuildPluginManager.java:59) at org.apache.maven.plugin.prefix.internal.DefaultPluginPrefixResolver.resolveFromProject(DefaultPluginPrefixResolver.java:139) at org.apache.maven.plugin.prefix.internal.DefaultPluginPrefixResolver.resolveFromProject(DefaultPluginPrefixResolver.java:122) at org.apache.maven.plugin.prefix.internal.DefaultPluginPrefixResolver.resolve(DefaultPluginPrefixResolver.java:86) at org.apache.maven.lifecycle.internal.MojoDescriptorCreator.findPluginForPrefix(MojoDescriptorCreator.java:262) at org.apache.maven.lifecycle.internal.MojoDescriptorCreator.getMojoDescriptor(MojoDescriptorCreator.java:222) at org.apache.maven.lifecycle.internal.DefaultLifecycleTaskSegmentCalculator.calculateTaskSegments(DefaultLifecycleTaskSegmentCalculator.java:106) at org.apache.maven.lifecycle.internal.DefaultLifecycleTaskSegmentCalculator.calculateTaskSegments(DefaultLifecycleTaskSegmentCalculator.java:86) at org.apache.maven.lifecycle.internal.LifecycleStarter.execute(LifecycleStarter.java:98) at org.apache.maven.DefaultMaven.doExecute(DefaultMaven.java:320) at org.apache.maven.DefaultMaven.execute(DefaultMaven.java:156) at org.apache.maven.cli.MavenCli.execute(MavenCli.java:537) at org.apache.maven.cli.MavenCli.doMain(MavenCli.java:196) at org.apache.maven.cli.MavenCli.main(MavenCli.java:141) at sun.reflect.NativeMethodAccessorImpl.invoke0(Native Method) at sun.reflect.NativeMethodAccessorImpl.invoke(NativeMethodAccessorImpl.java:39) at sun.reflect.DelegatingMethodAccessorImpl.invoke(DelegatingMethodAccessorImpl.java:25) at java.lang.reflect.Method.invoke(Method.java:597) at org.codehaus.plexus.classworlds.launcher.Launcher.launchEnhanced(Launcher.java:290) at org.codehaus.plexus.classworlds.launcher.Launcher.launch(Launcher.java:230) at org.codehaus.plexus.classworlds.launcher.Launcher.mainWithExitCode(Launcher.java:409) at org.codehaus.plexus.classworlds.launcher.Launcher.main(Launcher.java:354) Caused by: org.sonatype.aether.resolution.ArtifactDescriptorException: Failed to read artifact descriptor for org.apache.maven.plugins:maven-deploy-plugin:jar:2.7 at org.apache.maven.repository.internal.DefaultArtifactDescriptorReader.loadPom(DefaultArtifactDescriptorReader.java:296) at org.apache.maven.repository.internal.DefaultArtifactDescriptorReader.readArtifactDescriptor(DefaultArtifactDescriptorReader.java:186) at org.sonatype.aether.impl.internal.DefaultRepositorySystem.readArtifactDescriptor(DefaultRepositorySystem.java:279) at org.apache.maven.plugin.internal.DefaultPluginDependenciesResolver.resolve(DefaultPluginDependenciesResolver.java:115) ... 23 more Caused by: org.sonatype.aether.resolution.ArtifactResolutionException: Could not transfer artifact org.apache.maven.plugins:maven-deploy-plugin:pom:2.7 from/to central (http://repo.maven.apache.org/maven2): Access denied to: http://repo.maven.apache.org/maven2/org/apache/maven/plugins/maven-deploy-plugin/2.7/maven-deploy-plugin-2.7.pom , ReasonPhrase:Forbidden. at org.sonatype.aether.impl.internal.DefaultArtifactResolver.resolve(DefaultArtifactResolver.java:538) at org.sonatype.aether.impl.internal.DefaultArtifactResolver.resolveArtifacts(DefaultArtifactResolver.java:216) at org.sonatype.aether.impl.internal.DefaultArtifactResolver.resolveArtifact(DefaultArtifactResolver.java:193) at org.apache.maven.repository.internal.DefaultArtifactDescriptorReader.loadPom(DefaultArtifactDescriptorReader.java:281) ... 26 more Caused by: org.sonatype.aether.transfer.ArtifactTransferException: Could not transfer artifact org.apache.maven.plugins:maven-deploy-plugin:pom:2.7 from/to central (http://repo.maven.apache.org/maven2): Access denied to: http://repo.maven.apache.org/maven2/org/apache/maven/plugins/maven-deploy-plugin/2.7/maven-deploy-plugin-2.7.pom , ReasonPhrase:Forbidden. at org.sonatype.aether.connector.wagon.WagonRepositoryConnector$4.wrap(WagonRepositoryConnector.java:951) at org.sonatype.aether.connector.wagon.WagonRepositoryConnector$4.wrap(WagonRepositoryConnector.java:941) at org.sonatype.aether.connector.wagon.WagonRepositoryConnector$GetTask.run(WagonRepositoryConnector.java:669) at org.sonatype.aether.util.concurrency.RunnableErrorForwarder$1.run(RunnableErrorForwarder.java:60) at java.util.concurrent.ThreadPoolExecutor$Worker.runTask(ThreadPoolExecutor.java:886) at java.util.concurrent.ThreadPoolExecutor$Worker.run(ThreadPoolExecutor.java:908) at java.lang.Thread.run(Thread.java:662) Caused by: org.apache.maven.wagon.authorization.AuthorizationException: Access denied to: http://repo.maven.apache.org/maven2/org/apache/maven/plugins/maven-deploy-plugin/2.7/maven-deploy-plugin-2.7.pom , ReasonPhrase:Forbidden. at org.apache.maven.wagon.shared.http4.AbstractHttpClientWagon.fillInputData(AbstractHttpClientWagon.java:928) at org.apache.maven.wagon.StreamWagon.getInputStream(StreamWagon.java:116) at org.apache.maven.wagon.StreamWagon.getIfNewer(StreamWagon.java:88) at org.apache.maven.wagon.StreamWagon.get(StreamWagon.java:62) at org.sonatype.aether.connector.wagon.WagonRepositoryConnector$GetTask.run(WagonRepositoryConnector.java:601) at org.sonatype.aether.util.concurrency.RunnableErrorForwarder$1.run(RunnableErrorForwarder.java:60) at java.util.concurrent.ThreadPoolExecutor$Worker.runTask(ThreadPoolExecutor.java:886) at java.util.concurrent.ThreadPoolExecutor$Worker.run(ThreadPoolExecutor.java:909) ... 1 more [DEBUG] Using connector WagonRepositoryConnector with priority 0 for http://repo.maven.apache.org/maven2 via 171.147.63.2:8080 as zkfiibm Downloading: http://repo.maven.apache.org/maven2/org/apache/maven/plugins/maven-site-plugin/3.0/maven-site-plugin-3.0.pom [DEBUG] Writing resolution tracking file C:\Toro Softwares\ToroRepo\org\apache\maven\plugins\maven-site-plugin\3.0\maven-site-plugin-3.0.pom.lastUpdated [WARNING] Failed to retrieve plugin descriptor for org.apache.maven.plugins:maven-site-plugin:3.0: Plugin org.apache.maven.plugins:maven-site-plugin:3.0 or one of its dependencies could not be resolved: Failed to read artifact descriptor for org.apache.maven.plugins:maven-site-plugin:jar:3.0 org.apache.maven.plugin.PluginResolutionException: Plugin org.apache.maven.plugins:maven-site-plugin:3.0 or one of its dependencies could not be resolved: Failed to read artifact descriptor for org.apache.maven.plugins:maven-site-plugin:jar:3.0 at org.apache.maven.plugin.internal.DefaultPluginDependenciesResolver.resolve(DefaultPluginDependenciesResolver.java:129) at org.apache.maven.plugin.internal.DefaultMavenPluginManager.getPluginDescriptor(DefaultMavenPluginManager.java:142) at org.apache.maven.plugin.DefaultBuildPluginManager.loadPlugin(DefaultBuildPluginManager.java:59) at org.apache.maven.plugin.prefix.internal.DefaultPluginPrefixResolver.resolveFromProject(DefaultPluginPrefixResolver.java:139) at org.apache.maven.plugin.prefix.internal.DefaultPluginPrefixResolver.resolveFromProject(DefaultPluginPrefixResolver.java:122) at org.apache.maven.plugin.prefix.internal.DefaultPluginPrefixResolver.resolve(DefaultPluginPrefixResolver.java:86) at org.apache.maven.lifecycle.internal.MojoDescriptorCreator.findPluginForPrefix(MojoDescriptorCreator.java:262) at org.apache.maven.lifecycle.internal.MojoDescriptorCreator.getMojoDescriptor(MojoDescriptorCreator.java:222) at org.apache.maven.lifecycle.internal.DefaultLifecycleTaskSegmentCalculator.calculateTaskSegments(DefaultLifecycleTaskSegmentCalculator.java:106) at org.apache.maven.lifecycle.internal.DefaultLifecycleTaskSegmentCalculator.calculateTaskSegments(DefaultLifecycleTaskSegmentCalculator.java:86) at org.apache.maven.lifecycle.internal.LifecycleStarter.execute(LifecycleStarter.java:98) at org.apache.maven.DefaultMaven.doExecute(DefaultMaven.java:320) at org.apache.maven.DefaultMaven.execute(DefaultMaven.java:156) at org.apache.maven.cli.MavenCli.execute(MavenCli.java:537) at org.apache.maven.cli.MavenCli.doMain(MavenCli.java:196) at org.apache.maven.cli.MavenCli.main(MavenCli.java:141) at sun.reflect.NativeMethodAccessorImpl.invoke0(Native Method) at sun.reflect.NativeMethodAccessorImpl.invoke(NativeMethodAccessorImpl.java:39) at sun.reflect.DelegatingMethodAccessorImpl.invoke(DelegatingMethodAccessorImpl.java:25) at java.lang.reflect.Method.invoke(Method.java:597) at org.codehaus.plexus.classworlds.launcher.Launcher.launchEnhanced(Launcher.java:290) at org.codehaus.plexus.classworlds.launcher.Launcher.launch(Launcher.java:230) at org.codehaus.plexus.classworlds.launcher.Launcher.mainWithExitCode(Launcher.java:409) at org.codehaus.plexus.classworlds.launcher.Launcher.main(Launcher.java:354) Caused by: org.sonatype.aether.resolution.ArtifactDescriptorException: Failed to read artifact descriptor for org.apache.maven.plugins:maven-site-plugin:jar:3.0 at org.apache.maven.repository.internal.DefaultArtifactDescriptorReader.loadPom(DefaultArtifactDescriptorReader.java:296) at org.apache.maven.repository.internal.DefaultArtifactDescriptorReader.readArtifactDescriptor(DefaultArtifactDescriptorReader.java:186) at org.sonatype.aether.impl.internal.DefaultRepositorySystem.readArtifactDescriptor(DefaultRepositorySystem.java:279) at org.apache.maven.plugin.internal.DefaultPluginDependenciesResolver.resolve(DefaultPluginDependenciesResolver.java:115) ... 23 more Caused by: org.sonatype.aether.resolution.ArtifactResolutionException: Could not transfer artifact org.apache.maven.plugins:maven-site-plugin:pom:3.0 from/to central (http://repo.maven.apache.org/maven2): Access denied to: http://repo.maven.apache.org/maven2/org/apache/maven/plugins/maven-site-plugin/3.0/maven-site-plugin-3.0.pom , ReasonPhrase:Forbidden. at org.sonatype.aether.impl.internal.DefaultArtifactResolver.resolve(DefaultArtifactResolver.java:538) at org.sonatype.aether.impl.internal.DefaultArtifactResolver.resolveArtifacts(DefaultArtifactResolver.java:216) at org.sonatype.aether.impl.internal.DefaultArtifactResolver.resolveArtifact(DefaultArtifactResolver.java:193) at org.apache.maven.repository.internal.DefaultArtifactDescriptorReader.loadPom(DefaultArtifactDescriptorReader.java:281) ... 26 more Caused by: org.sonatype.aether.transfer.ArtifactTransferException: Could not transfer artifact org.apache.maven.plugins:maven-site-plugin:pom:3.0 from/to central (http://repo.maven.apache.org/maven2): Access denied to: http://repo.maven.apache.org/maven2/org/apache/maven/plugins/maven-site-plugin/3.0/maven-site-plugin-3.0.pom , ReasonPhrase:Forbidden. at org.sonatype.aether.connector.wagon.WagonRepositoryConnector$4.wrap(WagonRepositoryConnector.java:951) at org.sonatype.aether.connector.wagon.WagonRepositoryConnector$4.wrap(WagonRepositoryConnector.java:941) at org.sonatype.aether.connector.wagon.WagonRepositoryConnector$GetTask.run(WagonRepositoryConnector.java:669) at org.sonatype.aether.util.concurrency.RunnableErrorForwarder$1.run(RunnableErrorForwarder.java:60) at java.util.concurrent.ThreadPoolExecutor$Worker.runTask(ThreadPoolExecutor.java:886) at java.util.concurrent.ThreadPoolExecutor$Worker.run(ThreadPoolExecutor.java:908) at java.lang.Thread.run(Thread.java:662) Caused by: org.apache.maven.wagon.authorization.AuthorizationException: Access denied to: http://repo.maven.apache.org/maven2/org/apache/maven/plugins/maven-site-plugin/3.0/maven-site-plugin-3.0.pom , ReasonPhrase:Forbidden. at org.apache.maven.wagon.shared.http4.AbstractHttpClientWagon.fillInputData(AbstractHttpClientWagon.java:928) at org.apache.maven.wagon.StreamWagon.getInputStream(StreamWagon.java:116) at org.apache.maven.wagon.StreamWagon.getIfNewer(StreamWagon.java:88) at org.apache.maven.wagon.StreamWagon.get(StreamWagon.java:62) at org.sonatype.aether.connector.wagon.WagonRepositoryConnector$GetTask.run(WagonRepositoryConnector.java:601) at org.sonatype.aether.util.concurrency.RunnableErrorForwarder$1.run(RunnableErrorForwarder.java:60) at java.util.concurrent.ThreadPoolExecutor$Worker.runTask(ThreadPoolExecutor.java:886) at java.util.concurrent.ThreadPoolExecutor$Worker.run(ThreadPoolExecutor.java:909) ... 1 more [DEBUG] Using connector WagonRepositoryConnector with priority 0 for http://repo.maven.apache.org/maven2 via 171.147.63.2:8080 as zkfiibm Downloading: http://repo.maven.apache.org/maven2/org/apache/maven/plugins/maven-antrun-plugin/1.3/maven-antrun-plugin-1.3.pom [DEBUG] Writing resolution tracking file C:\Toro Softwares\ToroRepo\org\apache\maven\plugins\maven-antrun-plugin\1.3\maven-antrun-plugin-1.3.pom.lastUpdated [WARNING] Failed to retrieve plugin descriptor for org.apache.maven.plugins:maven-antrun-plugin:1.3: Plugin org.apache.maven.plugins:maven-antrun-plugin:1.3 or one of its dependencies could not be resolved: Failed to read artifact descriptor for org.apache.maven.plugins:maven-antrun-plugin:jar:1.3 org.apache.maven.plugin.PluginResolutionException: Plugin org.apache.maven.plugins:maven-antrun-plugin:1.3 or one of its dependencies could not be resolved: Failed to read artifact descriptor for org.apache.maven.plugins:maven-antrun-plugin:jar:1.3 at org.apache.maven.plugin.internal.DefaultPluginDependenciesResolver.resolve(DefaultPluginDependenciesResolver.java:129) at org.apache.maven.plugin.internal.DefaultMavenPluginManager.getPluginDescriptor(DefaultMavenPluginManager.java:142) at org.apache.maven.plugin.DefaultBuildPluginManager.loadPlugin(DefaultBuildPluginManager.java:59) at org.apache.maven.plugin.prefix.internal.DefaultPluginPrefixResolver.resolveFromProject(DefaultPluginPrefixResolver.java:139) at org.apache.maven.plugin.prefix.internal.DefaultPluginPrefixResolver.resolveFromProject(DefaultPluginPrefixResolver.java:126) at org.apache.maven.plugin.prefix.internal.DefaultPluginPrefixResolver.resolve(DefaultPluginPrefixResolver.java:86) at org.apache.maven.lifecycle.internal.MojoDescriptorCreator.findPluginForPrefix(MojoDescriptorCreator.java:262) at org.apache.maven.lifecycle.internal.MojoDescriptorCreator.getMojoDescriptor(MojoDescriptorCreator.java:222) at org.apache.maven.lifecycle.internal.DefaultLifecycleTaskSegmentCalculator.calculateTaskSegments(DefaultLifecycleTaskSegmentCalculator.java:106) at org.apache.maven.lifecycle.internal.DefaultLifecycleTaskSegmentCalculator.calculateTaskSegments(DefaultLifecycleTaskSegmentCalculator.java:86) at org.apache.maven.lifecycle.internal.LifecycleStarter.execute(LifecycleStarter.java:98) at org.apache.maven.DefaultMaven.doExecute(DefaultMaven.java:320) at org.apache.maven.DefaultMaven.execute(DefaultMaven.java:156) at org.apache.maven.cli.MavenCli.execute(MavenCli.java:537) at org.apache.maven.cli.MavenCli.doMain(MavenCli.java:196) at org.apache.maven.cli.MavenCli.main(MavenCli.java:141) at sun.reflect.NativeMethodAccessorImpl.invoke0(Native Method) at sun.reflect.NativeMethodAccessorImpl.invoke(NativeMethodAccessorImpl.java:39) at sun.reflect.DelegatingMethodAccessorImpl.invoke(DelegatingMethodAccessorImpl.java:25) at java.lang.reflect.Method.invoke(Method.java:597) at org.codehaus.plexus.classworlds.launcher.Launcher.launchEnhanced(Launcher.java:290) at org.codehaus.plexus.classworlds.launcher.Launcher.launch(Launcher.java:230) at org.codehaus.plexus.classworlds.launcher.Launcher.mainWithExitCode(Launcher.java:409) at org.codehaus.plexus.classworlds.launcher.Launcher.main(Launcher.java:354) Caused by: org.sonatype.aether.resolution.ArtifactDescriptorException: Failed to read artifact descriptor for org.apache.maven.plugins:maven-antrun-plugin:jar:1.3 at org.apache.maven.repository.internal.DefaultArtifactDescriptorReader.loadPom(DefaultArtifactDescriptorReader.java:296) at org.apache.maven.repository.internal.DefaultArtifactDescriptorReader.readArtifactDescriptor(DefaultArtifactDescriptorReader.java:186) at org.sonatype.aether.impl.internal.DefaultRepositorySystem.readArtifactDescriptor(DefaultRepositorySystem.java:279) at org.apache.maven.plugin.internal.DefaultPluginDependenciesResolver.resolve(DefaultPluginDependenciesResolver.java:115) ... 23 more Caused by: org.sonatype.aether.resolution.ArtifactResolutionException: Could not transfer artifact org.apache.maven.plugins:maven-antrun-plugin:pom:1.3 from/to central (http://repo.maven.apache.org/maven2): Access denied to: http://repo.maven.apache.org/maven2/org/apache/maven/plugins/maven-antrun-plugin/1.3/maven-antrun-plugin-1.3.pom , ReasonPhrase:Forbidden. at org.sonatype.aether.impl.internal.DefaultArtifactResolver.resolve(DefaultArtifactResolver.java:538) at org.sonatype.aether.impl.internal.DefaultArtifactResolver.resolveArtifacts(DefaultArtifactResolver.java:216) at org.sonatype.aether.impl.internal.DefaultArtifactResolver.resolveArtifact(DefaultArtifactResolver.java:193) at org.apache.maven.repository.internal.DefaultArtifactDescriptorReader.loadPom(DefaultArtifactDescriptorReader.java:281) ... 26 more Caused by: org.sonatype.aether.transfer.ArtifactTransferException: Could not transfer artifact org.apache.maven.plugins:maven-antrun-plugin:pom:1.3 from/to central (http://repo.maven.apache.org/maven2): Access denied to: http://repo.maven.apache.org/maven2/org/apache/maven/plugins/maven-antrun-plugin/1.3/maven-antrun-plugin-1.3.pom , ReasonPhrase:Forbidden. at org.sonatype.aether.connector.wagon.WagonRepositoryConnector$4.wrap(WagonRepositoryConnector.java:951) at org.sonatype.aether.connector.wagon.WagonRepositoryConnector$4.wrap(WagonRepositoryConnector.java:941) at org.sonatype.aether.connector.wagon.WagonRepositoryConnector$GetTask.run(WagonRepositoryConnector.java:669) at org.sonatype.aether.util.concurrency.RunnableErrorForwarder$1.run(RunnableErrorForwarder.java:60) at java.util.concurrent.ThreadPoolExecutor$Worker.runTask(ThreadPoolExecutor.java:886) at java.util.concurrent.ThreadPoolExecutor$Worker.run(ThreadPoolExecutor.java:908) at java.lang.Thread.run(Thread.java:662) Caused by: org.apache.maven.wagon.authorization.AuthorizationException: Access denied to: http://repo.maven.apache.org/maven2/org/apache/maven/plugins/maven-antrun-plugin/1.3/maven-antrun-plugin-1.3.pom , ReasonPhrase:Forbidden. at org.apache.maven.wagon.shared.http4.AbstractHttpClientWagon.fillInputData(AbstractHttpClientWagon.java:928) at org.apache.maven.wagon.StreamWagon.getInputStream(StreamWagon.java:116) at org.apache.maven.wagon.StreamWagon.getIfNewer(StreamWagon.java:88) at org.apache.maven.wagon.StreamWagon.get(StreamWagon.java:62) at org.sonatype.aether.connector.wagon.WagonRepositoryConnector$GetTask.run(WagonRepositoryConnector.java:601) at org.sonatype.aether.util.concurrency.RunnableErrorForwarder$1.run(RunnableErrorForwarder.java:60) at java.util.concurrent.ThreadPoolExecutor$Worker.runTask(ThreadPoolExecutor.java:886) at java.util.concurrent.ThreadPoolExecutor$Worker.run(ThreadPoolExecutor.java:909) ... 1 more [DEBUG] Using connector WagonRepositoryConnector with priority 0 for http://repo.maven.apache.org/maven2 via 171.147.63.2:8080 as zkfiibm Downloading: http://repo.maven.apache.org/maven2/org/apache/maven/plugins/maven-assembly-plugin/2.2-beta-5/maven-assembly-plugin-2.2-beta-5.pom [DEBUG] Writing resolution tracking file C:\Toro Softwares\ToroRepo\org\apache\maven\plugins\maven-assembly-plugin\2.2-beta-5\maven-assembly-plugin-2.2-beta-5.pom.lastUpdated [WARNING] Failed to retrieve plugin descriptor for org.apache.maven.plugins:maven-assembly-plugin:2.2-beta-5: Plugin org.apache.maven.plugins:maven-assembly-plugin:2.2-beta-5 or one of its dependencies could not be resolved: Failed to read artifact descriptor for org.apache.maven.plugins:maven-assembly-plugin:jar:2.2-beta-5 org.apache.maven.plugin.PluginResolutionException: Plugin org.apache.maven.plugins:maven-assembly-plugin:2.2-beta-5 or one of its dependencies could not be resolved: Failed to read artifact descriptor for org.apache.maven.plugins:maven-assembly-plugin:jar:2.2-beta-5 at org.apache.maven.plugin.internal.DefaultPluginDependenciesResolver.resolve(DefaultPluginDependenciesResolver.java:129) at org.apache.maven.plugin.internal.DefaultMavenPluginManager.getPluginDescriptor(DefaultMavenPluginManager.java:142) at org.apache.maven.plugin.DefaultBuildPluginManager.loadPlugin(DefaultBuildPluginManager.java:59) at org.apache.maven.plugin.prefix.internal.DefaultPluginPrefixResolver.resolveFromProject(DefaultPluginPrefixResolver.java:139) at org.apache.maven.plugin.prefix.internal.DefaultPluginPrefixResolver.resolveFromProject(DefaultPluginPrefixResolver.java:126) at org.apache.maven.plugin.prefix.internal.DefaultPluginPrefixResolver.resolve(DefaultPluginPrefixResolver.java:86) at org.apache.maven.lifecycle.internal.MojoDescriptorCreator.findPluginForPrefix(MojoDescriptorCreator.java:262) at org.apache.maven.lifecycle.internal.MojoDescriptorCreator.getMojoDescriptor(MojoDescriptorCreator.java:222) at org.apache.maven.lifecycle.internal.DefaultLifecycleTaskSegmentCalculator.calculateTaskSegments(DefaultLifecycleTaskSegmentCalculator.java:106) at org.apache.maven.lifecycle.internal.DefaultLifecycleTaskSegmentCalculator.calculateTaskSegments(DefaultLifecycleTaskSegmentCalculator.java:86) at org.apache.maven.lifecycle.internal.LifecycleStarter.execute(LifecycleStarter.java:98) at org.apache.maven.DefaultMaven.doExecute(DefaultMaven.java:320) at org.apache.maven.DefaultMaven.execute(DefaultMaven.java:156) at org.apache.maven.cli.MavenCli.execute(MavenCli.java:537) at org.apache.maven.cli.MavenCli.doMain(MavenCli.java:196) at org.apache.maven.cli.MavenCli.main(MavenCli.java:141) at sun.reflect.NativeMethodAccessorImpl.invoke0(Native Method) at sun.reflect.NativeMethodAccessorImpl.invoke(NativeMethodAccessorImpl.java:39) at sun.reflect.DelegatingMethodAccessorImpl.invoke(DelegatingMethodAccessorImpl.java:25) at java.lang.reflect.Method.invoke(Method.java:597) at org.codehaus.plexus.classworlds.launcher.Launcher.launchEnhanced(Launcher.java:290) at org.codehaus.plexus.classworlds.launcher.Launcher.launch(Launcher.java:230) at org.codehaus.plexus.classworlds.launcher.Launcher.mainWithExitCode(Launcher.java:409) at org.codehaus.plexus.classworlds.launcher.Launcher.main(Launcher.java:354) Caused by: org.sonatype.aether.resolution.ArtifactDescriptorException: Failed to read artifact descriptor for org.apache.maven.plugins:maven-assembly-plugin:jar:2.2-beta-5 at org.apache.maven.repository.internal.DefaultArtifactDescriptorReader.loadPom(DefaultArtifactDescriptorReader.java:296) at org.apache.maven.repository.internal.DefaultArtifactDescriptorReader.readArtifactDescriptor(DefaultArtifactDescriptorReader.java:186) at org.sonatype.aether.impl.internal.DefaultRepositorySystem.readArtifactDescriptor(DefaultRepositorySystem.java:279) at org.apache.maven.plugin.internal.DefaultPluginDependenciesResolver.resolve(DefaultPluginDependenciesResolver.java:115) ... 23 more Caused by: org.sonatype.aether.resolution.ArtifactResolutionException: Could not transfer artifact org.apache.maven.plugins:maven-assembly-plugin:pom:2.2-beta-5 from/to central (http://repo.maven.apache.org/maven2): Access denied to: http://repo.maven.apache.org/maven2/org/apache/maven/plugins/maven-assembly-plugin/2.2-beta-5/maven-assembly-plugin-2.2-beta-5.pom , ReasonPhrase:Forbidden. at org.sonatype.aether.impl.internal.DefaultArtifactResolver.resolve(DefaultArtifactResolver.java:538) at org.sonatype.aether.impl.internal.DefaultArtifactResolver.resolveArtifacts(DefaultArtifactResolver.java:216) at org.sonatype.aether.impl.internal.DefaultArtifactResolver.resolveArtifact(DefaultArtifactResolver.java:193) at org.apache.maven.repository.internal.DefaultArtifactDescriptorReader.loadPom(DefaultArtifactDescriptorReader.java:281) ... 26 more Caused by: org.sonatype.aether.transfer.ArtifactTransferException: Could not transfer artifact org.apache.maven.plugins:maven-assembly-plugin:pom:2.2-beta-5 from/to central (http://repo.maven.apache.org/maven2): Access denied to: http://repo.maven.apache.org/maven2/org/apache/maven/plugins/maven-assembly-plugin/2.2-beta-5/maven-assembly-plugin-2.2-beta-5.pom , ReasonPhrase:Forbidden. at org.sonatype.aether.connector.wagon.WagonRepositoryConnector$4.wrap(WagonRepositoryConnector.java:951) at org.sonatype.aether.connector.wagon.WagonRepositoryConnector$4.wrap(WagonRepositoryConnector.java:941) at org.sonatype.aether.connector.wagon.WagonRepositoryConnector$GetTask.run(WagonRepositoryConnector.java:669) at org.sonatype.aether.util.concurrency.RunnableErrorForwarder$1.run(RunnableErrorForwarder.java:60) at java.util.concurrent.ThreadPoolExecutor$Worker.runTask(ThreadPoolExecutor.java:886) at java.util.concurrent.ThreadPoolExecutor$Worker.run(ThreadPoolExecutor.java:908) at java.lang.Thread.run(Thread.java:662) Caused by: org.apache.maven.wagon.authorization.AuthorizationException: Access denied to: http://repo.maven.apache.org/maven2/org/apache/maven/plugins/maven-assembly-plugin/2.2-beta-5/maven-assembly-plugin-2.2-beta-5.pom , ReasonPhrase:Forbidden. at org.apache.maven.wagon.shared.http4.AbstractHttpClientWagon.fillInputData(AbstractHttpClientWagon.java:928) at org.apache.maven.wagon.StreamWagon.getInputStream(StreamWagon.java:116) at org.apache.maven.wagon.StreamWagon.getIfNewer(StreamWagon.java:88) at org.apache.maven.wagon.StreamWagon.get(StreamWagon.java:62) at org.sonatype.aether.connector.wagon.WagonRepositoryConnector$GetTask.run(WagonRepositoryConnector.java:601) at org.sonatype.aether.util.concurrency.RunnableErrorForwarder$1.run(RunnableErrorForwarder.java:60) at java.util.concurrent.ThreadPoolExecutor$Worker.runTask(ThreadPoolExecutor.java:886) at java.util.concurrent.ThreadPoolExecutor$Worker.run(ThreadPoolExecutor.java:909) ... 1 more [DEBUG] Using connector WagonRepositoryConnector with priority 0 for http://repo.maven.apache.org/maven2 via 171.147.63.2:8080 as zkfiibm Downloading: http://repo.maven.apache.org/maven2/org/apache/maven/plugins/maven-dependency-plugin/2.1/maven-dependency-plugin-2.1.pom [DEBUG] Writing resolution tracking file C:\Toro Softwares\ToroRepo\org\apache\maven\plugins\maven-dependency-plugin\2.1\maven-dependency-plugin-2.1.pom.lastUpdated [WARNING] Failed to retrieve plugin descriptor for org.apache.maven.plugins:maven-dependency-plugin:2.1: Plugin org.apache.maven.plugins:maven-dependency-plugin:2.1 or one of its dependencies could not be resolved: Failed to read artifact descriptor for org.apache.maven.plugins:maven-dependency-plugin:jar:2.1 org.apache.maven.plugin.PluginResolutionException: Plugin org.apache.maven.plugins:maven-dependency-plugin:2.1 or one of its dependencies could not be resolved: Failed to read artifact descriptor for org.apache.maven.plugins:maven-dependency-plugin:jar:2.1 at org.apache.maven.plugin.internal.DefaultPluginDependenciesResolver.resolve(DefaultPluginDependenciesResolver.java:129) at org.apache.maven.plugin.internal.DefaultMavenPluginManager.getPluginDescriptor(DefaultMavenPluginManager.java:142) at org.apache.maven.plugin.DefaultBuildPluginManager.loadPlugin(DefaultBuildPluginManager.java:59) at org.apache.maven.plugin.prefix.internal.DefaultPluginPrefixResolver.resolveFromProject(DefaultPluginPrefixResolver.java:139) at org.apache.maven.plugin.prefix.internal.DefaultPluginPrefixResolver.resolveFromProject(DefaultPluginPrefixResolver.java:126) at org.apache.maven.plugin.prefix.internal.DefaultPluginPrefixResolver.resolve(DefaultPluginPrefixResolver.java:86) at org.apache.maven.lifecycle.internal.MojoDescriptorCreator.findPluginForPrefix(MojoDescriptorCreator.java:262) at org.apache.maven.lifecycle.internal.MojoDescriptorCreator.getMojoDescriptor(MojoDescriptorCreator.java:222) at org.apache.maven.lifecycle.internal.DefaultLifecycleTaskSegmentCalculator.calculateTaskSegments(DefaultLifecycleTaskSegmentCalculator.java:106) at org.apache.maven.lifecycle.internal.DefaultLifecycleTaskSegmentCalculator.calculateTaskSegments(DefaultLifecycleTaskSegmentCalculator.java:86) at org.apache.maven.lifecycle.internal.LifecycleStarter.execute(LifecycleStarter.java:98) at org.apache.maven.DefaultMaven.doExecute(DefaultMaven.java:320) at org.apache.maven.DefaultMaven.execute(DefaultMaven.java:156) at org.apache.maven.cli.MavenCli.execute(MavenCli.java:537) at org.apache.maven.cli.MavenCli.doMain(MavenCli.java:196) at org.apache.maven.cli.MavenCli.main(MavenCli.java:141) at sun.reflect.NativeMethodAccessorImpl.invoke0(Native Method) at sun.reflect.NativeMethodAccessorImpl.invoke(NativeMethodAccessorImpl.java:39) at sun.reflect.DelegatingMethodAccessorImpl.invoke(DelegatingMethodAccessorImpl.java:25) at java.lang.reflect.Method.invoke(Method.java:597) at org.codehaus.plexus.classworlds.launcher.Launcher.launchEnhanced(Launcher.java:290) at org.codehaus.plexus.classworlds.launcher.Launcher.launch(Launcher.java:230) at org.codehaus.plexus.classworlds.launcher.Launcher.mainWithExitCode(Launcher.java:409) at org.codehaus.plexus.classworlds.launcher.Launcher.main(Launcher.java:354) Caused by: org.sonatype.aether.resolution.ArtifactDescriptorException: Failed to read artifact descriptor for org.apache.maven.plugins:maven-dependency-plugin:jar:2.1 at org.apache.maven.repository.internal.DefaultArtifactDescriptorReader.loadPom(DefaultArtifactDescriptorReader.java:296) at org.apache.maven.repository.internal.DefaultArtifactDescriptorReader.readArtifactDescriptor(DefaultArtifactDescriptorReader.java:186) at org.sonatype.aether.impl.internal.DefaultRepositorySystem.readArtifactDescriptor(DefaultRepositorySystem.java:279) at org.apache.maven.plugin.internal.DefaultPluginDependenciesResolver.resolve(DefaultPluginDependenciesResolver.java:115) ... 23 more Caused by: org.sonatype.aether.resolution.ArtifactResolutionException: Could not transfer artifact org.apache.maven.plugins:maven-dependency-plugin:pom:2.1 from/to central (http://repo.maven.apache.org/maven2): Access denied to: http://repo.maven.apache.org/maven2/org/apache/maven/plugins/maven-dependency-plugin/2.1/maven-dependency-plugin-2.1.pom , ReasonPhrase:Forbidden. at org.sonatype.aether.impl.internal.DefaultArtifactResolver.resolve(DefaultArtifactResolver.java:538) at org.sonatype.aether.impl.internal.DefaultArtifactResolver.resolveArtifacts(DefaultArtifactResolver.java:216) at org.sonatype.aether.impl.internal.DefaultArtifactResolver.resolveArtifact(DefaultArtifactResolver.java:193) at org.apache.maven.repository.internal.DefaultArtifactDescriptorReader.loadPom(DefaultArtifactDescriptorReader.java:281) ... 26 more Caused by: org.sonatype.aether.transfer.ArtifactTransferException: Could not transfer artifact org.apache.maven.plugins:maven-dependency-plugin:pom:2.1 from/to central (http://repo.maven.apache.org/maven2): Access denied to: http://repo.maven.apache.org/maven2/org/apache/maven/plugins/maven-dependency-plugin/2.1/maven-dependency-plugin-2.1.pom , ReasonPhrase:Forbidden. at org.sonatype.aether.connector.wagon.WagonRepositoryConnector$4.wrap(WagonRepositoryConnector.java:951) at org.sonatype.aether.connector.wagon.WagonRepositoryConnector$4.wrap(WagonRepositoryConnector.java:941) at org.sonatype.aether.connector.wagon.WagonRepositoryConnector$GetTask.run(WagonRepositoryConnector.java:669) at org.sonatype.aether.util.concurrency.RunnableErrorForwarder$1.run(RunnableErrorForwarder.java:60) at java.util.concurrent.ThreadPoolExecutor$Worker.runTask(ThreadPoolExecutor.java:886) at java.util.concurrent.ThreadPoolExecutor$Worker.run(ThreadPoolExecutor.java:908) at java.lang.Thread.run(Thread.java:662) Caused by: org.apache.maven.wagon.authorization.AuthorizationException: Access denied to: http://repo.maven.apache.org/maven2/org/apache/maven/plugins/maven-dependency-plugin/2.1/maven-dependency-plugin-2.1.pom , ReasonPhrase:Forbidden. at org.apache.maven.wagon.shared.http4.AbstractHttpClientWagon.fillInputData(AbstractHttpClientWagon.java:928) at org.apache.maven.wagon.StreamWagon.getInputStream(StreamWagon.java:116) at org.apache.maven.wagon.StreamWagon.getIfNewer(StreamWagon.java:88) at org.apache.maven.wagon.StreamWagon.get(StreamWagon.java:62) at org.sonatype.aether.connector.wagon.WagonRepositoryConnector$GetTask.run(WagonRepositoryConnector.java:601) at org.sonatype.aether.util.concurrency.RunnableErrorForwarder$1.run(RunnableErrorForwarder.java:60) at java.util.concurrent.ThreadPoolExecutor$Worker.runTask(ThreadPoolExecutor.java:886) at java.util.concurrent.ThreadPoolExecutor$Worker.run(ThreadPoolExecutor.java:909) ... 1 more [DEBUG] Using connector WagonRepositoryConnector with priority 0 for http://repo.maven.apache.org/maven2 via 171.147.63.2:8080 as zkfiibm Downloading: http://repo.maven.apache.org/maven2/org/apache/maven/plugins/maven-release-plugin/2.0/maven-release-plugin-2.0.pom [DEBUG] Writing resolution tracking file C:\Toro Softwares\ToroRepo\org\apache\maven\plugins\maven-release-plugin\2.0\maven-release-plugin-2.0.pom.lastUpdated [WARNING] Failed to retrieve plugin descriptor for org.apache.maven.plugins:maven-release-plugin:2.0: Plugin org.apache.maven.plugins:maven-release-plugin:2.0 or one of its dependencies could not be resolved: Failed to read artifact descriptor for org.apache.maven.plugins:maven-release-plugin:jar:2.0 org.apache.maven.plugin.PluginResolutionException: Plugin org.apache.maven.plugins:maven-release-plugin:2.0 or one of its dependencies could not be resolved: Failed to read artifact descriptor for org.apache.maven.plugins:maven-release-plugin:jar:2.0 at org.apache.maven.plugin.internal.DefaultPluginDependenciesResolver.resolve(DefaultPluginDependenciesResolver.java:129) at org.apache.maven.plugin.internal.DefaultMavenPluginManager.getPluginDescriptor(DefaultMavenPluginManager.java:142) at org.apache.maven.plugin.DefaultBuildPluginManager.loadPlugin(DefaultBuildPluginManager.java:59) at org.apache.maven.plugin.prefix.internal.DefaultPluginPrefixResolver.resolveFromProject(DefaultPluginPrefixResolver.java:139) at org.apache.maven.plugin.prefix.internal.DefaultPluginPrefixResolver.resolveFromProject(DefaultPluginPrefixResolver.java:126) at org.apache.maven.plugin.prefix.internal.DefaultPluginPrefixResolver.resolve(DefaultPluginPrefixResolver.java:86) at org.apache.maven.lifecycle.internal.MojoDescriptorCreator.findPluginForPrefix(MojoDescriptorCreator.java:262) at org.apache.maven.lifecycle.internal.MojoDescriptorCreator.getMojoDescriptor(MojoDescriptorCreator.java:222) at org.apache.maven.lifecycle.internal.DefaultLifecycleTaskSegmentCalculator.calculateTaskSegments(DefaultLifecycleTaskSegmentCalculator.java:106) at org.apache.maven.lifecycle.internal.DefaultLifecycleTaskSegmentCalculator.calculateTaskSegments(DefaultLifecycleTaskSegmentCalculator.java:86) at org.apache.maven.lifecycle.internal.LifecycleStarter.execute(LifecycleStarter.java:98) at org.apache.maven.DefaultMaven.doExecute(DefaultMaven.java:320) at org.apache.maven.DefaultMaven.execute(DefaultMaven.java:156) at org.apache.maven.cli.MavenCli.execute(MavenCli.java:537) at org.apache.maven.cli.MavenCli.doMain(MavenCli.java:196) at org.apache.maven.cli.MavenCli.main(MavenCli.java:141) at sun.reflect.NativeMethodAccessorImpl.invoke0(Native Method) at sun.reflect.NativeMethodAccessorImpl.invoke(NativeMethodAccessorImpl.java:39) at sun.reflect.DelegatingMethodAccessorImpl.invoke(DelegatingMethodAccessorImpl.java:25) at java.lang.reflect.Method.invoke(Method.java:597) at org.codehaus.plexus.classworlds.launcher.Launcher.launchEnhanced(Launcher.java:290) at org.codehaus.plexus.classworlds.launcher.Launcher.launch(Launcher.java:230) at org.codehaus.plexus.classworlds.launcher.Launcher.mainWithExitCode(Launcher.java:409) at org.codehaus.plexus.classworlds.launcher.Launcher.main(Launcher.java:354) Caused by: org.sonatype.aether.resolution.ArtifactDescriptorException: Failed to read artifact descriptor for org.apache.maven.plugins:maven-release-plugin:jar:2.0 at org.apache.maven.repository.internal.DefaultArtifactDescriptorReader.loadPom(DefaultArtifactDescriptorReader.java:296) at org.apache.maven.repository.internal.DefaultArtifactDescriptorReader.readArtifactDescriptor(DefaultArtifactDescriptorReader.java:186) at org.sonatype.aether.impl.internal.DefaultRepositorySystem.readArtifactDescriptor(DefaultRepositorySystem.java:279) at org.apache.maven.plugin.internal.DefaultPluginDependenciesResolver.resolve(DefaultPluginDependenciesResolver.java:115) ... 23 more Caused by: org.sonatype.aether.resolution.ArtifactResolutionException: Could not transfer artifact org.apache.maven.plugins:maven-release-plugin:pom:2.0 from/to central (http://repo.maven.apache.org/maven2): Access denied to: http://repo.maven.apache.org/maven2/org/apache/maven/plugins/maven-release-plugin/2.0/maven-release-plugin-2.0.pom , ReasonPhrase:Forbidden. at org.sonatype.aether.impl.internal.DefaultArtifactResolver.resolve(DefaultArtifactResolver.java:538) at org.sonatype.aether.impl.internal.DefaultArtifactResolver.resolveArtifacts(DefaultArtifactResolver.java:216) at org.sonatype.aether.impl.internal.DefaultArtifactResolver.resolveArtifact(DefaultArtifactResolver.java:193) at org.apache.maven.repository.internal.DefaultArtifactDescriptorReader.loadPom(DefaultArtifactDescriptorReader.java:281) ... 26 more Caused by: org.sonatype.aether.transfer.ArtifactTransferException: Could not transfer artifact org.apache.maven.plugins:maven-release-plugin:pom:2.0 from/to central (http://repo.maven.apache.org/maven2): Access denied to: http://repo.maven.apache.org/maven2/org/apache/maven/plugins/maven-release-plugin/2.0/maven-release-plugin-2.0.pom , ReasonPhrase:Forbidden. at org.sonatype.aether.connector.wagon.WagonRepositoryConnector$4.wrap(WagonRepositoryConnector.java:951) at org.sonatype.aether.connector.wagon.WagonRepositoryConnector$4.wrap(WagonRepositoryConnector.java:941) at org.sonatype.aether.connector.wagon.WagonRepositoryConnector$GetTask.run(WagonRepositoryConnector.java:669) at org.sonatype.aether.util.concurrency.RunnableErrorForwarder$1.run(RunnableErrorForwarder.java:60) at java.util.concurrent.ThreadPoolExecutor$Worker.runTask(ThreadPoolExecutor.java:886) at java.util.concurrent.ThreadPoolExecutor$Worker.run(ThreadPoolExecutor.java:908) at java.lang.Thread.run(Thread.java:662) Caused by: org.apache.maven.wagon.authorization.AuthorizationException: Access denied to: http://repo.maven.apache.org/maven2/org/apache/maven/plugins/maven-release-plugin/2.0/maven-release-plugin-2.0.pom , ReasonPhrase:Forbidden. at org.apache.maven.wagon.shared.http4.AbstractHttpClientWagon.fillInputData(AbstractHttpClientWagon.java:928) at org.apache.maven.wagon.StreamWagon.getInputStream(StreamWagon.java:116) at org.apache.maven.wagon.StreamWagon.getIfNewer(StreamWagon.java:88) at org.apache.maven.wagon.StreamWagon.get(StreamWagon.java:62) at org.sonatype.aether.connector.wagon.WagonRepositoryConnector$GetTask.run(WagonRepositoryConnector.java:601) at org.sonatype.aether.util.concurrency.RunnableErrorForwarder$1.run(RunnableErrorForwarder.java:60) at java.util.concurrent.ThreadPoolExecutor$Worker.runTask(ThreadPoolExecutor.java:886) at java.util.concurrent.ThreadPoolExecutor$Worker.run(ThreadPoolExecutor.java:909) ... 1 more [DEBUG] Could not find metadata org.apache.maven.plugins/maven-metadata.xml in local (C:\Toro Softwares\ToroRepo) [DEBUG] Could not find metadata org.codehaus.mojo/maven-metadata.xml in local (C:\Toro Softwares\ToroRepo) [DEBUG] Using connector WagonRepositoryConnector with priority 0 for http://repo.maven.apache.org/maven2 via 171.147.63.2:8080 as zkfiibm [DEBUG] Using connector WagonRepositoryConnector with priority 0 for http://repo.maven.apache.org/maven2 via 171.147.63.2:8080 as zkfiibm Downloading: http://repo.maven.apache.org/maven2/org/apache/maven/plugins/maven-metadata.xml Downloading: http://repo.maven.apache.org/maven2/org/codehaus/mojo/maven-metadata.xml [DEBUG] Writing resolution tracking file C:\Toro Softwares\ToroRepo\org\apache\maven\plugins\resolver-status.properties [DEBUG] Writing resolution tracking file C:\Toro Softwares\ToroRepo\org\codehaus\mojo\resolver-status.properties [WARNING] Could not transfer metadata org.apache.maven.plugins/maven-metadata.xml from/to central (http://repo.maven.apache.org/maven2): Access denied to: http://repo.maven.apache.org/maven2/org/apache/maven/plugins/maven-metadata.xml , ReasonPhrase:Forbidden. org.sonatype.aether.transfer.MetadataTransferException: Could not transfer metadata org.apache.maven.plugins/maven-metadata.xml from/to central (http://repo.maven.apache.org/maven2): Access denied to: http://repo.maven.apache.org/maven2/org/apache/maven/plugins/maven-metadata.xml , ReasonPhrase:Forbidden. at org.sonatype.aether.connector.wagon.WagonRepositoryConnector$3.wrap(WagonRepositoryConnector.java:930) at org.sonatype.aether.connector.wagon.WagonRepositoryConnector$3.wrap(WagonRepositoryConnector.java:920) at org.sonatype.aether.connector.wagon.WagonRepositoryConnector$GetTask.run(WagonRepositoryConnector.java:669) at org.sonatype.aether.util.concurrency.RunnableErrorForwarder$1.run(RunnableErrorForwarder.java:60) at java.util.concurrent.ThreadPoolExecutor$Worker.runTask(ThreadPoolExecutor.java:886) at java.util.concurrent.ThreadPoolExecutor$Worker.run(ThreadPoolExecutor.java:908) at java.lang.Thread.run(Thread.java:662) Caused by: org.apache.maven.wagon.authorization.AuthorizationException: Access denied to: http://repo.maven.apache.org/maven2/org/apache/maven/plugins/maven-metadata.xml , ReasonPhrase:Forbidden. at org.apache.maven.wagon.shared.http4.AbstractHttpClientWagon.fillInputData(AbstractHttpClientWagon.java:928) at org.apache.maven.wagon.StreamWagon.getInputStream(StreamWagon.java:116) at org.apache.maven.wagon.StreamWagon.getIfNewer(StreamWagon.java:88) at org.apache.maven.wagon.StreamWagon.get(StreamWagon.java:62) at org.sonatype.aether.connector.wagon.WagonRepositoryConnector$GetTask.run(WagonRepositoryConnector.java:601) at org.sonatype.aether.util.concurrency.RunnableErrorForwarder$1.run(RunnableErrorForwarder.java:60) at java.util.concurrent.ThreadPoolExecutor$Worker.runTask(ThreadPoolExecutor.java:886) at java.util.concurrent.ThreadPoolExecutor$Worker.run(ThreadPoolExecutor.java:909) ... 1 more [WARNING] Could not transfer metadata org.codehaus.mojo/maven-metadata.xml from/to central (http://repo.maven.apache.org/maven2): Access denied to: http://repo.maven.apache.org/maven2/org/codehaus/mojo/maven-metadata.xml , ReasonPhrase:Forbidden. org.sonatype.aether.transfer.MetadataTransferException: Could not transfer metadata org.codehaus.mojo/maven-metadata.xml from/to central (http://repo.maven.apache.org/maven2): Access denied to: http://repo.maven.apache.org/maven2/org/codehaus/mojo/maven-metadata.xml , ReasonPhrase:Forbidden. at org.sonatype.aether.connector.wagon.WagonRepositoryConnector$3.wrap(WagonRepositoryConnector.java:930) at org.sonatype.aether.connector.wagon.WagonRepositoryConnector$3.wrap(WagonRepositoryConnector.java:920) at org.sonatype.aether.connector.wagon.WagonRepositoryConnector$GetTask.run(WagonRepositoryConnector.java:669) at org.sonatype.aether.util.concurrency.RunnableErrorForwarder$1.run(RunnableErrorForwarder.java:60) at java.util.concurrent.ThreadPoolExecutor$Worker.runTask(ThreadPoolExecutor.java:886) at java.util.concurrent.ThreadPoolExecutor$Worker.run(ThreadPoolExecutor.java:908) at java.lang.Thread.run(Thread.java:662) Caused by: org.apache.maven.wagon.authorization.AuthorizationException: Access denied to: http://repo.maven.apache.org/maven2/org/codehaus/mojo/maven-metadata.xml , ReasonPhrase:Forbidden. at org.apache.maven.wagon.shared.http4.AbstractHttpClientWagon.fillInputData(AbstractHttpClientWagon.java:928) at org.apache.maven.wagon.StreamWagon.getInputStream(StreamWagon.java:116) at org.apache.maven.wagon.StreamWagon.getIfNewer(StreamWagon.java:88) at org.apache.maven.wagon.StreamWagon.get(StreamWagon.java:62) at org.sonatype.aether.connector.wagon.WagonRepositoryConnector$GetTask.run(WagonRepositoryConnector.java:601) at org.sonatype.aether.util.concurrency.RunnableErrorForwarder$1.run(RunnableErrorForwarder.java:60) at java.util.concurrent.ThreadPoolExecutor$Worker.runTask(ThreadPoolExecutor.java:886) at java.util.concurrent.ThreadPoolExecutor$Worker.run(ThreadPoolExecutor.java:909) ... 1 more [DEBUG] Could not find metadata org.apache.maven.plugins/maven-metadata.xml in local (C:\Toro Softwares\ToroRepo) [DEBUG] Skipped remote update check for org.apache.maven.plugins/maven-metadata.xml, already updated during this session. [WARNING] Failure to transfer org.apache.maven.plugins/maven-metadata.xml from http://repo.maven.apache.org/maven2 was cached in the local repository, resolution will not be reattempted until the update interval of central has elapsed or updates are forced. Original error: Could not transfer metadata org.apache.maven.plugins/maven-metadata.xml from/to central (http://repo.maven.apache.org/maven2): Access denied to: http://repo.maven.apache.org/maven2/org/apache/maven/plugins/maven-metadata.xml , ReasonPhrase:Forbidden. org.sonatype.aether.transfer.MetadataTransferException: Failure to transfer org.apache.maven.plugins/maven-metadata.xml from http://repo.maven.apache.org/maven2 was cached in the local repository, resolution will not be reattempted until the update interval of central has elapsed or updates are forced. Original error: Could not transfer metadata org.apache.maven.plugins/maven-metadata.xml from/to central (http://repo.maven.apache.org/maven2): Access denied to: http://repo.maven.apache.org/maven2/org/apache/maven/plugins/maven-metadata.xml , ReasonPhrase:Forbidden. at org.sonatype.aether.impl.internal.DefaultUpdateCheckManager.newException(DefaultUpdateCheckManager.java:369) at org.sonatype.aether.impl.internal.DefaultUpdateCheckManager.checkMetadata(DefaultUpdateCheckManager.java:315) at org.sonatype.aether.impl.internal.DefaultMetadataResolver.resolve(DefaultMetadataResolver.java:295) at org.sonatype.aether.impl.internal.DefaultMetadataResolver.resolveMetadata(DefaultMetadataResolver.java:173) at org.sonatype.aether.impl.internal.DefaultRepositorySystem.resolveMetadata(DefaultRepositorySystem.java:301) at org.apache.maven.plugin.prefix.internal.DefaultPluginPrefixResolver.resolveFromRepository(DefaultPluginPrefixResolver.java:203) at org.apache.maven.plugin.prefix.internal.DefaultPluginPrefixResolver.resolve(DefaultPluginPrefixResolver.java:90) at org.apache.maven.lifecycle.internal.MojoDescriptorCreator.findPluginForPrefix(MojoDescriptorCreator.java:262) at org.apache.maven.lifecycle.internal.MojoDescriptorCreator.getMojoDescriptor(MojoDescriptorCreator.java:222) at org.apache.maven.lifecycle.internal.DefaultLifecycleTaskSegmentCalculator.calculateTaskSegments(DefaultLifecycleTaskSegmentCalculator.java:106) at org.apache.maven.lifecycle.internal.DefaultLifecycleTaskSegmentCalculator.calculateTaskSegments(DefaultLifecycleTaskSegmentCalculator.java:86) at org.apache.maven.lifecycle.internal.LifecycleStarter.execute(LifecycleStarter.java:98) at org.apache.maven.DefaultMaven.doExecute(DefaultMaven.java:320) at org.apache.maven.DefaultMaven.execute(DefaultMaven.java:156) at org.apache.maven.cli.MavenCli.execute(MavenCli.java:537) at org.apache.maven.cli.MavenCli.doMain(MavenCli.java:196) at org.apache.maven.cli.MavenCli.main(MavenCli.java:141) at sun.reflect.NativeMethodAccessorImpl.invoke0(Native Method) at sun.reflect.NativeMethodAccessorImpl.invoke(NativeMethodAccessorImpl.java:39) at sun.reflect.DelegatingMethodAccessorImpl.invoke(DelegatingMethodAccessorImpl.java:25) at java.lang.reflect.Method.invoke(Method.java:597) at org.codehaus.plexus.classworlds.launcher.Launcher.launchEnhanced(Launcher.java:290) at org.codehaus.plexus.classworlds.launcher.Launcher.launch(Launcher.java:230) at org.codehaus.plexus.classworlds.launcher.Launcher.mainWithExitCode(Launcher.java:409) at org.codehaus.plexus.classworlds.launcher.Launcher.main(Launcher.java:352) [DEBUG] Could not find metadata org.codehaus.mojo/maven-metadata.xml in local (C:\Toro Softwares\ToroRepo) [DEBUG] Skipped remote update check for org.codehaus.mojo/maven-metadata.xml, already updated during this session. [WARNING] Failure to transfer org.codehaus.mojo/maven-metadata.xml from http://repo.maven.apache.org/maven2 was cached in the local repository, resolution will not be reattempted until the update interval of central has elapsed or updates are forced. Original error: Could not transfer metadata org.codehaus.mojo/maven-metadata.xml from/to central (http://repo.maven.apache.org/maven2): Access denied to: http://repo.maven.apache.org/maven2/org/codehaus/mojo/maven-metadata.xml , ReasonPhrase:Forbidden. org.sonatype.aether.transfer.MetadataTransferException: Failure to transfer org.codehaus.mojo/maven-metadata.xml from http://repo.maven.apache.org/maven2 was cached in the local repository, resolution will not be reattempted until the update interval of central has elapsed or updates are forced. Original error: Could not transfer metadata org.codehaus.mojo/maven-metadata.xml from/to central (http://repo.maven.apache.org/maven2): Access denied to: http://repo.maven.apache.org/maven2/org/codehaus/mojo/maven-metadata.xml , ReasonPhrase:Forbidden. at org.sonatype.aether.impl.internal.DefaultUpdateCheckManager.newException(DefaultUpdateCheckManager.java:369) at org.sonatype.aether.impl.internal.DefaultUpdateCheckManager.checkMetadata(DefaultUpdateCheckManager.java:315) at org.sonatype.aether.impl.internal.DefaultMetadataResolver.resolve(DefaultMetadataResolver.java:295) at org.sonatype.aether.impl.internal.DefaultMetadataResolver.resolveMetadata(DefaultMetadataResolver.java:173) at org.sonatype.aether.impl.internal.DefaultRepositorySystem.resolveMetadata(DefaultRepositorySystem.java:301) at org.apache.maven.plugin.prefix.internal.DefaultPluginPrefixResolver.resolveFromRepository(DefaultPluginPrefixResolver.java:203) at org.apache.maven.plugin.prefix.internal.DefaultPluginPrefixResolver.resolve(DefaultPluginPrefixResolver.java:90) at org.apache.maven.lifecycle.internal.MojoDescriptorCreator.findPluginForPrefix(MojoDescriptorCreator.java:262) at org.apache.maven.lifecycle.internal.MojoDescriptorCreator.getMojoDescriptor(MojoDescriptorCreator.java:222) at org.apache.maven.lifecycle.internal.DefaultLifecycleTaskSegmentCalculator.calculateTaskSegments(DefaultLifecycleTaskSegmentCalculator.java:106) at org.apache.maven.lifecycle.internal.DefaultLifecycleTaskSegmentCalculator.calculateTaskSegments(DefaultLifecycleTaskSegmentCalculator.java:86) at org.apache.maven.lifecycle.internal.LifecycleStarter.execute(LifecycleStarter.java:98) at org.apache.maven.DefaultMaven.doExecute(DefaultMaven.java:320) at org.apache.maven.DefaultMaven.execute(DefaultMaven.java:156) at org.apache.maven.cli.MavenCli.execute(MavenCli.java:537) at org.apache.maven.cli.MavenCli.doMain(MavenCli.java:196) at org.apache.maven.cli.MavenCli.main(MavenCli.java:141) at sun.reflect.NativeMethodAccessorImpl.invoke0(Native Method) at sun.reflect.NativeMethodAccessorImpl.invoke(NativeMethodAccessorImpl.java:39) at sun.reflect.DelegatingMethodAccessorImpl.invoke(DelegatingMethodAccessorImpl.java:25) at java.lang.reflect.Method.invoke(Method.java:597) at org.codehaus.plexus.classworlds.launcher.Launcher.launchEnhanced(Launcher.java:290) at org.codehaus.plexus.classworlds.launcher.Launcher.launch(Launcher.java:230) at org.codehaus.plexus.classworlds.launcher.Launcher.mainWithExitCode(Launcher.java:409) at org.codehaus.plexus.classworlds.launcher.Launcher.main(Launcher.java:352) [INFO] ------------------------------------------------------------------------ [INFO] BUILD FAILURE [INFO] ------------------------------------------------------------------------ [INFO] Total time: 2.018s [INFO] Finished at: Thu Oct 03 18:20:29 IST 2013 [INFO] Final Memory: 33M/64M [INFO] ------------------------------------------------------------------------ [ERROR] No plugin found for prefix 'archetype' in the current project and in the plugin groups [org.apache.maven.plugins, org.codehaus.mojo] available from the repositories [local (C:\Toro Softwares\ToroRepo), central (http://repo.maven.apache.org/maven2)] -> [Help 1] org.apache.maven.plugin.prefix.NoPluginFoundForPrefixException: No plugin found for prefix 'archetype' in the current project and in the plugin groups [org.apache.maven.plugins, org.codehaus.mojo] available from the repositories [local (C:\Toro Softwares\ToroRepo), central (http://repo.maven.apache.org/maven2)] at org.apache.maven.plugin.prefix.internal.DefaultPluginPrefixResolver.resolve(DefaultPluginPrefixResolver.java:94) at org.apache.maven.lifecycle.internal.MojoDescriptorCreator.findPluginForPrefix(MojoDescriptorCreator.java:262) at org.apache.maven.lifecycle.internal.MojoDescriptorCreator.getMojoDescriptor(MojoDescriptorCreator.java:222) at org.apache.maven.lifecycle.internal.DefaultLifecycleTaskSegmentCalculator.calculateTaskSegments(DefaultLifecycleTaskSegmentCalculator.java:106) at org.apache.maven.lifecycle.internal.DefaultLifecycleTaskSegmentCalculator.calculateTaskSegments(DefaultLifecycleTaskSegmentCalculator.java:86) at org.apache.maven.lifecycle.internal.LifecycleStarter.execute(LifecycleStarter.java:98) at org.apache.maven.DefaultMaven.doExecute(DefaultMaven.java:320) at org.apache.maven.DefaultMaven.execute(DefaultMaven.java:156) at org.apache.maven.cli.MavenCli.execute(MavenCli.java:537) at org.apache.maven.cli.MavenCli.doMain(MavenCli.java:196) at org.apache.maven.cli.MavenCli.main(MavenCli.java:141) at sun.reflect.NativeMethodAccessorImpl.invoke0(Native Method) at sun.reflect.NativeMethodAccessorImpl.invoke(NativeMethodAccessorImpl.java:39) at sun.reflect.DelegatingMethodAccessorImpl.invoke(DelegatingMethodAccessorImpl.java:25) at java.lang.reflect.Method.invoke(Method.java:597) at org.codehaus.plexus.classworlds.launcher.Launcher.launchEnhanced(Launcher.java:290) at org.codehaus.plexus.classworlds.launcher.Launcher.launch(Launcher.java:230) at org.codehaus.plexus.classworlds.launcher.Launcher.mainWithExitCode(Launcher.java:409) at org.codehaus.plexus.classworlds.launcher.Launcher.main(Launcher.java:354) [ERROR] [ERROR] [ERROR] For more information about the errors and possible solutions, please read the following articles: [ERROR] [Help 1] http://cwiki.apache.org/confluence/display/MAVEN/NoPluginFoundForPrefixException