Cannot build Nexus-OSS

Previous Topic Next Topic
 
classic Classic list List threaded Threaded
8 messages Options
Reply | Threaded
Open this post in threaded view
|

Cannot build Nexus-OSS

Neil Bartlett
Hi,

I am unable to build Nexus-OSS, which I have just checked out from the
Github project. The build reports multiple errors "Unknown packaging:
nexus-plugin". The full error output is at the bottom of this email. I
am using Maven 3.0.5 and Java 1.6.0_31 on Mac OS 10.8.2. I could not
find any actual build instructions for Nexus, so I simply assumed "mvn
install" is correct. I have no ~/.m2/settings.xml.

If there are some special setup steps required before building, might
I suggest that these be documented somewhere?

Kind regards,
Neil

Full error output:

[ERROR] The build could not read 25 projects -> [Help 1]
[ERROR]
[ERROR]   The project
org.sonatype.nexus:nexus-it-helper-plugin:2.6.0-SNAPSHOT
(/Users/njbartlett/Projects/nexus-oss/testsupport/nexus-it-helper-plugin/pom.xml)
has 2 errors
[ERROR]     Unresolveable build extension: Plugin
org.sonatype.nexus:nexus-plugin-bundle-maven-plugin:1.0.1-SNAPSHOT or
one of its dependencies could not be resolved: Could not find artifact
org.sonatype.nexus:nexus-plugin-bund
le-maven-plugin:jar:1.0.1-SNAPSHOT -> [Help 2]
[ERROR]     Unknown packaging: nexus-plugin @ line 28, column 14
[ERROR]
[ERROR]   The project
org.sonatype.nexus.plugins:nexus-crypto-plugin:2.6.0-SNAPSHOT
(/Users/njbartlett/Projects/nexus-oss/plugins/basic/nexus-crypto-plugin/pom.xml)
has 2 errors
[ERROR]     Unresolveable build extension: Plugin
org.sonatype.nexus:nexus-plugin-bundle-maven-plugin:1.0.1-SNAPSHOT or
one of its dependencies could not be resolved: Could not find artifact
org.sonatype.nexus:nexus-plugin-bund
le-maven-plugin:jar:1.0.1-SNAPSHOT -> [Help 2]
[ERROR]     Unknown packaging: nexus-plugin @ line 28, column 14
[ERROR]
[ERROR]   The project
org.sonatype.nexus.plugins:nexus-h2-plugin:2.6.0-SNAPSHOT
(/Users/njbartlett/Projects/nexus-oss/plugins/basic/nexus-h2-plugin/pom.xml)
has 2 errors
[ERROR]     Unresolveable build extension: Plugin
org.sonatype.nexus:nexus-plugin-bundle-maven-plugin:1.0.1-SNAPSHOT or
one of its dependencies could not be resolved: Could not find artifact
org.sonatype.nexus:nexus-plugin-bund
le-maven-plugin:jar:1.0.1-SNAPSHOT -> [Help 2]
[ERROR]     Unknown packaging: nexus-plugin @ line 28, column 14
[ERROR]
[ERROR]   The project
org.sonatype.nexus.plugins:nexus-lvo-plugin:2.6.0-SNAPSHOT
(/Users/njbartlett/Projects/nexus-oss/plugins/basic/nexus-lvo-plugin/pom.xml)
has 2 errors
[ERROR]     Unresolveable build extension: Plugin
org.sonatype.nexus:nexus-plugin-bundle-maven-plugin:1.0.1-SNAPSHOT or
one of its dependencies could not be resolved: Could not find artifact
org.sonatype.nexus:nexus-plugin-bund
le-maven-plugin:jar:1.0.1-SNAPSHOT -> [Help 2]
[ERROR]     Unknown packaging: nexus-plugin @ line 27, column 14
[ERROR]
[ERROR]   The project
org.sonatype.nexus.plugins:nexus-plugin-console-plugin:2.6.0-SNAPSHOT
(/Users/njbartlett/Projects/nexus-oss/plugins/basic/nexus-plugin-console-plugin/pom.xml)
has 2 errors
[ERROR]     Unresolveable build extension: Plugin
org.sonatype.nexus:nexus-plugin-bundle-maven-plugin:1.0.1-SNAPSHOT or
one of its dependencies could not be resolved: Could not find artifact
org.sonatype.nexus:nexus-plugin-bund
le-maven-plugin:jar:1.0.1-SNAPSHOT -> [Help 2]
[ERROR]     Unknown packaging: nexus-plugin @ line 28, column 14
[ERROR]
[ERROR]   The project
org.sonatype.nexus.plugins:nexus-rrb-plugin:2.6.0-SNAPSHOT
(/Users/njbartlett/Projects/nexus-oss/plugins/basic/nexus-rrb-plugin/pom.xml)
has 2 errors
[ERROR]     Unresolveable build extension: Plugin
org.sonatype.nexus:nexus-plugin-bundle-maven-plugin:1.0.1-SNAPSHOT or
one of its dependencies could not be resolved: Could not find artifact
org.sonatype.nexus:nexus-plugin-bund
le-maven-plugin:jar:1.0.1-SNAPSHOT -> [Help 2]
[ERROR]     Unknown packaging: nexus-plugin @ line 29, column 14
[ERROR]
[ERROR]   The project
org.sonatype.nexus.plugins:nexus-siesta-plugin:2.6.0-SNAPSHOT
(/Users/njbartlett/Projects/nexus-oss/plugins/basic/nexus-siesta-plugin/pom.xml)
has 2 errors
[ERROR]     Unresolveable build extension: Plugin
org.sonatype.nexus:nexus-plugin-bundle-maven-plugin:1.0.1-SNAPSHOT or
one of its dependencies could not be resolved: Could not find artifact
org.sonatype.nexus:nexus-plugin-bund
le-maven-plugin:jar:1.0.1-SNAPSHOT -> [Help 2]
[ERROR]     Unknown packaging: nexus-plugin @ line 28, column 14
[ERROR]
[ERROR]   The project
org.sonatype.nexus.plugins:nexus-site-repository-plugin:2.6.0-SNAPSHOT
(/Users/njbartlett/Projects/nexus-oss/plugins/basic/nexus-site-repository-plugin/pom.xml)
has 2 errors
[ERROR]     Unresolveable build extension: Plugin
org.sonatype.nexus:nexus-plugin-bundle-maven-plugin:1.0.1-SNAPSHOT or
one of its dependencies could not be resolved: Could not find artifact
org.sonatype.nexus:nexus-plugin-bund
le-maven-plugin:jar:1.0.1-SNAPSHOT -> [Help 2]
[ERROR]     Unknown packaging: nexus-plugin @ line 27, column 14
[ERROR]
[ERROR]   The project
org.sonatype.nexus.plugins:nexus-timeline-plugin:2.6.0-SNAPSHOT
(/Users/njbartlett/Projects/nexus-oss/plugins/basic/nexus-timeline-plugin/pom.xml)
has 2 errors
[ERROR]     Unresolveable build extension: Plugin
org.sonatype.nexus:nexus-plugin-bundle-maven-plugin:1.0.1-SNAPSHOT or
one of its dependencies could not be resolved: Could not find artifact
org.sonatype.nexus:nexus-plugin-bund
le-maven-plugin:jar:1.0.1-SNAPSHOT -> [Help 2]
[ERROR]     Unknown packaging: nexus-plugin @ line 28, column 14
[ERROR]
[ERROR]   The project
org.sonatype.nexus.plugins:nexus-ui-extjs3-plugin:2.6.0-SNAPSHOT
(/Users/njbartlett/Projects/nexus-oss/plugins/basic/nexus-ui-extjs3-plugin/pom.xml)
has 2 errors
[ERROR]     Unresolveable build extension: Plugin
org.sonatype.nexus:nexus-plugin-bundle-maven-plugin:1.0.1-SNAPSHOT or
one of its dependencies could not be resolved: Could not find artifact
org.sonatype.nexus:nexus-plugin-bund
le-maven-plugin:jar:1.0.1-SNAPSHOT -> [Help 2]
[ERROR]     Unknown packaging: nexus-plugin @ line 28, column 14
[ERROR]
[ERROR]   The project
org.sonatype.nexus.plugins:nexus-unpack-plugin:2.6.0-SNAPSHOT
(/Users/njbartlett/Projects/nexus-oss/plugins/basic/nexus-unpack-plugin/pom.xml)
has 2 errors
[ERROR]     Unresolveable build extension: Plugin
org.sonatype.nexus:nexus-plugin-bundle-maven-plugin:1.0.1-SNAPSHOT or
one of its dependencies could not be resolved: Could not find artifact
org.sonatype.nexus:nexus-plugin-bund
le-maven-plugin:jar:1.0.1-SNAPSHOT -> [Help 2]
[ERROR]     Unknown packaging: nexus-plugin @ line 28, column 14
[ERROR]
[ERROR]   The project
org.sonatype.nexus.plugins:nexus-capabilities-plugin:2.6.0-SNAPSHOT
(/Users/njbartlett/Projects/nexus-oss/plugins/capabilities/nexus-capabilities-plugin/pom.xml)
has 2 errors
[ERROR]     Unresolveable build extension: Plugin
org.sonatype.nexus:nexus-plugin-bundle-maven-plugin:1.0.1-SNAPSHOT or
one of its dependencies could not be resolved: Could not find artifact
org.sonatype.nexus:nexus-plugin-bund
le-maven-plugin:jar:1.0.1-SNAPSHOT -> [Help 2]
[ERROR]     Unknown packaging: nexus-plugin @ line 30, column 14
[ERROR]
[ERROR]   The project
org.sonatype.nexus.plugins:nexus-capabilities-testsuite-helper:2.6.0-SNAPSHOT
(/Users/njbartlett/Projects/nexus-oss/plugins/capabilities/nexus-capabilities-testsuite-helper/pom.xml)
has 2 errors
[ERROR]     Unresolveable build extension: Plugin
org.sonatype.nexus:nexus-plugin-bundle-maven-plugin:1.0.1-SNAPSHOT or
one of its dependencies could not be resolved: Could not find artifact
org.sonatype.nexus:nexus-plugin-bund
le-maven-plugin:jar:1.0.1-SNAPSHOT -> [Help 2]
[ERROR]     Unknown packaging: nexus-plugin @ line 28, column 14
[ERROR]
[ERROR]   The project
org.sonatype.nexus.plugins:nexus-indexer-lucene-plugin:2.6.0-SNAPSHOT
(/Users/njbartlett/Projects/nexus-oss/plugins/indexer/nexus-indexer-lucene-plugin/pom.xml)
has 2 errors
[ERROR]     Unresolveable build extension: Plugin
org.sonatype.nexus:nexus-plugin-bundle-maven-plugin:1.0.1-SNAPSHOT or
one of its dependencies could not be resolved: Could not find artifact
org.sonatype.nexus:nexus-plugin-bund
le-maven-plugin:jar:1.0.1-SNAPSHOT -> [Help 2]
[ERROR]     Unknown packaging: nexus-plugin @ line 28, column 14
[ERROR]
[ERROR]   The project
org.sonatype.nexus.plugins:nexus-groovyremote-plugin:2.6.0-SNAPSHOT
(/Users/njbartlett/Projects/nexus-oss/plugins/internal/nexus-groovyremote-plugin/pom.xml)
has 2 errors
[ERROR]     Unresolveable build extension: Plugin
org.sonatype.nexus:nexus-plugin-bundle-maven-plugin:1.0.1-SNAPSHOT or
one of its dependencies could not be resolved: Could not find artifact
org.sonatype.nexus:nexus-plugin-bund
le-maven-plugin:jar:1.0.1-SNAPSHOT -> [Help 2]
[ERROR]     Unknown packaging: nexus-plugin @ line 28, column 14
[ERROR]
[ERROR]   The project
org.sonatype.nexus.plugins:nexus-maven-bridge-plugin:2.6.0-SNAPSHOT
(/Users/njbartlett/Projects/nexus-oss/plugins/maven/nexus-maven-bridge-plugin/pom.xml)
has 2 errors
[ERROR]     Unresolveable build extension: Plugin
org.sonatype.nexus:nexus-plugin-bundle-maven-plugin:1.0.1-SNAPSHOT or
one of its dependencies could not be resolved: Could not find artifact
org.sonatype.nexus:nexus-plugin-bund
le-maven-plugin:jar:1.0.1-SNAPSHOT -> [Help 2]
[ERROR]     Unknown packaging: nexus-plugin @ line 29, column 14
[ERROR]
[ERROR]   The project
org.sonatype.nexus.plugins:nexus-archetype-plugin:2.6.0-SNAPSHOT
(/Users/njbartlett/Projects/nexus-oss/plugins/maven/nexus-archetype-plugin/pom.xml)
has 2 errors
[ERROR]     Unresolveable build extension: Plugin
org.sonatype.nexus:nexus-plugin-bundle-maven-plugin:1.0.1-SNAPSHOT or
one of its dependencies could not be resolved: Could not find artifact
org.sonatype.nexus:nexus-plugin-bund
le-maven-plugin:jar:1.0.1-SNAPSHOT -> [Help 2]
[ERROR]     Unknown packaging: nexus-plugin @ line 29, column 14
[ERROR]
[ERROR]   The project
org.sonatype.nexus.plugins:nexus-obr-plugin:2.6.0-SNAPSHOT
(/Users/njbartlett/Projects/nexus-oss/plugins/osgi/nexus-obr-plugin/pom.xml)
has 2 errors
[ERROR]     Unresolveable build extension: Plugin
org.sonatype.nexus:nexus-plugin-bundle-maven-plugin:1.0.1-SNAPSHOT or
one of its dependencies could not be resolved: Could not find artifact
org.sonatype.nexus:nexus-plugin-bund
le-maven-plugin:jar:1.0.1-SNAPSHOT -> [Help 2]
[ERROR]     Unknown packaging: nexus-plugin @ line 28, column 14
[ERROR]
[ERROR]   The project
org.sonatype.nexus.plugins:nexus-p2-bridge-plugin:2.6.0-SNAPSHOT
(/Users/njbartlett/Projects/nexus-oss/plugins/p2/nexus-p2-bridge-plugin/pom.xml)
has 2 errors
[ERROR]     Unresolveable build extension: Plugin
org.sonatype.nexus:nexus-plugin-bundle-maven-plugin:1.0.1-SNAPSHOT or
one of its dependencies could not be resolved: Could not find artifact
org.sonatype.nexus:nexus-plugin-bund
le-maven-plugin:jar:1.0.1-SNAPSHOT -> [Help 2]
[ERROR]     Unknown packaging: nexus-plugin @ line 28, column 14
[ERROR]
[ERROR]   The project
org.sonatype.nexus.plugins:nexus-p2-repository-plugin:2.6.0-SNAPSHOT
(/Users/njbartlett/Projects/nexus-oss/plugins/p2/nexus-p2-repository-plugin/pom.xml)
has 2 errors
[ERROR]     Unresolveable build extension: Plugin
org.sonatype.nexus:nexus-plugin-bundle-maven-plugin:1.0.1-SNAPSHOT or
one of its dependencies could not be resolved: Could not find artifact
org.sonatype.nexus:nexus-plugin-bund
le-maven-plugin:jar:1.0.1-SNAPSHOT -> [Help 2]
[ERROR]     Unknown packaging: nexus-plugin @ line 28, column 14
[ERROR]
[ERROR]   The project
org.sonatype.nexus.plugins:nexus-restlet1x-plugin:2.6.0-SNAPSHOT
(/Users/njbartlett/Projects/nexus-oss/plugins/restlet1x/nexus-restlet1x-plugin/pom.xml)
has 2 errors
[ERROR]     Unresolveable build extension: Plugin
org.sonatype.nexus:nexus-plugin-bundle-maven-plugin:1.0.1-SNAPSHOT or
one of its dependencies could not be resolved: Could not find artifact
org.sonatype.nexus:nexus-plugin-bund
le-maven-plugin:jar:1.0.1-SNAPSHOT -> [Help 2]
[ERROR]     Unknown packaging: nexus-plugin @ line 28, column 14
[ERROR]
[ERROR]   The project
org.sonatype.nexus.plugins:nexus-restlet1x-testsupport-plugin:2.6.0-SNAPSHOT
(/Users/njbartlett/Projects/nexus-oss/plugins/restlet1x/nexus-restlet1x-testsupport-plugin/pom.xml)
has 2 errors
[ERROR]     Unresolveable build extension: Plugin
org.sonatype.nexus:nexus-plugin-bundle-maven-plugin:1.0.1-SNAPSHOT or
one of its dependencies could not be resolved: Could not find artifact
org.sonatype.nexus:nexus-plugin-bund
le-maven-plugin:jar:1.0.1-SNAPSHOT -> [Help 2]
[ERROR]     Unknown packaging: nexus-plugin @ line 28, column 14
[ERROR]
[ERROR]   The project
org.sonatype.nexus.plugins:nexus-ldap-realm-plugin:2.6.0-SNAPSHOT
(/Users/njbartlett/Projects/nexus-oss/plugins/security/nexus-ldap-realm-plugin/pom.xml)
has 2 errors
[ERROR]     Unresolveable build extension: Plugin
org.sonatype.nexus:nexus-plugin-bundle-maven-plugin:1.0.1-SNAPSHOT or
one of its dependencies could not be resolved: Could not find artifact
org.sonatype.nexus:nexus-plugin-bund
le-maven-plugin:jar:1.0.1-SNAPSHOT -> [Help 2]
[ERROR]     Unknown packaging: nexus-plugin @ line 31, column 14
[ERROR]
[ERROR]   The project
org.sonatype.nexus.plugins:nexus-kenai-plugin:2.6.0-SNAPSHOT
(/Users/njbartlett/Projects/nexus-oss/plugins/security/nexus-kenai-plugin/pom.xml)
has 2 errors
[ERROR]     Unresolveable build extension: Plugin
org.sonatype.nexus:nexus-plugin-bundle-maven-plugin:1.0.1-SNAPSHOT or
one of its dependencies could not be resolved: Could not find artifact
org.sonatype.nexus:nexus-plugin-bund
le-maven-plugin:jar:1.0.1-SNAPSHOT -> [Help 2]
[ERROR]     Unknown packaging: nexus-plugin @ line 29, column 14
[ERROR]
[ERROR]   The project
org.sonatype.nexus.testsuite:nexus-testsuite:2.6.0-SNAPSHOT
(/Users/njbartlett/Projects/nexus-oss/testsuite/pom.xml) has 1 error
[ERROR]     Unresolveable build extension: Plugin
org.sonatype.nexus:nexus-plugin-bundle-maven-plugin:1.0.1-SNAPSHOT or
one of its dependencies could not be resolved: Could not find artifact
org.sonatype.nexus:nexus-plugin-bund
le-maven-plugin:jar:1.0.1-SNAPSHOT -> [Help 2]
[ERROR]
[ERROR] To see the full stack trace of the errors, re-run Maven with
the -e switch.
[ERROR] Re-run Maven using the -X switch to enable full debug logging.
[ERROR]
[ERROR] For more information about the errors and possible solutions,
please read the following articles:
[ERROR] [Help 1]
http://cwiki.apache.org/confluence/display/MAVEN/ProjectBuildingException
[ERROR] [Help 2]
http://cwiki.apache.org/confluence/display/MAVEN/PluginResolutionException
n

---------------------------------------------------------------------
To unsubscribe, e-mail: [hidden email]
For additional commands, e-mail: [hidden email]

Reply | Threaded
Open this post in threaded view
|

Re: Cannot build Nexus-OSS

Stuart McCulloch-2
Hi Neil,

Nexus trunk depends on some snapshots at the moment which are available in the forge repository:

        https://repository.sonatype.org/content/groups/sonatype-public-grid/

you can either add this to your local repository manager (if you happen to already have one installed)

or as an additional repository (and pluginRepository) in your settings.xml:

        http://books.sonatype.com/mvnref-book/reference/appendix-settings-sect-details.html#appendix-settings-sect-settings-repository

or use a mirror by following the old instructions at:

        https://github.com/sonatype/nexus/blob/158692ec7c4bcf1a6e711e9ad3b9a1297f96b231/README.md#building

--
Cheers, Stuart

On 20 Jun 2013, at 12:24, Neil Bartlett wrote:

> Hi,
>
> I am unable to build Nexus-OSS, which I have just checked out from the
> Github project. The build reports multiple errors "Unknown packaging:
> nexus-plugin". The full error output is at the bottom of this email. I
> am using Maven 3.0.5 and Java 1.6.0_31 on Mac OS 10.8.2. I could not
> find any actual build instructions for Nexus, so I simply assumed "mvn
> install" is correct. I have no ~/.m2/settings.xml.
>
> If there are some special setup steps required before building, might
> I suggest that these be documented somewhere?
>
> Kind regards,
> Neil
>
> Full error output:
>
> [ERROR] The build could not read 25 projects -> [Help 1]
> [ERROR]
> [ERROR]   The project
> org.sonatype.nexus:nexus-it-helper-plugin:2.6.0-SNAPSHOT
> (/Users/njbartlett/Projects/nexus-oss/testsupport/nexus-it-helper-plugin/pom.xml)
> has 2 errors
> [ERROR]     Unresolveable build extension: Plugin
> org.sonatype.nexus:nexus-plugin-bundle-maven-plugin:1.0.1-SNAPSHOT or
> one of its dependencies could not be resolved: Could not find artifact
> org.sonatype.nexus:nexus-plugin-bund
> le-maven-plugin:jar:1.0.1-SNAPSHOT -> [Help 2]
> [ERROR]     Unknown packaging: nexus-plugin @ line 28, column 14
> [ERROR]
> [ERROR]   The project
> org.sonatype.nexus.plugins:nexus-crypto-plugin:2.6.0-SNAPSHOT
> (/Users/njbartlett/Projects/nexus-oss/plugins/basic/nexus-crypto-plugin/pom.xml)
> has 2 errors
> [ERROR]     Unresolveable build extension: Plugin
> org.sonatype.nexus:nexus-plugin-bundle-maven-plugin:1.0.1-SNAPSHOT or
> one of its dependencies could not be resolved: Could not find artifact
> org.sonatype.nexus:nexus-plugin-bund
> le-maven-plugin:jar:1.0.1-SNAPSHOT -> [Help 2]
> [ERROR]     Unknown packaging: nexus-plugin @ line 28, column 14
> [ERROR]
> [ERROR]   The project
> org.sonatype.nexus.plugins:nexus-h2-plugin:2.6.0-SNAPSHOT
> (/Users/njbartlett/Projects/nexus-oss/plugins/basic/nexus-h2-plugin/pom.xml)
> has 2 errors
> [ERROR]     Unresolveable build extension: Plugin
> org.sonatype.nexus:nexus-plugin-bundle-maven-plugin:1.0.1-SNAPSHOT or
> one of its dependencies could not be resolved: Could not find artifact
> org.sonatype.nexus:nexus-plugin-bund
> le-maven-plugin:jar:1.0.1-SNAPSHOT -> [Help 2]
> [ERROR]     Unknown packaging: nexus-plugin @ line 28, column 14
> [ERROR]
> [ERROR]   The project
> org.sonatype.nexus.plugins:nexus-lvo-plugin:2.6.0-SNAPSHOT
> (/Users/njbartlett/Projects/nexus-oss/plugins/basic/nexus-lvo-plugin/pom.xml)
> has 2 errors
> [ERROR]     Unresolveable build extension: Plugin
> org.sonatype.nexus:nexus-plugin-bundle-maven-plugin:1.0.1-SNAPSHOT or
> one of its dependencies could not be resolved: Could not find artifact
> org.sonatype.nexus:nexus-plugin-bund
> le-maven-plugin:jar:1.0.1-SNAPSHOT -> [Help 2]
> [ERROR]     Unknown packaging: nexus-plugin @ line 27, column 14
> [ERROR]
> [ERROR]   The project
> org.sonatype.nexus.plugins:nexus-plugin-console-plugin:2.6.0-SNAPSHOT
> (/Users/njbartlett/Projects/nexus-oss/plugins/basic/nexus-plugin-console-plugin/pom.xml)
> has 2 errors
> [ERROR]     Unresolveable build extension: Plugin
> org.sonatype.nexus:nexus-plugin-bundle-maven-plugin:1.0.1-SNAPSHOT or
> one of its dependencies could not be resolved: Could not find artifact
> org.sonatype.nexus:nexus-plugin-bund
> le-maven-plugin:jar:1.0.1-SNAPSHOT -> [Help 2]
> [ERROR]     Unknown packaging: nexus-plugin @ line 28, column 14
> [ERROR]
> [ERROR]   The project
> org.sonatype.nexus.plugins:nexus-rrb-plugin:2.6.0-SNAPSHOT
> (/Users/njbartlett/Projects/nexus-oss/plugins/basic/nexus-rrb-plugin/pom.xml)
> has 2 errors
> [ERROR]     Unresolveable build extension: Plugin
> org.sonatype.nexus:nexus-plugin-bundle-maven-plugin:1.0.1-SNAPSHOT or
> one of its dependencies could not be resolved: Could not find artifact
> org.sonatype.nexus:nexus-plugin-bund
> le-maven-plugin:jar:1.0.1-SNAPSHOT -> [Help 2]
> [ERROR]     Unknown packaging: nexus-plugin @ line 29, column 14
> [ERROR]
> [ERROR]   The project
> org.sonatype.nexus.plugins:nexus-siesta-plugin:2.6.0-SNAPSHOT
> (/Users/njbartlett/Projects/nexus-oss/plugins/basic/nexus-siesta-plugin/pom.xml)
> has 2 errors
> [ERROR]     Unresolveable build extension: Plugin
> org.sonatype.nexus:nexus-plugin-bundle-maven-plugin:1.0.1-SNAPSHOT or
> one of its dependencies could not be resolved: Could not find artifact
> org.sonatype.nexus:nexus-plugin-bund
> le-maven-plugin:jar:1.0.1-SNAPSHOT -> [Help 2]
> [ERROR]     Unknown packaging: nexus-plugin @ line 28, column 14
> [ERROR]
> [ERROR]   The project
> org.sonatype.nexus.plugins:nexus-site-repository-plugin:2.6.0-SNAPSHOT
> (/Users/njbartlett/Projects/nexus-oss/plugins/basic/nexus-site-repository-plugin/pom.xml)
> has 2 errors
> [ERROR]     Unresolveable build extension: Plugin
> org.sonatype.nexus:nexus-plugin-bundle-maven-plugin:1.0.1-SNAPSHOT or
> one of its dependencies could not be resolved: Could not find artifact
> org.sonatype.nexus:nexus-plugin-bund
> le-maven-plugin:jar:1.0.1-SNAPSHOT -> [Help 2]
> [ERROR]     Unknown packaging: nexus-plugin @ line 27, column 14
> [ERROR]
> [ERROR]   The project
> org.sonatype.nexus.plugins:nexus-timeline-plugin:2.6.0-SNAPSHOT
> (/Users/njbartlett/Projects/nexus-oss/plugins/basic/nexus-timeline-plugin/pom.xml)
> has 2 errors
> [ERROR]     Unresolveable build extension: Plugin
> org.sonatype.nexus:nexus-plugin-bundle-maven-plugin:1.0.1-SNAPSHOT or
> one of its dependencies could not be resolved: Could not find artifact
> org.sonatype.nexus:nexus-plugin-bund
> le-maven-plugin:jar:1.0.1-SNAPSHOT -> [Help 2]
> [ERROR]     Unknown packaging: nexus-plugin @ line 28, column 14
> [ERROR]
> [ERROR]   The project
> org.sonatype.nexus.plugins:nexus-ui-extjs3-plugin:2.6.0-SNAPSHOT
> (/Users/njbartlett/Projects/nexus-oss/plugins/basic/nexus-ui-extjs3-plugin/pom.xml)
> has 2 errors
> [ERROR]     Unresolveable build extension: Plugin
> org.sonatype.nexus:nexus-plugin-bundle-maven-plugin:1.0.1-SNAPSHOT or
> one of its dependencies could not be resolved: Could not find artifact
> org.sonatype.nexus:nexus-plugin-bund
> le-maven-plugin:jar:1.0.1-SNAPSHOT -> [Help 2]
> [ERROR]     Unknown packaging: nexus-plugin @ line 28, column 14
> [ERROR]
> [ERROR]   The project
> org.sonatype.nexus.plugins:nexus-unpack-plugin:2.6.0-SNAPSHOT
> (/Users/njbartlett/Projects/nexus-oss/plugins/basic/nexus-unpack-plugin/pom.xml)
> has 2 errors
> [ERROR]     Unresolveable build extension: Plugin
> org.sonatype.nexus:nexus-plugin-bundle-maven-plugin:1.0.1-SNAPSHOT or
> one of its dependencies could not be resolved: Could not find artifact
> org.sonatype.nexus:nexus-plugin-bund
> le-maven-plugin:jar:1.0.1-SNAPSHOT -> [Help 2]
> [ERROR]     Unknown packaging: nexus-plugin @ line 28, column 14
> [ERROR]
> [ERROR]   The project
> org.sonatype.nexus.plugins:nexus-capabilities-plugin:2.6.0-SNAPSHOT
> (/Users/njbartlett/Projects/nexus-oss/plugins/capabilities/nexus-capabilities-plugin/pom.xml)
> has 2 errors
> [ERROR]     Unresolveable build extension: Plugin
> org.sonatype.nexus:nexus-plugin-bundle-maven-plugin:1.0.1-SNAPSHOT or
> one of its dependencies could not be resolved: Could not find artifact
> org.sonatype.nexus:nexus-plugin-bund
> le-maven-plugin:jar:1.0.1-SNAPSHOT -> [Help 2]
> [ERROR]     Unknown packaging: nexus-plugin @ line 30, column 14
> [ERROR]
> [ERROR]   The project
> org.sonatype.nexus.plugins:nexus-capabilities-testsuite-helper:2.6.0-SNAPSHOT
> (/Users/njbartlett/Projects/nexus-oss/plugins/capabilities/nexus-capabilities-testsuite-helper/pom.xml)
> has 2 errors
> [ERROR]     Unresolveable build extension: Plugin
> org.sonatype.nexus:nexus-plugin-bundle-maven-plugin:1.0.1-SNAPSHOT or
> one of its dependencies could not be resolved: Could not find artifact
> org.sonatype.nexus:nexus-plugin-bund
> le-maven-plugin:jar:1.0.1-SNAPSHOT -> [Help 2]
> [ERROR]     Unknown packaging: nexus-plugin @ line 28, column 14
> [ERROR]
> [ERROR]   The project
> org.sonatype.nexus.plugins:nexus-indexer-lucene-plugin:2.6.0-SNAPSHOT
> (/Users/njbartlett/Projects/nexus-oss/plugins/indexer/nexus-indexer-lucene-plugin/pom.xml)
> has 2 errors
> [ERROR]     Unresolveable build extension: Plugin
> org.sonatype.nexus:nexus-plugin-bundle-maven-plugin:1.0.1-SNAPSHOT or
> one of its dependencies could not be resolved: Could not find artifact
> org.sonatype.nexus:nexus-plugin-bund
> le-maven-plugin:jar:1.0.1-SNAPSHOT -> [Help 2]
> [ERROR]     Unknown packaging: nexus-plugin @ line 28, column 14
> [ERROR]
> [ERROR]   The project
> org.sonatype.nexus.plugins:nexus-groovyremote-plugin:2.6.0-SNAPSHOT
> (/Users/njbartlett/Projects/nexus-oss/plugins/internal/nexus-groovyremote-plugin/pom.xml)
> has 2 errors
> [ERROR]     Unresolveable build extension: Plugin
> org.sonatype.nexus:nexus-plugin-bundle-maven-plugin:1.0.1-SNAPSHOT or
> one of its dependencies could not be resolved: Could not find artifact
> org.sonatype.nexus:nexus-plugin-bund
> le-maven-plugin:jar:1.0.1-SNAPSHOT -> [Help 2]
> [ERROR]     Unknown packaging: nexus-plugin @ line 28, column 14
> [ERROR]
> [ERROR]   The project
> org.sonatype.nexus.plugins:nexus-maven-bridge-plugin:2.6.0-SNAPSHOT
> (/Users/njbartlett/Projects/nexus-oss/plugins/maven/nexus-maven-bridge-plugin/pom.xml)
> has 2 errors
> [ERROR]     Unresolveable build extension: Plugin
> org.sonatype.nexus:nexus-plugin-bundle-maven-plugin:1.0.1-SNAPSHOT or
> one of its dependencies could not be resolved: Could not find artifact
> org.sonatype.nexus:nexus-plugin-bund
> le-maven-plugin:jar:1.0.1-SNAPSHOT -> [Help 2]
> [ERROR]     Unknown packaging: nexus-plugin @ line 29, column 14
> [ERROR]
> [ERROR]   The project
> org.sonatype.nexus.plugins:nexus-archetype-plugin:2.6.0-SNAPSHOT
> (/Users/njbartlett/Projects/nexus-oss/plugins/maven/nexus-archetype-plugin/pom.xml)
> has 2 errors
> [ERROR]     Unresolveable build extension: Plugin
> org.sonatype.nexus:nexus-plugin-bundle-maven-plugin:1.0.1-SNAPSHOT or
> one of its dependencies could not be resolved: Could not find artifact
> org.sonatype.nexus:nexus-plugin-bund
> le-maven-plugin:jar:1.0.1-SNAPSHOT -> [Help 2]
> [ERROR]     Unknown packaging: nexus-plugin @ line 29, column 14
> [ERROR]
> [ERROR]   The project
> org.sonatype.nexus.plugins:nexus-obr-plugin:2.6.0-SNAPSHOT
> (/Users/njbartlett/Projects/nexus-oss/plugins/osgi/nexus-obr-plugin/pom.xml)
> has 2 errors
> [ERROR]     Unresolveable build extension: Plugin
> org.sonatype.nexus:nexus-plugin-bundle-maven-plugin:1.0.1-SNAPSHOT or
> one of its dependencies could not be resolved: Could not find artifact
> org.sonatype.nexus:nexus-plugin-bund
> le-maven-plugin:jar:1.0.1-SNAPSHOT -> [Help 2]
> [ERROR]     Unknown packaging: nexus-plugin @ line 28, column 14
> [ERROR]
> [ERROR]   The project
> org.sonatype.nexus.plugins:nexus-p2-bridge-plugin:2.6.0-SNAPSHOT
> (/Users/njbartlett/Projects/nexus-oss/plugins/p2/nexus-p2-bridge-plugin/pom.xml)
> has 2 errors
> [ERROR]     Unresolveable build extension: Plugin
> org.sonatype.nexus:nexus-plugin-bundle-maven-plugin:1.0.1-SNAPSHOT or
> one of its dependencies could not be resolved: Could not find artifact
> org.sonatype.nexus:nexus-plugin-bund
> le-maven-plugin:jar:1.0.1-SNAPSHOT -> [Help 2]
> [ERROR]     Unknown packaging: nexus-plugin @ line 28, column 14
> [ERROR]
> [ERROR]   The project
> org.sonatype.nexus.plugins:nexus-p2-repository-plugin:2.6.0-SNAPSHOT
> (/Users/njbartlett/Projects/nexus-oss/plugins/p2/nexus-p2-repository-plugin/pom.xml)
> has 2 errors
> [ERROR]     Unresolveable build extension: Plugin
> org.sonatype.nexus:nexus-plugin-bundle-maven-plugin:1.0.1-SNAPSHOT or
> one of its dependencies could not be resolved: Could not find artifact
> org.sonatype.nexus:nexus-plugin-bund
> le-maven-plugin:jar:1.0.1-SNAPSHOT -> [Help 2]
> [ERROR]     Unknown packaging: nexus-plugin @ line 28, column 14
> [ERROR]
> [ERROR]   The project
> org.sonatype.nexus.plugins:nexus-restlet1x-plugin:2.6.0-SNAPSHOT
> (/Users/njbartlett/Projects/nexus-oss/plugins/restlet1x/nexus-restlet1x-plugin/pom.xml)
> has 2 errors
> [ERROR]     Unresolveable build extension: Plugin
> org.sonatype.nexus:nexus-plugin-bundle-maven-plugin:1.0.1-SNAPSHOT or
> one of its dependencies could not be resolved: Could not find artifact
> org.sonatype.nexus:nexus-plugin-bund
> le-maven-plugin:jar:1.0.1-SNAPSHOT -> [Help 2]
> [ERROR]     Unknown packaging: nexus-plugin @ line 28, column 14
> [ERROR]
> [ERROR]   The project
> org.sonatype.nexus.plugins:nexus-restlet1x-testsupport-plugin:2.6.0-SNAPSHOT
> (/Users/njbartlett/Projects/nexus-oss/plugins/restlet1x/nexus-restlet1x-testsupport-plugin/pom.xml)
> has 2 errors
> [ERROR]     Unresolveable build extension: Plugin
> org.sonatype.nexus:nexus-plugin-bundle-maven-plugin:1.0.1-SNAPSHOT or
> one of its dependencies could not be resolved: Could not find artifact
> org.sonatype.nexus:nexus-plugin-bund
> le-maven-plugin:jar:1.0.1-SNAPSHOT -> [Help 2]
> [ERROR]     Unknown packaging: nexus-plugin @ line 28, column 14
> [ERROR]
> [ERROR]   The project
> org.sonatype.nexus.plugins:nexus-ldap-realm-plugin:2.6.0-SNAPSHOT
> (/Users/njbartlett/Projects/nexus-oss/plugins/security/nexus-ldap-realm-plugin/pom.xml)
> has 2 errors
> [ERROR]     Unresolveable build extension: Plugin
> org.sonatype.nexus:nexus-plugin-bundle-maven-plugin:1.0.1-SNAPSHOT or
> one of its dependencies could not be resolved: Could not find artifact
> org.sonatype.nexus:nexus-plugin-bund
> le-maven-plugin:jar:1.0.1-SNAPSHOT -> [Help 2]
> [ERROR]     Unknown packaging: nexus-plugin @ line 31, column 14
> [ERROR]
> [ERROR]   The project
> org.sonatype.nexus.plugins:nexus-kenai-plugin:2.6.0-SNAPSHOT
> (/Users/njbartlett/Projects/nexus-oss/plugins/security/nexus-kenai-plugin/pom.xml)
> has 2 errors
> [ERROR]     Unresolveable build extension: Plugin
> org.sonatype.nexus:nexus-plugin-bundle-maven-plugin:1.0.1-SNAPSHOT or
> one of its dependencies could not be resolved: Could not find artifact
> org.sonatype.nexus:nexus-plugin-bund
> le-maven-plugin:jar:1.0.1-SNAPSHOT -> [Help 2]
> [ERROR]     Unknown packaging: nexus-plugin @ line 29, column 14
> [ERROR]
> [ERROR]   The project
> org.sonatype.nexus.testsuite:nexus-testsuite:2.6.0-SNAPSHOT
> (/Users/njbartlett/Projects/nexus-oss/testsuite/pom.xml) has 1 error
> [ERROR]     Unresolveable build extension: Plugin
> org.sonatype.nexus:nexus-plugin-bundle-maven-plugin:1.0.1-SNAPSHOT or
> one of its dependencies could not be resolved: Could not find artifact
> org.sonatype.nexus:nexus-plugin-bund
> le-maven-plugin:jar:1.0.1-SNAPSHOT -> [Help 2]
> [ERROR]
> [ERROR] To see the full stack trace of the errors, re-run Maven with
> the -e switch.
> [ERROR] Re-run Maven using the -X switch to enable full debug logging.
> [ERROR]
> [ERROR] For more information about the errors and possible solutions,
> please read the following articles:
> [ERROR] [Help 1]
> http://cwiki.apache.org/confluence/display/MAVEN/ProjectBuildingException
> [ERROR] [Help 2]
> http://cwiki.apache.org/confluence/display/MAVEN/PluginResolutionException
> n
>
> ---------------------------------------------------------------------
> To unsubscribe, e-mail: [hidden email]
> For additional commands, e-mail: [hidden email]
>


---------------------------------------------------------------------
To unsubscribe, e-mail: [hidden email]
For additional commands, e-mail: [hidden email]

Reply | Threaded
Open this post in threaded view
|

Re: Cannot build Nexus-OSS

Neil Bartlett
Thanks Stuart. That seemed to work.

Note that I did get test failures in nexus-restlet1x-plugin and
legacy-testsuite, but I assume that is just a temporary issue as a
result of checking out git HEAD, so I commented out those modules.

Regards
Neil


On Thu, Jun 20, 2013 at 1:31 PM, Stuart McCulloch <[hidden email]> wrote:

> Hi Neil,
>
> Nexus trunk depends on some snapshots at the moment which are available in the forge repository:
>
>         https://repository.sonatype.org/content/groups/sonatype-public-grid/
>
> you can either add this to your local repository manager (if you happen to already have one installed)
>
> or as an additional repository (and pluginRepository) in your settings.xml:
>
>         http://books.sonatype.com/mvnref-book/reference/appendix-settings-sect-details.html#appendix-settings-sect-settings-repository
>
> or use a mirror by following the old instructions at:
>
>         https://github.com/sonatype/nexus/blob/158692ec7c4bcf1a6e711e9ad3b9a1297f96b231/README.md#building
>
> --
> Cheers, Stuart
>
> On 20 Jun 2013, at 12:24, Neil Bartlett wrote:
>
>> Hi,
>>
>> I am unable to build Nexus-OSS, which I have just checked out from the
>> Github project. The build reports multiple errors "Unknown packaging:
>> nexus-plugin". The full error output is at the bottom of this email. I
>> am using Maven 3.0.5 and Java 1.6.0_31 on Mac OS 10.8.2. I could not
>> find any actual build instructions for Nexus, so I simply assumed "mvn
>> install" is correct. I have no ~/.m2/settings.xml.
>>
>> If there are some special setup steps required before building, might
>> I suggest that these be documented somewhere?
>>
>> Kind regards,
>> Neil
>>
>> Full error output:
>>
>> [ERROR] The build could not read 25 projects -> [Help 1]
>> [ERROR]
>> [ERROR]   The project
>> org.sonatype.nexus:nexus-it-helper-plugin:2.6.0-SNAPSHOT
>> (/Users/njbartlett/Projects/nexus-oss/testsupport/nexus-it-helper-plugin/pom.xml)
>> has 2 errors
>> [ERROR]     Unresolveable build extension: Plugin
>> org.sonatype.nexus:nexus-plugin-bundle-maven-plugin:1.0.1-SNAPSHOT or
>> one of its dependencies could not be resolved: Could not find artifact
>> org.sonatype.nexus:nexus-plugin-bund
>> le-maven-plugin:jar:1.0.1-SNAPSHOT -> [Help 2]
>> [ERROR]     Unknown packaging: nexus-plugin @ line 28, column 14
>> [ERROR]
>> [ERROR]   The project
>> org.sonatype.nexus.plugins:nexus-crypto-plugin:2.6.0-SNAPSHOT
>> (/Users/njbartlett/Projects/nexus-oss/plugins/basic/nexus-crypto-plugin/pom.xml)
>> has 2 errors
>> [ERROR]     Unresolveable build extension: Plugin
>> org.sonatype.nexus:nexus-plugin-bundle-maven-plugin:1.0.1-SNAPSHOT or
>> one of its dependencies could not be resolved: Could not find artifact
>> org.sonatype.nexus:nexus-plugin-bund
>> le-maven-plugin:jar:1.0.1-SNAPSHOT -> [Help 2]
>> [ERROR]     Unknown packaging: nexus-plugin @ line 28, column 14
>> [ERROR]
>> [ERROR]   The project
>> org.sonatype.nexus.plugins:nexus-h2-plugin:2.6.0-SNAPSHOT
>> (/Users/njbartlett/Projects/nexus-oss/plugins/basic/nexus-h2-plugin/pom.xml)
>> has 2 errors
>> [ERROR]     Unresolveable build extension: Plugin
>> org.sonatype.nexus:nexus-plugin-bundle-maven-plugin:1.0.1-SNAPSHOT or
>> one of its dependencies could not be resolved: Could not find artifact
>> org.sonatype.nexus:nexus-plugin-bund
>> le-maven-plugin:jar:1.0.1-SNAPSHOT -> [Help 2]
>> [ERROR]     Unknown packaging: nexus-plugin @ line 28, column 14
>> [ERROR]
>> [ERROR]   The project
>> org.sonatype.nexus.plugins:nexus-lvo-plugin:2.6.0-SNAPSHOT
>> (/Users/njbartlett/Projects/nexus-oss/plugins/basic/nexus-lvo-plugin/pom.xml)
>> has 2 errors
>> [ERROR]     Unresolveable build extension: Plugin
>> org.sonatype.nexus:nexus-plugin-bundle-maven-plugin:1.0.1-SNAPSHOT or
>> one of its dependencies could not be resolved: Could not find artifact
>> org.sonatype.nexus:nexus-plugin-bund
>> le-maven-plugin:jar:1.0.1-SNAPSHOT -> [Help 2]
>> [ERROR]     Unknown packaging: nexus-plugin @ line 27, column 14
>> [ERROR]
>> [ERROR]   The project
>> org.sonatype.nexus.plugins:nexus-plugin-console-plugin:2.6.0-SNAPSHOT
>> (/Users/njbartlett/Projects/nexus-oss/plugins/basic/nexus-plugin-console-plugin/pom.xml)
>> has 2 errors
>> [ERROR]     Unresolveable build extension: Plugin
>> org.sonatype.nexus:nexus-plugin-bundle-maven-plugin:1.0.1-SNAPSHOT or
>> one of its dependencies could not be resolved: Could not find artifact
>> org.sonatype.nexus:nexus-plugin-bund
>> le-maven-plugin:jar:1.0.1-SNAPSHOT -> [Help 2]
>> [ERROR]     Unknown packaging: nexus-plugin @ line 28, column 14
>> [ERROR]
>> [ERROR]   The project
>> org.sonatype.nexus.plugins:nexus-rrb-plugin:2.6.0-SNAPSHOT
>> (/Users/njbartlett/Projects/nexus-oss/plugins/basic/nexus-rrb-plugin/pom.xml)
>> has 2 errors
>> [ERROR]     Unresolveable build extension: Plugin
>> org.sonatype.nexus:nexus-plugin-bundle-maven-plugin:1.0.1-SNAPSHOT or
>> one of its dependencies could not be resolved: Could not find artifact
>> org.sonatype.nexus:nexus-plugin-bund
>> le-maven-plugin:jar:1.0.1-SNAPSHOT -> [Help 2]
>> [ERROR]     Unknown packaging: nexus-plugin @ line 29, column 14
>> [ERROR]
>> [ERROR]   The project
>> org.sonatype.nexus.plugins:nexus-siesta-plugin:2.6.0-SNAPSHOT
>> (/Users/njbartlett/Projects/nexus-oss/plugins/basic/nexus-siesta-plugin/pom.xml)
>> has 2 errors
>> [ERROR]     Unresolveable build extension: Plugin
>> org.sonatype.nexus:nexus-plugin-bundle-maven-plugin:1.0.1-SNAPSHOT or
>> one of its dependencies could not be resolved: Could not find artifact
>> org.sonatype.nexus:nexus-plugin-bund
>> le-maven-plugin:jar:1.0.1-SNAPSHOT -> [Help 2]
>> [ERROR]     Unknown packaging: nexus-plugin @ line 28, column 14
>> [ERROR]
>> [ERROR]   The project
>> org.sonatype.nexus.plugins:nexus-site-repository-plugin:2.6.0-SNAPSHOT
>> (/Users/njbartlett/Projects/nexus-oss/plugins/basic/nexus-site-repository-plugin/pom.xml)
>> has 2 errors
>> [ERROR]     Unresolveable build extension: Plugin
>> org.sonatype.nexus:nexus-plugin-bundle-maven-plugin:1.0.1-SNAPSHOT or
>> one of its dependencies could not be resolved: Could not find artifact
>> org.sonatype.nexus:nexus-plugin-bund
>> le-maven-plugin:jar:1.0.1-SNAPSHOT -> [Help 2]
>> [ERROR]     Unknown packaging: nexus-plugin @ line 27, column 14
>> [ERROR]
>> [ERROR]   The project
>> org.sonatype.nexus.plugins:nexus-timeline-plugin:2.6.0-SNAPSHOT
>> (/Users/njbartlett/Projects/nexus-oss/plugins/basic/nexus-timeline-plugin/pom.xml)
>> has 2 errors
>> [ERROR]     Unresolveable build extension: Plugin
>> org.sonatype.nexus:nexus-plugin-bundle-maven-plugin:1.0.1-SNAPSHOT or
>> one of its dependencies could not be resolved: Could not find artifact
>> org.sonatype.nexus:nexus-plugin-bund
>> le-maven-plugin:jar:1.0.1-SNAPSHOT -> [Help 2]
>> [ERROR]     Unknown packaging: nexus-plugin @ line 28, column 14
>> [ERROR]
>> [ERROR]   The project
>> org.sonatype.nexus.plugins:nexus-ui-extjs3-plugin:2.6.0-SNAPSHOT
>> (/Users/njbartlett/Projects/nexus-oss/plugins/basic/nexus-ui-extjs3-plugin/pom.xml)
>> has 2 errors
>> [ERROR]     Unresolveable build extension: Plugin
>> org.sonatype.nexus:nexus-plugin-bundle-maven-plugin:1.0.1-SNAPSHOT or
>> one of its dependencies could not be resolved: Could not find artifact
>> org.sonatype.nexus:nexus-plugin-bund
>> le-maven-plugin:jar:1.0.1-SNAPSHOT -> [Help 2]
>> [ERROR]     Unknown packaging: nexus-plugin @ line 28, column 14
>> [ERROR]
>> [ERROR]   The project
>> org.sonatype.nexus.plugins:nexus-unpack-plugin:2.6.0-SNAPSHOT
>> (/Users/njbartlett/Projects/nexus-oss/plugins/basic/nexus-unpack-plugin/pom.xml)
>> has 2 errors
>> [ERROR]     Unresolveable build extension: Plugin
>> org.sonatype.nexus:nexus-plugin-bundle-maven-plugin:1.0.1-SNAPSHOT or
>> one of its dependencies could not be resolved: Could not find artifact
>> org.sonatype.nexus:nexus-plugin-bund
>> le-maven-plugin:jar:1.0.1-SNAPSHOT -> [Help 2]
>> [ERROR]     Unknown packaging: nexus-plugin @ line 28, column 14
>> [ERROR]
>> [ERROR]   The project
>> org.sonatype.nexus.plugins:nexus-capabilities-plugin:2.6.0-SNAPSHOT
>> (/Users/njbartlett/Projects/nexus-oss/plugins/capabilities/nexus-capabilities-plugin/pom.xml)
>> has 2 errors
>> [ERROR]     Unresolveable build extension: Plugin
>> org.sonatype.nexus:nexus-plugin-bundle-maven-plugin:1.0.1-SNAPSHOT or
>> one of its dependencies could not be resolved: Could not find artifact
>> org.sonatype.nexus:nexus-plugin-bund
>> le-maven-plugin:jar:1.0.1-SNAPSHOT -> [Help 2]
>> [ERROR]     Unknown packaging: nexus-plugin @ line 30, column 14
>> [ERROR]
>> [ERROR]   The project
>> org.sonatype.nexus.plugins:nexus-capabilities-testsuite-helper:2.6.0-SNAPSHOT
>> (/Users/njbartlett/Projects/nexus-oss/plugins/capabilities/nexus-capabilities-testsuite-helper/pom.xml)
>> has 2 errors
>> [ERROR]     Unresolveable build extension: Plugin
>> org.sonatype.nexus:nexus-plugin-bundle-maven-plugin:1.0.1-SNAPSHOT or
>> one of its dependencies could not be resolved: Could not find artifact
>> org.sonatype.nexus:nexus-plugin-bund
>> le-maven-plugin:jar:1.0.1-SNAPSHOT -> [Help 2]
>> [ERROR]     Unknown packaging: nexus-plugin @ line 28, column 14
>> [ERROR]
>> [ERROR]   The project
>> org.sonatype.nexus.plugins:nexus-indexer-lucene-plugin:2.6.0-SNAPSHOT
>> (/Users/njbartlett/Projects/nexus-oss/plugins/indexer/nexus-indexer-lucene-plugin/pom.xml)
>> has 2 errors
>> [ERROR]     Unresolveable build extension: Plugin
>> org.sonatype.nexus:nexus-plugin-bundle-maven-plugin:1.0.1-SNAPSHOT or
>> one of its dependencies could not be resolved: Could not find artifact
>> org.sonatype.nexus:nexus-plugin-bund
>> le-maven-plugin:jar:1.0.1-SNAPSHOT -> [Help 2]
>> [ERROR]     Unknown packaging: nexus-plugin @ line 28, column 14
>> [ERROR]
>> [ERROR]   The project
>> org.sonatype.nexus.plugins:nexus-groovyremote-plugin:2.6.0-SNAPSHOT
>> (/Users/njbartlett/Projects/nexus-oss/plugins/internal/nexus-groovyremote-plugin/pom.xml)
>> has 2 errors
>> [ERROR]     Unresolveable build extension: Plugin
>> org.sonatype.nexus:nexus-plugin-bundle-maven-plugin:1.0.1-SNAPSHOT or
>> one of its dependencies could not be resolved: Could not find artifact
>> org.sonatype.nexus:nexus-plugin-bund
>> le-maven-plugin:jar:1.0.1-SNAPSHOT -> [Help 2]
>> [ERROR]     Unknown packaging: nexus-plugin @ line 28, column 14
>> [ERROR]
>> [ERROR]   The project
>> org.sonatype.nexus.plugins:nexus-maven-bridge-plugin:2.6.0-SNAPSHOT
>> (/Users/njbartlett/Projects/nexus-oss/plugins/maven/nexus-maven-bridge-plugin/pom.xml)
>> has 2 errors
>> [ERROR]     Unresolveable build extension: Plugin
>> org.sonatype.nexus:nexus-plugin-bundle-maven-plugin:1.0.1-SNAPSHOT or
>> one of its dependencies could not be resolved: Could not find artifact
>> org.sonatype.nexus:nexus-plugin-bund
>> le-maven-plugin:jar:1.0.1-SNAPSHOT -> [Help 2]
>> [ERROR]     Unknown packaging: nexus-plugin @ line 29, column 14
>> [ERROR]
>> [ERROR]   The project
>> org.sonatype.nexus.plugins:nexus-archetype-plugin:2.6.0-SNAPSHOT
>> (/Users/njbartlett/Projects/nexus-oss/plugins/maven/nexus-archetype-plugin/pom.xml)
>> has 2 errors
>> [ERROR]     Unresolveable build extension: Plugin
>> org.sonatype.nexus:nexus-plugin-bundle-maven-plugin:1.0.1-SNAPSHOT or
>> one of its dependencies could not be resolved: Could not find artifact
>> org.sonatype.nexus:nexus-plugin-bund
>> le-maven-plugin:jar:1.0.1-SNAPSHOT -> [Help 2]
>> [ERROR]     Unknown packaging: nexus-plugin @ line 29, column 14
>> [ERROR]
>> [ERROR]   The project
>> org.sonatype.nexus.plugins:nexus-obr-plugin:2.6.0-SNAPSHOT
>> (/Users/njbartlett/Projects/nexus-oss/plugins/osgi/nexus-obr-plugin/pom.xml)
>> has 2 errors
>> [ERROR]     Unresolveable build extension: Plugin
>> org.sonatype.nexus:nexus-plugin-bundle-maven-plugin:1.0.1-SNAPSHOT or
>> one of its dependencies could not be resolved: Could not find artifact
>> org.sonatype.nexus:nexus-plugin-bund
>> le-maven-plugin:jar:1.0.1-SNAPSHOT -> [Help 2]
>> [ERROR]     Unknown packaging: nexus-plugin @ line 28, column 14
>> [ERROR]
>> [ERROR]   The project
>> org.sonatype.nexus.plugins:nexus-p2-bridge-plugin:2.6.0-SNAPSHOT
>> (/Users/njbartlett/Projects/nexus-oss/plugins/p2/nexus-p2-bridge-plugin/pom.xml)
>> has 2 errors
>> [ERROR]     Unresolveable build extension: Plugin
>> org.sonatype.nexus:nexus-plugin-bundle-maven-plugin:1.0.1-SNAPSHOT or
>> one of its dependencies could not be resolved: Could not find artifact
>> org.sonatype.nexus:nexus-plugin-bund
>> le-maven-plugin:jar:1.0.1-SNAPSHOT -> [Help 2]
>> [ERROR]     Unknown packaging: nexus-plugin @ line 28, column 14
>> [ERROR]
>> [ERROR]   The project
>> org.sonatype.nexus.plugins:nexus-p2-repository-plugin:2.6.0-SNAPSHOT
>> (/Users/njbartlett/Projects/nexus-oss/plugins/p2/nexus-p2-repository-plugin/pom.xml)
>> has 2 errors
>> [ERROR]     Unresolveable build extension: Plugin
>> org.sonatype.nexus:nexus-plugin-bundle-maven-plugin:1.0.1-SNAPSHOT or
>> one of its dependencies could not be resolved: Could not find artifact
>> org.sonatype.nexus:nexus-plugin-bund
>> le-maven-plugin:jar:1.0.1-SNAPSHOT -> [Help 2]
>> [ERROR]     Unknown packaging: nexus-plugin @ line 28, column 14
>> [ERROR]
>> [ERROR]   The project
>> org.sonatype.nexus.plugins:nexus-restlet1x-plugin:2.6.0-SNAPSHOT
>> (/Users/njbartlett/Projects/nexus-oss/plugins/restlet1x/nexus-restlet1x-plugin/pom.xml)
>> has 2 errors
>> [ERROR]     Unresolveable build extension: Plugin
>> org.sonatype.nexus:nexus-plugin-bundle-maven-plugin:1.0.1-SNAPSHOT or
>> one of its dependencies could not be resolved: Could not find artifact
>> org.sonatype.nexus:nexus-plugin-bund
>> le-maven-plugin:jar:1.0.1-SNAPSHOT -> [Help 2]
>> [ERROR]     Unknown packaging: nexus-plugin @ line 28, column 14
>> [ERROR]
>> [ERROR]   The project
>> org.sonatype.nexus.plugins:nexus-restlet1x-testsupport-plugin:2.6.0-SNAPSHOT
>> (/Users/njbartlett/Projects/nexus-oss/plugins/restlet1x/nexus-restlet1x-testsupport-plugin/pom.xml)
>> has 2 errors
>> [ERROR]     Unresolveable build extension: Plugin
>> org.sonatype.nexus:nexus-plugin-bundle-maven-plugin:1.0.1-SNAPSHOT or
>> one of its dependencies could not be resolved: Could not find artifact
>> org.sonatype.nexus:nexus-plugin-bund
>> le-maven-plugin:jar:1.0.1-SNAPSHOT -> [Help 2]
>> [ERROR]     Unknown packaging: nexus-plugin @ line 28, column 14
>> [ERROR]
>> [ERROR]   The project
>> org.sonatype.nexus.plugins:nexus-ldap-realm-plugin:2.6.0-SNAPSHOT
>> (/Users/njbartlett/Projects/nexus-oss/plugins/security/nexus-ldap-realm-plugin/pom.xml)
>> has 2 errors
>> [ERROR]     Unresolveable build extension: Plugin
>> org.sonatype.nexus:nexus-plugin-bundle-maven-plugin:1.0.1-SNAPSHOT or
>> one of its dependencies could not be resolved: Could not find artifact
>> org.sonatype.nexus:nexus-plugin-bund
>> le-maven-plugin:jar:1.0.1-SNAPSHOT -> [Help 2]
>> [ERROR]     Unknown packaging: nexus-plugin @ line 31, column 14
>> [ERROR]
>> [ERROR]   The project
>> org.sonatype.nexus.plugins:nexus-kenai-plugin:2.6.0-SNAPSHOT
>> (/Users/njbartlett/Projects/nexus-oss/plugins/security/nexus-kenai-plugin/pom.xml)
>> has 2 errors
>> [ERROR]     Unresolveable build extension: Plugin
>> org.sonatype.nexus:nexus-plugin-bundle-maven-plugin:1.0.1-SNAPSHOT or
>> one of its dependencies could not be resolved: Could not find artifact
>> org.sonatype.nexus:nexus-plugin-bund
>> le-maven-plugin:jar:1.0.1-SNAPSHOT -> [Help 2]
>> [ERROR]     Unknown packaging: nexus-plugin @ line 29, column 14
>> [ERROR]
>> [ERROR]   The project
>> org.sonatype.nexus.testsuite:nexus-testsuite:2.6.0-SNAPSHOT
>> (/Users/njbartlett/Projects/nexus-oss/testsuite/pom.xml) has 1 error
>> [ERROR]     Unresolveable build extension: Plugin
>> org.sonatype.nexus:nexus-plugin-bundle-maven-plugin:1.0.1-SNAPSHOT or
>> one of its dependencies could not be resolved: Could not find artifact
>> org.sonatype.nexus:nexus-plugin-bund
>> le-maven-plugin:jar:1.0.1-SNAPSHOT -> [Help 2]
>> [ERROR]
>> [ERROR] To see the full stack trace of the errors, re-run Maven with
>> the -e switch.
>> [ERROR] Re-run Maven using the -X switch to enable full debug logging.
>> [ERROR]
>> [ERROR] For more information about the errors and possible solutions,
>> please read the following articles:
>> [ERROR] [Help 1]
>> http://cwiki.apache.org/confluence/display/MAVEN/ProjectBuildingException
>> [ERROR] [Help 2]
>> http://cwiki.apache.org/confluence/display/MAVEN/PluginResolutionException
>> n
>>
>> ---------------------------------------------------------------------
>> To unsubscribe, e-mail: [hidden email]
>> For additional commands, e-mail: [hidden email]
>>
>
>
> ---------------------------------------------------------------------
> To unsubscribe, e-mail: [hidden email]
> For additional commands, e-mail: [hidden email]
>

---------------------------------------------------------------------
To unsubscribe, e-mail: [hidden email]
For additional commands, e-mail: [hidden email]

Reply | Threaded
Open this post in threaded view
|

Re: Cannot build Nexus-OSS

Neil Bartlett
I spoke too soon...

Stumbling around in the dark a bit because "mvn install" didn't
produce anything that looked like an installable product... so I tried
"mvn deploy". This fails in
org.sonatype.nexus.testsuite:nexus-modern-testsuite with the following
error:

[ERROR] Failed to execute goal
org.sonatype.plugins:nexus-staging-maven-plugin:1.4.4:deploy
(injected-nexus-deploy) on project nexus-modern-testsuite: Failed to
deploy artifacts: Could not transfer artifact
org.sonatype.nexus.testsuite:nexus-modern-testsuite:jar:2.6.0-20130620.164206-1
from/to forge-snapshots
(https://repository.sonatype.org/content/repositories/snapshots):
Failed to transfer file:
https://repository.sonatype.org/content/repositories/snapshots/org/sonatype/nexus/testsuite/nexus-modern-testsuite/2.6.0-SNAPSHOT/nexus-modern-testsuite-2.6.0-20130620.164206-1.jar.
Return code is: 401, ReasonPhrase: Unauthorized. -> [Help 1]

Thanks,
Neil

On Thu, Jun 20, 2013 at 4:58 PM, Neil Bartlett <[hidden email]> wrote:

> Thanks Stuart. That seemed to work.
>
> Note that I did get test failures in nexus-restlet1x-plugin and
> legacy-testsuite, but I assume that is just a temporary issue as a
> result of checking out git HEAD, so I commented out those modules.
>
> Regards
> Neil
>
>
> On Thu, Jun 20, 2013 at 1:31 PM, Stuart McCulloch <[hidden email]> wrote:
>> Hi Neil,
>>
>> Nexus trunk depends on some snapshots at the moment which are available in the forge repository:
>>
>>         https://repository.sonatype.org/content/groups/sonatype-public-grid/
>>
>> you can either add this to your local repository manager (if you happen to already have one installed)
>>
>> or as an additional repository (and pluginRepository) in your settings.xml:
>>
>>         http://books.sonatype.com/mvnref-book/reference/appendix-settings-sect-details.html#appendix-settings-sect-settings-repository
>>
>> or use a mirror by following the old instructions at:
>>
>>         https://github.com/sonatype/nexus/blob/158692ec7c4bcf1a6e711e9ad3b9a1297f96b231/README.md#building
>>
>> --
>> Cheers, Stuart
>>
>> On 20 Jun 2013, at 12:24, Neil Bartlett wrote:
>>
>>> Hi,
>>>
>>> I am unable to build Nexus-OSS, which I have just checked out from the
>>> Github project. The build reports multiple errors "Unknown packaging:
>>> nexus-plugin". The full error output is at the bottom of this email. I
>>> am using Maven 3.0.5 and Java 1.6.0_31 on Mac OS 10.8.2. I could not
>>> find any actual build instructions for Nexus, so I simply assumed "mvn
>>> install" is correct. I have no ~/.m2/settings.xml.
>>>
>>> If there are some special setup steps required before building, might
>>> I suggest that these be documented somewhere?
>>>
>>> Kind regards,
>>> Neil
>>>
>>> Full error output:
>>>
>>> [ERROR] The build could not read 25 projects -> [Help 1]
>>> [ERROR]
>>> [ERROR]   The project
>>> org.sonatype.nexus:nexus-it-helper-plugin:2.6.0-SNAPSHOT
>>> (/Users/njbartlett/Projects/nexus-oss/testsupport/nexus-it-helper-plugin/pom.xml)
>>> has 2 errors
>>> [ERROR]     Unresolveable build extension: Plugin
>>> org.sonatype.nexus:nexus-plugin-bundle-maven-plugin:1.0.1-SNAPSHOT or
>>> one of its dependencies could not be resolved: Could not find artifact
>>> org.sonatype.nexus:nexus-plugin-bund
>>> le-maven-plugin:jar:1.0.1-SNAPSHOT -> [Help 2]
>>> [ERROR]     Unknown packaging: nexus-plugin @ line 28, column 14
>>> [ERROR]
>>> [ERROR]   The project
>>> org.sonatype.nexus.plugins:nexus-crypto-plugin:2.6.0-SNAPSHOT
>>> (/Users/njbartlett/Projects/nexus-oss/plugins/basic/nexus-crypto-plugin/pom.xml)
>>> has 2 errors
>>> [ERROR]     Unresolveable build extension: Plugin
>>> org.sonatype.nexus:nexus-plugin-bundle-maven-plugin:1.0.1-SNAPSHOT or
>>> one of its dependencies could not be resolved: Could not find artifact
>>> org.sonatype.nexus:nexus-plugin-bund
>>> le-maven-plugin:jar:1.0.1-SNAPSHOT -> [Help 2]
>>> [ERROR]     Unknown packaging: nexus-plugin @ line 28, column 14
>>> [ERROR]
>>> [ERROR]   The project
>>> org.sonatype.nexus.plugins:nexus-h2-plugin:2.6.0-SNAPSHOT
>>> (/Users/njbartlett/Projects/nexus-oss/plugins/basic/nexus-h2-plugin/pom.xml)
>>> has 2 errors
>>> [ERROR]     Unresolveable build extension: Plugin
>>> org.sonatype.nexus:nexus-plugin-bundle-maven-plugin:1.0.1-SNAPSHOT or
>>> one of its dependencies could not be resolved: Could not find artifact
>>> org.sonatype.nexus:nexus-plugin-bund
>>> le-maven-plugin:jar:1.0.1-SNAPSHOT -> [Help 2]
>>> [ERROR]     Unknown packaging: nexus-plugin @ line 28, column 14
>>> [ERROR]
>>> [ERROR]   The project
>>> org.sonatype.nexus.plugins:nexus-lvo-plugin:2.6.0-SNAPSHOT
>>> (/Users/njbartlett/Projects/nexus-oss/plugins/basic/nexus-lvo-plugin/pom.xml)
>>> has 2 errors
>>> [ERROR]     Unresolveable build extension: Plugin
>>> org.sonatype.nexus:nexus-plugin-bundle-maven-plugin:1.0.1-SNAPSHOT or
>>> one of its dependencies could not be resolved: Could not find artifact
>>> org.sonatype.nexus:nexus-plugin-bund
>>> le-maven-plugin:jar:1.0.1-SNAPSHOT -> [Help 2]
>>> [ERROR]     Unknown packaging: nexus-plugin @ line 27, column 14
>>> [ERROR]
>>> [ERROR]   The project
>>> org.sonatype.nexus.plugins:nexus-plugin-console-plugin:2.6.0-SNAPSHOT
>>> (/Users/njbartlett/Projects/nexus-oss/plugins/basic/nexus-plugin-console-plugin/pom.xml)
>>> has 2 errors
>>> [ERROR]     Unresolveable build extension: Plugin
>>> org.sonatype.nexus:nexus-plugin-bundle-maven-plugin:1.0.1-SNAPSHOT or
>>> one of its dependencies could not be resolved: Could not find artifact
>>> org.sonatype.nexus:nexus-plugin-bund
>>> le-maven-plugin:jar:1.0.1-SNAPSHOT -> [Help 2]
>>> [ERROR]     Unknown packaging: nexus-plugin @ line 28, column 14
>>> [ERROR]
>>> [ERROR]   The project
>>> org.sonatype.nexus.plugins:nexus-rrb-plugin:2.6.0-SNAPSHOT
>>> (/Users/njbartlett/Projects/nexus-oss/plugins/basic/nexus-rrb-plugin/pom.xml)
>>> has 2 errors
>>> [ERROR]     Unresolveable build extension: Plugin
>>> org.sonatype.nexus:nexus-plugin-bundle-maven-plugin:1.0.1-SNAPSHOT or
>>> one of its dependencies could not be resolved: Could not find artifact
>>> org.sonatype.nexus:nexus-plugin-bund
>>> le-maven-plugin:jar:1.0.1-SNAPSHOT -> [Help 2]
>>> [ERROR]     Unknown packaging: nexus-plugin @ line 29, column 14
>>> [ERROR]
>>> [ERROR]   The project
>>> org.sonatype.nexus.plugins:nexus-siesta-plugin:2.6.0-SNAPSHOT
>>> (/Users/njbartlett/Projects/nexus-oss/plugins/basic/nexus-siesta-plugin/pom.xml)
>>> has 2 errors
>>> [ERROR]     Unresolveable build extension: Plugin
>>> org.sonatype.nexus:nexus-plugin-bundle-maven-plugin:1.0.1-SNAPSHOT or
>>> one of its dependencies could not be resolved: Could not find artifact
>>> org.sonatype.nexus:nexus-plugin-bund
>>> le-maven-plugin:jar:1.0.1-SNAPSHOT -> [Help 2]
>>> [ERROR]     Unknown packaging: nexus-plugin @ line 28, column 14
>>> [ERROR]
>>> [ERROR]   The project
>>> org.sonatype.nexus.plugins:nexus-site-repository-plugin:2.6.0-SNAPSHOT
>>> (/Users/njbartlett/Projects/nexus-oss/plugins/basic/nexus-site-repository-plugin/pom.xml)
>>> has 2 errors
>>> [ERROR]     Unresolveable build extension: Plugin
>>> org.sonatype.nexus:nexus-plugin-bundle-maven-plugin:1.0.1-SNAPSHOT or
>>> one of its dependencies could not be resolved: Could not find artifact
>>> org.sonatype.nexus:nexus-plugin-bund
>>> le-maven-plugin:jar:1.0.1-SNAPSHOT -> [Help 2]
>>> [ERROR]     Unknown packaging: nexus-plugin @ line 27, column 14
>>> [ERROR]
>>> [ERROR]   The project
>>> org.sonatype.nexus.plugins:nexus-timeline-plugin:2.6.0-SNAPSHOT
>>> (/Users/njbartlett/Projects/nexus-oss/plugins/basic/nexus-timeline-plugin/pom.xml)
>>> has 2 errors
>>> [ERROR]     Unresolveable build extension: Plugin
>>> org.sonatype.nexus:nexus-plugin-bundle-maven-plugin:1.0.1-SNAPSHOT or
>>> one of its dependencies could not be resolved: Could not find artifact
>>> org.sonatype.nexus:nexus-plugin-bund
>>> le-maven-plugin:jar:1.0.1-SNAPSHOT -> [Help 2]
>>> [ERROR]     Unknown packaging: nexus-plugin @ line 28, column 14
>>> [ERROR]
>>> [ERROR]   The project
>>> org.sonatype.nexus.plugins:nexus-ui-extjs3-plugin:2.6.0-SNAPSHOT
>>> (/Users/njbartlett/Projects/nexus-oss/plugins/basic/nexus-ui-extjs3-plugin/pom.xml)
>>> has 2 errors
>>> [ERROR]     Unresolveable build extension: Plugin
>>> org.sonatype.nexus:nexus-plugin-bundle-maven-plugin:1.0.1-SNAPSHOT or
>>> one of its dependencies could not be resolved: Could not find artifact
>>> org.sonatype.nexus:nexus-plugin-bund
>>> le-maven-plugin:jar:1.0.1-SNAPSHOT -> [Help 2]
>>> [ERROR]     Unknown packaging: nexus-plugin @ line 28, column 14
>>> [ERROR]
>>> [ERROR]   The project
>>> org.sonatype.nexus.plugins:nexus-unpack-plugin:2.6.0-SNAPSHOT
>>> (/Users/njbartlett/Projects/nexus-oss/plugins/basic/nexus-unpack-plugin/pom.xml)
>>> has 2 errors
>>> [ERROR]     Unresolveable build extension: Plugin
>>> org.sonatype.nexus:nexus-plugin-bundle-maven-plugin:1.0.1-SNAPSHOT or
>>> one of its dependencies could not be resolved: Could not find artifact
>>> org.sonatype.nexus:nexus-plugin-bund
>>> le-maven-plugin:jar:1.0.1-SNAPSHOT -> [Help 2]
>>> [ERROR]     Unknown packaging: nexus-plugin @ line 28, column 14
>>> [ERROR]
>>> [ERROR]   The project
>>> org.sonatype.nexus.plugins:nexus-capabilities-plugin:2.6.0-SNAPSHOT
>>> (/Users/njbartlett/Projects/nexus-oss/plugins/capabilities/nexus-capabilities-plugin/pom.xml)
>>> has 2 errors
>>> [ERROR]     Unresolveable build extension: Plugin
>>> org.sonatype.nexus:nexus-plugin-bundle-maven-plugin:1.0.1-SNAPSHOT or
>>> one of its dependencies could not be resolved: Could not find artifact
>>> org.sonatype.nexus:nexus-plugin-bund
>>> le-maven-plugin:jar:1.0.1-SNAPSHOT -> [Help 2]
>>> [ERROR]     Unknown packaging: nexus-plugin @ line 30, column 14
>>> [ERROR]
>>> [ERROR]   The project
>>> org.sonatype.nexus.plugins:nexus-capabilities-testsuite-helper:2.6.0-SNAPSHOT
>>> (/Users/njbartlett/Projects/nexus-oss/plugins/capabilities/nexus-capabilities-testsuite-helper/pom.xml)
>>> has 2 errors
>>> [ERROR]     Unresolveable build extension: Plugin
>>> org.sonatype.nexus:nexus-plugin-bundle-maven-plugin:1.0.1-SNAPSHOT or
>>> one of its dependencies could not be resolved: Could not find artifact
>>> org.sonatype.nexus:nexus-plugin-bund
>>> le-maven-plugin:jar:1.0.1-SNAPSHOT -> [Help 2]
>>> [ERROR]     Unknown packaging: nexus-plugin @ line 28, column 14
>>> [ERROR]
>>> [ERROR]   The project
>>> org.sonatype.nexus.plugins:nexus-indexer-lucene-plugin:2.6.0-SNAPSHOT
>>> (/Users/njbartlett/Projects/nexus-oss/plugins/indexer/nexus-indexer-lucene-plugin/pom.xml)
>>> has 2 errors
>>> [ERROR]     Unresolveable build extension: Plugin
>>> org.sonatype.nexus:nexus-plugin-bundle-maven-plugin:1.0.1-SNAPSHOT or
>>> one of its dependencies could not be resolved: Could not find artifact
>>> org.sonatype.nexus:nexus-plugin-bund
>>> le-maven-plugin:jar:1.0.1-SNAPSHOT -> [Help 2]
>>> [ERROR]     Unknown packaging: nexus-plugin @ line 28, column 14
>>> [ERROR]
>>> [ERROR]   The project
>>> org.sonatype.nexus.plugins:nexus-groovyremote-plugin:2.6.0-SNAPSHOT
>>> (/Users/njbartlett/Projects/nexus-oss/plugins/internal/nexus-groovyremote-plugin/pom.xml)
>>> has 2 errors
>>> [ERROR]     Unresolveable build extension: Plugin
>>> org.sonatype.nexus:nexus-plugin-bundle-maven-plugin:1.0.1-SNAPSHOT or
>>> one of its dependencies could not be resolved: Could not find artifact
>>> org.sonatype.nexus:nexus-plugin-bund
>>> le-maven-plugin:jar:1.0.1-SNAPSHOT -> [Help 2]
>>> [ERROR]     Unknown packaging: nexus-plugin @ line 28, column 14
>>> [ERROR]
>>> [ERROR]   The project
>>> org.sonatype.nexus.plugins:nexus-maven-bridge-plugin:2.6.0-SNAPSHOT
>>> (/Users/njbartlett/Projects/nexus-oss/plugins/maven/nexus-maven-bridge-plugin/pom.xml)
>>> has 2 errors
>>> [ERROR]     Unresolveable build extension: Plugin
>>> org.sonatype.nexus:nexus-plugin-bundle-maven-plugin:1.0.1-SNAPSHOT or
>>> one of its dependencies could not be resolved: Could not find artifact
>>> org.sonatype.nexus:nexus-plugin-bund
>>> le-maven-plugin:jar:1.0.1-SNAPSHOT -> [Help 2]
>>> [ERROR]     Unknown packaging: nexus-plugin @ line 29, column 14
>>> [ERROR]
>>> [ERROR]   The project
>>> org.sonatype.nexus.plugins:nexus-archetype-plugin:2.6.0-SNAPSHOT
>>> (/Users/njbartlett/Projects/nexus-oss/plugins/maven/nexus-archetype-plugin/pom.xml)
>>> has 2 errors
>>> [ERROR]     Unresolveable build extension: Plugin
>>> org.sonatype.nexus:nexus-plugin-bundle-maven-plugin:1.0.1-SNAPSHOT or
>>> one of its dependencies could not be resolved: Could not find artifact
>>> org.sonatype.nexus:nexus-plugin-bund
>>> le-maven-plugin:jar:1.0.1-SNAPSHOT -> [Help 2]
>>> [ERROR]     Unknown packaging: nexus-plugin @ line 29, column 14
>>> [ERROR]
>>> [ERROR]   The project
>>> org.sonatype.nexus.plugins:nexus-obr-plugin:2.6.0-SNAPSHOT
>>> (/Users/njbartlett/Projects/nexus-oss/plugins/osgi/nexus-obr-plugin/pom.xml)
>>> has 2 errors
>>> [ERROR]     Unresolveable build extension: Plugin
>>> org.sonatype.nexus:nexus-plugin-bundle-maven-plugin:1.0.1-SNAPSHOT or
>>> one of its dependencies could not be resolved: Could not find artifact
>>> org.sonatype.nexus:nexus-plugin-bund
>>> le-maven-plugin:jar:1.0.1-SNAPSHOT -> [Help 2]
>>> [ERROR]     Unknown packaging: nexus-plugin @ line 28, column 14
>>> [ERROR]
>>> [ERROR]   The project
>>> org.sonatype.nexus.plugins:nexus-p2-bridge-plugin:2.6.0-SNAPSHOT
>>> (/Users/njbartlett/Projects/nexus-oss/plugins/p2/nexus-p2-bridge-plugin/pom.xml)
>>> has 2 errors
>>> [ERROR]     Unresolveable build extension: Plugin
>>> org.sonatype.nexus:nexus-plugin-bundle-maven-plugin:1.0.1-SNAPSHOT or
>>> one of its dependencies could not be resolved: Could not find artifact
>>> org.sonatype.nexus:nexus-plugin-bund
>>> le-maven-plugin:jar:1.0.1-SNAPSHOT -> [Help 2]
>>> [ERROR]     Unknown packaging: nexus-plugin @ line 28, column 14
>>> [ERROR]
>>> [ERROR]   The project
>>> org.sonatype.nexus.plugins:nexus-p2-repository-plugin:2.6.0-SNAPSHOT
>>> (/Users/njbartlett/Projects/nexus-oss/plugins/p2/nexus-p2-repository-plugin/pom.xml)
>>> has 2 errors
>>> [ERROR]     Unresolveable build extension: Plugin
>>> org.sonatype.nexus:nexus-plugin-bundle-maven-plugin:1.0.1-SNAPSHOT or
>>> one of its dependencies could not be resolved: Could not find artifact
>>> org.sonatype.nexus:nexus-plugin-bund
>>> le-maven-plugin:jar:1.0.1-SNAPSHOT -> [Help 2]
>>> [ERROR]     Unknown packaging: nexus-plugin @ line 28, column 14
>>> [ERROR]
>>> [ERROR]   The project
>>> org.sonatype.nexus.plugins:nexus-restlet1x-plugin:2.6.0-SNAPSHOT
>>> (/Users/njbartlett/Projects/nexus-oss/plugins/restlet1x/nexus-restlet1x-plugin/pom.xml)
>>> has 2 errors
>>> [ERROR]     Unresolveable build extension: Plugin
>>> org.sonatype.nexus:nexus-plugin-bundle-maven-plugin:1.0.1-SNAPSHOT or
>>> one of its dependencies could not be resolved: Could not find artifact
>>> org.sonatype.nexus:nexus-plugin-bund
>>> le-maven-plugin:jar:1.0.1-SNAPSHOT -> [Help 2]
>>> [ERROR]     Unknown packaging: nexus-plugin @ line 28, column 14
>>> [ERROR]
>>> [ERROR]   The project
>>> org.sonatype.nexus.plugins:nexus-restlet1x-testsupport-plugin:2.6.0-SNAPSHOT
>>> (/Users/njbartlett/Projects/nexus-oss/plugins/restlet1x/nexus-restlet1x-testsupport-plugin/pom.xml)
>>> has 2 errors
>>> [ERROR]     Unresolveable build extension: Plugin
>>> org.sonatype.nexus:nexus-plugin-bundle-maven-plugin:1.0.1-SNAPSHOT or
>>> one of its dependencies could not be resolved: Could not find artifact
>>> org.sonatype.nexus:nexus-plugin-bund
>>> le-maven-plugin:jar:1.0.1-SNAPSHOT -> [Help 2]
>>> [ERROR]     Unknown packaging: nexus-plugin @ line 28, column 14
>>> [ERROR]
>>> [ERROR]   The project
>>> org.sonatype.nexus.plugins:nexus-ldap-realm-plugin:2.6.0-SNAPSHOT
>>> (/Users/njbartlett/Projects/nexus-oss/plugins/security/nexus-ldap-realm-plugin/pom.xml)
>>> has 2 errors
>>> [ERROR]     Unresolveable build extension: Plugin
>>> org.sonatype.nexus:nexus-plugin-bundle-maven-plugin:1.0.1-SNAPSHOT or
>>> one of its dependencies could not be resolved: Could not find artifact
>>> org.sonatype.nexus:nexus-plugin-bund
>>> le-maven-plugin:jar:1.0.1-SNAPSHOT -> [Help 2]
>>> [ERROR]     Unknown packaging: nexus-plugin @ line 31, column 14
>>> [ERROR]
>>> [ERROR]   The project
>>> org.sonatype.nexus.plugins:nexus-kenai-plugin:2.6.0-SNAPSHOT
>>> (/Users/njbartlett/Projects/nexus-oss/plugins/security/nexus-kenai-plugin/pom.xml)
>>> has 2 errors
>>> [ERROR]     Unresolveable build extension: Plugin
>>> org.sonatype.nexus:nexus-plugin-bundle-maven-plugin:1.0.1-SNAPSHOT or
>>> one of its dependencies could not be resolved: Could not find artifact
>>> org.sonatype.nexus:nexus-plugin-bund
>>> le-maven-plugin:jar:1.0.1-SNAPSHOT -> [Help 2]
>>> [ERROR]     Unknown packaging: nexus-plugin @ line 29, column 14
>>> [ERROR]
>>> [ERROR]   The project
>>> org.sonatype.nexus.testsuite:nexus-testsuite:2.6.0-SNAPSHOT
>>> (/Users/njbartlett/Projects/nexus-oss/testsuite/pom.xml) has 1 error
>>> [ERROR]     Unresolveable build extension: Plugin
>>> org.sonatype.nexus:nexus-plugin-bundle-maven-plugin:1.0.1-SNAPSHOT or
>>> one of its dependencies could not be resolved: Could not find artifact
>>> org.sonatype.nexus:nexus-plugin-bund
>>> le-maven-plugin:jar:1.0.1-SNAPSHOT -> [Help 2]
>>> [ERROR]
>>> [ERROR] To see the full stack trace of the errors, re-run Maven with
>>> the -e switch.
>>> [ERROR] Re-run Maven using the -X switch to enable full debug logging.
>>> [ERROR]
>>> [ERROR] For more information about the errors and possible solutions,
>>> please read the following articles:
>>> [ERROR] [Help 1]
>>> http://cwiki.apache.org/confluence/display/MAVEN/ProjectBuildingException
>>> [ERROR] [Help 2]
>>> http://cwiki.apache.org/confluence/display/MAVEN/PluginResolutionException
>>> n
>>>
>>> ---------------------------------------------------------------------
>>> To unsubscribe, e-mail: [hidden email]
>>> For additional commands, e-mail: [hidden email]
>>>
>>
>>
>> ---------------------------------------------------------------------
>> To unsubscribe, e-mail: [hidden email]
>> For additional commands, e-mail: [hidden email]
>>

---------------------------------------------------------------------
To unsubscribe, e-mail: [hidden email]
For additional commands, e-mail: [hidden email]

Reply | Threaded
Open this post in threaded view
|

Re: Cannot build Nexus-OSS

Rich Seddon
Running install is what you want.

Unfortunately we are in the middle of a significant refactoring, so it seems only the war version is available at the moment (I could be wrong about this though, I haven't been keeping up on the details).

You can find the war here:  nexus-oss/components/nexus-webapp/target

Rich

On Jun 20, 2013, at 11:44 AM, Neil Bartlett <[hidden email]> wrote:

> I spoke too soon...
>
> Stumbling around in the dark a bit because "mvn install" didn't
> produce anything that looked like an installable product... so I tried
> "mvn deploy". This fails in
> org.sonatype.nexus.testsuite:nexus-modern-testsuite with the following
> error:
>
> [ERROR] Failed to execute goal
> org.sonatype.plugins:nexus-staging-maven-plugin:1.4.4:deploy
> (injected-nexus-deploy) on project nexus-modern-testsuite: Failed to
> deploy artifacts: Could not transfer artifact
> org.sonatype.nexus.testsuite:nexus-modern-testsuite:jar:2.6.0-20130620.164206-1
> from/to forge-snapshots
> (https://repository.sonatype.org/content/repositories/snapshots):
> Failed to transfer file:
> https://repository.sonatype.org/content/repositories/snapshots/org/sonatype/nexus/testsuite/nexus-modern-testsuite/2.6.0-SNAPSHOT/nexus-modern-testsuite-2.6.0-20130620.164206-1.jar.
> Return code is: 401, ReasonPhrase: Unauthorized. -> [Help 1]
>
> Thanks,
> Neil
>
> On Thu, Jun 20, 2013 at 4:58 PM, Neil Bartlett <[hidden email]> wrote:
>> Thanks Stuart. That seemed to work.
>>
>> Note that I did get test failures in nexus-restlet1x-plugin and
>> legacy-testsuite, but I assume that is just a temporary issue as a
>> result of checking out git HEAD, so I commented out those modules.
>>
>> Regards
>> Neil
>>
>>
>> On Thu, Jun 20, 2013 at 1:31 PM, Stuart McCulloch <[hidden email]> wrote:
>>> Hi Neil,
>>>
>>> Nexus trunk depends on some snapshots at the moment which are available in the forge repository:
>>>
>>>        https://repository.sonatype.org/content/groups/sonatype-public-grid/
>>>
>>> you can either add this to your local repository manager (if you happen to already have one installed)
>>>
>>> or as an additional repository (and pluginRepository) in your settings.xml:
>>>
>>>        http://books.sonatype.com/mvnref-book/reference/appendix-settings-sect-details.html#appendix-settings-sect-settings-repository
>>>
>>> or use a mirror by following the old instructions at:
>>>
>>>        https://github.com/sonatype/nexus/blob/158692ec7c4bcf1a6e711e9ad3b9a1297f96b231/README.md#building
>>>
>>> --
>>> Cheers, Stuart
>>>
>>> On 20 Jun 2013, at 12:24, Neil Bartlett wrote:
>>>
>>>> Hi,
>>>>
>>>> I am unable to build Nexus-OSS, which I have just checked out from the
>>>> Github project. The build reports multiple errors "Unknown packaging:
>>>> nexus-plugin". The full error output is at the bottom of this email. I
>>>> am using Maven 3.0.5 and Java 1.6.0_31 on Mac OS 10.8.2. I could not
>>>> find any actual build instructions for Nexus, so I simply assumed "mvn
>>>> install" is correct. I have no ~/.m2/settings.xml.
>>>>
>>>> If there are some special setup steps required before building, might
>>>> I suggest that these be documented somewhere?
>>>>
>>>> Kind regards,
>>>> Neil
>>>>
>>>> Full error output:
>>>>
>>>> [ERROR] The build could not read 25 projects -> [Help 1]
>>>> [ERROR]
>>>> [ERROR]   The project
>>>> org.sonatype.nexus:nexus-it-helper-plugin:2.6.0-SNAPSHOT
>>>> (/Users/njbartlett/Projects/nexus-oss/testsupport/nexus-it-helper-plugin/pom.xml)
>>>> has 2 errors
>>>> [ERROR]     Unresolveable build extension: Plugin
>>>> org.sonatype.nexus:nexus-plugin-bundle-maven-plugin:1.0.1-SNAPSHOT or
>>>> one of its dependencies could not be resolved: Could not find artifact
>>>> org.sonatype.nexus:nexus-plugin-bund
>>>> le-maven-plugin:jar:1.0.1-SNAPSHOT -> [Help 2]
>>>> [ERROR]     Unknown packaging: nexus-plugin @ line 28, column 14
>>>> [ERROR]
>>>> [ERROR]   The project
>>>> org.sonatype.nexus.plugins:nexus-crypto-plugin:2.6.0-SNAPSHOT
>>>> (/Users/njbartlett/Projects/nexus-oss/plugins/basic/nexus-crypto-plugin/pom.xml)
>>>> has 2 errors
>>>> [ERROR]     Unresolveable build extension: Plugin
>>>> org.sonatype.nexus:nexus-plugin-bundle-maven-plugin:1.0.1-SNAPSHOT or
>>>> one of its dependencies could not be resolved: Could not find artifact
>>>> org.sonatype.nexus:nexus-plugin-bund
>>>> le-maven-plugin:jar:1.0.1-SNAPSHOT -> [Help 2]
>>>> [ERROR]     Unknown packaging: nexus-plugin @ line 28, column 14
>>>> [ERROR]
>>>> [ERROR]   The project
>>>> org.sonatype.nexus.plugins:nexus-h2-plugin:2.6.0-SNAPSHOT
>>>> (/Users/njbartlett/Projects/nexus-oss/plugins/basic/nexus-h2-plugin/pom.xml)
>>>> has 2 errors
>>>> [ERROR]     Unresolveable build extension: Plugin
>>>> org.sonatype.nexus:nexus-plugin-bundle-maven-plugin:1.0.1-SNAPSHOT or
>>>> one of its dependencies could not be resolved: Could not find artifact
>>>> org.sonatype.nexus:nexus-plugin-bund
>>>> le-maven-plugin:jar:1.0.1-SNAPSHOT -> [Help 2]
>>>> [ERROR]     Unknown packaging: nexus-plugin @ line 28, column 14
>>>> [ERROR]
>>>> [ERROR]   The project
>>>> org.sonatype.nexus.plugins:nexus-lvo-plugin:2.6.0-SNAPSHOT
>>>> (/Users/njbartlett/Projects/nexus-oss/plugins/basic/nexus-lvo-plugin/pom.xml)
>>>> has 2 errors
>>>> [ERROR]     Unresolveable build extension: Plugin
>>>> org.sonatype.nexus:nexus-plugin-bundle-maven-plugin:1.0.1-SNAPSHOT or
>>>> one of its dependencies could not be resolved: Could not find artifact
>>>> org.sonatype.nexus:nexus-plugin-bund
>>>> le-maven-plugin:jar:1.0.1-SNAPSHOT -> [Help 2]
>>>> [ERROR]     Unknown packaging: nexus-plugin @ line 27, column 14
>>>> [ERROR]
>>>> [ERROR]   The project
>>>> org.sonatype.nexus.plugins:nexus-plugin-console-plugin:2.6.0-SNAPSHOT
>>>> (/Users/njbartlett/Projects/nexus-oss/plugins/basic/nexus-plugin-console-plugin/pom.xml)
>>>> has 2 errors
>>>> [ERROR]     Unresolveable build extension: Plugin
>>>> org.sonatype.nexus:nexus-plugin-bundle-maven-plugin:1.0.1-SNAPSHOT or
>>>> one of its dependencies could not be resolved: Could not find artifact
>>>> org.sonatype.nexus:nexus-plugin-bund
>>>> le-maven-plugin:jar:1.0.1-SNAPSHOT -> [Help 2]
>>>> [ERROR]     Unknown packaging: nexus-plugin @ line 28, column 14
>>>> [ERROR]
>>>> [ERROR]   The project
>>>> org.sonatype.nexus.plugins:nexus-rrb-plugin:2.6.0-SNAPSHOT
>>>> (/Users/njbartlett/Projects/nexus-oss/plugins/basic/nexus-rrb-plugin/pom.xml)
>>>> has 2 errors
>>>> [ERROR]     Unresolveable build extension: Plugin
>>>> org.sonatype.nexus:nexus-plugin-bundle-maven-plugin:1.0.1-SNAPSHOT or
>>>> one of its dependencies could not be resolved: Could not find artifact
>>>> org.sonatype.nexus:nexus-plugin-bund
>>>> le-maven-plugin:jar:1.0.1-SNAPSHOT -> [Help 2]
>>>> [ERROR]     Unknown packaging: nexus-plugin @ line 29, column 14
>>>> [ERROR]
>>>> [ERROR]   The project
>>>> org.sonatype.nexus.plugins:nexus-siesta-plugin:2.6.0-SNAPSHOT
>>>> (/Users/njbartlett/Projects/nexus-oss/plugins/basic/nexus-siesta-plugin/pom.xml)
>>>> has 2 errors
>>>> [ERROR]     Unresolveable build extension: Plugin
>>>> org.sonatype.nexus:nexus-plugin-bundle-maven-plugin:1.0.1-SNAPSHOT or
>>>> one of its dependencies could not be resolved: Could not find artifact
>>>> org.sonatype.nexus:nexus-plugin-bund
>>>> le-maven-plugin:jar:1.0.1-SNAPSHOT -> [Help 2]
>>>> [ERROR]     Unknown packaging: nexus-plugin @ line 28, column 14
>>>> [ERROR]
>>>> [ERROR]   The project
>>>> org.sonatype.nexus.plugins:nexus-site-repository-plugin:2.6.0-SNAPSHOT
>>>> (/Users/njbartlett/Projects/nexus-oss/plugins/basic/nexus-site-repository-plugin/pom.xml)
>>>> has 2 errors
>>>> [ERROR]     Unresolveable build extension: Plugin
>>>> org.sonatype.nexus:nexus-plugin-bundle-maven-plugin:1.0.1-SNAPSHOT or
>>>> one of its dependencies could not be resolved: Could not find artifact
>>>> org.sonatype.nexus:nexus-plugin-bund
>>>> le-maven-plugin:jar:1.0.1-SNAPSHOT -> [Help 2]
>>>> [ERROR]     Unknown packaging: nexus-plugin @ line 27, column 14
>>>> [ERROR]
>>>> [ERROR]   The project
>>>> org.sonatype.nexus.plugins:nexus-timeline-plugin:2.6.0-SNAPSHOT
>>>> (/Users/njbartlett/Projects/nexus-oss/plugins/basic/nexus-timeline-plugin/pom.xml)
>>>> has 2 errors
>>>> [ERROR]     Unresolveable build extension: Plugin
>>>> org.sonatype.nexus:nexus-plugin-bundle-maven-plugin:1.0.1-SNAPSHOT or
>>>> one of its dependencies could not be resolved: Could not find artifact
>>>> org.sonatype.nexus:nexus-plugin-bund
>>>> le-maven-plugin:jar:1.0.1-SNAPSHOT -> [Help 2]
>>>> [ERROR]     Unknown packaging: nexus-plugin @ line 28, column 14
>>>> [ERROR]
>>>> [ERROR]   The project
>>>> org.sonatype.nexus.plugins:nexus-ui-extjs3-plugin:2.6.0-SNAPSHOT
>>>> (/Users/njbartlett/Projects/nexus-oss/plugins/basic/nexus-ui-extjs3-plugin/pom.xml)
>>>> has 2 errors
>>>> [ERROR]     Unresolveable build extension: Plugin
>>>> org.sonatype.nexus:nexus-plugin-bundle-maven-plugin:1.0.1-SNAPSHOT or
>>>> one of its dependencies could not be resolved: Could not find artifact
>>>> org.sonatype.nexus:nexus-plugin-bund
>>>> le-maven-plugin:jar:1.0.1-SNAPSHOT -> [Help 2]
>>>> [ERROR]     Unknown packaging: nexus-plugin @ line 28, column 14
>>>> [ERROR]
>>>> [ERROR]   The project
>>>> org.sonatype.nexus.plugins:nexus-unpack-plugin:2.6.0-SNAPSHOT
>>>> (/Users/njbartlett/Projects/nexus-oss/plugins/basic/nexus-unpack-plugin/pom.xml)
>>>> has 2 errors
>>>> [ERROR]     Unresolveable build extension: Plugin
>>>> org.sonatype.nexus:nexus-plugin-bundle-maven-plugin:1.0.1-SNAPSHOT or
>>>> one of its dependencies could not be resolved: Could not find artifact
>>>> org.sonatype.nexus:nexus-plugin-bund
>>>> le-maven-plugin:jar:1.0.1-SNAPSHOT -> [Help 2]
>>>> [ERROR]     Unknown packaging: nexus-plugin @ line 28, column 14
>>>> [ERROR]
>>>> [ERROR]   The project
>>>> org.sonatype.nexus.plugins:nexus-capabilities-plugin:2.6.0-SNAPSHOT
>>>> (/Users/njbartlett/Projects/nexus-oss/plugins/capabilities/nexus-capabilities-plugin/pom.xml)
>>>> has 2 errors
>>>> [ERROR]     Unresolveable build extension: Plugin
>>>> org.sonatype.nexus:nexus-plugin-bundle-maven-plugin:1.0.1-SNAPSHOT or
>>>> one of its dependencies could not be resolved: Could not find artifact
>>>> org.sonatype.nexus:nexus-plugin-bund
>>>> le-maven-plugin:jar:1.0.1-SNAPSHOT -> [Help 2]
>>>> [ERROR]     Unknown packaging: nexus-plugin @ line 30, column 14
>>>> [ERROR]
>>>> [ERROR]   The project
>>>> org.sonatype.nexus.plugins:nexus-capabilities-testsuite-helper:2.6.0-SNAPSHOT
>>>> (/Users/njbartlett/Projects/nexus-oss/plugins/capabilities/nexus-capabilities-testsuite-helper/pom.xml)
>>>> has 2 errors
>>>> [ERROR]     Unresolveable build extension: Plugin
>>>> org.sonatype.nexus:nexus-plugin-bundle-maven-plugin:1.0.1-SNAPSHOT or
>>>> one of its dependencies could not be resolved: Could not find artifact
>>>> org.sonatype.nexus:nexus-plugin-bund
>>>> le-maven-plugin:jar:1.0.1-SNAPSHOT -> [Help 2]
>>>> [ERROR]     Unknown packaging: nexus-plugin @ line 28, column 14
>>>> [ERROR]
>>>> [ERROR]   The project
>>>> org.sonatype.nexus.plugins:nexus-indexer-lucene-plugin:2.6.0-SNAPSHOT
>>>> (/Users/njbartlett/Projects/nexus-oss/plugins/indexer/nexus-indexer-lucene-plugin/pom.xml)
>>>> has 2 errors
>>>> [ERROR]     Unresolveable build extension: Plugin
>>>> org.sonatype.nexus:nexus-plugin-bundle-maven-plugin:1.0.1-SNAPSHOT or
>>>> one of its dependencies could not be resolved: Could not find artifact
>>>> org.sonatype.nexus:nexus-plugin-bund
>>>> le-maven-plugin:jar:1.0.1-SNAPSHOT -> [Help 2]
>>>> [ERROR]     Unknown packaging: nexus-plugin @ line 28, column 14
>>>> [ERROR]
>>>> [ERROR]   The project
>>>> org.sonatype.nexus.plugins:nexus-groovyremote-plugin:2.6.0-SNAPSHOT
>>>> (/Users/njbartlett/Projects/nexus-oss/plugins/internal/nexus-groovyremote-plugin/pom.xml)
>>>> has 2 errors
>>>> [ERROR]     Unresolveable build extension: Plugin
>>>> org.sonatype.nexus:nexus-plugin-bundle-maven-plugin:1.0.1-SNAPSHOT or
>>>> one of its dependencies could not be resolved: Could not find artifact
>>>> org.sonatype.nexus:nexus-plugin-bund
>>>> le-maven-plugin:jar:1.0.1-SNAPSHOT -> [Help 2]
>>>> [ERROR]     Unknown packaging: nexus-plugin @ line 28, column 14
>>>> [ERROR]
>>>> [ERROR]   The project
>>>> org.sonatype.nexus.plugins:nexus-maven-bridge-plugin:2.6.0-SNAPSHOT
>>>> (/Users/njbartlett/Projects/nexus-oss/plugins/maven/nexus-maven-bridge-plugin/pom.xml)
>>>> has 2 errors
>>>> [ERROR]     Unresolveable build extension: Plugin
>>>> org.sonatype.nexus:nexus-plugin-bundle-maven-plugin:1.0.1-SNAPSHOT or
>>>> one of its dependencies could not be resolved: Could not find artifact
>>>> org.sonatype.nexus:nexus-plugin-bund
>>>> le-maven-plugin:jar:1.0.1-SNAPSHOT -> [Help 2]
>>>> [ERROR]     Unknown packaging: nexus-plugin @ line 29, column 14
>>>> [ERROR]
>>>> [ERROR]   The project
>>>> org.sonatype.nexus.plugins:nexus-archetype-plugin:2.6.0-SNAPSHOT
>>>> (/Users/njbartlett/Projects/nexus-oss/plugins/maven/nexus-archetype-plugin/pom.xml)
>>>> has 2 errors
>>>> [ERROR]     Unresolveable build extension: Plugin
>>>> org.sonatype.nexus:nexus-plugin-bundle-maven-plugin:1.0.1-SNAPSHOT or
>>>> one of its dependencies could not be resolved: Could not find artifact
>>>> org.sonatype.nexus:nexus-plugin-bund
>>>> le-maven-plugin:jar:1.0.1-SNAPSHOT -> [Help 2]
>>>> [ERROR]     Unknown packaging: nexus-plugin @ line 29, column 14
>>>> [ERROR]
>>>> [ERROR]   The project
>>>> org.sonatype.nexus.plugins:nexus-obr-plugin:2.6.0-SNAPSHOT
>>>> (/Users/njbartlett/Projects/nexus-oss/plugins/osgi/nexus-obr-plugin/pom.xml)
>>>> has 2 errors
>>>> [ERROR]     Unresolveable build extension: Plugin
>>>> org.sonatype.nexus:nexus-plugin-bundle-maven-plugin:1.0.1-SNAPSHOT or
>>>> one of its dependencies could not be resolved: Could not find artifact
>>>> org.sonatype.nexus:nexus-plugin-bund
>>>> le-maven-plugin:jar:1.0.1-SNAPSHOT -> [Help 2]
>>>> [ERROR]     Unknown packaging: nexus-plugin @ line 28, column 14
>>>> [ERROR]
>>>> [ERROR]   The project
>>>> org.sonatype.nexus.plugins:nexus-p2-bridge-plugin:2.6.0-SNAPSHOT
>>>> (/Users/njbartlett/Projects/nexus-oss/plugins/p2/nexus-p2-bridge-plugin/pom.xml)
>>>> has 2 errors
>>>> [ERROR]     Unresolveable build extension: Plugin
>>>> org.sonatype.nexus:nexus-plugin-bundle-maven-plugin:1.0.1-SNAPSHOT or
>>>> one of its dependencies could not be resolved: Could not find artifact
>>>> org.sonatype.nexus:nexus-plugin-bund
>>>> le-maven-plugin:jar:1.0.1-SNAPSHOT -> [Help 2]
>>>> [ERROR]     Unknown packaging: nexus-plugin @ line 28, column 14
>>>> [ERROR]
>>>> [ERROR]   The project
>>>> org.sonatype.nexus.plugins:nexus-p2-repository-plugin:2.6.0-SNAPSHOT
>>>> (/Users/njbartlett/Projects/nexus-oss/plugins/p2/nexus-p2-repository-plugin/pom.xml)
>>>> has 2 errors
>>>> [ERROR]     Unresolveable build extension: Plugin
>>>> org.sonatype.nexus:nexus-plugin-bundle-maven-plugin:1.0.1-SNAPSHOT or
>>>> one of its dependencies could not be resolved: Could not find artifact
>>>> org.sonatype.nexus:nexus-plugin-bund
>>>> le-maven-plugin:jar:1.0.1-SNAPSHOT -> [Help 2]
>>>> [ERROR]     Unknown packaging: nexus-plugin @ line 28, column 14
>>>> [ERROR]
>>>> [ERROR]   The project
>>>> org.sonatype.nexus.plugins:nexus-restlet1x-plugin:2.6.0-SNAPSHOT
>>>> (/Users/njbartlett/Projects/nexus-oss/plugins/restlet1x/nexus-restlet1x-plugin/pom.xml)
>>>> has 2 errors
>>>> [ERROR]     Unresolveable build extension: Plugin
>>>> org.sonatype.nexus:nexus-plugin-bundle-maven-plugin:1.0.1-SNAPSHOT or
>>>> one of its dependencies could not be resolved: Could not find artifact
>>>> org.sonatype.nexus:nexus-plugin-bund
>>>> le-maven-plugin:jar:1.0.1-SNAPSHOT -> [Help 2]
>>>> [ERROR]     Unknown packaging: nexus-plugin @ line 28, column 14
>>>> [ERROR]
>>>> [ERROR]   The project
>>>> org.sonatype.nexus.plugins:nexus-restlet1x-testsupport-plugin:2.6.0-SNAPSHOT
>>>> (/Users/njbartlett/Projects/nexus-oss/plugins/restlet1x/nexus-restlet1x-testsupport-plugin/pom.xml)
>>>> has 2 errors
>>>> [ERROR]     Unresolveable build extension: Plugin
>>>> org.sonatype.nexus:nexus-plugin-bundle-maven-plugin:1.0.1-SNAPSHOT or
>>>> one of its dependencies could not be resolved: Could not find artifact
>>>> org.sonatype.nexus:nexus-plugin-bund
>>>> le-maven-plugin:jar:1.0.1-SNAPSHOT -> [Help 2]
>>>> [ERROR]     Unknown packaging: nexus-plugin @ line 28, column 14
>>>> [ERROR]
>>>> [ERROR]   The project
>>>> org.sonatype.nexus.plugins:nexus-ldap-realm-plugin:2.6.0-SNAPSHOT
>>>> (/Users/njbartlett/Projects/nexus-oss/plugins/security/nexus-ldap-realm-plugin/pom.xml)
>>>> has 2 errors
>>>> [ERROR]     Unresolveable build extension: Plugin
>>>> org.sonatype.nexus:nexus-plugin-bundle-maven-plugin:1.0.1-SNAPSHOT or
>>>> one of its dependencies could not be resolved: Could not find artifact
>>>> org.sonatype.nexus:nexus-plugin-bund
>>>> le-maven-plugin:jar:1.0.1-SNAPSHOT -> [Help 2]
>>>> [ERROR]     Unknown packaging: nexus-plugin @ line 31, column 14
>>>> [ERROR]
>>>> [ERROR]   The project
>>>> org.sonatype.nexus.plugins:nexus-kenai-plugin:2.6.0-SNAPSHOT
>>>> (/Users/njbartlett/Projects/nexus-oss/plugins/security/nexus-kenai-plugin/pom.xml)
>>>> has 2 errors
>>>> [ERROR]     Unresolveable build extension: Plugin
>>>> org.sonatype.nexus:nexus-plugin-bundle-maven-plugin:1.0.1-SNAPSHOT or
>>>> one of its dependencies could not be resolved: Could not find artifact
>>>> org.sonatype.nexus:nexus-plugin-bund
>>>> le-maven-plugin:jar:1.0.1-SNAPSHOT -> [Help 2]
>>>> [ERROR]     Unknown packaging: nexus-plugin @ line 29, column 14
>>>> [ERROR]
>>>> [ERROR]   The project
>>>> org.sonatype.nexus.testsuite:nexus-testsuite:2.6.0-SNAPSHOT
>>>> (/Users/njbartlett/Projects/nexus-oss/testsuite/pom.xml) has 1 error
>>>> [ERROR]     Unresolveable build extension: Plugin
>>>> org.sonatype.nexus:nexus-plugin-bundle-maven-plugin:1.0.1-SNAPSHOT or
>>>> one of its dependencies could not be resolved: Could not find artifact
>>>> org.sonatype.nexus:nexus-plugin-bund
>>>> le-maven-plugin:jar:1.0.1-SNAPSHOT -> [Help 2]
>>>> [ERROR]
>>>> [ERROR] To see the full stack trace of the errors, re-run Maven with
>>>> the -e switch.
>>>> [ERROR] Re-run Maven using the -X switch to enable full debug logging.
>>>> [ERROR]
>>>> [ERROR] For more information about the errors and possible solutions,
>>>> please read the following articles:
>>>> [ERROR] [Help 1]
>>>> http://cwiki.apache.org/confluence/display/MAVEN/ProjectBuildingException
>>>> [ERROR] [Help 2]
>>>> http://cwiki.apache.org/confluence/display/MAVEN/PluginResolutionException
>>>> n
>>>>
>>>> ---------------------------------------------------------------------
>>>> To unsubscribe, e-mail: [hidden email]
>>>> For additional commands, e-mail: [hidden email]
>>>>
>>>
>>>
>>> ---------------------------------------------------------------------
>>> To unsubscribe, e-mail: [hidden email]
>>> For additional commands, e-mail: [hidden email]
>>>
>
> ---------------------------------------------------------------------
> To unsubscribe, e-mail: [hidden email]
> For additional commands, e-mail: [hidden email]
>


---------------------------------------------------------------------
To unsubscribe, e-mail: [hidden email]
For additional commands, e-mail: [hidden email]

Reply | Threaded
Open this post in threaded view
|

Re: Cannot build Nexus-OSS

Stuart McCulloch-2
In reply to this post by Neil Bartlett
On 20 Jun 2013, at 17:44, Neil Bartlett wrote:

> I spoke too soon...
>
> Stumbling around in the dark a bit because "mvn install" didn't
> produce anything that looked like an installable product...

As Rich mentioned nexus-oss master is going through a bit of churn at the moment, but you could either use the WAR:

        nexus-oss/components/nexus-webapp/target/nexus-webapp-2.6.0-SNAPSHOT.war

or the nexus-bundle-template assembly which you can unpack and run as follows:

        unzip -d ~/some/where nexus-oss/assemblies/nexus-bundle-template/target/nexus-bundle-template-2.6.0-SNAPSHOT-bundle.zip

        ~/some/where/nexus-bundle-template-2.6.0-SNAPSHOT/bin/nexus  { console | start | stop | restart | status | dump }

Use 'start' to run Nexus as a background service, otherwise use 'console' to run it in the foreground in the current console window

> so I tried "mvn deploy". This fails in
> org.sonatype.nexus.testsuite:nexus-modern-testsuite with the following
> error:

The "deploy" goal will try to upload the artifacts to the configured remote repository, in this case RSO which has limited write access.

Most of the time "install" or "verify" is the goal you want: http://maven.apache.org/guides/introduction/introduction-to-the-lifecycle.html

PS. you might find http://books.sonatype.com/mvnex-book/reference/ and http://books.sonatype.com/mvnref-book/reference/ useful.

> [ERROR] Failed to execute goal
> org.sonatype.plugins:nexus-staging-maven-plugin:1.4.4:deploy
> (injected-nexus-deploy) on project nexus-modern-testsuite: Failed to
> deploy artifacts: Could not transfer artifact
> org.sonatype.nexus.testsuite:nexus-modern-testsuite:jar:2.6.0-20130620.164206-1
> from/to forge-snapshots
> (https://repository.sonatype.org/content/repositories/snapshots):
> Failed to transfer file:
> https://repository.sonatype.org/content/repositories/snapshots/org/sonatype/nexus/testsuite/nexus-modern-testsuite/2.6.0-SNAPSHOT/nexus-modern-testsuite-2.6.0-20130620.164206-1.jar.
> Return code is: 401, ReasonPhrase: Unauthorized. -> [Help 1]
>
> Thanks,
> Neil
>
> On Thu, Jun 20, 2013 at 4:58 PM, Neil Bartlett <[hidden email]> wrote:
>> Thanks Stuart. That seemed to work.
>>
>> Note that I did get test failures in nexus-restlet1x-plugin and
>> legacy-testsuite, but I assume that is just a temporary issue as a
>> result of checking out git HEAD, so I commented out those modules.
>>
>> Regards
>> Neil
>>
>>
>> On Thu, Jun 20, 2013 at 1:31 PM, Stuart McCulloch <[hidden email]> wrote:
>>> Hi Neil,
>>>
>>> Nexus trunk depends on some snapshots at the moment which are available in the forge repository:
>>>
>>>        https://repository.sonatype.org/content/groups/sonatype-public-grid/
>>>
>>> you can either add this to your local repository manager (if you happen to already have one installed)
>>>
>>> or as an additional repository (and pluginRepository) in your settings.xml:
>>>
>>>        http://books.sonatype.com/mvnref-book/reference/appendix-settings-sect-details.html#appendix-settings-sect-settings-repository
>>>
>>> or use a mirror by following the old instructions at:
>>>
>>>        https://github.com/sonatype/nexus/blob/158692ec7c4bcf1a6e711e9ad3b9a1297f96b231/README.md#building
>>>
>>> --
>>> Cheers, Stuart
>>>
>>> On 20 Jun 2013, at 12:24, Neil Bartlett wrote:
>>>
>>>> Hi,
>>>>
>>>> I am unable to build Nexus-OSS, which I have just checked out from the
>>>> Github project. The build reports multiple errors "Unknown packaging:
>>>> nexus-plugin". The full error output is at the bottom of this email. I
>>>> am using Maven 3.0.5 and Java 1.6.0_31 on Mac OS 10.8.2. I could not
>>>> find any actual build instructions for Nexus, so I simply assumed "mvn
>>>> install" is correct. I have no ~/.m2/settings.xml.
>>>>
>>>> If there are some special setup steps required before building, might
>>>> I suggest that these be documented somewhere?
>>>>
>>>> Kind regards,
>>>> Neil
>>>>
>>>> Full error output:
>>>>
>>>> [ERROR] The build could not read 25 projects -> [Help 1]
>>>> [ERROR]
>>>> [ERROR]   The project
>>>> org.sonatype.nexus:nexus-it-helper-plugin:2.6.0-SNAPSHOT
>>>> (/Users/njbartlett/Projects/nexus-oss/testsupport/nexus-it-helper-plugin/pom.xml)
>>>> has 2 errors
>>>> [ERROR]     Unresolveable build extension: Plugin
>>>> org.sonatype.nexus:nexus-plugin-bundle-maven-plugin:1.0.1-SNAPSHOT or
>>>> one of its dependencies could not be resolved: Could not find artifact
>>>> org.sonatype.nexus:nexus-plugin-bund
>>>> le-maven-plugin:jar:1.0.1-SNAPSHOT -> [Help 2]
>>>> [ERROR]     Unknown packaging: nexus-plugin @ line 28, column 14
>>>> [ERROR]
>>>> [ERROR]   The project
>>>> org.sonatype.nexus.plugins:nexus-crypto-plugin:2.6.0-SNAPSHOT
>>>> (/Users/njbartlett/Projects/nexus-oss/plugins/basic/nexus-crypto-plugin/pom.xml)
>>>> has 2 errors
>>>> [ERROR]     Unresolveable build extension: Plugin
>>>> org.sonatype.nexus:nexus-plugin-bundle-maven-plugin:1.0.1-SNAPSHOT or
>>>> one of its dependencies could not be resolved: Could not find artifact
>>>> org.sonatype.nexus:nexus-plugin-bund
>>>> le-maven-plugin:jar:1.0.1-SNAPSHOT -> [Help 2]
>>>> [ERROR]     Unknown packaging: nexus-plugin @ line 28, column 14
>>>> [ERROR]
>>>> [ERROR]   The project
>>>> org.sonatype.nexus.plugins:nexus-h2-plugin:2.6.0-SNAPSHOT
>>>> (/Users/njbartlett/Projects/nexus-oss/plugins/basic/nexus-h2-plugin/pom.xml)
>>>> has 2 errors
>>>> [ERROR]     Unresolveable build extension: Plugin
>>>> org.sonatype.nexus:nexus-plugin-bundle-maven-plugin:1.0.1-SNAPSHOT or
>>>> one of its dependencies could not be resolved: Could not find artifact
>>>> org.sonatype.nexus:nexus-plugin-bund
>>>> le-maven-plugin:jar:1.0.1-SNAPSHOT -> [Help 2]
>>>> [ERROR]     Unknown packaging: nexus-plugin @ line 28, column 14
>>>> [ERROR]
>>>> [ERROR]   The project
>>>> org.sonatype.nexus.plugins:nexus-lvo-plugin:2.6.0-SNAPSHOT
>>>> (/Users/njbartlett/Projects/nexus-oss/plugins/basic/nexus-lvo-plugin/pom.xml)
>>>> has 2 errors
>>>> [ERROR]     Unresolveable build extension: Plugin
>>>> org.sonatype.nexus:nexus-plugin-bundle-maven-plugin:1.0.1-SNAPSHOT or
>>>> one of its dependencies could not be resolved: Could not find artifact
>>>> org.sonatype.nexus:nexus-plugin-bund
>>>> le-maven-plugin:jar:1.0.1-SNAPSHOT -> [Help 2]
>>>> [ERROR]     Unknown packaging: nexus-plugin @ line 27, column 14
>>>> [ERROR]
>>>> [ERROR]   The project
>>>> org.sonatype.nexus.plugins:nexus-plugin-console-plugin:2.6.0-SNAPSHOT
>>>> (/Users/njbartlett/Projects/nexus-oss/plugins/basic/nexus-plugin-console-plugin/pom.xml)
>>>> has 2 errors
>>>> [ERROR]     Unresolveable build extension: Plugin
>>>> org.sonatype.nexus:nexus-plugin-bundle-maven-plugin:1.0.1-SNAPSHOT or
>>>> one of its dependencies could not be resolved: Could not find artifact
>>>> org.sonatype.nexus:nexus-plugin-bund
>>>> le-maven-plugin:jar:1.0.1-SNAPSHOT -> [Help 2]
>>>> [ERROR]     Unknown packaging: nexus-plugin @ line 28, column 14
>>>> [ERROR]
>>>> [ERROR]   The project
>>>> org.sonatype.nexus.plugins:nexus-rrb-plugin:2.6.0-SNAPSHOT
>>>> (/Users/njbartlett/Projects/nexus-oss/plugins/basic/nexus-rrb-plugin/pom.xml)
>>>> has 2 errors
>>>> [ERROR]     Unresolveable build extension: Plugin
>>>> org.sonatype.nexus:nexus-plugin-bundle-maven-plugin:1.0.1-SNAPSHOT or
>>>> one of its dependencies could not be resolved: Could not find artifact
>>>> org.sonatype.nexus:nexus-plugin-bund
>>>> le-maven-plugin:jar:1.0.1-SNAPSHOT -> [Help 2]
>>>> [ERROR]     Unknown packaging: nexus-plugin @ line 29, column 14
>>>> [ERROR]
>>>> [ERROR]   The project
>>>> org.sonatype.nexus.plugins:nexus-siesta-plugin:2.6.0-SNAPSHOT
>>>> (/Users/njbartlett/Projects/nexus-oss/plugins/basic/nexus-siesta-plugin/pom.xml)
>>>> has 2 errors
>>>> [ERROR]     Unresolveable build extension: Plugin
>>>> org.sonatype.nexus:nexus-plugin-bundle-maven-plugin:1.0.1-SNAPSHOT or
>>>> one of its dependencies could not be resolved: Could not find artifact
>>>> org.sonatype.nexus:nexus-plugin-bund
>>>> le-maven-plugin:jar:1.0.1-SNAPSHOT -> [Help 2]
>>>> [ERROR]     Unknown packaging: nexus-plugin @ line 28, column 14
>>>> [ERROR]
>>>> [ERROR]   The project
>>>> org.sonatype.nexus.plugins:nexus-site-repository-plugin:2.6.0-SNAPSHOT
>>>> (/Users/njbartlett/Projects/nexus-oss/plugins/basic/nexus-site-repository-plugin/pom.xml)
>>>> has 2 errors
>>>> [ERROR]     Unresolveable build extension: Plugin
>>>> org.sonatype.nexus:nexus-plugin-bundle-maven-plugin:1.0.1-SNAPSHOT or
>>>> one of its dependencies could not be resolved: Could not find artifact
>>>> org.sonatype.nexus:nexus-plugin-bund
>>>> le-maven-plugin:jar:1.0.1-SNAPSHOT -> [Help 2]
>>>> [ERROR]     Unknown packaging: nexus-plugin @ line 27, column 14
>>>> [ERROR]
>>>> [ERROR]   The project
>>>> org.sonatype.nexus.plugins:nexus-timeline-plugin:2.6.0-SNAPSHOT
>>>> (/Users/njbartlett/Projects/nexus-oss/plugins/basic/nexus-timeline-plugin/pom.xml)
>>>> has 2 errors
>>>> [ERROR]     Unresolveable build extension: Plugin
>>>> org.sonatype.nexus:nexus-plugin-bundle-maven-plugin:1.0.1-SNAPSHOT or
>>>> one of its dependencies could not be resolved: Could not find artifact
>>>> org.sonatype.nexus:nexus-plugin-bund
>>>> le-maven-plugin:jar:1.0.1-SNAPSHOT -> [Help 2]
>>>> [ERROR]     Unknown packaging: nexus-plugin @ line 28, column 14
>>>> [ERROR]
>>>> [ERROR]   The project
>>>> org.sonatype.nexus.plugins:nexus-ui-extjs3-plugin:2.6.0-SNAPSHOT
>>>> (/Users/njbartlett/Projects/nexus-oss/plugins/basic/nexus-ui-extjs3-plugin/pom.xml)
>>>> has 2 errors
>>>> [ERROR]     Unresolveable build extension: Plugin
>>>> org.sonatype.nexus:nexus-plugin-bundle-maven-plugin:1.0.1-SNAPSHOT or
>>>> one of its dependencies could not be resolved: Could not find artifact
>>>> org.sonatype.nexus:nexus-plugin-bund
>>>> le-maven-plugin:jar:1.0.1-SNAPSHOT -> [Help 2]
>>>> [ERROR]     Unknown packaging: nexus-plugin @ line 28, column 14
>>>> [ERROR]
>>>> [ERROR]   The project
>>>> org.sonatype.nexus.plugins:nexus-unpack-plugin:2.6.0-SNAPSHOT
>>>> (/Users/njbartlett/Projects/nexus-oss/plugins/basic/nexus-unpack-plugin/pom.xml)
>>>> has 2 errors
>>>> [ERROR]     Unresolveable build extension: Plugin
>>>> org.sonatype.nexus:nexus-plugin-bundle-maven-plugin:1.0.1-SNAPSHOT or
>>>> one of its dependencies could not be resolved: Could not find artifact
>>>> org.sonatype.nexus:nexus-plugin-bund
>>>> le-maven-plugin:jar:1.0.1-SNAPSHOT -> [Help 2]
>>>> [ERROR]     Unknown packaging: nexus-plugin @ line 28, column 14
>>>> [ERROR]
>>>> [ERROR]   The project
>>>> org.sonatype.nexus.plugins:nexus-capabilities-plugin:2.6.0-SNAPSHOT
>>>> (/Users/njbartlett/Projects/nexus-oss/plugins/capabilities/nexus-capabilities-plugin/pom.xml)
>>>> has 2 errors
>>>> [ERROR]     Unresolveable build extension: Plugin
>>>> org.sonatype.nexus:nexus-plugin-bundle-maven-plugin:1.0.1-SNAPSHOT or
>>>> one of its dependencies could not be resolved: Could not find artifact
>>>> org.sonatype.nexus:nexus-plugin-bund
>>>> le-maven-plugin:jar:1.0.1-SNAPSHOT -> [Help 2]
>>>> [ERROR]     Unknown packaging: nexus-plugin @ line 30, column 14
>>>> [ERROR]
>>>> [ERROR]   The project
>>>> org.sonatype.nexus.plugins:nexus-capabilities-testsuite-helper:2.6.0-SNAPSHOT
>>>> (/Users/njbartlett/Projects/nexus-oss/plugins/capabilities/nexus-capabilities-testsuite-helper/pom.xml)
>>>> has 2 errors
>>>> [ERROR]     Unresolveable build extension: Plugin
>>>> org.sonatype.nexus:nexus-plugin-bundle-maven-plugin:1.0.1-SNAPSHOT or
>>>> one of its dependencies could not be resolved: Could not find artifact
>>>> org.sonatype.nexus:nexus-plugin-bund
>>>> le-maven-plugin:jar:1.0.1-SNAPSHOT -> [Help 2]
>>>> [ERROR]     Unknown packaging: nexus-plugin @ line 28, column 14
>>>> [ERROR]
>>>> [ERROR]   The project
>>>> org.sonatype.nexus.plugins:nexus-indexer-lucene-plugin:2.6.0-SNAPSHOT
>>>> (/Users/njbartlett/Projects/nexus-oss/plugins/indexer/nexus-indexer-lucene-plugin/pom.xml)
>>>> has 2 errors
>>>> [ERROR]     Unresolveable build extension: Plugin
>>>> org.sonatype.nexus:nexus-plugin-bundle-maven-plugin:1.0.1-SNAPSHOT or
>>>> one of its dependencies could not be resolved: Could not find artifact
>>>> org.sonatype.nexus:nexus-plugin-bund
>>>> le-maven-plugin:jar:1.0.1-SNAPSHOT -> [Help 2]
>>>> [ERROR]     Unknown packaging: nexus-plugin @ line 28, column 14
>>>> [ERROR]
>>>> [ERROR]   The project
>>>> org.sonatype.nexus.plugins:nexus-groovyremote-plugin:2.6.0-SNAPSHOT
>>>> (/Users/njbartlett/Projects/nexus-oss/plugins/internal/nexus-groovyremote-plugin/pom.xml)
>>>> has 2 errors
>>>> [ERROR]     Unresolveable build extension: Plugin
>>>> org.sonatype.nexus:nexus-plugin-bundle-maven-plugin:1.0.1-SNAPSHOT or
>>>> one of its dependencies could not be resolved: Could not find artifact
>>>> org.sonatype.nexus:nexus-plugin-bund
>>>> le-maven-plugin:jar:1.0.1-SNAPSHOT -> [Help 2]
>>>> [ERROR]     Unknown packaging: nexus-plugin @ line 28, column 14
>>>> [ERROR]
>>>> [ERROR]   The project
>>>> org.sonatype.nexus.plugins:nexus-maven-bridge-plugin:2.6.0-SNAPSHOT
>>>> (/Users/njbartlett/Projects/nexus-oss/plugins/maven/nexus-maven-bridge-plugin/pom.xml)
>>>> has 2 errors
>>>> [ERROR]     Unresolveable build extension: Plugin
>>>> org.sonatype.nexus:nexus-plugin-bundle-maven-plugin:1.0.1-SNAPSHOT or
>>>> one of its dependencies could not be resolved: Could not find artifact
>>>> org.sonatype.nexus:nexus-plugin-bund
>>>> le-maven-plugin:jar:1.0.1-SNAPSHOT -> [Help 2]
>>>> [ERROR]     Unknown packaging: nexus-plugin @ line 29, column 14
>>>> [ERROR]
>>>> [ERROR]   The project
>>>> org.sonatype.nexus.plugins:nexus-archetype-plugin:2.6.0-SNAPSHOT
>>>> (/Users/njbartlett/Projects/nexus-oss/plugins/maven/nexus-archetype-plugin/pom.xml)
>>>> has 2 errors
>>>> [ERROR]     Unresolveable build extension: Plugin
>>>> org.sonatype.nexus:nexus-plugin-bundle-maven-plugin:1.0.1-SNAPSHOT or
>>>> one of its dependencies could not be resolved: Could not find artifact
>>>> org.sonatype.nexus:nexus-plugin-bund
>>>> le-maven-plugin:jar:1.0.1-SNAPSHOT -> [Help 2]
>>>> [ERROR]     Unknown packaging: nexus-plugin @ line 29, column 14
>>>> [ERROR]
>>>> [ERROR]   The project
>>>> org.sonatype.nexus.plugins:nexus-obr-plugin:2.6.0-SNAPSHOT
>>>> (/Users/njbartlett/Projects/nexus-oss/plugins/osgi/nexus-obr-plugin/pom.xml)
>>>> has 2 errors
>>>> [ERROR]     Unresolveable build extension: Plugin
>>>> org.sonatype.nexus:nexus-plugin-bundle-maven-plugin:1.0.1-SNAPSHOT or
>>>> one of its dependencies could not be resolved: Could not find artifact
>>>> org.sonatype.nexus:nexus-plugin-bund
>>>> le-maven-plugin:jar:1.0.1-SNAPSHOT -> [Help 2]
>>>> [ERROR]     Unknown packaging: nexus-plugin @ line 28, column 14
>>>> [ERROR]
>>>> [ERROR]   The project
>>>> org.sonatype.nexus.plugins:nexus-p2-bridge-plugin:2.6.0-SNAPSHOT
>>>> (/Users/njbartlett/Projects/nexus-oss/plugins/p2/nexus-p2-bridge-plugin/pom.xml)
>>>> has 2 errors
>>>> [ERROR]     Unresolveable build extension: Plugin
>>>> org.sonatype.nexus:nexus-plugin-bundle-maven-plugin:1.0.1-SNAPSHOT or
>>>> one of its dependencies could not be resolved: Could not find artifact
>>>> org.sonatype.nexus:nexus-plugin-bund
>>>> le-maven-plugin:jar:1.0.1-SNAPSHOT -> [Help 2]
>>>> [ERROR]     Unknown packaging: nexus-plugin @ line 28, column 14
>>>> [ERROR]
>>>> [ERROR]   The project
>>>> org.sonatype.nexus.plugins:nexus-p2-repository-plugin:2.6.0-SNAPSHOT
>>>> (/Users/njbartlett/Projects/nexus-oss/plugins/p2/nexus-p2-repository-plugin/pom.xml)
>>>> has 2 errors
>>>> [ERROR]     Unresolveable build extension: Plugin
>>>> org.sonatype.nexus:nexus-plugin-bundle-maven-plugin:1.0.1-SNAPSHOT or
>>>> one of its dependencies could not be resolved: Could not find artifact
>>>> org.sonatype.nexus:nexus-plugin-bund
>>>> le-maven-plugin:jar:1.0.1-SNAPSHOT -> [Help 2]
>>>> [ERROR]     Unknown packaging: nexus-plugin @ line 28, column 14
>>>> [ERROR]
>>>> [ERROR]   The project
>>>> org.sonatype.nexus.plugins:nexus-restlet1x-plugin:2.6.0-SNAPSHOT
>>>> (/Users/njbartlett/Projects/nexus-oss/plugins/restlet1x/nexus-restlet1x-plugin/pom.xml)
>>>> has 2 errors
>>>> [ERROR]     Unresolveable build extension: Plugin
>>>> org.sonatype.nexus:nexus-plugin-bundle-maven-plugin:1.0.1-SNAPSHOT or
>>>> one of its dependencies could not be resolved: Could not find artifact
>>>> org.sonatype.nexus:nexus-plugin-bund
>>>> le-maven-plugin:jar:1.0.1-SNAPSHOT -> [Help 2]
>>>> [ERROR]     Unknown packaging: nexus-plugin @ line 28, column 14
>>>> [ERROR]
>>>> [ERROR]   The project
>>>> org.sonatype.nexus.plugins:nexus-restlet1x-testsupport-plugin:2.6.0-SNAPSHOT
>>>> (/Users/njbartlett/Projects/nexus-oss/plugins/restlet1x/nexus-restlet1x-testsupport-plugin/pom.xml)
>>>> has 2 errors
>>>> [ERROR]     Unresolveable build extension: Plugin
>>>> org.sonatype.nexus:nexus-plugin-bundle-maven-plugin:1.0.1-SNAPSHOT or
>>>> one of its dependencies could not be resolved: Could not find artifact
>>>> org.sonatype.nexus:nexus-plugin-bund
>>>> le-maven-plugin:jar:1.0.1-SNAPSHOT -> [Help 2]
>>>> [ERROR]     Unknown packaging: nexus-plugin @ line 28, column 14
>>>> [ERROR]
>>>> [ERROR]   The project
>>>> org.sonatype.nexus.plugins:nexus-ldap-realm-plugin:2.6.0-SNAPSHOT
>>>> (/Users/njbartlett/Projects/nexus-oss/plugins/security/nexus-ldap-realm-plugin/pom.xml)
>>>> has 2 errors
>>>> [ERROR]     Unresolveable build extension: Plugin
>>>> org.sonatype.nexus:nexus-plugin-bundle-maven-plugin:1.0.1-SNAPSHOT or
>>>> one of its dependencies could not be resolved: Could not find artifact
>>>> org.sonatype.nexus:nexus-plugin-bund
>>>> le-maven-plugin:jar:1.0.1-SNAPSHOT -> [Help 2]
>>>> [ERROR]     Unknown packaging: nexus-plugin @ line 31, column 14
>>>> [ERROR]
>>>> [ERROR]   The project
>>>> org.sonatype.nexus.plugins:nexus-kenai-plugin:2.6.0-SNAPSHOT
>>>> (/Users/njbartlett/Projects/nexus-oss/plugins/security/nexus-kenai-plugin/pom.xml)
>>>> has 2 errors
>>>> [ERROR]     Unresolveable build extension: Plugin
>>>> org.sonatype.nexus:nexus-plugin-bundle-maven-plugin:1.0.1-SNAPSHOT or
>>>> one of its dependencies could not be resolved: Could not find artifact
>>>> org.sonatype.nexus:nexus-plugin-bund
>>>> le-maven-plugin:jar:1.0.1-SNAPSHOT -> [Help 2]
>>>> [ERROR]     Unknown packaging: nexus-plugin @ line 29, column 14
>>>> [ERROR]
>>>> [ERROR]   The project
>>>> org.sonatype.nexus.testsuite:nexus-testsuite:2.6.0-SNAPSHOT
>>>> (/Users/njbartlett/Projects/nexus-oss/testsuite/pom.xml) has 1 error
>>>> [ERROR]     Unresolveable build extension: Plugin
>>>> org.sonatype.nexus:nexus-plugin-bundle-maven-plugin:1.0.1-SNAPSHOT or
>>>> one of its dependencies could not be resolved: Could not find artifact
>>>> org.sonatype.nexus:nexus-plugin-bund
>>>> le-maven-plugin:jar:1.0.1-SNAPSHOT -> [Help 2]
>>>> [ERROR]
>>>> [ERROR] To see the full stack trace of the errors, re-run Maven with
>>>> the -e switch.
>>>> [ERROR] Re-run Maven using the -X switch to enable full debug logging.
>>>> [ERROR]
>>>> [ERROR] For more information about the errors and possible solutions,
>>>> please read the following articles:
>>>> [ERROR] [Help 1]
>>>> http://cwiki.apache.org/confluence/display/MAVEN/ProjectBuildingException
>>>> [ERROR] [Help 2]
>>>> http://cwiki.apache.org/confluence/display/MAVEN/PluginResolutionException
>>>> n
>>>>
>>>> ---------------------------------------------------------------------
>>>> To unsubscribe, e-mail: [hidden email]
>>>> For additional commands, e-mail: [hidden email]
>>>>
>>>
>>>
>>> ---------------------------------------------------------------------
>>> To unsubscribe, e-mail: [hidden email]
>>> For additional commands, e-mail: [hidden email]
>>>
>
> ---------------------------------------------------------------------
> To unsubscribe, e-mail: [hidden email]
> For additional commands, e-mail: [hidden email]
>


---------------------------------------------------------------------
To unsubscribe, e-mail: [hidden email]
For additional commands, e-mail: [hidden email]

Reply | Threaded
Open this post in threaded view
|

Re: Cannot build Nexus-OSS

Neil Bartlett
Many thanks for your help Stuart. The WAR artifact is fine for my needs for now.

I am primarily interested in deploying the OBR plugin, which I note
has been discontinued as a separate GitHub project and not included by
default in the webapp, however I was able to work out how to modify
the build to include it.

I'm also interested in contributing OSGi R5 index support (time
permitting), which I previous expected to contribute as a PR against
the OBR plugin project. Since that has been merged into the main
Nexus, should I prepare a pull request against that?

Thanks again,
Neil

On Fri, Jun 21, 2013 at 11:43 AM, Stuart McCulloch <[hidden email]> wrote:

> On 20 Jun 2013, at 17:44, Neil Bartlett wrote:
>
>> I spoke too soon...
>>
>> Stumbling around in the dark a bit because "mvn install" didn't
>> produce anything that looked like an installable product...
>
> As Rich mentioned nexus-oss master is going through a bit of churn at the moment, but you could either use the WAR:
>
>         nexus-oss/components/nexus-webapp/target/nexus-webapp-2.6.0-SNAPSHOT.war
>
> or the nexus-bundle-template assembly which you can unpack and run as follows:
>
>         unzip -d ~/some/where nexus-oss/assemblies/nexus-bundle-template/target/nexus-bundle-template-2.6.0-SNAPSHOT-bundle.zip
>
>         ~/some/where/nexus-bundle-template-2.6.0-SNAPSHOT/bin/nexus  { console | start | stop | restart | status | dump }
>
> Use 'start' to run Nexus as a background service, otherwise use 'console' to run it in the foreground in the current console window
>
>> so I tried "mvn deploy". This fails in
>> org.sonatype.nexus.testsuite:nexus-modern-testsuite with the following
>> error:
>
> The "deploy" goal will try to upload the artifacts to the configured remote repository, in this case RSO which has limited write access.
>
> Most of the time "install" or "verify" is the goal you want: http://maven.apache.org/guides/introduction/introduction-to-the-lifecycle.html
>
> PS. you might find http://books.sonatype.com/mvnex-book/reference/ and http://books.sonatype.com/mvnref-book/reference/ useful.
>
>> [ERROR] Failed to execute goal
>> org.sonatype.plugins:nexus-staging-maven-plugin:1.4.4:deploy
>> (injected-nexus-deploy) on project nexus-modern-testsuite: Failed to
>> deploy artifacts: Could not transfer artifact
>> org.sonatype.nexus.testsuite:nexus-modern-testsuite:jar:2.6.0-20130620.164206-1
>> from/to forge-snapshots
>> (https://repository.sonatype.org/content/repositories/snapshots):
>> Failed to transfer file:
>> https://repository.sonatype.org/content/repositories/snapshots/org/sonatype/nexus/testsuite/nexus-modern-testsuite/2.6.0-SNAPSHOT/nexus-modern-testsuite-2.6.0-20130620.164206-1.jar.
>> Return code is: 401, ReasonPhrase: Unauthorized. -> [Help 1]
>>
>> Thanks,
>> Neil
>>
>> On Thu, Jun 20, 2013 at 4:58 PM, Neil Bartlett <[hidden email]> wrote:
>>> Thanks Stuart. That seemed to work.
>>>
>>> Note that I did get test failures in nexus-restlet1x-plugin and
>>> legacy-testsuite, but I assume that is just a temporary issue as a
>>> result of checking out git HEAD, so I commented out those modules.
>>>
>>> Regards
>>> Neil
>>>
>>>
>>> On Thu, Jun 20, 2013 at 1:31 PM, Stuart McCulloch <[hidden email]> wrote:
>>>> Hi Neil,
>>>>
>>>> Nexus trunk depends on some snapshots at the moment which are available in the forge repository:
>>>>
>>>>        https://repository.sonatype.org/content/groups/sonatype-public-grid/
>>>>
>>>> you can either add this to your local repository manager (if you happen to already have one installed)
>>>>
>>>> or as an additional repository (and pluginRepository) in your settings.xml:
>>>>
>>>>        http://books.sonatype.com/mvnref-book/reference/appendix-settings-sect-details.html#appendix-settings-sect-settings-repository
>>>>
>>>> or use a mirror by following the old instructions at:
>>>>
>>>>        https://github.com/sonatype/nexus/blob/158692ec7c4bcf1a6e711e9ad3b9a1297f96b231/README.md#building
>>>>
>>>> --
>>>> Cheers, Stuart
>>>>
>>>> On 20 Jun 2013, at 12:24, Neil Bartlett wrote:
>>>>
>>>>> Hi,
>>>>>
>>>>> I am unable to build Nexus-OSS, which I have just checked out from the
>>>>> Github project. The build reports multiple errors "Unknown packaging:
>>>>> nexus-plugin". The full error output is at the bottom of this email. I
>>>>> am using Maven 3.0.5 and Java 1.6.0_31 on Mac OS 10.8.2. I could not
>>>>> find any actual build instructions for Nexus, so I simply assumed "mvn
>>>>> install" is correct. I have no ~/.m2/settings.xml.
>>>>>
>>>>> If there are some special setup steps required before building, might
>>>>> I suggest that these be documented somewhere?
>>>>>
>>>>> Kind regards,
>>>>> Neil
>>>>>
>>>>> Full error output:
>>>>>
>>>>> [ERROR] The build could not read 25 projects -> [Help 1]
>>>>> [ERROR]
>>>>> [ERROR]   The project
>>>>> org.sonatype.nexus:nexus-it-helper-plugin:2.6.0-SNAPSHOT
>>>>> (/Users/njbartlett/Projects/nexus-oss/testsupport/nexus-it-helper-plugin/pom.xml)
>>>>> has 2 errors
>>>>> [ERROR]     Unresolveable build extension: Plugin
>>>>> org.sonatype.nexus:nexus-plugin-bundle-maven-plugin:1.0.1-SNAPSHOT or
>>>>> one of its dependencies could not be resolved: Could not find artifact
>>>>> org.sonatype.nexus:nexus-plugin-bund
>>>>> le-maven-plugin:jar:1.0.1-SNAPSHOT -> [Help 2]
>>>>> [ERROR]     Unknown packaging: nexus-plugin @ line 28, column 14
>>>>> [ERROR]
>>>>> [ERROR]   The project
>>>>> org.sonatype.nexus.plugins:nexus-crypto-plugin:2.6.0-SNAPSHOT
>>>>> (/Users/njbartlett/Projects/nexus-oss/plugins/basic/nexus-crypto-plugin/pom.xml)
>>>>> has 2 errors
>>>>> [ERROR]     Unresolveable build extension: Plugin
>>>>> org.sonatype.nexus:nexus-plugin-bundle-maven-plugin:1.0.1-SNAPSHOT or
>>>>> one of its dependencies could not be resolved: Could not find artifact
>>>>> org.sonatype.nexus:nexus-plugin-bund
>>>>> le-maven-plugin:jar:1.0.1-SNAPSHOT -> [Help 2]
>>>>> [ERROR]     Unknown packaging: nexus-plugin @ line 28, column 14
>>>>> [ERROR]
>>>>> [ERROR]   The project
>>>>> org.sonatype.nexus.plugins:nexus-h2-plugin:2.6.0-SNAPSHOT
>>>>> (/Users/njbartlett/Projects/nexus-oss/plugins/basic/nexus-h2-plugin/pom.xml)
>>>>> has 2 errors
>>>>> [ERROR]     Unresolveable build extension: Plugin
>>>>> org.sonatype.nexus:nexus-plugin-bundle-maven-plugin:1.0.1-SNAPSHOT or
>>>>> one of its dependencies could not be resolved: Could not find artifact
>>>>> org.sonatype.nexus:nexus-plugin-bund
>>>>> le-maven-plugin:jar:1.0.1-SNAPSHOT -> [Help 2]
>>>>> [ERROR]     Unknown packaging: nexus-plugin @ line 28, column 14
>>>>> [ERROR]
>>>>> [ERROR]   The project
>>>>> org.sonatype.nexus.plugins:nexus-lvo-plugin:2.6.0-SNAPSHOT
>>>>> (/Users/njbartlett/Projects/nexus-oss/plugins/basic/nexus-lvo-plugin/pom.xml)
>>>>> has 2 errors
>>>>> [ERROR]     Unresolveable build extension: Plugin
>>>>> org.sonatype.nexus:nexus-plugin-bundle-maven-plugin:1.0.1-SNAPSHOT or
>>>>> one of its dependencies could not be resolved: Could not find artifact
>>>>> org.sonatype.nexus:nexus-plugin-bund
>>>>> le-maven-plugin:jar:1.0.1-SNAPSHOT -> [Help 2]
>>>>> [ERROR]     Unknown packaging: nexus-plugin @ line 27, column 14
>>>>> [ERROR]
>>>>> [ERROR]   The project
>>>>> org.sonatype.nexus.plugins:nexus-plugin-console-plugin:2.6.0-SNAPSHOT
>>>>> (/Users/njbartlett/Projects/nexus-oss/plugins/basic/nexus-plugin-console-plugin/pom.xml)
>>>>> has 2 errors
>>>>> [ERROR]     Unresolveable build extension: Plugin
>>>>> org.sonatype.nexus:nexus-plugin-bundle-maven-plugin:1.0.1-SNAPSHOT or
>>>>> one of its dependencies could not be resolved: Could not find artifact
>>>>> org.sonatype.nexus:nexus-plugin-bund
>>>>> le-maven-plugin:jar:1.0.1-SNAPSHOT -> [Help 2]
>>>>> [ERROR]     Unknown packaging: nexus-plugin @ line 28, column 14
>>>>> [ERROR]
>>>>> [ERROR]   The project
>>>>> org.sonatype.nexus.plugins:nexus-rrb-plugin:2.6.0-SNAPSHOT
>>>>> (/Users/njbartlett/Projects/nexus-oss/plugins/basic/nexus-rrb-plugin/pom.xml)
>>>>> has 2 errors
>>>>> [ERROR]     Unresolveable build extension: Plugin
>>>>> org.sonatype.nexus:nexus-plugin-bundle-maven-plugin:1.0.1-SNAPSHOT or
>>>>> one of its dependencies could not be resolved: Could not find artifact
>>>>> org.sonatype.nexus:nexus-plugin-bund
>>>>> le-maven-plugin:jar:1.0.1-SNAPSHOT -> [Help 2]
>>>>> [ERROR]     Unknown packaging: nexus-plugin @ line 29, column 14
>>>>> [ERROR]
>>>>> [ERROR]   The project
>>>>> org.sonatype.nexus.plugins:nexus-siesta-plugin:2.6.0-SNAPSHOT
>>>>> (/Users/njbartlett/Projects/nexus-oss/plugins/basic/nexus-siesta-plugin/pom.xml)
>>>>> has 2 errors
>>>>> [ERROR]     Unresolveable build extension: Plugin
>>>>> org.sonatype.nexus:nexus-plugin-bundle-maven-plugin:1.0.1-SNAPSHOT or
>>>>> one of its dependencies could not be resolved: Could not find artifact
>>>>> org.sonatype.nexus:nexus-plugin-bund
>>>>> le-maven-plugin:jar:1.0.1-SNAPSHOT -> [Help 2]
>>>>> [ERROR]     Unknown packaging: nexus-plugin @ line 28, column 14
>>>>> [ERROR]
>>>>> [ERROR]   The project
>>>>> org.sonatype.nexus.plugins:nexus-site-repository-plugin:2.6.0-SNAPSHOT
>>>>> (/Users/njbartlett/Projects/nexus-oss/plugins/basic/nexus-site-repository-plugin/pom.xml)
>>>>> has 2 errors
>>>>> [ERROR]     Unresolveable build extension: Plugin
>>>>> org.sonatype.nexus:nexus-plugin-bundle-maven-plugin:1.0.1-SNAPSHOT or
>>>>> one of its dependencies could not be resolved: Could not find artifact
>>>>> org.sonatype.nexus:nexus-plugin-bund
>>>>> le-maven-plugin:jar:1.0.1-SNAPSHOT -> [Help 2]
>>>>> [ERROR]     Unknown packaging: nexus-plugin @ line 27, column 14
>>>>> [ERROR]
>>>>> [ERROR]   The project
>>>>> org.sonatype.nexus.plugins:nexus-timeline-plugin:2.6.0-SNAPSHOT
>>>>> (/Users/njbartlett/Projects/nexus-oss/plugins/basic/nexus-timeline-plugin/pom.xml)
>>>>> has 2 errors
>>>>> [ERROR]     Unresolveable build extension: Plugin
>>>>> org.sonatype.nexus:nexus-plugin-bundle-maven-plugin:1.0.1-SNAPSHOT or
>>>>> one of its dependencies could not be resolved: Could not find artifact
>>>>> org.sonatype.nexus:nexus-plugin-bund
>>>>> le-maven-plugin:jar:1.0.1-SNAPSHOT -> [Help 2]
>>>>> [ERROR]     Unknown packaging: nexus-plugin @ line 28, column 14
>>>>> [ERROR]
>>>>> [ERROR]   The project
>>>>> org.sonatype.nexus.plugins:nexus-ui-extjs3-plugin:2.6.0-SNAPSHOT
>>>>> (/Users/njbartlett/Projects/nexus-oss/plugins/basic/nexus-ui-extjs3-plugin/pom.xml)
>>>>> has 2 errors
>>>>> [ERROR]     Unresolveable build extension: Plugin
>>>>> org.sonatype.nexus:nexus-plugin-bundle-maven-plugin:1.0.1-SNAPSHOT or
>>>>> one of its dependencies could not be resolved: Could not find artifact
>>>>> org.sonatype.nexus:nexus-plugin-bund
>>>>> le-maven-plugin:jar:1.0.1-SNAPSHOT -> [Help 2]
>>>>> [ERROR]     Unknown packaging: nexus-plugin @ line 28, column 14
>>>>> [ERROR]
>>>>> [ERROR]   The project
>>>>> org.sonatype.nexus.plugins:nexus-unpack-plugin:2.6.0-SNAPSHOT
>>>>> (/Users/njbartlett/Projects/nexus-oss/plugins/basic/nexus-unpack-plugin/pom.xml)
>>>>> has 2 errors
>>>>> [ERROR]     Unresolveable build extension: Plugin
>>>>> org.sonatype.nexus:nexus-plugin-bundle-maven-plugin:1.0.1-SNAPSHOT or
>>>>> one of its dependencies could not be resolved: Could not find artifact
>>>>> org.sonatype.nexus:nexus-plugin-bund
>>>>> le-maven-plugin:jar:1.0.1-SNAPSHOT -> [Help 2]
>>>>> [ERROR]     Unknown packaging: nexus-plugin @ line 28, column 14
>>>>> [ERROR]
>>>>> [ERROR]   The project
>>>>> org.sonatype.nexus.plugins:nexus-capabilities-plugin:2.6.0-SNAPSHOT
>>>>> (/Users/njbartlett/Projects/nexus-oss/plugins/capabilities/nexus-capabilities-plugin/pom.xml)
>>>>> has 2 errors
>>>>> [ERROR]     Unresolveable build extension: Plugin
>>>>> org.sonatype.nexus:nexus-plugin-bundle-maven-plugin:1.0.1-SNAPSHOT or
>>>>> one of its dependencies could not be resolved: Could not find artifact
>>>>> org.sonatype.nexus:nexus-plugin-bund
>>>>> le-maven-plugin:jar:1.0.1-SNAPSHOT -> [Help 2]
>>>>> [ERROR]     Unknown packaging: nexus-plugin @ line 30, column 14
>>>>> [ERROR]
>>>>> [ERROR]   The project
>>>>> org.sonatype.nexus.plugins:nexus-capabilities-testsuite-helper:2.6.0-SNAPSHOT
>>>>> (/Users/njbartlett/Projects/nexus-oss/plugins/capabilities/nexus-capabilities-testsuite-helper/pom.xml)
>>>>> has 2 errors
>>>>> [ERROR]     Unresolveable build extension: Plugin
>>>>> org.sonatype.nexus:nexus-plugin-bundle-maven-plugin:1.0.1-SNAPSHOT or
>>>>> one of its dependencies could not be resolved: Could not find artifact
>>>>> org.sonatype.nexus:nexus-plugin-bund
>>>>> le-maven-plugin:jar:1.0.1-SNAPSHOT -> [Help 2]
>>>>> [ERROR]     Unknown packaging: nexus-plugin @ line 28, column 14
>>>>> [ERROR]
>>>>> [ERROR]   The project
>>>>> org.sonatype.nexus.plugins:nexus-indexer-lucene-plugin:2.6.0-SNAPSHOT
>>>>> (/Users/njbartlett/Projects/nexus-oss/plugins/indexer/nexus-indexer-lucene-plugin/pom.xml)
>>>>> has 2 errors
>>>>> [ERROR]     Unresolveable build extension: Plugin
>>>>> org.sonatype.nexus:nexus-plugin-bundle-maven-plugin:1.0.1-SNAPSHOT or
>>>>> one of its dependencies could not be resolved: Could not find artifact
>>>>> org.sonatype.nexus:nexus-plugin-bund
>>>>> le-maven-plugin:jar:1.0.1-SNAPSHOT -> [Help 2]
>>>>> [ERROR]     Unknown packaging: nexus-plugin @ line 28, column 14
>>>>> [ERROR]
>>>>> [ERROR]   The project
>>>>> org.sonatype.nexus.plugins:nexus-groovyremote-plugin:2.6.0-SNAPSHOT
>>>>> (/Users/njbartlett/Projects/nexus-oss/plugins/internal/nexus-groovyremote-plugin/pom.xml)
>>>>> has 2 errors
>>>>> [ERROR]     Unresolveable build extension: Plugin
>>>>> org.sonatype.nexus:nexus-plugin-bundle-maven-plugin:1.0.1-SNAPSHOT or
>>>>> one of its dependencies could not be resolved: Could not find artifact
>>>>> org.sonatype.nexus:nexus-plugin-bund
>>>>> le-maven-plugin:jar:1.0.1-SNAPSHOT -> [Help 2]
>>>>> [ERROR]     Unknown packaging: nexus-plugin @ line 28, column 14
>>>>> [ERROR]
>>>>> [ERROR]   The project
>>>>> org.sonatype.nexus.plugins:nexus-maven-bridge-plugin:2.6.0-SNAPSHOT
>>>>> (/Users/njbartlett/Projects/nexus-oss/plugins/maven/nexus-maven-bridge-plugin/pom.xml)
>>>>> has 2 errors
>>>>> [ERROR]     Unresolveable build extension: Plugin
>>>>> org.sonatype.nexus:nexus-plugin-bundle-maven-plugin:1.0.1-SNAPSHOT or
>>>>> one of its dependencies could not be resolved: Could not find artifact
>>>>> org.sonatype.nexus:nexus-plugin-bund
>>>>> le-maven-plugin:jar:1.0.1-SNAPSHOT -> [Help 2]
>>>>> [ERROR]     Unknown packaging: nexus-plugin @ line 29, column 14
>>>>> [ERROR]
>>>>> [ERROR]   The project
>>>>> org.sonatype.nexus.plugins:nexus-archetype-plugin:2.6.0-SNAPSHOT
>>>>> (/Users/njbartlett/Projects/nexus-oss/plugins/maven/nexus-archetype-plugin/pom.xml)
>>>>> has 2 errors
>>>>> [ERROR]     Unresolveable build extension: Plugin
>>>>> org.sonatype.nexus:nexus-plugin-bundle-maven-plugin:1.0.1-SNAPSHOT or
>>>>> one of its dependencies could not be resolved: Could not find artifact
>>>>> org.sonatype.nexus:nexus-plugin-bund
>>>>> le-maven-plugin:jar:1.0.1-SNAPSHOT -> [Help 2]
>>>>> [ERROR]     Unknown packaging: nexus-plugin @ line 29, column 14
>>>>> [ERROR]
>>>>> [ERROR]   The project
>>>>> org.sonatype.nexus.plugins:nexus-obr-plugin:2.6.0-SNAPSHOT
>>>>> (/Users/njbartlett/Projects/nexus-oss/plugins/osgi/nexus-obr-plugin/pom.xml)
>>>>> has 2 errors
>>>>> [ERROR]     Unresolveable build extension: Plugin
>>>>> org.sonatype.nexus:nexus-plugin-bundle-maven-plugin:1.0.1-SNAPSHOT or
>>>>> one of its dependencies could not be resolved: Could not find artifact
>>>>> org.sonatype.nexus:nexus-plugin-bund
>>>>> le-maven-plugin:jar:1.0.1-SNAPSHOT -> [Help 2]
>>>>> [ERROR]     Unknown packaging: nexus-plugin @ line 28, column 14
>>>>> [ERROR]
>>>>> [ERROR]   The project
>>>>> org.sonatype.nexus.plugins:nexus-p2-bridge-plugin:2.6.0-SNAPSHOT
>>>>> (/Users/njbartlett/Projects/nexus-oss/plugins/p2/nexus-p2-bridge-plugin/pom.xml)
>>>>> has 2 errors
>>>>> [ERROR]     Unresolveable build extension: Plugin
>>>>> org.sonatype.nexus:nexus-plugin-bundle-maven-plugin:1.0.1-SNAPSHOT or
>>>>> one of its dependencies could not be resolved: Could not find artifact
>>>>> org.sonatype.nexus:nexus-plugin-bund
>>>>> le-maven-plugin:jar:1.0.1-SNAPSHOT -> [Help 2]
>>>>> [ERROR]     Unknown packaging: nexus-plugin @ line 28, column 14
>>>>> [ERROR]
>>>>> [ERROR]   The project
>>>>> org.sonatype.nexus.plugins:nexus-p2-repository-plugin:2.6.0-SNAPSHOT
>>>>> (/Users/njbartlett/Projects/nexus-oss/plugins/p2/nexus-p2-repository-plugin/pom.xml)
>>>>> has 2 errors
>>>>> [ERROR]     Unresolveable build extension: Plugin
>>>>> org.sonatype.nexus:nexus-plugin-bundle-maven-plugin:1.0.1-SNAPSHOT or
>>>>> one of its dependencies could not be resolved: Could not find artifact
>>>>> org.sonatype.nexus:nexus-plugin-bund
>>>>> le-maven-plugin:jar:1.0.1-SNAPSHOT -> [Help 2]
>>>>> [ERROR]     Unknown packaging: nexus-plugin @ line 28, column 14
>>>>> [ERROR]
>>>>> [ERROR]   The project
>>>>> org.sonatype.nexus.plugins:nexus-restlet1x-plugin:2.6.0-SNAPSHOT
>>>>> (/Users/njbartlett/Projects/nexus-oss/plugins/restlet1x/nexus-restlet1x-plugin/pom.xml)
>>>>> has 2 errors
>>>>> [ERROR]     Unresolveable build extension: Plugin
>>>>> org.sonatype.nexus:nexus-plugin-bundle-maven-plugin:1.0.1-SNAPSHOT or
>>>>> one of its dependencies could not be resolved: Could not find artifact
>>>>> org.sonatype.nexus:nexus-plugin-bund
>>>>> le-maven-plugin:jar:1.0.1-SNAPSHOT -> [Help 2]
>>>>> [ERROR]     Unknown packaging: nexus-plugin @ line 28, column 14
>>>>> [ERROR]
>>>>> [ERROR]   The project
>>>>> org.sonatype.nexus.plugins:nexus-restlet1x-testsupport-plugin:2.6.0-SNAPSHOT
>>>>> (/Users/njbartlett/Projects/nexus-oss/plugins/restlet1x/nexus-restlet1x-testsupport-plugin/pom.xml)
>>>>> has 2 errors
>>>>> [ERROR]     Unresolveable build extension: Plugin
>>>>> org.sonatype.nexus:nexus-plugin-bundle-maven-plugin:1.0.1-SNAPSHOT or
>>>>> one of its dependencies could not be resolved: Could not find artifact
>>>>> org.sonatype.nexus:nexus-plugin-bund
>>>>> le-maven-plugin:jar:1.0.1-SNAPSHOT -> [Help 2]
>>>>> [ERROR]     Unknown packaging: nexus-plugin @ line 28, column 14
>>>>> [ERROR]
>>>>> [ERROR]   The project
>>>>> org.sonatype.nexus.plugins:nexus-ldap-realm-plugin:2.6.0-SNAPSHOT
>>>>> (/Users/njbartlett/Projects/nexus-oss/plugins/security/nexus-ldap-realm-plugin/pom.xml)
>>>>> has 2 errors
>>>>> [ERROR]     Unresolveable build extension: Plugin
>>>>> org.sonatype.nexus:nexus-plugin-bundle-maven-plugin:1.0.1-SNAPSHOT or
>>>>> one of its dependencies could not be resolved: Could not find artifact
>>>>> org.sonatype.nexus:nexus-plugin-bund
>>>>> le-maven-plugin:jar:1.0.1-SNAPSHOT -> [Help 2]
>>>>> [ERROR]     Unknown packaging: nexus-plugin @ line 31, column 14
>>>>> [ERROR]
>>>>> [ERROR]   The project
>>>>> org.sonatype.nexus.plugins:nexus-kenai-plugin:2.6.0-SNAPSHOT
>>>>> (/Users/njbartlett/Projects/nexus-oss/plugins/security/nexus-kenai-plugin/pom.xml)
>>>>> has 2 errors
>>>>> [ERROR]     Unresolveable build extension: Plugin
>>>>> org.sonatype.nexus:nexus-plugin-bundle-maven-plugin:1.0.1-SNAPSHOT or
>>>>> one of its dependencies could not be resolved: Could not find artifact
>>>>> org.sonatype.nexus:nexus-plugin-bund
>>>>> le-maven-plugin:jar:1.0.1-SNAPSHOT -> [Help 2]
>>>>> [ERROR]     Unknown packaging: nexus-plugin @ line 29, column 14
>>>>> [ERROR]
>>>>> [ERROR]   The project
>>>>> org.sonatype.nexus.testsuite:nexus-testsuite:2.6.0-SNAPSHOT
>>>>> (/Users/njbartlett/Projects/nexus-oss/testsuite/pom.xml) has 1 error
>>>>> [ERROR]     Unresolveable build extension: Plugin
>>>>> org.sonatype.nexus:nexus-plugin-bundle-maven-plugin:1.0.1-SNAPSHOT or
>>>>> one of its dependencies could not be resolved: Could not find artifact
>>>>> org.sonatype.nexus:nexus-plugin-bund
>>>>> le-maven-plugin:jar:1.0.1-SNAPSHOT -> [Help 2]
>>>>> [ERROR]
>>>>> [ERROR] To see the full stack trace of the errors, re-run Maven with
>>>>> the -e switch.
>>>>> [ERROR] Re-run Maven using the -X switch to enable full debug logging.
>>>>> [ERROR]
>>>>> [ERROR] For more information about the errors and possible solutions,
>>>>> please read the following articles:
>>>>> [ERROR] [Help 1]
>>>>> http://cwiki.apache.org/confluence/display/MAVEN/ProjectBuildingException
>>>>> [ERROR] [Help 2]
>>>>> http://cwiki.apache.org/confluence/display/MAVEN/PluginResolutionException
>>>>> n
>>>>>
>>>>> ---------------------------------------------------------------------
>>>>> To unsubscribe, e-mail: [hidden email]
>>>>> For additional commands, e-mail: [hidden email]
>>>>>
>>>>
>>>>
>>>> ---------------------------------------------------------------------
>>>> To unsubscribe, e-mail: [hidden email]
>>>> For additional commands, e-mail: [hidden email]
>>>>
>>
>> ---------------------------------------------------------------------
>> To unsubscribe, e-mail: [hidden email]
>> For additional commands, e-mail: [hidden email]
>>
>
>
> ---------------------------------------------------------------------
> To unsubscribe, e-mail: [hidden email]
> For additional commands, e-mail: [hidden email]
>

---------------------------------------------------------------------
To unsubscribe, e-mail: [hidden email]
For additional commands, e-mail: [hidden email]

Reply | Threaded
Open this post in threaded view
|

Re: Cannot build Nexus-OSS

Tamás Cservenák
Yes please, pulls should be made now against nexus-oss.

and for cases like your, you could simply have an own project, that
"merges" the needed plugin(s) with the OSS assembly. This way,
you can easily maintain it without the need of nexus-oss modification
that just makes "following the codebase" a hassle. Ie. if we reshuffle again
some modules, your changes might become hard to re-apply.


Thanks,
~t~


On Fri, Jun 21, 2013 at 3:01 PM, Neil Bartlett <[hidden email]> wrote:
Many thanks for your help Stuart. The WAR artifact is fine for my needs for now.

I am primarily interested in deploying the OBR plugin, which I note
has been discontinued as a separate GitHub project and not included by
default in the webapp, however I was able to work out how to modify
the build to include it.

I'm also interested in contributing OSGi R5 index support (time
permitting), which I previous expected to contribute as a PR against
the OBR plugin project. Since that has been merged into the main
Nexus, should I prepare a pull request against that?

Thanks again,
Neil

On Fri, Jun 21, 2013 at 11:43 AM, Stuart McCulloch <[hidden email]> wrote:
> On 20 Jun 2013, at 17:44, Neil Bartlett wrote:
>
>> I spoke too soon...
>>
>> Stumbling around in the dark a bit because "mvn install" didn't
>> produce anything that looked like an installable product...
>
> As Rich mentioned nexus-oss master is going through a bit of churn at the moment, but you could either use the WAR:
>
>         nexus-oss/components/nexus-webapp/target/nexus-webapp-2.6.0-SNAPSHOT.war
>
> or the nexus-bundle-template assembly which you can unpack and run as follows:
>
>         unzip -d ~/some/where nexus-oss/assemblies/nexus-bundle-template/target/nexus-bundle-template-2.6.0-SNAPSHOT-bundle.zip
>
>         ~/some/where/nexus-bundle-template-2.6.0-SNAPSHOT/bin/nexus  { console | start | stop | restart | status | dump }
>
> Use 'start' to run Nexus as a background service, otherwise use 'console' to run it in the foreground in the current console window
>
>> so I tried "mvn deploy". This fails in
>> org.sonatype.nexus.testsuite:nexus-modern-testsuite with the following
>> error:
>
> The "deploy" goal will try to upload the artifacts to the configured remote repository, in this case RSO which has limited write access.
>
> Most of the time "install" or "verify" is the goal you want: http://maven.apache.org/guides/introduction/introduction-to-the-lifecycle.html
>
> PS. you might find http://books.sonatype.com/mvnex-book/reference/ and http://books.sonatype.com/mvnref-book/reference/ useful.
>
>> [ERROR] Failed to execute goal
>> org.sonatype.plugins:nexus-staging-maven-plugin:1.4.4:deploy
>> (injected-nexus-deploy) on project nexus-modern-testsuite: Failed to
>> deploy artifacts: Could not transfer artifact
>> org.sonatype.nexus.testsuite:nexus-modern-testsuite:jar:2.6.0-20130620.164206-1
>> from/to forge-snapshots
>> (https://repository.sonatype.org/content/repositories/snapshots):
>> Failed to transfer file:
>> https://repository.sonatype.org/content/repositories/snapshots/org/sonatype/nexus/testsuite/nexus-modern-testsuite/2.6.0-SNAPSHOT/nexus-modern-testsuite-2.6.0-20130620.164206-1.jar.
>> Return code is: 401, ReasonPhrase: Unauthorized. -> [Help 1]
>>
>> Thanks,
>> Neil
>>
>> On Thu, Jun 20, 2013 at 4:58 PM, Neil Bartlett <[hidden email]> wrote:
>>> Thanks Stuart. That seemed to work.
>>>
>>> Note that I did get test failures in nexus-restlet1x-plugin and
>>> legacy-testsuite, but I assume that is just a temporary issue as a
>>> result of checking out git HEAD, so I commented out those modules.
>>>
>>> Regards
>>> Neil
>>>
>>>
>>> On Thu, Jun 20, 2013 at 1:31 PM, Stuart McCulloch <[hidden email]> wrote:
>>>> Hi Neil,
>>>>
>>>> Nexus trunk depends on some snapshots at the moment which are available in the forge repository:
>>>>
>>>>        https://repository.sonatype.org/content/groups/sonatype-public-grid/
>>>>
>>>> you can either add this to your local repository manager (if you happen to already have one installed)
>>>>
>>>> or as an additional repository (and pluginRepository) in your settings.xml:
>>>>
>>>>        http://books.sonatype.com/mvnref-book/reference/appendix-settings-sect-details.html#appendix-settings-sect-settings-repository
>>>>
>>>> or use a mirror by following the old instructions at:
>>>>
>>>>        https://github.com/sonatype/nexus/blob/158692ec7c4bcf1a6e711e9ad3b9a1297f96b231/README.md#building
>>>>
>>>> --
>>>> Cheers, Stuart
>>>>
>>>> On 20 Jun 2013, at 12:24, Neil Bartlett wrote:
>>>>
>>>>> Hi,
>>>>>
>>>>> I am unable to build Nexus-OSS, which I have just checked out from the
>>>>> Github project. The build reports multiple errors "Unknown packaging:
>>>>> nexus-plugin". The full error output is at the bottom of this email. I
>>>>> am using Maven 3.0.5 and Java 1.6.0_31 on Mac OS 10.8.2. I could not
>>>>> find any actual build instructions for Nexus, so I simply assumed "mvn
>>>>> install" is correct. I have no ~/.m2/settings.xml.
>>>>>
>>>>> If there are some special setup steps required before building, might
>>>>> I suggest that these be documented somewhere?
>>>>>
>>>>> Kind regards,
>>>>> Neil
>>>>>
>>>>> Full error output:
>>>>>
>>>>> [ERROR] The build could not read 25 projects -> [Help 1]
>>>>> [ERROR]
>>>>> [ERROR]   The project
>>>>> org.sonatype.nexus:nexus-it-helper-plugin:2.6.0-SNAPSHOT
>>>>> (/Users/njbartlett/Projects/nexus-oss/testsupport/nexus-it-helper-plugin/pom.xml)
>>>>> has 2 errors
>>>>> [ERROR]     Unresolveable build extension: Plugin
>>>>> org.sonatype.nexus:nexus-plugin-bundle-maven-plugin:1.0.1-SNAPSHOT or
>>>>> one of its dependencies could not be resolved: Could not find artifact
>>>>> org.sonatype.nexus:nexus-plugin-bund
>>>>> le-maven-plugin:jar:1.0.1-SNAPSHOT -> [Help 2]
>>>>> [ERROR]     Unknown packaging: nexus-plugin @ line 28, column 14
>>>>> [ERROR]
>>>>> [ERROR]   The project
>>>>> org.sonatype.nexus.plugins:nexus-crypto-plugin:2.6.0-SNAPSHOT
>>>>> (/Users/njbartlett/Projects/nexus-oss/plugins/basic/nexus-crypto-plugin/pom.xml)
>>>>> has 2 errors
>>>>> [ERROR]     Unresolveable build extension: Plugin
>>>>> org.sonatype.nexus:nexus-plugin-bundle-maven-plugin:1.0.1-SNAPSHOT or
>>>>> one of its dependencies could not be resolved: Could not find artifact
>>>>> org.sonatype.nexus:nexus-plugin-bund
>>>>> le-maven-plugin:jar:1.0.1-SNAPSHOT -> [Help 2]
>>>>> [ERROR]     Unknown packaging: nexus-plugin @ line 28, column 14
>>>>> [ERROR]
>>>>> [ERROR]   The project
>>>>> org.sonatype.nexus.plugins:nexus-h2-plugin:2.6.0-SNAPSHOT
>>>>> (/Users/njbartlett/Projects/nexus-oss/plugins/basic/nexus-h2-plugin/pom.xml)
>>>>> has 2 errors
>>>>> [ERROR]     Unresolveable build extension: Plugin
>>>>> org.sonatype.nexus:nexus-plugin-bundle-maven-plugin:1.0.1-SNAPSHOT or
>>>>> one of its dependencies could not be resolved: Could not find artifact
>>>>> org.sonatype.nexus:nexus-plugin-bund
>>>>> le-maven-plugin:jar:1.0.1-SNAPSHOT -> [Help 2]
>>>>> [ERROR]     Unknown packaging: nexus-plugin @ line 28, column 14
>>>>> [ERROR]
>>>>> [ERROR]   The project
>>>>> org.sonatype.nexus.plugins:nexus-lvo-plugin:2.6.0-SNAPSHOT
>>>>> (/Users/njbartlett/Projects/nexus-oss/plugins/basic/nexus-lvo-plugin/pom.xml)
>>>>> has 2 errors
>>>>> [ERROR]     Unresolveable build extension: Plugin
>>>>> org.sonatype.nexus:nexus-plugin-bundle-maven-plugin:1.0.1-SNAPSHOT or
>>>>> one of its dependencies could not be resolved: Could not find artifact
>>>>> org.sonatype.nexus:nexus-plugin-bund
>>>>> le-maven-plugin:jar:1.0.1-SNAPSHOT -> [Help 2]
>>>>> [ERROR]     Unknown packaging: nexus-plugin @ line 27, column 14
>>>>> [ERROR]
>>>>> [ERROR]   The project
>>>>> org.sonatype.nexus.plugins:nexus-plugin-console-plugin:2.6.0-SNAPSHOT
>>>>> (/Users/njbartlett/Projects/nexus-oss/plugins/basic/nexus-plugin-console-plugin/pom.xml)
>>>>> has 2 errors
>>>>> [ERROR]     Unresolveable build extension: Plugin
>>>>> org.sonatype.nexus:nexus-plugin-bundle-maven-plugin:1.0.1-SNAPSHOT or
>>>>> one of its dependencies could not be resolved: Could not find artifact
>>>>> org.sonatype.nexus:nexus-plugin-bund
>>>>> le-maven-plugin:jar:1.0.1-SNAPSHOT -> [Help 2]
>>>>> [ERROR]     Unknown packaging: nexus-plugin @ line 28, column 14
>>>>> [ERROR]
>>>>> [ERROR]   The project
>>>>> org.sonatype.nexus.plugins:nexus-rrb-plugin:2.6.0-SNAPSHOT
>>>>> (/Users/njbartlett/Projects/nexus-oss/plugins/basic/nexus-rrb-plugin/pom.xml)
>>>>> has 2 errors
>>>>> [ERROR]     Unresolveable build extension: Plugin
>>>>> org.sonatype.nexus:nexus-plugin-bundle-maven-plugin:1.0.1-SNAPSHOT or
>>>>> one of its dependencies could not be resolved: Could not find artifact
>>>>> org.sonatype.nexus:nexus-plugin-bund
>>>>> le-maven-plugin:jar:1.0.1-SNAPSHOT -> [Help 2]
>>>>> [ERROR]     Unknown packaging: nexus-plugin @ line 29, column 14
>>>>> [ERROR]
>>>>> [ERROR]   The project
>>>>> org.sonatype.nexus.plugins:nexus-siesta-plugin:2.6.0-SNAPSHOT
>>>>> (/Users/njbartlett/Projects/nexus-oss/plugins/basic/nexus-siesta-plugin/pom.xml)
>>>>> has 2 errors
>>>>> [ERROR]     Unresolveable build extension: Plugin
>>>>> org.sonatype.nexus:nexus-plugin-bundle-maven-plugin:1.0.1-SNAPSHOT or
>>>>> one of its dependencies could not be resolved: Could not find artifact
>>>>> org.sonatype.nexus:nexus-plugin-bund
>>>>> le-maven-plugin:jar:1.0.1-SNAPSHOT -> [Help 2]
>>>>> [ERROR]     Unknown packaging: nexus-plugin @ line 28, column 14
>>>>> [ERROR]
>>>>> [ERROR]   The project
>>>>> org.sonatype.nexus.plugins:nexus-site-repository-plugin:2.6.0-SNAPSHOT
>>>>> (/Users/njbartlett/Projects/nexus-oss/plugins/basic/nexus-site-repository-plugin/pom.xml)
>>>>> has 2 errors
>>>>> [ERROR]     Unresolveable build extension: Plugin
>>>>> org.sonatype.nexus:nexus-plugin-bundle-maven-plugin:1.0.1-SNAPSHOT or
>>>>> one of its dependencies could not be resolved: Could not find artifact
>>>>> org.sonatype.nexus:nexus-plugin-bund
>>>>> le-maven-plugin:jar:1.0.1-SNAPSHOT -> [Help 2]
>>>>> [ERROR]     Unknown packaging: nexus-plugin @ line 27, column 14
>>>>> [ERROR]
>>>>> [ERROR]   The project
>>>>> org.sonatype.nexus.plugins:nexus-timeline-plugin:2.6.0-SNAPSHOT
>>>>> (/Users/njbartlett/Projects/nexus-oss/plugins/basic/nexus-timeline-plugin/pom.xml)
>>>>> has 2 errors
>>>>> [ERROR]     Unresolveable build extension: Plugin
>>>>> org.sonatype.nexus:nexus-plugin-bundle-maven-plugin:1.0.1-SNAPSHOT or
>>>>> one of its dependencies could not be resolved: Could not find artifact
>>>>> org.sonatype.nexus:nexus-plugin-bund
>>>>> le-maven-plugin:jar:1.0.1-SNAPSHOT -> [Help 2]
>>>>> [ERROR]     Unknown packaging: nexus-plugin @ line 28, column 14
>>>>> [ERROR]
>>>>> [ERROR]   The project
>>>>> org.sonatype.nexus.plugins:nexus-ui-extjs3-plugin:2.6.0-SNAPSHOT
>>>>> (/Users/njbartlett/Projects/nexus-oss/plugins/basic/nexus-ui-extjs3-plugin/pom.xml)
>>>>> has 2 errors
>>>>> [ERROR]     Unresolveable build extension: Plugin
>>>>> org.sonatype.nexus:nexus-plugin-bundle-maven-plugin:1.0.1-SNAPSHOT or
>>>>> one of its dependencies could not be resolved: Could not find artifact
>>>>> org.sonatype.nexus:nexus-plugin-bund
>>>>> le-maven-plugin:jar:1.0.1-SNAPSHOT -> [Help 2]
>>>>> [ERROR]     Unknown packaging: nexus-plugin @ line 28, column 14
>>>>> [ERROR]
>>>>> [ERROR]   The project
>>>>> org.sonatype.nexus.plugins:nexus-unpack-plugin:2.6.0-SNAPSHOT
>>>>> (/Users/njbartlett/Projects/nexus-oss/plugins/basic/nexus-unpack-plugin/pom.xml)
>>>>> has 2 errors
>>>>> [ERROR]     Unresolveable build extension: Plugin
>>>>> org.sonatype.nexus:nexus-plugin-bundle-maven-plugin:1.0.1-SNAPSHOT or
>>>>> one of its dependencies could not be resolved: Could not find artifact
>>>>> org.sonatype.nexus:nexus-plugin-bund
>>>>> le-maven-plugin:jar:1.0.1-SNAPSHOT -> [Help 2]
>>>>> [ERROR]     Unknown packaging: nexus-plugin @ line 28, column 14
>>>>> [ERROR]
>>>>> [ERROR]   The project
>>>>> org.sonatype.nexus.plugins:nexus-capabilities-plugin:2.6.0-SNAPSHOT
>>>>> (/Users/njbartlett/Projects/nexus-oss/plugins/capabilities/nexus-capabilities-plugin/pom.xml)
>>>>> has 2 errors
>>>>> [ERROR]     Unresolveable build extension: Plugin
>>>>> org.sonatype.nexus:nexus-plugin-bundle-maven-plugin:1.0.1-SNAPSHOT or
>>>>> one of its dependencies could not be resolved: Could not find artifact
>>>>> org.sonatype.nexus:nexus-plugin-bund
>>>>> le-maven-plugin:jar:1.0.1-SNAPSHOT -> [Help 2]
>>>>> [ERROR]     Unknown packaging: nexus-plugin @ line 30, column 14
>>>>> [ERROR]
>>>>> [ERROR]   The project
>>>>> org.sonatype.nexus.plugins:nexus-capabilities-testsuite-helper:2.6.0-SNAPSHOT
>>>>> (/Users/njbartlett/Projects/nexus-oss/plugins/capabilities/nexus-capabilities-testsuite-helper/pom.xml)
>>>>> has 2 errors
>>>>> [ERROR]     Unresolveable build extension: Plugin
>>>>> org.sonatype.nexus:nexus-plugin-bundle-maven-plugin:1.0.1-SNAPSHOT or
>>>>> one of its dependencies could not be resolved: Could not find artifact
>>>>> org.sonatype.nexus:nexus-plugin-bund
>>>>> le-maven-plugin:jar:1.0.1-SNAPSHOT -> [Help 2]
>>>>> [ERROR]     Unknown packaging: nexus-plugin @ line 28, column 14
>>>>> [ERROR]
>>>>> [ERROR]   The project
>>>>> org.sonatype.nexus.plugins:nexus-indexer-lucene-plugin:2.6.0-SNAPSHOT
>>>>> (/Users/njbartlett/Projects/nexus-oss/plugins/indexer/nexus-indexer-lucene-plugin/pom.xml)
>>>>> has 2 errors
>>>>> [ERROR]     Unresolveable build extension: Plugin
>>>>> org.sonatype.nexus:nexus-plugin-bundle-maven-plugin:1.0.1-SNAPSHOT or
>>>>> one of its dependencies could not be resolved: Could not find artifact
>>>>> org.sonatype.nexus:nexus-plugin-bund
>>>>> le-maven-plugin:jar:1.0.1-SNAPSHOT -> [Help 2]
>>>>> [ERROR]     Unknown packaging: nexus-plugin @ line 28, column 14
>>>>> [ERROR]
>>>>> [ERROR]   The project
>>>>> org.sonatype.nexus.plugins:nexus-groovyremote-plugin:2.6.0-SNAPSHOT
>>>>> (/Users/njbartlett/Projects/nexus-oss/plugins/internal/nexus-groovyremote-plugin/pom.xml)
>>>>> has 2 errors
>>>>> [ERROR]     Unresolveable build extension: Plugin
>>>>> org.sonatype.nexus:nexus-plugin-bundle-maven-plugin:1.0.1-SNAPSHOT or
>>>>> one of its dependencies could not be resolved: Could not find artifact
>>>>> org.sonatype.nexus:nexus-plugin-bund
>>>>> le-maven-plugin:jar:1.0.1-SNAPSHOT -> [Help 2]
>>>>> [ERROR]     Unknown packaging: nexus-plugin @ line 28, column 14
>>>>> [ERROR]
>>>>> [ERROR]   The project
>>>>> org.sonatype.nexus.plugins:nexus-maven-bridge-plugin:2.6.0-SNAPSHOT
>>>>> (/Users/njbartlett/Projects/nexus-oss/plugins/maven/nexus-maven-bridge-plugin/pom.xml)
>>>>> has 2 errors
>>>>> [ERROR]     Unresolveable build extension: Plugin
>>>>> org.sonatype.nexus:nexus-plugin-bundle-maven-plugin:1.0.1-SNAPSHOT or
>>>>> one of its dependencies could not be resolved: Could not find artifact
>>>>> org.sonatype.nexus:nexus-plugin-bund
>>>>> le-maven-plugin:jar:1.0.1-SNAPSHOT -> [Help 2]
>>>>> [ERROR]     Unknown packaging: nexus-plugin @ line 29, column 14
>>>>> [ERROR]
>>>>> [ERROR]   The project
>>>>> org.sonatype.nexus.plugins:nexus-archetype-plugin:2.6.0-SNAPSHOT
>>>>> (/Users/njbartlett/Projects/nexus-oss/plugins/maven/nexus-archetype-plugin/pom.xml)
>>>>> has 2 errors
>>>>> [ERROR]     Unresolveable build extension: Plugin
>>>>> org.sonatype.nexus:nexus-plugin-bundle-maven-plugin:1.0.1-SNAPSHOT or
>>>>> one of its dependencies could not be resolved: Could not find artifact
>>>>> org.sonatype.nexus:nexus-plugin-bund
>>>>> le-maven-plugin:jar:1.0.1-SNAPSHOT -> [Help 2]
>>>>> [ERROR]     Unknown packaging: nexus-plugin @ line 29, column 14
>>>>> [ERROR]
>>>>> [ERROR]   The project
>>>>> org.sonatype.nexus.plugins:nexus-obr-plugin:2.6.0-SNAPSHOT
>>>>> (/Users/njbartlett/Projects/nexus-oss/plugins/osgi/nexus-obr-plugin/pom.xml)
>>>>> has 2 errors
>>>>> [ERROR]     Unresolveable build extension: Plugin
>>>>> org.sonatype.nexus:nexus-plugin-bundle-maven-plugin:1.0.1-SNAPSHOT or
>>>>> one of its dependencies could not be resolved: Could not find artifact
>>>>> org.sonatype.nexus:nexus-plugin-bund
>>>>> le-maven-plugin:jar:1.0.1-SNAPSHOT -> [Help 2]
>>>>> [ERROR]     Unknown packaging: nexus-plugin @ line 28, column 14
>>>>> [ERROR]
>>>>> [ERROR]   The project
>>>>> org.sonatype.nexus.plugins:nexus-p2-bridge-plugin:2.6.0-SNAPSHOT
>>>>> (/Users/njbartlett/Projects/nexus-oss/plugins/p2/nexus-p2-bridge-plugin/pom.xml)
>>>>> has 2 errors
>>>>> [ERROR]     Unresolveable build extension: Plugin
>>>>> org.sonatype.nexus:nexus-plugin-bundle-maven-plugin:1.0.1-SNAPSHOT or
>>>>> one of its dependencies could not be resolved: Could not find artifact
>>>>> org.sonatype.nexus:nexus-plugin-bund
>>>>> le-maven-plugin:jar:1.0.1-SNAPSHOT -> [Help 2]
>>>>> [ERROR]     Unknown packaging: nexus-plugin @ line 28, column 14
>>>>> [ERROR]
>>>>> [ERROR]   The project
>>>>> org.sonatype.nexus.plugins:nexus-p2-repository-plugin:2.6.0-SNAPSHOT
>>>>> (/Users/njbartlett/Projects/nexus-oss/plugins/p2/nexus-p2-repository-plugin/pom.xml)
>>>>> has 2 errors
>>>>> [ERROR]     Unresolveable build extension: Plugin
>>>>> org.sonatype.nexus:nexus-plugin-bundle-maven-plugin:1.0.1-SNAPSHOT or
>>>>> one of its dependencies could not be resolved: Could not find artifact
>>>>> org.sonatype.nexus:nexus-plugin-bund
>>>>> le-maven-plugin:jar:1.0.1-SNAPSHOT -> [Help 2]
>>>>> [ERROR]     Unknown packaging: nexus-plugin @ line 28, column 14
>>>>> [ERROR]
>>>>> [ERROR]   The project
>>>>> org.sonatype.nexus.plugins:nexus-restlet1x-plugin:2.6.0-SNAPSHOT
>>>>> (/Users/njbartlett/Projects/nexus-oss/plugins/restlet1x/nexus-restlet1x-plugin/pom.xml)
>>>>> has 2 errors
>>>>> [ERROR]     Unresolveable build extension: Plugin
>>>>> org.sonatype.nexus:nexus-plugin-bundle-maven-plugin:1.0.1-SNAPSHOT or
>>>>> one of its dependencies could not be resolved: Could not find artifact
>>>>> org.sonatype.nexus:nexus-plugin-bund
>>>>> le-maven-plugin:jar:1.0.1-SNAPSHOT -> [Help 2]
>>>>> [ERROR]     Unknown packaging: nexus-plugin @ line 28, column 14
>>>>> [ERROR]
>>>>> [ERROR]   The project
>>>>> org.sonatype.nexus.plugins:nexus-restlet1x-testsupport-plugin:2.6.0-SNAPSHOT
>>>>> (/Users/njbartlett/Projects/nexus-oss/plugins/restlet1x/nexus-restlet1x-testsupport-plugin/pom.xml)
>>>>> has 2 errors
>>>>> [ERROR]     Unresolveable build extension: Plugin
>>>>> org.sonatype.nexus:nexus-plugin-bundle-maven-plugin:1.0.1-SNAPSHOT or
>>>>> one of its dependencies could not be resolved: Could not find artifact
>>>>> org.sonatype.nexus:nexus-plugin-bund
>>>>> le-maven-plugin:jar:1.0.1-SNAPSHOT -> [Help 2]
>>>>> [ERROR]     Unknown packaging: nexus-plugin @ line 28, column 14
>>>>> [ERROR]
>>>>> [ERROR]   The project
>>>>> org.sonatype.nexus.plugins:nexus-ldap-realm-plugin:2.6.0-SNAPSHOT
>>>>> (/Users/njbartlett/Projects/nexus-oss/plugins/security/nexus-ldap-realm-plugin/pom.xml)
>>>>> has 2 errors
>>>>> [ERROR]     Unresolveable build extension: Plugin
>>>>> org.sonatype.nexus:nexus-plugin-bundle-maven-plugin:1.0.1-SNAPSHOT or
>>>>> one of its dependencies could not be resolved: Could not find artifact
>>>>> org.sonatype.nexus:nexus-plugin-bund
>>>>> le-maven-plugin:jar:1.0.1-SNAPSHOT -> [Help 2]
>>>>> [ERROR]     Unknown packaging: nexus-plugin @ line 31, column 14
>>>>> [ERROR]
>>>>> [ERROR]   The project
>>>>> org.sonatype.nexus.plugins:nexus-kenai-plugin:2.6.0-SNAPSHOT
>>>>> (/Users/njbartlett/Projects/nexus-oss/plugins/security/nexus-kenai-plugin/pom.xml)
>>>>> has 2 errors
>>>>> [ERROR]     Unresolveable build extension: Plugin
>>>>> org.sonatype.nexus:nexus-plugin-bundle-maven-plugin:1.0.1-SNAPSHOT or
>>>>> one of its dependencies could not be resolved: Could not find artifact
>>>>> org.sonatype.nexus:nexus-plugin-bund
>>>>> le-maven-plugin:jar:1.0.1-SNAPSHOT -> [Help 2]
>>>>> [ERROR]     Unknown packaging: nexus-plugin @ line 29, column 14
>>>>> [ERROR]
>>>>> [ERROR]   The project
>>>>> org.sonatype.nexus.testsuite:nexus-testsuite:2.6.0-SNAPSHOT
>>>>> (/Users/njbartlett/Projects/nexus-oss/testsuite/pom.xml) has 1 error
>>>>> [ERROR]     Unresolveable build extension: Plugin
>>>>> org.sonatype.nexus:nexus-plugin-bundle-maven-plugin:1.0.1-SNAPSHOT or
>>>>> one of its dependencies could not be resolved: Could not find artifact
>>>>> org.sonatype.nexus:nexus-plugin-bund
>>>>> le-maven-plugin:jar:1.0.1-SNAPSHOT -> [Help 2]
>>>>> [ERROR]
>>>>> [ERROR] To see the full stack trace of the errors, re-run Maven with
>>>>> the -e switch.
>>>>> [ERROR] Re-run Maven using the -X switch to enable full debug logging.
>>>>> [ERROR]
>>>>> [ERROR] For more information about the errors and possible solutions,
>>>>> please read the following articles:
>>>>> [ERROR] [Help 1]
>>>>> http://cwiki.apache.org/confluence/display/MAVEN/ProjectBuildingException
>>>>> [ERROR] [Help 2]
>>>>> http://cwiki.apache.org/confluence/display/MAVEN/PluginResolutionException
>>>>> n
>>>>>
>>>>> ---------------------------------------------------------------------
>>>>> To unsubscribe, e-mail: [hidden email]
>>>>> For additional commands, e-mail: [hidden email]
>>>>>
>>>>
>>>>
>>>> ---------------------------------------------------------------------
>>>> To unsubscribe, e-mail: [hidden email]
>>>> For additional commands, e-mail: [hidden email]
>>>>
>>
>> ---------------------------------------------------------------------
>> To unsubscribe, e-mail: [hidden email]
>> For additional commands, e-mail: [hidden email]
>>
>
>
> ---------------------------------------------------------------------
> To unsubscribe, e-mail: [hidden email]
> For additional commands, e-mail: [hidden email]
>

---------------------------------------------------------------------
To unsubscribe, e-mail: [hidden email]
For additional commands, e-mail: [hidden email]