Build unstable in Jenkins: maven-3.x-jenkinsfile » MNG-6308_display_packaging #6

Previous Topic Next Topic
 
classic Classic list List threaded Threaded
6 messages Options
Reply | Threaded
Open this post in threaded view
|

Build unstable in Jenkins: maven-3.x-jenkinsfile » MNG-6308_display_packaging #6

Apache Jenkins Server-2
See https://builds.apache.org/job/maven-3.x-jenkinsfile/job/MNG-6308_display_packaging/6/

Changes:

* Start using some of the jenkinsEnv stuff
* Syntax
* Syntax
* [MNG-6308] display packaging when building a module Add -<
* Ensure any forked Maven executions are not spied on by Jenkins
* Ensure any forked Maven executions are not spied on by Jenkins
* Ensure any forked Maven executions are not spied on by Jenkins
* Ensure any forked Maven executions are not spied on by Jenkins
* Ensure any forked Maven executions are not spied on by Jenkins
* Ensure any forked Maven executions are not spied on by Jenkins
* Ensure any forked Maven executions are not spied on by Jenkins
* Ensure any forked Maven executions are not spied on by Jenkins

4 tests failed.
FAILED:  org.apache.maven.it.MavenITmng4387QuietLoggingTest.testit

Error Message:
expected:<[]> but was:<[[jenkins-maven-event-spy] INFO Jenkins Maven Event Spy is disabled]>

Stack Trace:
junit.framework.AssertionFailedError: expected:<[]> but was:<[[jenkins-maven-event-spy] INFO Jenkins Maven Event Spy is disabled]>
        at junit.framework.Assert.fail(Assert.java:47)
        at junit.framework.Assert.failNotEquals(Assert.java:283)
        at junit.framework.Assert.assertEquals(Assert.java:64)
        at junit.framework.Assert.assertEquals(Assert.java:71)
        at org.apache.maven.it.MavenITmng4387QuietLoggingTest.testit(MavenITmng4387QuietLoggingTest.java:71)


FAILED:  org.apache.maven.it.MavenITmng4387QuietLoggingTest.testit

Error Message:
expected:<[]> but was:<[[jenkins-maven-event-spy] INFO Jenkins Maven Event Spy is disabled]>

Stack Trace:
junit.framework.AssertionFailedError: expected:<[]> but was:<[[jenkins-maven-event-spy] INFO Jenkins Maven Event Spy is disabled]>
        at junit.framework.Assert.fail(Assert.java:47)
        at junit.framework.Assert.failNotEquals(Assert.java:283)
        at junit.framework.Assert.assertEquals(Assert.java:64)
        at junit.framework.Assert.assertEquals(Assert.java:71)
        at org.apache.maven.it.MavenITmng4387QuietLoggingTest.testit(MavenITmng4387QuietLoggingTest.java:71)


FAILED:  org.apache.maven.it.MavenITmng6057CheckReactorOrderTest.testitReactorShouldResultInExpectedOrder

Error Message:
expected:<3> but was:<5>

Stack Trace:
junit.framework.AssertionFailedError: expected:<3> but was:<5>
        at junit.framework.Assert.fail(Assert.java:47)
        at junit.framework.Assert.failNotEquals(Assert.java:283)
        at junit.framework.Assert.assertEquals(Assert.java:64)
        at junit.framework.Assert.assertEquals(Assert.java:195)
        at junit.framework.Assert.assertEquals(Assert.java:201)
        at org.apache.maven.it.MavenITmng6057CheckReactorOrderTest.testitReactorShouldResultInExpectedOrder(MavenITmng6057CheckReactorOrderTest.java:69)


FAILED:  org.apache.maven.it.MavenITmng6057CheckReactorOrderTest.testitReactorShouldResultInExpectedOrder

Error Message:
expected:<3> but was:<5>

Stack Trace:
junit.framework.AssertionFailedError: expected:<3> but was:<5>
        at junit.framework.Assert.fail(Assert.java:47)
        at junit.framework.Assert.failNotEquals(Assert.java:283)
        at junit.framework.Assert.assertEquals(Assert.java:64)
        at junit.framework.Assert.assertEquals(Assert.java:195)
        at junit.framework.Assert.assertEquals(Assert.java:201)
        at org.apache.maven.it.MavenITmng6057CheckReactorOrderTest.testitReactorShouldResultInExpectedOrder(MavenITmng6057CheckReactorOrderTest.java:69)




Build log:
[...truncated 6.00 MB...]
[winJava7] java.lang.IllegalArgumentException: Cannot relativize 'C:\mvn-it-1.tmp\core-it-support\target\core-it-support-2.1-SNAPSHOT-site.xml' relatively to '/mvn-it-1.tmp'
[winJava7] at org.jenkinsci.plugins.pipeline.maven.util.XmlUtils.getPathInWorkspace(XmlUtils.java:319)
[winJava7] at org.jenkinsci.plugins.pipeline.maven.publishers.GeneratedArtifactsPublisher.process(GeneratedArtifactsPublisher.java:95)
[winJava7] at org.jenkinsci.plugins.pipeline.maven.MavenSpyLogProcessor.processMavenSpyLogs(MavenSpyLogProcessor.java:109)
[winJava7] at org.jenkinsci.plugins.pipeline.maven.WithMavenStepExecution$WorkspaceCleanupCallback.finished(WithMavenStepExecution.java:913)
[winJava7] at org.jenkinsci.plugins.workflow.steps.BodyExecutionCallback$TailCall.onSuccess(BodyExecutionCallback.java:114)
[winJava7] at org.jenkinsci.plugins.workflow.cps.CpsBodyExecution$SuccessAdapter.receive(CpsBodyExecution.java:362)
[winJava7] at com.cloudbees.groovy.cps.Outcome.resumeFrom(Outcome.java:73)
[winJava7] at com.cloudbees.groovy.cps.Continuable$1.call(Continuable.java:166)
[winJava7] at com.cloudbees.groovy.cps.Continuable$1.call(Continuable.java:163)
[winJava7] at org.codehaus.groovy.runtime.GroovyCategorySupport$ThreadCategoryInfo.use(GroovyCategorySupport.java:122)
[winJava7] at org.codehaus.groovy.runtime.GroovyCategorySupport.use(GroovyCategorySupport.java:261)
[winJava7] at com.cloudbees.groovy.cps.Continuable.run0(Continuable.java:163)
[winJava7] at org.jenkinsci.plugins.workflow.cps.SandboxContinuable.access$001(SandboxContinuable.java:19)
[winJava7] at org.jenkinsci.plugins.workflow.cps.SandboxContinuable$1.call(SandboxContinuable.java:35)
[winJava7] at org.jenkinsci.plugins.workflow.cps.SandboxContinuable$1.call(SandboxContinuable.java:32)
[winJava7] at org.jenkinsci.plugins.scriptsecurity.sandbox.groovy.GroovySandbox.runInSandbox(GroovySandbox.java:108)
[winJava7] at org.jenkinsci.plugins.workflow.cps.SandboxContinuable.run0(SandboxContinuable.java:32)
[winJava7] at org.jenkinsci.plugins.workflow.cps.CpsThread.runNextChunk(CpsThread.java:174)
[winJava7] at org.jenkinsci.plugins.workflow.cps.CpsThreadGroup.run(CpsThreadGroup.java:330)
[winJava7] at org.jenkinsci.plugins.workflow.cps.CpsThreadGroup.access$100(CpsThreadGroup.java:82)
[winJava7] at org.jenkinsci.plugins.workflow.cps.CpsThreadGroup$2.call(CpsThreadGroup.java:242)
[winJava7] at org.jenkinsci.plugins.workflow.cps.CpsThreadGroup$2.call(CpsThreadGroup.java:230)
[winJava7] at org.jenkinsci.plugins.workflow.cps.CpsVmExecutorService$2.call(CpsVmExecutorService.java:64)
[winJava7] at java.util.concurrent.FutureTask.run(FutureTask.java:266)
[winJava7] at hudson.remoting.SingleLaneExecutorService$1.run(SingleLaneExecutorService.java:112)
[winJava7] at jenkins.util.ContextResettingExecutorService$1.run(ContextResettingExecutorService.java:28)
[winJava7] at java.util.concurrent.Executors$RunnableAdapter.call(Executors.java:511)
[winJava7] at java.util.concurrent.FutureTask.run(FutureTask.java:266)
[winJava7] at java.util.concurrent.ThreadPoolExecutor.runWorker(ThreadPoolExecutor.java:1149)
[winJava7] at java.util.concurrent.ThreadPoolExecutor$Worker.run(ThreadPoolExecutor.java:624)
[winJava7] at java.lang.Thread.run(Thread.java:748)
[winJava7] ERROR: [withMaven] artifactsPublisher - WARNING: Exception archiving and fingerprinting MavenArtifact{org.apache.maven.its.plugins:maven-it-plugins:xml:site:2.1-SNAPSHOT(version: 2.1-SNAPSHOT, snapshot:true)  C:\mvn-it-1.tmp\core-it-support\core-it-plugins\target\maven-it-plugins-2.1-SNAPSHOT-site.xml}, skip archiving of the artifacts
[winJava7] java.lang.IllegalArgumentException: Cannot relativize 'C:\mvn-it-1.tmp\core-it-support\core-it-plugins\target\maven-it-plugins-2.1-SNAPSHOT-site.xml' relatively to '/mvn-it-1.tmp'
[winJava7] at org.jenkinsci.plugins.pipeline.maven.util.XmlUtils.getPathInWorkspace(XmlUtils.java:319)
[winJava7] at org.jenkinsci.plugins.pipeline.maven.publishers.GeneratedArtifactsPublisher.process(GeneratedArtifactsPublisher.java:95)
[winJava7] at org.jenkinsci.plugins.pipeline.maven.MavenSpyLogProcessor.processMavenSpyLogs(MavenSpyLogProcessor.java:109)
[winJava7] at org.jenkinsci.plugins.pipeline.maven.WithMavenStepExecution$WorkspaceCleanupCallback.finished(WithMavenStepExecution.java:913)
[winJava7] at org.jenkinsci.plugins.workflow.steps.BodyExecutionCallback$TailCall.onSuccess(BodyExecutionCallback.java:114)
[winJava7] at org.jenkinsci.plugins.workflow.cps.CpsBodyExecution$SuccessAdapter.receive(CpsBodyExecution.java:362)
[winJava7] at com.cloudbees.groovy.cps.Outcome.resumeFrom(Outcome.java:73)
[winJava7] at com.cloudbees.groovy.cps.Continuable$1.call(Continuable.java:166)
[winJava7] at com.cloudbees.groovy.cps.Continuable$1.call(Continuable.java:163)
[winJava7] at org.codehaus.groovy.runtime.GroovyCategorySupport$ThreadCategoryInfo.use(GroovyCategorySupport.java:122)
[winJava7] at org.codehaus.groovy.runtime.GroovyCategorySupport.use(GroovyCategorySupport.java:261)
[winJava7] at com.cloudbees.groovy.cps.Continuable.run0(Continuable.java:163)
[winJava7] at org.jenkinsci.plugins.workflow.cps.SandboxContinuable.access$001(SandboxContinuable.java:19)
[winJava7] at org.jenkinsci.plugins.workflow.cps.SandboxContinuable$1.call(SandboxContinuable.java:35)
[winJava7] at org.jenkinsci.plugins.workflow.cps.SandboxContinuable$1.call(SandboxContinuable.java:32)
[winJava7] at org.jenkinsci.plugins.scriptsecurity.sandbox.groovy.GroovySandbox.runInSandbox(GroovySandbox.java:108)
[winJava7] at org.jenkinsci.plugins.workflow.cps.SandboxContinuable.run0(SandboxContinuable.java:32)
[winJava7] at org.jenkinsci.plugins.workflow.cps.CpsThread.runNextChunk(CpsThread.java:174)
[winJava7] at org.jenkinsci.plugins.workflow.cps.CpsThreadGroup.run(CpsThreadGroup.java:330)
[winJava7] at org.jenkinsci.plugins.workflow.cps.CpsThreadGroup.access$100(CpsThreadGroup.java:82)
[winJava7] at org.jenkinsci.plugins.workflow.cps.CpsThreadGroup$2.call(CpsThreadGroup.java:242)
[winJava7] at org.jenkinsci.plugins.workflow.cps.CpsThreadGroup$2.call(CpsThreadGroup.java:230)
[winJava7] at org.jenkinsci.plugins.workflow.cps.CpsVmExecutorService$2.call(CpsVmExecutorService.java:64)
[winJava7] at java.util.concurrent.FutureTask.run(FutureTask.java:266)
[winJava7] at hudson.remoting.SingleLaneExecutorService$1.run(SingleLaneExecutorService.java:112)
[winJava7] at jenkins.util.ContextResettingExecutorService$1.run(ContextResettingExecutorService.java:28)
[winJava7] at java.util.concurrent.Executors$RunnableAdapter.call(Executors.java:511)
[winJava7] at java.util.concurrent.FutureTask.run(FutureTask.java:266)
[winJava7] at java.util.concurrent.ThreadPoolExecutor.runWorker(ThreadPoolExecutor.java:1149)
[winJava7] at java.util.concurrent.ThreadPoolExecutor$Worker.run(ThreadPoolExecutor.java:624)
[winJava7] at java.lang.Thread.run(Thread.java:748)
[winJava7] ERROR: [withMaven] artifactsPublisher - WARNING: Exception archiving and fingerprinting MavenArtifact{org.apache.maven.its.plugins:maven-it-plugin-core-stubs:xml:site:2.1-SNAPSHOT(version: 2.1-SNAPSHOT, snapshot:true)  C:\mvn-it-1.tmp\core-it-support\core-it-plugins\maven-it-plugin-core-stubs\target\maven-it-plugin-core-stubs-2.1-SNAPSHOT-site.xml}, skip archiving of the artifacts
[winJava7] java.lang.IllegalArgumentException: Cannot relativize 'C:\mvn-it-1.tmp\core-it-support\core-it-plugins\maven-it-plugin-core-stubs\target\maven-it-plugin-core-stubs-2.1-SNAPSHOT-site.xml' relatively to '/mvn-it-1.tmp'
[winJava7] at org.jenkinsci.plugins.pipeline.maven.util.XmlUtils.getPathInWorkspace(XmlUtils.java:319)
[winJava7] at org.jenkinsci.plugins.pipeline.maven.publishers.GeneratedArtifactsPublisher.process(GeneratedArtifactsPublisher.java:95)
[winJava7] at org.jenkinsci.plugins.pipeline.maven.MavenSpyLogProcessor.processMavenSpyLogs(MavenSpyLogProcessor.java:109)
[winJava7] at org.jenkinsci.plugins.pipeline.maven.WithMavenStepExecution$WorkspaceCleanupCallback.finished(WithMavenStepExecution.java:913)
[winJava7] at org.jenkinsci.plugins.workflow.steps.BodyExecutionCallback$TailCall.onSuccess(BodyExecutionCallback.java:114)
[winJava7] at org.jenkinsci.plugins.workflow.cps.CpsBodyExecution$SuccessAdapter.receive(CpsBodyExecution.java:362)
[winJava7] at com.cloudbees.groovy.cps.Outcome.resumeFrom(Outcome.java:73)
[winJava7] at com.cloudbees.groovy.cps.Continuable$1.call(Continuable.java:166)
[winJava7] at com.cloudbees.groovy.cps.Continuable$1.call(Continuable.java:163)
[winJava7] at org.codehaus.groovy.runtime.GroovyCategorySupport$ThreadCategoryInfo.use(GroovyCategorySupport.java:122)
[winJava7] at org.codehaus.groovy.runtime.GroovyCategorySupport.use(GroovyCategorySupport.java:261)
[winJava7] at com.cloudbees.groovy.cps.Continuable.run0(Continuable.java:163)
[winJava7] at org.jenkinsci.plugins.workflow.cps.SandboxContinuable.access$001(SandboxContinuable.java:19)
[winJava7] at org.jenkinsci.plugins.workflow.cps.SandboxContinuable$1.call(SandboxContinuable.java:35)
[winJava7] at org.jenkinsci.plugins.workflow.cps.SandboxContinuable$1.call(SandboxContinuable.java:32)
[winJava7] at org.jenkinsci.plugins.scriptsecurity.sandbox.groovy.GroovySandbox.runInSandbox(GroovySandbox.java:108)
[winJava7] at org.jenkinsci.plugins.workflow.cps.SandboxContinuable.run0(SandboxContinuable.java:32)
[winJava7] at org.jenkinsci.plugins.workflow.cps.CpsThread.runNextChunk(CpsThread.java:174)
[winJava7] at org.jenkinsci.plugins.workflow.cps.CpsThreadGroup.run(CpsThreadGroup.java:330)
[winJava7] at org.jenkinsci.plugins.workflow.cps.CpsThreadGroup.access$100(CpsThreadGroup.java:82)
[winJava7] at org.jenkinsci.plugins.workflow.cps.CpsThreadGroup$2.call(CpsThreadGroup.java:242)
[winJava7] at org.jenkinsci.plugins.workflow.cps.CpsThreadGroup$2.call(CpsThreadGroup.java:230)
[winJava7] at org.jenkinsci.plugins.workflow.cps.CpsVmExecutorService$2.call(CpsVmExecutorService.java:64)
[winJava7] at java.util.concurrent.FutureTask.run(FutureTask.java:266)
[winJava7] at hudson.remoting.SingleLaneExecutorService$1.run(SingleLaneExecutorService.java:112)
[winJava7] at jenkins.util.ContextResettingExecutorService$1.run(ContextResettingExecutorService.java:28)
[winJava7] at java.util.concurrent.Executors$RunnableAdapter.call(Executors.java:511)
[winJava7] at java.util.concurrent.FutureTask.run(FutureTask.java:266)
[winJava7] at java.util.concurrent.ThreadPoolExecutor.runWorker(ThreadPoolExecutor.java:1149)
[winJava7] at java.util.concurrent.ThreadPoolExecutor$Worker.run(ThreadPoolExecutor.java:624)
[winJava7] at java.lang.Thread.run(Thread.java:748)
[winJava7] ERROR: [withMaven] artifactsPublisher - WARNING: Exception archiving and fingerprinting MavenArtifact{org.apache.maven.its:core-it-support-artifacts:zip:repo:2.1-SNAPSHOT(version: 2.1-SNAPSHOT, snapshot:true)  C:\mvn-it-1.tmp\core-it-support\core-it-support-artifacts\target\core-it-support-artifacts-2.1-SNAPSHOT-repo.zip}, skip archiving of the artifacts
[winJava7] java.lang.IllegalArgumentException: Cannot relativize 'C:\mvn-it-1.tmp\core-it-support\core-it-support-artifacts\target\core-it-support-artifacts-2.1-SNAPSHOT-repo.zip' relatively to '/mvn-it-1.tmp'
[winJava7] at org.jenkinsci.plugins.pipeline.maven.util.XmlUtils.getPathInWorkspace(XmlUtils.java:319)
[winJava7] at org.jenkinsci.plugins.pipeline.maven.publishers.GeneratedArtifactsPublisher.process(GeneratedArtifactsPublisher.java:95)
[winJava7] at org.jenkinsci.plugins.pipeline.maven.MavenSpyLogProcessor.processMavenSpyLogs(MavenSpyLogProcessor.java:109)
[winJava7] at org.jenkinsci.plugins.pipeline.maven.WithMavenStepExecution$WorkspaceCleanupCallback.finished(WithMavenStepExecution.java:913)
[winJava7] at org.jenkinsci.plugins.workflow.steps.BodyExecutionCallback$TailCall.onSuccess(BodyExecutionCallback.java:114)
[winJava7] at org.jenkinsci.plugins.workflow.cps.CpsBodyExecution$SuccessAdapter.receive(CpsBodyExecution.java:362)
[winJava7] at com.cloudbees.groovy.cps.Outcome.resumeFrom(Outcome.java:73)
[winJava7] at com.cloudbees.groovy.cps.Continuable$1.call(Continuable.java:166)
[winJava7] at com.cloudbees.groovy.cps.Continuable$1.call(Continuable.java:163)
[winJava7] at org.codehaus.groovy.runtime.GroovyCategorySupport$ThreadCategoryInfo.use(GroovyCategorySupport.java:122)
[winJava7] at org.codehaus.groovy.runtime.GroovyCategorySupport.use(GroovyCategorySupport.java:261)
[winJava7] at com.cloudbees.groovy.cps.Continuable.run0(Continuable.java:163)
[winJava7] at org.jenkinsci.plugins.workflow.cps.SandboxContinuable.access$001(SandboxContinuable.java:19)
[winJava7] at org.jenkinsci.plugins.workflow.cps.SandboxContinuable$1.call(SandboxContinuable.java:35)
[winJava7] at org.jenkinsci.plugins.workflow.cps.SandboxContinuable$1.call(SandboxContinuable.java:32)
[winJava7] at org.jenkinsci.plugins.scriptsecurity.sandbox.groovy.GroovySandbox.runInSandbox(GroovySandbox.java:108)
[winJava7] at org.jenkinsci.plugins.workflow.cps.SandboxContinuable.run0(SandboxContinuable.java:32)
[winJava7] at org.jenkinsci.plugins.workflow.cps.CpsThread.runNextChunk(CpsThread.java:174)
[winJava7] at org.jenkinsci.plugins.workflow.cps.CpsThreadGroup.run(CpsThreadGroup.java:330)
[winJava7] at org.jenkinsci.plugins.workflow.cps.CpsThreadGroup.access$100(CpsThreadGroup.java:82)
[winJava7] at org.jenkinsci.plugins.workflow.cps.CpsThreadGroup$2.call(CpsThreadGroup.java:242)
[winJava7] at org.jenkinsci.plugins.workflow.cps.CpsThreadGroup$2.call(CpsThreadGroup.java:230)
[winJava7] at org.jenkinsci.plugins.workflow.cps.CpsVmExecutorService$2.call(CpsVmExecutorService.java:64)
[winJava7] at java.util.concurrent.FutureTask.run(FutureTask.java:266)
[winJava7] at hudson.remoting.SingleLaneExecutorService$1.run(SingleLaneExecutorService.java:112)
[winJava7] at jenkins.util.ContextResettingExecutorService$1.run(ContextResettingExecutorService.java:28)
[winJava7] at java.util.concurrent.Executors$RunnableAdapter.call(Executors.java:511)
[winJava7] at java.util.concurrent.FutureTask.run(FutureTask.java:266)
[winJava7] at java.util.concurrent.ThreadPoolExecutor.runWorker(ThreadPoolExecutor.java:1149)
[winJava7] at java.util.concurrent.ThreadPoolExecutor$Worker.run(ThreadPoolExecutor.java:624)
[winJava7] at java.lang.Thread.run(Thread.java:748)
[winJava7] ERROR: [withMaven] artifactsPublisher - WARNING: Exception archiving and fingerprinting MavenArtifact{org.apache.maven.its:core-it-suite:test-jar:tests:2.1-SNAPSHOT(version: 2.1-SNAPSHOT, snapshot:true)  C:\mvn-it-1.tmp\core-it-suite\target\core-it-suite-2.1-SNAPSHOT-tests.jar}, skip archiving of the artifacts
[winJava7] java.lang.IllegalArgumentException: Cannot relativize 'C:\mvn-it-1.tmp\core-it-suite\target\core-it-suite-2.1-SNAPSHOT-tests.jar' relatively to '/mvn-it-1.tmp'
[winJava7] at org.jenkinsci.plugins.pipeline.maven.util.XmlUtils.getPathInWorkspace(XmlUtils.java:319)
[winJava7] at org.jenkinsci.plugins.pipeline.maven.publishers.GeneratedArtifactsPublisher.process(GeneratedArtifactsPublisher.java:95)
[winJava7] at org.jenkinsci.plugins.pipeline.maven.MavenSpyLogProcessor.processMavenSpyLogs(MavenSpyLogProcessor.java:109)
[winJava7] at org.jenkinsci.plugins.pipeline.maven.WithMavenStepExecution$WorkspaceCleanupCallback.finished(WithMavenStepExecution.java:913)
[winJava7] at org.jenkinsci.plugins.workflow.steps.BodyExecutionCallback$TailCall.onSuccess(BodyExecutionCallback.java:114)
[winJava7] at org.jenkinsci.plugins.workflow.cps.CpsBodyExecution$SuccessAdapter.receive(CpsBodyExecution.java:362)
[winJava7] at com.cloudbees.groovy.cps.Outcome.resumeFrom(Outcome.java:73)
[winJava7] at com.cloudbees.groovy.cps.Continuable$1.call(Continuable.java:166)
[winJava7] at com.cloudbees.groovy.cps.Continuable$1.call(Continuable.java:163)
[winJava7] at org.codehaus.groovy.runtime.GroovyCategorySupport$ThreadCategoryInfo.use(GroovyCategorySupport.java:122)
[winJava7] at org.codehaus.groovy.runtime.GroovyCategorySupport.use(GroovyCategorySupport.java:261)
[winJava7] at com.cloudbees.groovy.cps.Continuable.run0(Continuable.java:163)
[winJava7] at org.jenkinsci.plugins.workflow.cps.SandboxContinuable.access$001(SandboxContinuable.java:19)
[winJava7] at org.jenkinsci.plugins.workflow.cps.SandboxContinuable$1.call(SandboxContinuable.java:35)
[winJava7] at org.jenkinsci.plugins.workflow.cps.SandboxContinuable$1.call(SandboxContinuable.java:32)
[winJava7] at org.jenkinsci.plugins.scriptsecurity.sandbox.groovy.GroovySandbox.runInSandbox(GroovySandbox.java:108)
[winJava7] at org.jenkinsci.plugins.workflow.cps.SandboxContinuable.run0(SandboxContinuable.java:32)
[winJava7] at org.jenkinsci.plugins.workflow.cps.CpsThread.runNextChunk(CpsThread.java:174)
[winJava7] at org.jenkinsci.plugins.workflow.cps.CpsThreadGroup.run(CpsThreadGroup.java:330)
[winJava7] at org.jenkinsci.plugins.workflow.cps.CpsThreadGroup.access$100(CpsThreadGroup.java:82)
[winJava7] at org.jenkinsci.plugins.workflow.cps.CpsThreadGroup$2.call(CpsThreadGroup.java:242)
[winJava7] at org.jenkinsci.plugins.workflow.cps.CpsThreadGroup$2.call(CpsThreadGroup.java:230)
[winJava7] at org.jenkinsci.plugins.workflow.cps.CpsVmExecutorService$2.call(CpsVmExecutorService.java:64)
[winJava7] at java.util.concurrent.FutureTask.run(FutureTask.java:266)
[winJava7] at hudson.remoting.SingleLaneExecutorService$1.run(SingleLaneExecutorService.java:112)
[winJava7] at jenkins.util.ContextResettingExecutorService$1.run(ContextResettingExecutorService.java:28)
[winJava7] at java.util.concurrent.Executors$RunnableAdapter.call(Executors.java:511)
[winJava7] at java.util.concurrent.FutureTask.run(FutureTask.java:266)
[winJava7] at java.util.concurrent.ThreadPoolExecutor.runWorker(ThreadPoolExecutor.java:1149)
[winJava7] at java.util.concurrent.ThreadPoolExecutor$Worker.run(ThreadPoolExecutor.java:624)
[winJava7] at java.lang.Thread.run(Thread.java:748)
[winJava7] [Fast Archiver] No artifacts from maven-3.x-jenkinsfile » MNG-6308_display_packaging #2 to compare, so performing full copy of artifacts
[winJava7] ERROR: [withMaven] WARNING Exception executing Maven reporter 'Junit Publisher' / org.jenkinsci.plugins.pipeline.maven.publishers.JunitTestsPublisher. Please report a bug associated for the component 'pipeline-maven-plugin' at https://issues.jenkins-ci.org 
[winJava7] java.lang.IllegalArgumentException: Cannot relativize 'C:\mvn-it-1.tmp\core-it-support\core-it-plugins\maven-it-plugin-active-collection\target/surefire-reports' relatively to '/mvn-it-1.tmp'
[winJava7] at org.jenkinsci.plugins.pipeline.maven.util.XmlUtils.getPathInWorkspace(XmlUtils.java:319)
[winJava7] at org.jenkinsci.plugins.pipeline.maven.publishers.JunitTestsPublisher.executeReporter(JunitTestsPublisher.java:235)
[winJava7] at org.jenkinsci.plugins.pipeline.maven.publishers.JunitTestsPublisher.process(JunitTestsPublisher.java:181)
[winJava7] at org.jenkinsci.plugins.pipeline.maven.MavenSpyLogProcessor.processMavenSpyLogs(MavenSpyLogProcessor.java:109)
[winJava7] at org.jenkinsci.plugins.pipeline.maven.WithMavenStepExecution$WorkspaceCleanupCallback.finished(WithMavenStepExecution.java:913)
[winJava7] at org.jenkinsci.plugins.workflow.steps.BodyExecutionCallback$TailCall.onSuccess(BodyExecutionCallback.java:114)
[winJava7] at org.jenkinsci.plugins.workflow.cps.CpsBodyExecution$SuccessAdapter.receive(CpsBodyExecution.java:362)
[winJava7] at com.cloudbees.groovy.cps.Outcome.resumeFrom(Outcome.java:73)
[winJava7] at com.cloudbees.groovy.cps.Continuable$1.call(Continuable.java:166)
[winJava7] at com.cloudbees.groovy.cps.Continuable$1.call(Continuable.java:163)
[winJava7] at org.codehaus.groovy.runtime.GroovyCategorySupport$ThreadCategoryInfo.use(GroovyCategorySupport.java:122)
[winJava7] at org.codehaus.groovy.runtime.GroovyCategorySupport.use(GroovyCategorySupport.java:261)
[winJava7] at com.cloudbees.groovy.cps.Continuable.run0(Continuable.java:163)
[winJava7] at org.jenkinsci.plugins.workflow.cps.SandboxContinuable.access$001(SandboxContinuable.java:19)
[winJava7] at org.jenkinsci.plugins.workflow.cps.SandboxContinuable$1.call(SandboxContinuable.java:35)
[winJava7] at org.jenkinsci.plugins.workflow.cps.SandboxContinuable$1.call(SandboxContinuable.java:32)
[winJava7] at org.jenkinsci.plugins.scriptsecurity.sandbox.groovy.GroovySandbox.runInSandbox(GroovySandbox.java:108)
[winJava7] at org.jenkinsci.plugins.workflow.cps.SandboxContinuable.run0(SandboxContinuable.java:32)
[winJava7] at org.jenkinsci.plugins.workflow.cps.CpsThread.runNextChunk(CpsThread.java:174)
[winJava7] at org.jenkinsci.plugins.workflow.cps.CpsThreadGroup.run(CpsThreadGroup.java:330)
[winJava7] at org.jenkinsci.plugins.workflow.cps.CpsThreadGroup.access$100(CpsThreadGroup.java:82)
[winJava7] at org.jenkinsci.plugins.workflow.cps.CpsThreadGroup$2.call(CpsThreadGroup.java:242)
[winJava7] at org.jenkinsci.plugins.workflow.cps.CpsThreadGroup$2.call(CpsThreadGroup.java:230)
[winJava7] at org.jenkinsci.plugins.workflow.cps.CpsVmExecutorService$2.call(CpsVmExecutorService.java:64)
[winJava7] at java.util.concurrent.FutureTask.run(FutureTask.java:266)
[winJava7] at hudson.remoting.SingleLaneExecutorService$1.run(SingleLaneExecutorService.java:112)
[winJava7] at jenkins.util.ContextResettingExecutorService$1.run(ContextResettingExecutorService.java:28)
[winJava7] at java.util.concurrent.Executors$RunnableAdapter.call(Executors.java:511)
[winJava7] at java.util.concurrent.FutureTask.run(FutureTask.java:266)
[winJava7] at java.util.concurrent.ThreadPoolExecutor.runWorker(ThreadPoolExecutor.java:1149)
[winJava7] at java.util.concurrent.ThreadPoolExecutor$Worker.run(ThreadPoolExecutor.java:624)
[winJava7] at java.lang.Thread.run(Thread.java:748)
[winJava7] ERROR: [withMaven] WARNING Exception executing Maven reporter 'Open Task Scanner Publisher' / org.jenkinsci.plugins.pipeline.maven.publishers.TasksScannerPublisher. Please report a bug associated for the component 'pipeline-maven-plugin' at https://issues.jenkins-ci.org 
[winJava7] java.lang.IllegalArgumentException: Cannot relativize 'C:\mvn-it-1.tmp\src\main\java' relatively to '/mvn-it-1.tmp'
[winJava7] at org.jenkinsci.plugins.pipeline.maven.util.XmlUtils.getPathInWorkspace(XmlUtils.java:319)
[winJava7] at org.jenkinsci.plugins.pipeline.maven.publishers.TasksScannerPublisher.process(TasksScannerPublisher.java:128)
[winJava7] at org.jenkinsci.plugins.pipeline.maven.MavenSpyLogProcessor.processMavenSpyLogs(MavenSpyLogProcessor.java:109)
[winJava7] at org.jenkinsci.plugins.pipeline.maven.WithMavenStepExecution$WorkspaceCleanupCallback.finished(WithMavenStepExecution.java:913)
[winJava7] at org.jenkinsci.plugins.workflow.steps.BodyExecutionCallback$TailCall.onSuccess(BodyExecutionCallback.java:114)
[winJava7] at org.jenkinsci.plugins.workflow.cps.CpsBodyExecution$SuccessAdapter.receive(CpsBodyExecution.java:362)
[winJava7] at com.cloudbees.groovy.cps.Outcome.resumeFrom(Outcome.java:73)
[winJava7] at com.cloudbees.groovy.cps.Continuable$1.call(Continuable.java:166)
[winJava7] at com.cloudbees.groovy.cps.Continuable$1.call(Continuable.java:163)
[winJava7] at org.codehaus.groovy.runtime.GroovyCategorySupport$ThreadCategoryInfo.use(GroovyCategorySupport.java:122)
[winJava7] at org.codehaus.groovy.runtime.GroovyCategorySupport.use(GroovyCategorySupport.java:261)
[winJava7] at com.cloudbees.groovy.cps.Continuable.run0(Continuable.java:163)
[winJava7] at org.jenkinsci.plugins.workflow.cps.SandboxContinuable.access$001(SandboxContinuable.java:19)
[winJava7] at org.jenkinsci.plugins.workflow.cps.SandboxContinuable$1.call(SandboxContinuable.java:35)
[winJava7] at org.jenkinsci.plugins.workflow.cps.SandboxContinuable$1.call(SandboxContinuable.java:32)
[winJava7] at org.jenkinsci.plugins.scriptsecurity.sandbox.groovy.GroovySandbox.runInSandbox(GroovySandbox.java:108)
[winJava7] at org.jenkinsci.plugins.workflow.cps.SandboxContinuable.run0(SandboxContinuable.java:32)
[winJava7] at org.jenkinsci.plugins.workflow.cps.CpsThread.runNextChunk(CpsThread.java:174)
[winJava7] at org.jenkinsci.plugins.workflow.cps.CpsThreadGroup.run(CpsThreadGroup.java:330)
[winJava7] at org.jenkinsci.plugins.workflow.cps.CpsThreadGroup.access$100(CpsThreadGroup.java:82)
[winJava7] at org.jenkinsci.plugins.workflow.cps.CpsThreadGroup$2.call(CpsThreadGroup.java:242)
[winJava7] at org.jenkinsci.plugins.workflow.cps.CpsThreadGroup$2.call(CpsThreadGroup.java:230)
[winJava7] at org.jenkinsci.plugins.workflow.cps.CpsVmExecutorService$2.call(CpsVmExecutorService.java:64)
[winJava7] at java.util.concurrent.FutureTask.run(FutureTask.java:266)
[winJava7] at hudson.remoting.SingleLaneExecutorService$1.run(SingleLaneExecutorService.java:112)
[winJava7] at jenkins.util.ContextResettingExecutorService$1.run(ContextResettingExecutorService.java:28)
[winJava7] at java.util.concurrent.Executors$RunnableAdapter.call(Executors.java:511)
[winJava7] at java.util.concurrent.FutureTask.run(FutureTask.java:266)
[winJava7] at java.util.concurrent.ThreadPoolExecutor.runWorker(ThreadPoolExecutor.java:1149)
[winJava7] at java.util.concurrent.ThreadPoolExecutor$Worker.run(ThreadPoolExecutor.java:624)
[winJava7] at java.lang.Thread.run(Thread.java:748)
[Pipeline] [winJava7] // withMaven
[Pipeline] [winJava7] deleteDir
[Pipeline] [winJava7] }
[Pipeline] [winJava7] // dir
[Pipeline] [winJava7] }
[Pipeline] [winJava7] // stage
[Pipeline] [winJava7] }
[Pipeline] [winJava7] // node
[Pipeline] [winJava7] }
[Pipeline] // parallel
[Pipeline] stage
[Pipeline] { (Notifications)
[Pipeline] echo
Build result: UNSTABLE
[Pipeline] jiraIssueSelector
[Pipeline] jiraComment
[Pipeline] emailext
Reply | Threaded
Open this post in threaded view
|

Build failed in Jenkins: maven-3.x-jenkinsfile » MNG-6308_display_packaging #7

Apache Jenkins Server-2
See https://builds.apache.org/job/maven-3.x-jenkinsfile/job/MNG-6308_display_packaging/7/

Changes:

* [MNG-6308] display packaging when building a module highlight projectKey

All tests passed

Build log:
[...truncated 461.27 KB...]
Tests run: 1, Failures: 0, Errors: 0, Skipped: 0, Time elapsed: 0.303 sec - in org.apache.maven.project.inheritance.t06.ProjectInheritanceTest
Running org.apache.maven.project.inheritance.t12scm.ProjectInheritanceTest
Tests run: 2, Failures: 0, Errors: 0, Skipped: 0, Time elapsed: 0.296 sec - in org.apache.maven.project.inheritance.t12scm.ProjectInheritanceTest
Running org.apache.maven.project.inheritance.t07.ProjectInheritanceTest
Tests run: 1, Failures: 0, Errors: 0, Skipped: 0, Time elapsed: 0.14 sec - in org.apache.maven.project.inheritance.t07.ProjectInheritanceTest
Running org.apache.maven.project.inheritance.t08.ProjectInheritanceTest
Tests run: 1, Failures: 0, Errors: 0, Skipped: 0, Time elapsed: 0.227 sec - in org.apache.maven.project.inheritance.t08.ProjectInheritanceTest
Running org.apache.maven.project.inheritance.t09.ProjectInheritanceTest
Tests run: 2, Failures: 0, Errors: 0, Skipped: 0, Time elapsed: 0.265 sec - in org.apache.maven.project.inheritance.t09.ProjectInheritanceTest
Running org.apache.maven.project.inheritance.t01.ProjectInheritanceTest
Tests run: 1, Failures: 0, Errors: 0, Skipped: 0, Time elapsed: 0.154 sec - in org.apache.maven.project.inheritance.t01.ProjectInheritanceTest
Running org.apache.maven.project.inheritance.t04.ProjectInheritanceTest
Tests run: 1, Failures: 0, Errors: 0, Skipped: 0, Time elapsed: 0.116 sec - in org.apache.maven.project.inheritance.t04.ProjectInheritanceTest
Running org.apache.maven.project.inheritance.t00.ProjectInheritanceTest
Tests run: 1, Failures: 0, Errors: 0, Skipped: 0, Time elapsed: 0.11 sec - in org.apache.maven.project.inheritance.t00.ProjectInheritanceTest
Running org.apache.maven.project.inheritance.t12.ProjectInheritanceTest
Tests run: 1, Failures: 0, Errors: 0, Skipped: 0, Time elapsed: 0.105 sec - in org.apache.maven.project.inheritance.t12.ProjectInheritanceTest
Running org.apache.maven.project.inheritance.t03.ProjectInheritanceTest
Tests run: 1, Failures: 0, Errors: 0, Skipped: 0, Time elapsed: 0.123 sec - in org.apache.maven.project.inheritance.t03.ProjectInheritanceTest
Running org.apache.maven.project.inheritance.t02.ProjectInheritanceTest
Tests run: 1, Failures: 0, Errors: 0, Skipped: 0, Time elapsed: 0.153 sec - in org.apache.maven.project.inheritance.t02.ProjectInheritanceTest
Running org.apache.maven.project.inheritance.t10.ProjectInheritanceTest
Tests run: 1, Failures: 0, Errors: 0, Skipped: 0, Time elapsed: 0.103 sec - in org.apache.maven.project.inheritance.t10.ProjectInheritanceTest
Running org.apache.maven.project.inheritance.t11.ProjectInheritanceTest
Tests run: 1, Failures: 0, Errors: 0, Skipped: 0, Time elapsed: 0.105 sec - in org.apache.maven.project.inheritance.t11.ProjectInheritanceTest
Running org.apache.maven.project.inheritance.t05.ProjectInheritanceTest
Tests run: 1, Failures: 0, Errors: 0, Skipped: 0, Time elapsed: 0.099 sec - in org.apache.maven.project.inheritance.t05.ProjectInheritanceTest
Running org.apache.maven.project.ProjectClasspathTest
Tests run: 1, Failures: 0, Errors: 0, Skipped: 0, Time elapsed: 0.1 sec - in org.apache.maven.project.ProjectClasspathTest
Running org.apache.maven.repository.DefaultMirrorSelectorTest
Tests run: 1, Failures: 0, Errors: 0, Skipped: 0, Time elapsed: 0 sec - in org.apache.maven.repository.DefaultMirrorSelectorTest
Running org.apache.maven.repository.MirrorProcessorTest
Tests run: 8, Failures: 0, Errors: 0, Skipped: 0, Time elapsed: 0.202 sec - in org.apache.maven.repository.MirrorProcessorTest
Running org.apache.maven.repository.metadata.DefaultClasspathTransformationTest
Tests run: 3, Failures: 0, Errors: 0, Skipped: 0, Time elapsed: 0.066 sec - in org.apache.maven.repository.metadata.DefaultClasspathTransformationTest
Running org.apache.maven.repository.metadata.DefaultGraphConflictResolverTest
Tests run: 3, Failures: 0, Errors: 0, Skipped: 0, Time elapsed: 0.061 sec - in org.apache.maven.repository.metadata.DefaultGraphConflictResolverTest
Running org.apache.maven.repository.metadata.DefaultGraphConflictResolutionPolicyTest
Tests run: 1, Failures: 0, Errors: 0, Skipped: 0, Time elapsed: 0.044 sec - in org.apache.maven.repository.metadata.DefaultGraphConflictResolutionPolicyTest
Running org.apache.maven.repository.LegacyRepositorySystemTest
Tests run: 2, Failures: 0, Errors: 0, Skipped: 0, Time elapsed: 0.176 sec - in org.apache.maven.repository.LegacyRepositorySystemTest
Running org.apache.maven.repository.legacy.resolver.DefaultArtifactCollectorTest
Tests run: 29, Failures: 0, Errors: 0, Skipped: 0, Time elapsed: 0.769 sec - in org.apache.maven.repository.legacy.resolver.DefaultArtifactCollectorTest
Running org.apache.maven.repository.legacy.resolver.conflict.FarthestConflictResolverTest
Tests run: 4, Failures: 0, Errors: 0, Skipped: 0, Time elapsed: 0.089 sec - in org.apache.maven.repository.legacy.resolver.conflict.FarthestConflictResolverTest
Running org.apache.maven.repository.legacy.resolver.conflict.NewestConflictResolverTest
Tests run: 4, Failures: 0, Errors: 0, Skipped: 0, Time elapsed: 0.082 sec - in org.apache.maven.repository.legacy.resolver.conflict.NewestConflictResolverTest
Running org.apache.maven.repository.legacy.resolver.conflict.NearestConflictResolverTest
Tests run: 4, Failures: 0, Errors: 0, Skipped: 0, Time elapsed: 0.102 sec - in org.apache.maven.repository.legacy.resolver.conflict.NearestConflictResolverTest
Running org.apache.maven.repository.legacy.resolver.conflict.OldestConflictResolverTest
Tests run: 4, Failures: 0, Errors: 0, Skipped: 0, Time elapsed: 0.087 sec - in org.apache.maven.repository.legacy.resolver.conflict.OldestConflictResolverTest
Running org.apache.maven.repository.legacy.LegacyRepositorySystemTest
Tests run: 2, Failures: 0, Errors: 0, Skipped: 0, Time elapsed: 0.107 sec - in org.apache.maven.repository.legacy.LegacyRepositorySystemTest
Running org.apache.maven.repository.legacy.DefaultUpdateCheckManagerTest
Tests run: 7, Failures: 0, Errors: 0, Skipped: 0, Time elapsed: 0.338 sec - in org.apache.maven.repository.legacy.DefaultUpdateCheckManagerTest
Running org.apache.maven.repository.legacy.DefaultWagonManagerTest
Tests run: 7, Failures: 0, Errors: 0, Skipped: 0, Time elapsed: 0.225 sec - in org.apache.maven.repository.legacy.DefaultWagonManagerTest

Results :

Tests run: 156, Failures: 0, Errors: 0, Skipped: 0

[INFO]
[INFO] --- maven-jar-plugin:2.5:jar (default-jar) @ maven-compat ---
[INFO] Building jar: /home/jenkins/jenkins-slave/workspace/_MNG-6308_display_packaging-ULE2OXRVCENAJ3SAUC4NYIAF5SKXS7XEM6YLJZJZS6BVAYAZ4HDA/build/maven-compat/target/maven-compat-3.5.3-SNAPSHOT.jar
[INFO]
[INFO] --- maven-site-plugin:3.4:attach-descriptor (attach-descriptor) @ maven-compat ---
[INFO]
[INFO] --- maven-checkstyle-plugin:2.15:check (checkstyle-check) @ maven-compat ---
[INFO] There are 60 errors reported by Checkstyle 6.1.1 with config/maven_checks.xml ruleset.
[ERROR] src/main/java/org/apache/maven/artifact/resolver/DefaultArtifactResolver.java[261] (sizes) LineLength: Line is longer than 120 characters (found 126).
[ERROR] src/main/java/org/apache/maven/artifact/resolver/DefaultArtifactResolver.java[308] (sizes) LineLength: Line is longer than 120 characters (found 126).
[ERROR] src/main/java/org/apache/maven/repository/MetadataResolutionResult.java[325] (blocks) NeedBraces: 'if' construct must use '{}'s.
[ERROR] src/main/java/org/apache/maven/repository/metadata/MetadataGraphEdge.java[83:5] (coding) EqualsHashCode: Definition of 'equals()' without corresponding definition of 'hashCode()'.
[INFO] Ignored 56 errors, 4 violations remaining.
[WARNING] checkstyle:check violations detected but failOnViolation set to false
[INFO]
[INFO] ------------------------------------------------------------------------
[INFO] Skipping Apache Maven Distribution
[INFO] This project has been banned from the build due to previous failures.
[INFO] ------------------------------------------------------------------------
[INFO] ------------------------------------------------------------------------
[INFO] Reactor Summary:
[INFO]
[INFO] Apache Maven ....................................... SUCCESS [ 11.983 s]
[INFO] Maven Model ........................................ SUCCESS [  7.567 s]
[INFO] Maven Artifact ..................................... SUCCESS [  2.579 s]
[INFO] Maven Plugin API ................................... SUCCESS [  2.579 s]
[INFO] Maven Builder Support .............................. SUCCESS [  1.200 s]
[INFO] Maven Model Builder ................................ SUCCESS [  7.896 s]
[INFO] Maven Settings ..................................... SUCCESS [  0.852 s]
[INFO] Maven Settings Builder ............................. SUCCESS [  1.319 s]
[INFO] Maven Repository Metadata Model .................... SUCCESS [  0.683 s]
[INFO] Maven Artifact Resolver Provider ................... SUCCESS [  5.674 s]
[INFO] Maven Core ......................................... SUCCESS [ 25.724 s]
[INFO] Maven SLF4J Simple Provider ........................ SUCCESS [  2.370 s]
[INFO] Maven Embedder ..................................... FAILURE [  3.393 s]
[INFO] Maven Compat ....................................... SUCCESS [ 13.736 s]
[INFO] Apache Maven Distribution .......................... SKIPPED
[INFO] ------------------------------------------------------------------------
[INFO] BUILD FAILURE
[INFO] ------------------------------------------------------------------------
[INFO] Total time: 01:29 min
[INFO] Finished at: 2017-12-22T10:48:56Z
[INFO] Final Memory: 71M/1904M
[INFO] ------------------------------------------------------------------------
[jenkins-maven-event-spy] INFO generated /home/jenkins/jenkins-slave/workspace/_MNG-6308_display_packaging-ULE2OXRVCENAJ3SAUC4NYIAF5SKXS7XEM6YLJZJZS6BVAYAZ4HDA/build@tmp/withMaven2093f7bb/maven-spy-20171222-104727-405543860362253200583.log
[ERROR] Failed to execute goal org.apache.maven.plugins:maven-checkstyle-plugin:2.15:check (checkstyle-check) on project maven-embedder: You have 2 Checkstyle violations. -> [Help 1]
org.apache.maven.lifecycle.LifecycleExecutionException: Failed to execute goal org.apache.maven.plugins:maven-checkstyle-plugin:2.15:check (checkstyle-check) on project maven-embedder: You have 2 Checkstyle violations.
    at org.apache.maven.lifecycle.internal.MojoExecutor.execute (MojoExecutor.java:213)
    at org.apache.maven.lifecycle.internal.MojoExecutor.execute (MojoExecutor.java:154)
    at org.apache.maven.lifecycle.internal.MojoExecutor.execute (MojoExecutor.java:146)
    at org.apache.maven.lifecycle.internal.LifecycleModuleBuilder.buildProject (LifecycleModuleBuilder.java:117)
    at org.apache.maven.lifecycle.internal.LifecycleModuleBuilder.buildProject (LifecycleModuleBuilder.java:81)
    at org.apache.maven.lifecycle.internal.builder.singlethreaded.SingleThreadedBuilder.build (SingleThreadedBuilder.java:51)
    at org.apache.maven.lifecycle.internal.LifecycleStarter.execute (LifecycleStarter.java:128)
    at org.apache.maven.DefaultMaven.doExecute (DefaultMaven.java:309)
    at org.apache.maven.DefaultMaven.doExecute (DefaultMaven.java:194)
    at org.apache.maven.DefaultMaven.execute (DefaultMaven.java:107)
    at org.apache.maven.cli.MavenCli.execute (MavenCli.java:955)
    at org.apache.maven.cli.MavenCli.doMain (MavenCli.java:290)
    at org.apache.maven.cli.MavenCli.main (MavenCli.java:194)
    at sun.reflect.NativeMethodAccessorImpl.invoke0 (Native Method)
    at sun.reflect.NativeMethodAccessorImpl.invoke (NativeMethodAccessorImpl.java:57)
    at sun.reflect.DelegatingMethodAccessorImpl.invoke (DelegatingMethodAccessorImpl.java:43)
    at java.lang.reflect.Method.invoke (Method.java:606)
    at org.codehaus.plexus.classworlds.launcher.Launcher.launchEnhanced (Launcher.java:289)
    at org.codehaus.plexus.classworlds.launcher.Launcher.launch (Launcher.java:229)
    at org.codehaus.plexus.classworlds.launcher.Launcher.mainWithExitCode (Launcher.java:415)
    at org.codehaus.plexus.classworlds.launcher.Launcher.main (Launcher.java:356)
Caused by: org.apache.maven.plugin.MojoFailureException: You have 2 Checkstyle violations.
    at org.apache.maven.plugin.checkstyle.CheckstyleViolationCheckMojo.execute (CheckstyleViolationCheckMojo.java:580)
    at org.apache.maven.plugin.DefaultBuildPluginManager.executeMojo (DefaultBuildPluginManager.java:134)
    at org.apache.maven.lifecycle.internal.MojoExecutor.execute (MojoExecutor.java:208)
    at org.apache.maven.lifecycle.internal.MojoExecutor.execute (MojoExecutor.java:154)
    at org.apache.maven.lifecycle.internal.MojoExecutor.execute (MojoExecutor.java:146)
    at org.apache.maven.lifecycle.internal.LifecycleModuleBuilder.buildProject (LifecycleModuleBuilder.java:117)
    at org.apache.maven.lifecycle.internal.LifecycleModuleBuilder.buildProject (LifecycleModuleBuilder.java:81)
    at org.apache.maven.lifecycle.internal.builder.singlethreaded.SingleThreadedBuilder.build (SingleThreadedBuilder.java:51)
    at org.apache.maven.lifecycle.internal.LifecycleStarter.execute (LifecycleStarter.java:128)
    at org.apache.maven.DefaultMaven.doExecute (DefaultMaven.java:309)
    at org.apache.maven.DefaultMaven.doExecute (DefaultMaven.java:194)
    at org.apache.maven.DefaultMaven.execute (DefaultMaven.java:107)
    at org.apache.maven.cli.MavenCli.execute (MavenCli.java:955)
    at org.apache.maven.cli.MavenCli.doMain (MavenCli.java:290)
    at org.apache.maven.cli.MavenCli.main (MavenCli.java:194)
    at sun.reflect.NativeMethodAccessorImpl.invoke0 (Native Method)
    at sun.reflect.NativeMethodAccessorImpl.invoke (NativeMethodAccessorImpl.java:57)
    at sun.reflect.DelegatingMethodAccessorImpl.invoke (DelegatingMethodAccessorImpl.java:43)
    at java.lang.reflect.Method.invoke (Method.java:606)
    at org.codehaus.plexus.classworlds.launcher.Launcher.launchEnhanced (Launcher.java:289)
    at org.codehaus.plexus.classworlds.launcher.Launcher.launch (Launcher.java:229)
    at org.codehaus.plexus.classworlds.launcher.Launcher.mainWithExitCode (Launcher.java:415)
    at org.codehaus.plexus.classworlds.launcher.Launcher.main (Launcher.java:356)
[ERROR]
[ERROR] Re-run Maven using the -X switch to enable full debug logging.
[ERROR]
[ERROR] For more information about the errors and possible solutions, please read the following articles:
[ERROR] [Help 1] http://cwiki.apache.org/confluence/display/MAVEN/MojoFailureException
[ERROR]
[ERROR] After correcting the problems, you can resume the build with the command
[ERROR]   mvn <goals> -rf :maven-embedder
[Pipeline] }
[withMaven] artifactsPublisher - Archive artifact pom.xml under org/apache/maven/maven/3.5.3-SNAPSHOT/maven-3.5.3-SNAPSHOT.pom
[withMaven] artifactsPublisher - Archive artifact maven-model/pom.xml under org/apache/maven/maven-model/3.5.3-SNAPSHOT/maven-model-3.5.3-SNAPSHOT.pom
[withMaven] artifactsPublisher - Archive artifact maven-model/target/maven-model-3.5.3-SNAPSHOT.jar under org/apache/maven/maven-model/3.5.3-SNAPSHOT/maven-model-3.5.3-SNAPSHOT.jar
[withMaven] artifactsPublisher - Archive artifact maven-artifact/pom.xml under org/apache/maven/maven-artifact/3.5.3-SNAPSHOT/maven-artifact-3.5.3-SNAPSHOT.pom
[withMaven] artifactsPublisher - Archive artifact maven-artifact/target/maven-artifact-3.5.3-SNAPSHOT.jar under org/apache/maven/maven-artifact/3.5.3-SNAPSHOT/maven-artifact-3.5.3-SNAPSHOT.jar
[withMaven] artifactsPublisher - Archive artifact maven-plugin-api/pom.xml under org/apache/maven/maven-plugin-api/3.5.3-SNAPSHOT/maven-plugin-api-3.5.3-SNAPSHOT.pom
[withMaven] artifactsPublisher - Archive artifact maven-plugin-api/target/maven-plugin-api-3.5.3-SNAPSHOT.jar under org/apache/maven/maven-plugin-api/3.5.3-SNAPSHOT/maven-plugin-api-3.5.3-SNAPSHOT.jar
[withMaven] artifactsPublisher - Archive artifact maven-builder-support/pom.xml under org/apache/maven/maven-builder-support/3.5.3-SNAPSHOT/maven-builder-support-3.5.3-SNAPSHOT.pom
[withMaven] artifactsPublisher - Archive artifact maven-builder-support/target/maven-builder-support-3.5.3-SNAPSHOT.jar under org/apache/maven/maven-builder-support/3.5.3-SNAPSHOT/maven-builder-support-3.5.3-SNAPSHOT.jar
[withMaven] artifactsPublisher - Archive artifact maven-model-builder/pom.xml under org/apache/maven/maven-model-builder/3.5.3-SNAPSHOT/maven-model-builder-3.5.3-SNAPSHOT.pom
[withMaven] artifactsPublisher - Archive artifact maven-model-builder/target/maven-model-builder-3.5.3-SNAPSHOT.jar under org/apache/maven/maven-model-builder/3.5.3-SNAPSHOT/maven-model-builder-3.5.3-SNAPSHOT.jar
[withMaven] artifactsPublisher - Archive artifact maven-settings/pom.xml under org/apache/maven/maven-settings/3.5.3-SNAPSHOT/maven-settings-3.5.3-SNAPSHOT.pom
[withMaven] artifactsPublisher - Archive artifact maven-settings/target/maven-settings-3.5.3-SNAPSHOT.jar under org/apache/maven/maven-settings/3.5.3-SNAPSHOT/maven-settings-3.5.3-SNAPSHOT.jar
[withMaven] artifactsPublisher - Archive artifact maven-settings-builder/pom.xml under org/apache/maven/maven-settings-builder/3.5.3-SNAPSHOT/maven-settings-builder-3.5.3-SNAPSHOT.pom
[withMaven] artifactsPublisher - Archive artifact maven-settings-builder/target/maven-settings-builder-3.5.3-SNAPSHOT.jar under org/apache/maven/maven-settings-builder/3.5.3-SNAPSHOT/maven-settings-builder-3.5.3-SNAPSHOT.jar
[withMaven] artifactsPublisher - Archive artifact maven-repository-metadata/pom.xml under org/apache/maven/maven-repository-metadata/3.5.3-SNAPSHOT/maven-repository-metadata-3.5.3-SNAPSHOT.pom
[withMaven] artifactsPublisher - Archive artifact maven-repository-metadata/target/maven-repository-metadata-3.5.3-SNAPSHOT.jar under org/apache/maven/maven-repository-metadata/3.5.3-SNAPSHOT/maven-repository-metadata-3.5.3-SNAPSHOT.jar
[withMaven] artifactsPublisher - Archive artifact maven-resolver-provider/pom.xml under org/apache/maven/maven-resolver-provider/3.5.3-SNAPSHOT/maven-resolver-provider-3.5.3-SNAPSHOT.pom
[withMaven] artifactsPublisher - Archive artifact maven-resolver-provider/target/maven-resolver-provider-3.5.3-SNAPSHOT.jar under org/apache/maven/maven-resolver-provider/3.5.3-SNAPSHOT/maven-resolver-provider-3.5.3-SNAPSHOT.jar
[withMaven] artifactsPublisher - Archive artifact maven-core/pom.xml under org/apache/maven/maven-core/3.5.3-SNAPSHOT/maven-core-3.5.3-SNAPSHOT.pom
[withMaven] artifactsPublisher - Archive artifact maven-core/target/maven-core-3.5.3-SNAPSHOT.jar under org/apache/maven/maven-core/3.5.3-SNAPSHOT/maven-core-3.5.3-SNAPSHOT.jar
[withMaven] artifactsPublisher - Archive artifact maven-slf4j-provider/pom.xml under org/apache/maven/maven-slf4j-provider/3.5.3-SNAPSHOT/maven-slf4j-provider-3.5.3-SNAPSHOT.pom
[withMaven] artifactsPublisher - Archive artifact maven-slf4j-provider/target/maven-slf4j-provider-3.5.3-SNAPSHOT.jar under org/apache/maven/maven-slf4j-provider/3.5.3-SNAPSHOT/maven-slf4j-provider-3.5.3-SNAPSHOT.jar
[withMaven] artifactsPublisher - Archive artifact maven-compat/pom.xml under org/apache/maven/maven-compat/3.5.3-SNAPSHOT/maven-compat-3.5.3-SNAPSHOT.pom
[withMaven] artifactsPublisher - Archive artifact maven-compat/target/maven-compat-3.5.3-SNAPSHOT.jar under org/apache/maven/maven-compat/3.5.3-SNAPSHOT/maven-compat-3.5.3-SNAPSHOT.jar
[withMaven] artifactsPublisher - Archive artifact target/maven-3.5.3-SNAPSHOT-site.xml under org/apache/maven/maven/3.5.3-SNAPSHOT/maven-3.5.3-SNAPSHOT-site.xml
[withMaven] junitPublisher - Archive test results for Maven artifact org.apache.maven:maven-model:3.5.3-SNAPSHOT generated by maven-surefire-plugin:test (default-test): maven-model/target/surefire-reports/*.xml
[withMaven] junitPublisher - Jenkins JUnit Attachments Plugin not found, can't publish test attachments.Recording test results
[withMaven] junitPublisher - Archive test results for Maven artifact org.apache.maven:maven-artifact:3.5.3-SNAPSHOT generated by maven-surefire-plugin:test (default-test): maven-artifact/target/surefire-reports/*.xml
[withMaven] junitPublisher - Jenkins JUnit Attachments Plugin not found, can't publish test attachments.Recording test results
[withMaven] junitPublisher - Archive test results for Maven artifact org.apache.maven:maven-plugin-api:3.5.3-SNAPSHOT generated by maven-surefire-plugin:test (default-test): maven-plugin-api/target/surefire-reports/*.xml
[withMaven] junitPublisher - Jenkins JUnit Attachments Plugin not found, can't publish test attachments.Recording test results
[withMaven] junitPublisher - Archive test results for Maven artifact org.apache.maven:maven-builder-support:3.5.3-SNAPSHOT generated by maven-surefire-plugin:test (default-test): maven-builder-support/target/surefire-reports/*.xml
[withMaven] junitPublisher - Jenkins JUnit Attachments Plugin not found, can't publish test attachments.Recording test results
[withMaven] junitPublisher - Archive test results for Maven artifact org.apache.maven:maven-model-builder:3.5.3-SNAPSHOT generated by maven-surefire-plugin:test (default-test): maven-model-builder/target/surefire-reports/*.xml
[withMaven] junitPublisher - Jenkins JUnit Attachments Plugin not found, can't publish test attachments.Recording test results
[withMaven] junitPublisher - Archive test results for Maven artifact org.apache.maven:maven-settings:3.5.3-SNAPSHOT generated by maven-surefire-plugin:test (default-test): maven-settings/target/surefire-reports/*.xml
[withMaven] junitPublisher - Jenkins JUnit Attachments Plugin not found, can't publish test attachments.Recording test results
None of the test reports contained any result
[withMaven] junitPublisher - Archive test results for Maven artifact org.apache.maven:maven-settings-builder:3.5.3-SNAPSHOT generated by maven-surefire-plugin:test (default-test): maven-settings-builder/target/surefire-reports/*.xml
[withMaven] junitPublisher - Jenkins JUnit Attachments Plugin not found, can't publish test attachments.Recording test results
[withMaven] junitPublisher - Archive test results for Maven artifact org.apache.maven:maven-repository-metadata:3.5.3-SNAPSHOT generated by maven-surefire-plugin:test (default-test): maven-repository-metadata/target/surefire-reports/*.xml
[withMaven] junitPublisher - Jenkins JUnit Attachments Plugin not found, can't publish test attachments.Recording test results
None of the test reports contained any result
[withMaven] junitPublisher - Archive test results for Maven artifact org.apache.maven:maven-resolver-provider:3.5.3-SNAPSHOT generated by maven-surefire-plugin:test (default-test): maven-resolver-provider/target/surefire-reports/*.xml
[withMaven] junitPublisher - Jenkins JUnit Attachments Plugin not found, can't publish test attachments.Recording test results
[withMaven] junitPublisher - Archive test results for Maven artifact org.apache.maven:maven-core:3.5.3-SNAPSHOT generated by maven-surefire-plugin:test (default-test): maven-core/target/surefire-reports/*.xml
[withMaven] junitPublisher - Jenkins JUnit Attachments Plugin not found, can't publish test attachments.Recording test results
[withMaven] junitPublisher - Archive test results for Maven artifact org.apache.maven:maven-slf4j-provider:3.5.3-SNAPSHOT generated by maven-surefire-plugin:test (default-test): maven-slf4j-provider/target/surefire-reports/*.xml
[withMaven] junitPublisher - Jenkins JUnit Attachments Plugin not found, can't publish test attachments.Recording test results
None of the test reports contained any result
[withMaven] junitPublisher - Archive test results for Maven artifact org.apache.maven:maven-embedder:3.5.3-SNAPSHOT generated by maven-surefire-plugin:test (default-test): maven-embedder/target/surefire-reports/*.xml
[withMaven] junitPublisher - Jenkins JUnit Attachments Plugin not found, can't publish test attachments.Recording test results
[withMaven] junitPublisher - Archive test results for Maven artifact org.apache.maven:maven-compat:3.5.3-SNAPSHOT generated by maven-surefire-plugin:test (default-test): maven-compat/target/surefire-reports/*.xml
[withMaven] junitPublisher - Jenkins JUnit Attachments Plugin not found, can't publish test attachments.Recording test results
[withMaven] openTasksPublisher - Scan Tasks for Maven artifact org.apache.maven:maven-model:3.5.3-SNAPSHOT in source directory maven-model/src/main/java
[withMaven] openTasksPublisher - Scan Tasks for Maven artifact org.apache.maven:maven-artifact:3.5.3-SNAPSHOT in source directory maven-artifact/src/main/java
[withMaven] openTasksPublisher - Scan Tasks for Maven artifact org.apache.maven:maven-plugin-api:3.5.3-SNAPSHOT in source directory maven-plugin-api/src/main/java
[withMaven] openTasksPublisher - Scan Tasks for Maven artifact org.apache.maven:maven-builder-support:3.5.3-SNAPSHOT in source directory maven-builder-support/src/main/java
[withMaven] openTasksPublisher - Scan Tasks for Maven artifact org.apache.maven:maven-model-builder:3.5.3-SNAPSHOT in source directory maven-model-builder/src/main/java
[withMaven] openTasksPublisher - Scan Tasks for Maven artifact org.apache.maven:maven-settings:3.5.3-SNAPSHOT in source directory maven-settings/src/main/java
[withMaven] openTasksPublisher - Scan Tasks for Maven artifact org.apache.maven:maven-settings-builder:3.5.3-SNAPSHOT in source directory maven-settings-builder/src/main/java
[withMaven] openTasksPublisher - Scan Tasks for Maven artifact org.apache.maven:maven-resolver-provider:3.5.3-SNAPSHOT in source directory maven-resolver-provider/src/main/java
[withMaven] openTasksPublisher - Scan Tasks for Maven artifact org.apache.maven:maven-core:3.5.3-SNAPSHOT in source directory maven-core/src/main/java
[withMaven] openTasksPublisher - Scan Tasks for Maven artifact org.apache.maven:maven-slf4j-provider:3.5.3-SNAPSHOT in source directory maven-slf4j-provider/src/main/java
[withMaven] openTasksPublisher - Scan Tasks for Maven artifact org.apache.maven:maven-embedder:3.5.3-SNAPSHOT in source directory maven-embedder/src/main/java
[withMaven] openTasksPublisher - Scan Tasks for Maven artifact org.apache.maven:maven-compat:3.5.3-SNAPSHOT in source directory maven-compat/src/main/java
[TASKS] Scanning folder '/home/jenkins/jenkins-slave/workspace/_MNG-6308_display_packaging-ULE2OXRVCENAJ3SAUC4NYIAF5SKXS7XEM6YLJZJZS6BVAYAZ4HDA/build' for files matching the pattern 'maven-model/src/main/java/**/*,maven-artifact/src/main/java/**/*,maven-plugin-api/src/main/java/**/*,maven-builder-support/src/main/java/**/*,maven-model-builder/src/main/java/**/*,maven-settings/src/main/java/**/*,maven-settings-builder/src/main/java/**/*,maven-resolver-provider/src/main/java/**/*,maven-core/src/main/java/**/*,maven-slf4j-provider/src/main/java/**/*,maven-embedder/src/main/java/**/*,maven-compat/src/main/java/**/*' - excludes: null
[TASKS] Found 700 files to scan for tasks
[TASKS] Found 165 open tasks.
Skipping warnings blame since pipelines do not have an SCM link.%n
[TASKS] Computing warning deltas based on reference build #6
[Pipeline] // withMaven
[Pipeline] }
[Pipeline] // stage
[Pipeline] }
[Pipeline] // dir
[Pipeline] }
[Pipeline] // node
[Pipeline] stage
[Pipeline] { (Notifications)
[Pipeline] echo
Build result: FAILURE
[Pipeline] jiraIssueSelector
[Pipeline] jiraComment
[Pipeline] emailext
Reply | Threaded
Open this post in threaded view
|

Build unstable in Jenkins: maven-3.x-jenkinsfile » MNG-6308_display_packaging #8

Apache Jenkins Server-2
See https://builds.apache.org/job/maven-3.x-jenkinsfile/job/MNG-6308_display_packaging/8/

Changes:

* [MNG-6308] display packaging when building a module Fix checkstyle

4 tests failed.
FAILED:  org.apache.maven.it.MavenITmng6057CheckReactorOrderTest.testitReactorShouldResultInExpectedOrder

Error Message:
expected:<3> but was:<5>

Stack Trace:
junit.framework.AssertionFailedError: expected:<3> but was:<5>
        at junit.framework.Assert.fail(Assert.java:47)
        at junit.framework.Assert.failNotEquals(Assert.java:283)
        at junit.framework.Assert.assertEquals(Assert.java:64)
        at junit.framework.Assert.assertEquals(Assert.java:195)
        at junit.framework.Assert.assertEquals(Assert.java:201)
        at org.apache.maven.it.MavenITmng6057CheckReactorOrderTest.testitReactorShouldResultInExpectedOrder(MavenITmng6057CheckReactorOrderTest.java:69)


FAILED:  org.apache.maven.it.MavenITmng4387QuietLoggingTest.testit

Error Message:
expected:<[]> but was:<[[jenkins-maven-event-spy] INFO Jenkins Maven Event Spy is disabled]>

Stack Trace:
junit.framework.AssertionFailedError: expected:<[]> but was:<[[jenkins-maven-event-spy] INFO Jenkins Maven Event Spy is disabled]>
        at junit.framework.Assert.fail(Assert.java:47)
        at junit.framework.Assert.failNotEquals(Assert.java:283)
        at junit.framework.Assert.assertEquals(Assert.java:64)
        at junit.framework.Assert.assertEquals(Assert.java:71)
        at org.apache.maven.it.MavenITmng4387QuietLoggingTest.testit(MavenITmng4387QuietLoggingTest.java:71)


FAILED:  org.apache.maven.it.MavenITmng6057CheckReactorOrderTest.testitReactorShouldResultInExpectedOrder

Error Message:
expected:<3> but was:<5>

Stack Trace:
junit.framework.AssertionFailedError: expected:<3> but was:<5>
        at junit.framework.Assert.fail(Assert.java:47)
        at junit.framework.Assert.failNotEquals(Assert.java:283)
        at junit.framework.Assert.assertEquals(Assert.java:64)
        at junit.framework.Assert.assertEquals(Assert.java:195)
        at junit.framework.Assert.assertEquals(Assert.java:201)
        at org.apache.maven.it.MavenITmng6057CheckReactorOrderTest.testitReactorShouldResultInExpectedOrder(MavenITmng6057CheckReactorOrderTest.java:69)


FAILED:  org.apache.maven.it.MavenITmng4387QuietLoggingTest.testit

Error Message:
expected:<[]> but was:<[[jenkins-maven-event-spy] INFO Jenkins Maven Event Spy is disabled]>

Stack Trace:
junit.framework.AssertionFailedError: expected:<[]> but was:<[[jenkins-maven-event-spy] INFO Jenkins Maven Event Spy is disabled]>
        at junit.framework.Assert.fail(Assert.java:47)
        at junit.framework.Assert.failNotEquals(Assert.java:283)
        at junit.framework.Assert.assertEquals(Assert.java:64)
        at junit.framework.Assert.assertEquals(Assert.java:71)
        at org.apache.maven.it.MavenITmng4387QuietLoggingTest.testit(MavenITmng4387QuietLoggingTest.java:71)




Build log:
[...truncated 6.00 MB...]
[winJava7] ERROR: [withMaven] artifactsPublisher - WARNING: Exception archiving and fingerprinting MavenArtifact{org.apache.maven.its:core-it-support:xml:site:2.1-SNAPSHOT(version: 2.1-SNAPSHOT, snapshot:true)  C:\mvn-it-1.tmp\core-it-support\target\core-it-support-2.1-SNAPSHOT-site.xml}, skip archiving of the artifacts
[winJava7] java.lang.IllegalArgumentException: Cannot relativize 'C:\mvn-it-1.tmp\core-it-support\target\core-it-support-2.1-SNAPSHOT-site.xml' relatively to '/mvn-it-1.tmp'
[winJava7] at org.jenkinsci.plugins.pipeline.maven.util.XmlUtils.getPathInWorkspace(XmlUtils.java:319)
[winJava7] at org.jenkinsci.plugins.pipeline.maven.publishers.GeneratedArtifactsPublisher.process(GeneratedArtifactsPublisher.java:95)
[winJava7] at org.jenkinsci.plugins.pipeline.maven.MavenSpyLogProcessor.processMavenSpyLogs(MavenSpyLogProcessor.java:109)
[winJava7] at org.jenkinsci.plugins.pipeline.maven.WithMavenStepExecution$WorkspaceCleanupCallback.finished(WithMavenStepExecution.java:913)
[winJava7] at org.jenkinsci.plugins.workflow.steps.BodyExecutionCallback$TailCall.onSuccess(BodyExecutionCallback.java:114)
[winJava7] at org.jenkinsci.plugins.workflow.cps.CpsBodyExecution$SuccessAdapter.receive(CpsBodyExecution.java:362)
[winJava7] at com.cloudbees.groovy.cps.Outcome.resumeFrom(Outcome.java:73)
[winJava7] at com.cloudbees.groovy.cps.Continuable$1.call(Continuable.java:166)
[winJava7] at com.cloudbees.groovy.cps.Continuable$1.call(Continuable.java:163)
[winJava7] at org.codehaus.groovy.runtime.GroovyCategorySupport$ThreadCategoryInfo.use(GroovyCategorySupport.java:122)
[winJava7] at org.codehaus.groovy.runtime.GroovyCategorySupport.use(GroovyCategorySupport.java:261)
[winJava7] at com.cloudbees.groovy.cps.Continuable.run0(Continuable.java:163)
[winJava7] at org.jenkinsci.plugins.workflow.cps.SandboxContinuable.access$001(SandboxContinuable.java:19)
[winJava7] at org.jenkinsci.plugins.workflow.cps.SandboxContinuable$1.call(SandboxContinuable.java:35)
[winJava7] at org.jenkinsci.plugins.workflow.cps.SandboxContinuable$1.call(SandboxContinuable.java:32)
[winJava7] at org.jenkinsci.plugins.scriptsecurity.sandbox.groovy.GroovySandbox.runInSandbox(GroovySandbox.java:108)
[winJava7] at org.jenkinsci.plugins.workflow.cps.SandboxContinuable.run0(SandboxContinuable.java:32)
[winJava7] at org.jenkinsci.plugins.workflow.cps.CpsThread.runNextChunk(CpsThread.java:174)
[winJava7] at org.jenkinsci.plugins.workflow.cps.CpsThreadGroup.run(CpsThreadGroup.java:330)
[winJava7] at org.jenkinsci.plugins.workflow.cps.CpsThreadGroup.access$100(CpsThreadGroup.java:82)
[winJava7] at org.jenkinsci.plugins.workflow.cps.CpsThreadGroup$2.call(CpsThreadGroup.java:242)
[winJava7] at org.jenkinsci.plugins.workflow.cps.CpsThreadGroup$2.call(CpsThreadGroup.java:230)
[winJava7] at org.jenkinsci.plugins.workflow.cps.CpsVmExecutorService$2.call(CpsVmExecutorService.java:64)
[winJava7] at java.util.concurrent.FutureTask.run(FutureTask.java:266)
[winJava7] at hudson.remoting.SingleLaneExecutorService$1.run(SingleLaneExecutorService.java:112)
[winJava7] at jenkins.util.ContextResettingExecutorService$1.run(ContextResettingExecutorService.java:28)
[winJava7] at java.util.concurrent.Executors$RunnableAdapter.call(Executors.java:511)
[winJava7] at java.util.concurrent.FutureTask.run(FutureTask.java:266)
[winJava7] at java.util.concurrent.ThreadPoolExecutor.runWorker(ThreadPoolExecutor.java:1149)
[winJava7] at java.util.concurrent.ThreadPoolExecutor$Worker.run(ThreadPoolExecutor.java:624)
[winJava7] at java.lang.Thread.run(Thread.java:748)
[winJava7] ERROR: [withMaven] artifactsPublisher - WARNING: Exception archiving and fingerprinting MavenArtifact{org.apache.maven.its.plugins:maven-it-plugins:xml:site:2.1-SNAPSHOT(version: 2.1-SNAPSHOT, snapshot:true)  C:\mvn-it-1.tmp\core-it-support\core-it-plugins\target\maven-it-plugins-2.1-SNAPSHOT-site.xml}, skip archiving of the artifacts
[winJava7] java.lang.IllegalArgumentException: Cannot relativize 'C:\mvn-it-1.tmp\core-it-support\core-it-plugins\target\maven-it-plugins-2.1-SNAPSHOT-site.xml' relatively to '/mvn-it-1.tmp'
[winJava7] at org.jenkinsci.plugins.pipeline.maven.util.XmlUtils.getPathInWorkspace(XmlUtils.java:319)
[winJava7] at org.jenkinsci.plugins.pipeline.maven.publishers.GeneratedArtifactsPublisher.process(GeneratedArtifactsPublisher.java:95)
[winJava7] at org.jenkinsci.plugins.pipeline.maven.MavenSpyLogProcessor.processMavenSpyLogs(MavenSpyLogProcessor.java:109)
[winJava7] at org.jenkinsci.plugins.pipeline.maven.WithMavenStepExecution$WorkspaceCleanupCallback.finished(WithMavenStepExecution.java:913)
[winJava7] at org.jenkinsci.plugins.workflow.steps.BodyExecutionCallback$TailCall.onSuccess(BodyExecutionCallback.java:114)
[winJava7] at org.jenkinsci.plugins.workflow.cps.CpsBodyExecution$SuccessAdapter.receive(CpsBodyExecution.java:362)
[winJava7] at com.cloudbees.groovy.cps.Outcome.resumeFrom(Outcome.java:73)
[winJava7] at com.cloudbees.groovy.cps.Continuable$1.call(Continuable.java:166)
[winJava7] at com.cloudbees.groovy.cps.Continuable$1.call(Continuable.java:163)
[winJava7] at org.codehaus.groovy.runtime.GroovyCategorySupport$ThreadCategoryInfo.use(GroovyCategorySupport.java:122)
[winJava7] at org.codehaus.groovy.runtime.GroovyCategorySupport.use(GroovyCategorySupport.java:261)
[winJava7] at com.cloudbees.groovy.cps.Continuable.run0(Continuable.java:163)
[winJava7] at org.jenkinsci.plugins.workflow.cps.SandboxContinuable.access$001(SandboxContinuable.java:19)
[winJava7] at org.jenkinsci.plugins.workflow.cps.SandboxContinuable$1.call(SandboxContinuable.java:35)
[winJava7] at org.jenkinsci.plugins.workflow.cps.SandboxContinuable$1.call(SandboxContinuable.java:32)
[winJava7] at org.jenkinsci.plugins.scriptsecurity.sandbox.groovy.GroovySandbox.runInSandbox(GroovySandbox.java:108)
[winJava7] at org.jenkinsci.plugins.workflow.cps.SandboxContinuable.run0(SandboxContinuable.java:32)
[winJava7] at org.jenkinsci.plugins.workflow.cps.CpsThread.runNextChunk(CpsThread.java:174)
[winJava7] at org.jenkinsci.plugins.workflow.cps.CpsThreadGroup.run(CpsThreadGroup.java:330)
[winJava7] at org.jenkinsci.plugins.workflow.cps.CpsThreadGroup.access$100(CpsThreadGroup.java:82)
[winJava7] at org.jenkinsci.plugins.workflow.cps.CpsThreadGroup$2.call(CpsThreadGroup.java:242)
[winJava7] at org.jenkinsci.plugins.workflow.cps.CpsThreadGroup$2.call(CpsThreadGroup.java:230)
[winJava7] at org.jenkinsci.plugins.workflow.cps.CpsVmExecutorService$2.call(CpsVmExecutorService.java:64)
[winJava7] at java.util.concurrent.FutureTask.run(FutureTask.java:266)
[winJava7] at hudson.remoting.SingleLaneExecutorService$1.run(SingleLaneExecutorService.java:112)
[winJava7] at jenkins.util.ContextResettingExecutorService$1.run(ContextResettingExecutorService.java:28)
[winJava7] at java.util.concurrent.Executors$RunnableAdapter.call(Executors.java:511)
[winJava7] at java.util.concurrent.FutureTask.run(FutureTask.java:266)
[winJava7] at java.util.concurrent.ThreadPoolExecutor.runWorker(ThreadPoolExecutor.java:1149)
[winJava7] at java.util.concurrent.ThreadPoolExecutor$Worker.run(ThreadPoolExecutor.java:624)
[winJava7] at java.lang.Thread.run(Thread.java:748)
[winJava7] ERROR: [withMaven] artifactsPublisher - WARNING: Exception archiving and fingerprinting MavenArtifact{org.apache.maven.its.plugins:maven-it-plugin-core-stubs:xml:site:2.1-SNAPSHOT(version: 2.1-SNAPSHOT, snapshot:true)  C:\mvn-it-1.tmp\core-it-support\core-it-plugins\maven-it-plugin-core-stubs\target\maven-it-plugin-core-stubs-2.1-SNAPSHOT-site.xml}, skip archiving of the artifacts
[winJava7] java.lang.IllegalArgumentException: Cannot relativize 'C:\mvn-it-1.tmp\core-it-support\core-it-plugins\maven-it-plugin-core-stubs\target\maven-it-plugin-core-stubs-2.1-SNAPSHOT-site.xml' relatively to '/mvn-it-1.tmp'
[winJava7] at org.jenkinsci.plugins.pipeline.maven.util.XmlUtils.getPathInWorkspace(XmlUtils.java:319)
[winJava7] at org.jenkinsci.plugins.pipeline.maven.publishers.GeneratedArtifactsPublisher.process(GeneratedArtifactsPublisher.java:95)
[winJava7] at org.jenkinsci.plugins.pipeline.maven.MavenSpyLogProcessor.processMavenSpyLogs(MavenSpyLogProcessor.java:109)
[winJava7] at org.jenkinsci.plugins.pipeline.maven.WithMavenStepExecution$WorkspaceCleanupCallback.finished(WithMavenStepExecution.java:913)
[winJava7] at org.jenkinsci.plugins.workflow.steps.BodyExecutionCallback$TailCall.onSuccess(BodyExecutionCallback.java:114)
[winJava7] at org.jenkinsci.plugins.workflow.cps.CpsBodyExecution$SuccessAdapter.receive(CpsBodyExecution.java:362)
[winJava7] at com.cloudbees.groovy.cps.Outcome.resumeFrom(Outcome.java:73)
[winJava7] at com.cloudbees.groovy.cps.Continuable$1.call(Continuable.java:166)
[winJava7] at com.cloudbees.groovy.cps.Continuable$1.call(Continuable.java:163)
[winJava7] at org.codehaus.groovy.runtime.GroovyCategorySupport$ThreadCategoryInfo.use(GroovyCategorySupport.java:122)
[winJava7] at org.codehaus.groovy.runtime.GroovyCategorySupport.use(GroovyCategorySupport.java:261)
[winJava7] at com.cloudbees.groovy.cps.Continuable.run0(Continuable.java:163)
[winJava7] at org.jenkinsci.plugins.workflow.cps.SandboxContinuable.access$001(SandboxContinuable.java:19)
[winJava7] at org.jenkinsci.plugins.workflow.cps.SandboxContinuable$1.call(SandboxContinuable.java:35)
[winJava7] at org.jenkinsci.plugins.workflow.cps.SandboxContinuable$1.call(SandboxContinuable.java:32)
[winJava7] at org.jenkinsci.plugins.scriptsecurity.sandbox.groovy.GroovySandbox.runInSandbox(GroovySandbox.java:108)
[winJava7] at org.jenkinsci.plugins.workflow.cps.SandboxContinuable.run0(SandboxContinuable.java:32)
[winJava7] at org.jenkinsci.plugins.workflow.cps.CpsThread.runNextChunk(CpsThread.java:174)
[winJava7] at org.jenkinsci.plugins.workflow.cps.CpsThreadGroup.run(CpsThreadGroup.java:330)
[winJava7] at org.jenkinsci.plugins.workflow.cps.CpsThreadGroup.access$100(CpsThreadGroup.java:82)
[winJava7] at org.jenkinsci.plugins.workflow.cps.CpsThreadGroup$2.call(CpsThreadGroup.java:242)
[winJava7] at org.jenkinsci.plugins.workflow.cps.CpsThreadGroup$2.call(CpsThreadGroup.java:230)
[winJava7] at org.jenkinsci.plugins.workflow.cps.CpsVmExecutorService$2.call(CpsVmExecutorService.java:64)
[winJava7] at java.util.concurrent.FutureTask.run(FutureTask.java:266)
[winJava7] at hudson.remoting.SingleLaneExecutorService$1.run(SingleLaneExecutorService.java:112)
[winJava7] at jenkins.util.ContextResettingExecutorService$1.run(ContextResettingExecutorService.java:28)
[winJava7] at java.util.concurrent.Executors$RunnableAdapter.call(Executors.java:511)
[winJava7] at java.util.concurrent.FutureTask.run(FutureTask.java:266)
[winJava7] at java.util.concurrent.ThreadPoolExecutor.runWorker(ThreadPoolExecutor.java:1149)
[winJava7] at java.util.concurrent.ThreadPoolExecutor$Worker.run(ThreadPoolExecutor.java:624)
[winJava7] at java.lang.Thread.run(Thread.java:748)
[winJava7] ERROR: [withMaven] artifactsPublisher - WARNING: Exception archiving and fingerprinting MavenArtifact{org.apache.maven.its:core-it-support-artifacts:zip:repo:2.1-SNAPSHOT(version: 2.1-SNAPSHOT, snapshot:true)  C:\mvn-it-1.tmp\core-it-support\core-it-support-artifacts\target\core-it-support-artifacts-2.1-SNAPSHOT-repo.zip}, skip archiving of the artifacts
[winJava7] java.lang.IllegalArgumentException: Cannot relativize 'C:\mvn-it-1.tmp\core-it-support\core-it-support-artifacts\target\core-it-support-artifacts-2.1-SNAPSHOT-repo.zip' relatively to '/mvn-it-1.tmp'
[winJava7] at org.jenkinsci.plugins.pipeline.maven.util.XmlUtils.getPathInWorkspace(XmlUtils.java:319)
[winJava7] at org.jenkinsci.plugins.pipeline.maven.publishers.GeneratedArtifactsPublisher.process(GeneratedArtifactsPublisher.java:95)
[winJava7] at org.jenkinsci.plugins.pipeline.maven.MavenSpyLogProcessor.processMavenSpyLogs(MavenSpyLogProcessor.java:109)
[winJava7] at org.jenkinsci.plugins.pipeline.maven.WithMavenStepExecution$WorkspaceCleanupCallback.finished(WithMavenStepExecution.java:913)
[winJava7] at org.jenkinsci.plugins.workflow.steps.BodyExecutionCallback$TailCall.onSuccess(BodyExecutionCallback.java:114)
[winJava7] at org.jenkinsci.plugins.workflow.cps.CpsBodyExecution$SuccessAdapter.receive(CpsBodyExecution.java:362)
[winJava7] at com.cloudbees.groovy.cps.Outcome.resumeFrom(Outcome.java:73)
[winJava7] at com.cloudbees.groovy.cps.Continuable$1.call(Continuable.java:166)
[winJava7] at com.cloudbees.groovy.cps.Continuable$1.call(Continuable.java:163)
[winJava7] at org.codehaus.groovy.runtime.GroovyCategorySupport$ThreadCategoryInfo.use(GroovyCategorySupport.java:122)
[winJava7] at org.codehaus.groovy.runtime.GroovyCategorySupport.use(GroovyCategorySupport.java:261)
[winJava7] at com.cloudbees.groovy.cps.Continuable.run0(Continuable.java:163)
[winJava7] at org.jenkinsci.plugins.workflow.cps.SandboxContinuable.access$001(SandboxContinuable.java:19)
[winJava7] at org.jenkinsci.plugins.workflow.cps.SandboxContinuable$1.call(SandboxContinuable.java:35)
[winJava7] at org.jenkinsci.plugins.workflow.cps.SandboxContinuable$1.call(SandboxContinuable.java:32)
[winJava7] at org.jenkinsci.plugins.scriptsecurity.sandbox.groovy.GroovySandbox.runInSandbox(GroovySandbox.java:108)
[winJava7] at org.jenkinsci.plugins.workflow.cps.SandboxContinuable.run0(SandboxContinuable.java:32)
[winJava7] at org.jenkinsci.plugins.workflow.cps.CpsThread.runNextChunk(CpsThread.java:174)
[winJava7] at org.jenkinsci.plugins.workflow.cps.CpsThreadGroup.run(CpsThreadGroup.java:330)
[winJava7] at org.jenkinsci.plugins.workflow.cps.CpsThreadGroup.access$100(CpsThreadGroup.java:82)
[winJava7] at org.jenkinsci.plugins.workflow.cps.CpsThreadGroup$2.call(CpsThreadGroup.java:242)
[winJava7] at org.jenkinsci.plugins.workflow.cps.CpsThreadGroup$2.call(CpsThreadGroup.java:230)
[winJava7] at org.jenkinsci.plugins.workflow.cps.CpsVmExecutorService$2.call(CpsVmExecutorService.java:64)
[winJava7] at java.util.concurrent.FutureTask.run(FutureTask.java:266)
[winJava7] at hudson.remoting.SingleLaneExecutorService$1.run(SingleLaneExecutorService.java:112)
[winJava7] at jenkins.util.ContextResettingExecutorService$1.run(ContextResettingExecutorService.java:28)
[winJava7] at java.util.concurrent.Executors$RunnableAdapter.call(Executors.java:511)
[winJava7] at java.util.concurrent.FutureTask.run(FutureTask.java:266)
[winJava7] at java.util.concurrent.ThreadPoolExecutor.runWorker(ThreadPoolExecutor.java:1149)
[winJava7] at java.util.concurrent.ThreadPoolExecutor$Worker.run(ThreadPoolExecutor.java:624)
[winJava7] at java.lang.Thread.run(Thread.java:748)
[winJava7] ERROR: [withMaven] artifactsPublisher - WARNING: Exception archiving and fingerprinting MavenArtifact{org.apache.maven.its:core-it-suite:test-jar:tests:2.1-SNAPSHOT(version: 2.1-SNAPSHOT, snapshot:true)  C:\mvn-it-1.tmp\core-it-suite\target\core-it-suite-2.1-SNAPSHOT-tests.jar}, skip archiving of the artifacts
[winJava7] java.lang.IllegalArgumentException: Cannot relativize 'C:\mvn-it-1.tmp\core-it-suite\target\core-it-suite-2.1-SNAPSHOT-tests.jar' relatively to '/mvn-it-1.tmp'
[winJava7] at org.jenkinsci.plugins.pipeline.maven.util.XmlUtils.getPathInWorkspace(XmlUtils.java:319)
[winJava7] at org.jenkinsci.plugins.pipeline.maven.publishers.GeneratedArtifactsPublisher.process(GeneratedArtifactsPublisher.java:95)
[winJava7] at org.jenkinsci.plugins.pipeline.maven.MavenSpyLogProcessor.processMavenSpyLogs(MavenSpyLogProcessor.java:109)
[winJava7] at org.jenkinsci.plugins.pipeline.maven.WithMavenStepExecution$WorkspaceCleanupCallback.finished(WithMavenStepExecution.java:913)
[winJava7] at org.jenkinsci.plugins.workflow.steps.BodyExecutionCallback$TailCall.onSuccess(BodyExecutionCallback.java:114)
[winJava7] at org.jenkinsci.plugins.workflow.cps.CpsBodyExecution$SuccessAdapter.receive(CpsBodyExecution.java:362)
[winJava7] at com.cloudbees.groovy.cps.Outcome.resumeFrom(Outcome.java:73)
[winJava7] at com.cloudbees.groovy.cps.Continuable$1.call(Continuable.java:166)
[winJava7] at com.cloudbees.groovy.cps.Continuable$1.call(Continuable.java:163)
[winJava7] at org.codehaus.groovy.runtime.GroovyCategorySupport$ThreadCategoryInfo.use(GroovyCategorySupport.java:122)
[winJava7] at org.codehaus.groovy.runtime.GroovyCategorySupport.use(GroovyCategorySupport.java:261)
[winJava7] at com.cloudbees.groovy.cps.Continuable.run0(Continuable.java:163)
[winJava7] at org.jenkinsci.plugins.workflow.cps.SandboxContinuable.access$001(SandboxContinuable.java:19)
[winJava7] at org.jenkinsci.plugins.workflow.cps.SandboxContinuable$1.call(SandboxContinuable.java:35)
[winJava7] at org.jenkinsci.plugins.workflow.cps.SandboxContinuable$1.call(SandboxContinuable.java:32)
[winJava7] at org.jenkinsci.plugins.scriptsecurity.sandbox.groovy.GroovySandbox.runInSandbox(GroovySandbox.java:108)
[winJava7] at org.jenkinsci.plugins.workflow.cps.SandboxContinuable.run0(SandboxContinuable.java:32)
[winJava7] at org.jenkinsci.plugins.workflow.cps.CpsThread.runNextChunk(CpsThread.java:174)
[winJava7] at org.jenkinsci.plugins.workflow.cps.CpsThreadGroup.run(CpsThreadGroup.java:330)
[winJava7] at org.jenkinsci.plugins.workflow.cps.CpsThreadGroup.access$100(CpsThreadGroup.java:82)
[winJava7] at org.jenkinsci.plugins.workflow.cps.CpsThreadGroup$2.call(CpsThreadGroup.java:242)
[winJava7] at org.jenkinsci.plugins.workflow.cps.CpsThreadGroup$2.call(CpsThreadGroup.java:230)
[winJava7] at org.jenkinsci.plugins.workflow.cps.CpsVmExecutorService$2.call(CpsVmExecutorService.java:64)
[winJava7] at java.util.concurrent.FutureTask.run(FutureTask.java:266)
[winJava7] at hudson.remoting.SingleLaneExecutorService$1.run(SingleLaneExecutorService.java:112)
[winJava7] at jenkins.util.ContextResettingExecutorService$1.run(ContextResettingExecutorService.java:28)
[winJava7] at java.util.concurrent.Executors$RunnableAdapter.call(Executors.java:511)
[winJava7] at java.util.concurrent.FutureTask.run(FutureTask.java:266)
[winJava7] at java.util.concurrent.ThreadPoolExecutor.runWorker(ThreadPoolExecutor.java:1149)
[winJava7] at java.util.concurrent.ThreadPoolExecutor$Worker.run(ThreadPoolExecutor.java:624)
[winJava7] at java.lang.Thread.run(Thread.java:748)
[winJava7] ERROR: [withMaven] WARNING Exception executing Maven reporter 'Junit Publisher' / org.jenkinsci.plugins.pipeline.maven.publishers.JunitTestsPublisher. Please report a bug associated for the component 'pipeline-maven-plugin' at https://issues.jenkins-ci.org 
[winJava7] java.lang.IllegalArgumentException: Cannot relativize 'C:\mvn-it-1.tmp\core-it-support\core-it-plugins\maven-it-plugin-active-collection\target/surefire-reports' relatively to '/mvn-it-1.tmp'
[winJava7] at org.jenkinsci.plugins.pipeline.maven.util.XmlUtils.getPathInWorkspace(XmlUtils.java:319)
[winJava7] at org.jenkinsci.plugins.pipeline.maven.publishers.JunitTestsPublisher.executeReporter(JunitTestsPublisher.java:235)
[winJava7] at org.jenkinsci.plugins.pipeline.maven.publishers.JunitTestsPublisher.process(JunitTestsPublisher.java:181)
[winJava7] at org.jenkinsci.plugins.pipeline.maven.MavenSpyLogProcessor.processMavenSpyLogs(MavenSpyLogProcessor.java:109)
[winJava7] at org.jenkinsci.plugins.pipeline.maven.WithMavenStepExecution$WorkspaceCleanupCallback.finished(WithMavenStepExecution.java:913)
[winJava7] at org.jenkinsci.plugins.workflow.steps.BodyExecutionCallback$TailCall.onSuccess(BodyExecutionCallback.java:114)
[winJava7] at org.jenkinsci.plugins.workflow.cps.CpsBodyExecution$SuccessAdapter.receive(CpsBodyExecution.java:362)
[winJava7] at com.cloudbees.groovy.cps.Outcome.resumeFrom(Outcome.java:73)
[winJava7] at com.cloudbees.groovy.cps.Continuable$1.call(Continuable.java:166)
[winJava7] at com.cloudbees.groovy.cps.Continuable$1.call(Continuable.java:163)
[winJava7] at org.codehaus.groovy.runtime.GroovyCategorySupport$ThreadCategoryInfo.use(GroovyCategorySupport.java:122)
[winJava7] at org.codehaus.groovy.runtime.GroovyCategorySupport.use(GroovyCategorySupport.java:261)
[winJava7] at com.cloudbees.groovy.cps.Continuable.run0(Continuable.java:163)
[winJava7] at org.jenkinsci.plugins.workflow.cps.SandboxContinuable.access$001(SandboxContinuable.java:19)
[winJava7] at org.jenkinsci.plugins.workflow.cps.SandboxContinuable$1.call(SandboxContinuable.java:35)
[winJava7] at org.jenkinsci.plugins.workflow.cps.SandboxContinuable$1.call(SandboxContinuable.java:32)
[winJava7] at org.jenkinsci.plugins.scriptsecurity.sandbox.groovy.GroovySandbox.runInSandbox(GroovySandbox.java:108)
[winJava7] at org.jenkinsci.plugins.workflow.cps.SandboxContinuable.run0(SandboxContinuable.java:32)
[winJava7] at org.jenkinsci.plugins.workflow.cps.CpsThread.runNextChunk(CpsThread.java:174)
[winJava7] at org.jenkinsci.plugins.workflow.cps.CpsThreadGroup.run(CpsThreadGroup.java:330)
[winJava7] at org.jenkinsci.plugins.workflow.cps.CpsThreadGroup.access$100(CpsThreadGroup.java:82)
[winJava7] at org.jenkinsci.plugins.workflow.cps.CpsThreadGroup$2.call(CpsThreadGroup.java:242)
[winJava7] at org.jenkinsci.plugins.workflow.cps.CpsThreadGroup$2.call(CpsThreadGroup.java:230)
[winJava7] at org.jenkinsci.plugins.workflow.cps.CpsVmExecutorService$2.call(CpsVmExecutorService.java:64)
[winJava7] at java.util.concurrent.FutureTask.run(FutureTask.java:266)
[winJava7] at hudson.remoting.SingleLaneExecutorService$1.run(SingleLaneExecutorService.java:112)
[winJava7] at jenkins.util.ContextResettingExecutorService$1.run(ContextResettingExecutorService.java:28)
[winJava7] at java.util.concurrent.Executors$RunnableAdapter.call(Executors.java:511)
[winJava7] at java.util.concurrent.FutureTask.run(FutureTask.java:266)
[winJava7] at java.util.concurrent.ThreadPoolExecutor.runWorker(ThreadPoolExecutor.java:1149)
[winJava7] at java.util.concurrent.ThreadPoolExecutor$Worker.run(ThreadPoolExecutor.java:624)
[winJava7] at java.lang.Thread.run(Thread.java:748)
[winJava7] ERROR: [withMaven] WARNING Exception executing Maven reporter 'Open Task Scanner Publisher' / org.jenkinsci.plugins.pipeline.maven.publishers.TasksScannerPublisher. Please report a bug associated for the component 'pipeline-maven-plugin' at https://issues.jenkins-ci.org 
[winJava7] java.lang.IllegalArgumentException: Cannot relativize 'C:\mvn-it-1.tmp\src\main\java' relatively to '/mvn-it-1.tmp'
[winJava7] at org.jenkinsci.plugins.pipeline.maven.util.XmlUtils.getPathInWorkspace(XmlUtils.java:319)
[winJava7] at org.jenkinsci.plugins.pipeline.maven.publishers.TasksScannerPublisher.process(TasksScannerPublisher.java:128)
[winJava7] at org.jenkinsci.plugins.pipeline.maven.MavenSpyLogProcessor.processMavenSpyLogs(MavenSpyLogProcessor.java:109)
[winJava7] at org.jenkinsci.plugins.pipeline.maven.WithMavenStepExecution$WorkspaceCleanupCallback.finished(WithMavenStepExecution.java:913)
[winJava7] at org.jenkinsci.plugins.workflow.steps.BodyExecutionCallback$TailCall.onSuccess(BodyExecutionCallback.java:114)
[winJava7] at org.jenkinsci.plugins.workflow.cps.CpsBodyExecution$SuccessAdapter.receive(CpsBodyExecution.java:362)
[winJava7] at com.cloudbees.groovy.cps.Outcome.resumeFrom(Outcome.java:73)
[winJava7] at com.cloudbees.groovy.cps.Continuable$1.call(Continuable.java:166)
[winJava7] at com.cloudbees.groovy.cps.Continuable$1.call(Continuable.java:163)
[winJava7] at org.codehaus.groovy.runtime.GroovyCategorySupport$ThreadCategoryInfo.use(GroovyCategorySupport.java:122)
[winJava7] at org.codehaus.groovy.runtime.GroovyCategorySupport.use(GroovyCategorySupport.java:261)
[winJava7] at com.cloudbees.groovy.cps.Continuable.run0(Continuable.java:163)
[winJava7] at org.jenkinsci.plugins.workflow.cps.SandboxContinuable.access$001(SandboxContinuable.java:19)
[winJava7] at org.jenkinsci.plugins.workflow.cps.SandboxContinuable$1.call(SandboxContinuable.java:35)
[winJava7] at org.jenkinsci.plugins.workflow.cps.SandboxContinuable$1.call(SandboxContinuable.java:32)
[winJava7] at org.jenkinsci.plugins.scriptsecurity.sandbox.groovy.GroovySandbox.runInSandbox(GroovySandbox.java:108)
[winJava7] at org.jenkinsci.plugins.workflow.cps.SandboxContinuable.run0(SandboxContinuable.java:32)
[winJava7] at org.jenkinsci.plugins.workflow.cps.CpsThread.runNextChunk(CpsThread.java:174)
[winJava7] at org.jenkinsci.plugins.workflow.cps.CpsThreadGroup.run(CpsThreadGroup.java:330)
[winJava7] at org.jenkinsci.plugins.workflow.cps.CpsThreadGroup.access$100(CpsThreadGroup.java:82)
[winJava7] at org.jenkinsci.plugins.workflow.cps.CpsThreadGroup$2.call(CpsThreadGroup.java:242)
[winJava7] at org.jenkinsci.plugins.workflow.cps.CpsThreadGroup$2.call(CpsThreadGroup.java:230)
[winJava7] at org.jenkinsci.plugins.workflow.cps.CpsVmExecutorService$2.call(CpsVmExecutorService.java:64)
[winJava7] at java.util.concurrent.FutureTask.run(FutureTask.java:266)
[winJava7] at hudson.remoting.SingleLaneExecutorService$1.run(SingleLaneExecutorService.java:112)
[winJava7] at jenkins.util.ContextResettingExecutorService$1.run(ContextResettingExecutorService.java:28)
[winJava7] at java.util.concurrent.Executors$RunnableAdapter.call(Executors.java:511)
[winJava7] at java.util.concurrent.FutureTask.run(FutureTask.java:266)
[winJava7] at java.util.concurrent.ThreadPoolExecutor.runWorker(ThreadPoolExecutor.java:1149)
[winJava7] at java.util.concurrent.ThreadPoolExecutor$Worker.run(ThreadPoolExecutor.java:624)
[winJava7] at java.lang.Thread.run(Thread.java:748)
[Pipeline] [winJava7] // withMaven
[Pipeline] [winJava7] deleteDir
[Pipeline] [winJava7] }
[Pipeline] [winJava7] // dir
[Pipeline] [winJava7] }
[Pipeline] [winJava7] // stage
[Pipeline] [winJava7] }
[Pipeline] [winJava7] // node
[Pipeline] [winJava7] }
[Pipeline] // parallel
[Pipeline] stage
[Pipeline] { (Notifications)
[Pipeline] echo
Build result: UNSTABLE
[Pipeline] jiraIssueSelector
[Pipeline] jiraComment
[Pipeline] emailext
Reply | Threaded
Open this post in threaded view
|

Build unstable in Jenkins: maven-3.x-jenkinsfile » MNG-6308_display_packaging #9

Apache Jenkins Server-2
See https://builds.apache.org/job/maven-3.x-jenkinsfile/job/MNG-6308_display_packaging/9/

Changes:

* [MNG-6308] split groupId/artifactId in header and packaging in footer

4 tests failed.
FAILED:  org.apache.maven.it.MavenITmng4387QuietLoggingTest.testit

Error Message:
expected:<[]> but was:<[[jenkins-maven-event-spy] INFO Jenkins Maven Event Spy is disabled]>

Stack Trace:
junit.framework.AssertionFailedError: expected:<[]> but was:<[[jenkins-maven-event-spy] INFO Jenkins Maven Event Spy is disabled]>
        at junit.framework.Assert.fail(Assert.java:47)
        at junit.framework.Assert.failNotEquals(Assert.java:283)
        at junit.framework.Assert.assertEquals(Assert.java:64)
        at junit.framework.Assert.assertEquals(Assert.java:71)
        at org.apache.maven.it.MavenITmng4387QuietLoggingTest.testit(MavenITmng4387QuietLoggingTest.java:71)


FAILED:  org.apache.maven.it.MavenITmng4387QuietLoggingTest.testit

Error Message:
expected:<[]> but was:<[[jenkins-maven-event-spy] INFO Jenkins Maven Event Spy is disabled]>

Stack Trace:
junit.framework.AssertionFailedError: expected:<[]> but was:<[[jenkins-maven-event-spy] INFO Jenkins Maven Event Spy is disabled]>
        at junit.framework.Assert.fail(Assert.java:47)
        at junit.framework.Assert.failNotEquals(Assert.java:283)
        at junit.framework.Assert.assertEquals(Assert.java:64)
        at junit.framework.Assert.assertEquals(Assert.java:71)
        at org.apache.maven.it.MavenITmng4387QuietLoggingTest.testit(MavenITmng4387QuietLoggingTest.java:71)


FAILED:  org.apache.maven.it.MavenITmng6057CheckReactorOrderTest.testitReactorShouldResultInExpectedOrder

Error Message:
expected:<3> but was:<5>

Stack Trace:
junit.framework.AssertionFailedError: expected:<3> but was:<5>
        at junit.framework.Assert.fail(Assert.java:47)
        at junit.framework.Assert.failNotEquals(Assert.java:283)
        at junit.framework.Assert.assertEquals(Assert.java:64)
        at junit.framework.Assert.assertEquals(Assert.java:195)
        at junit.framework.Assert.assertEquals(Assert.java:201)
        at org.apache.maven.it.MavenITmng6057CheckReactorOrderTest.testitReactorShouldResultInExpectedOrder(MavenITmng6057CheckReactorOrderTest.java:69)


FAILED:  org.apache.maven.it.MavenITmng6057CheckReactorOrderTest.testitReactorShouldResultInExpectedOrder

Error Message:
expected:<3> but was:<5>

Stack Trace:
junit.framework.AssertionFailedError: expected:<3> but was:<5>
        at junit.framework.Assert.fail(Assert.java:47)
        at junit.framework.Assert.failNotEquals(Assert.java:283)
        at junit.framework.Assert.assertEquals(Assert.java:64)
        at junit.framework.Assert.assertEquals(Assert.java:195)
        at junit.framework.Assert.assertEquals(Assert.java:201)
        at org.apache.maven.it.MavenITmng6057CheckReactorOrderTest.testitReactorShouldResultInExpectedOrder(MavenITmng6057CheckReactorOrderTest.java:69)




Build log:
[...truncated 6.00 MB...]
[winJava8] ERROR: [withMaven] artifactsPublisher - WARNING: Exception archiving and fingerprinting MavenArtifact{org.apache.maven.its:core-it-support:xml:site:2.1-SNAPSHOT(version: 2.1-SNAPSHOT, snapshot:true)  C:\mvn-it-1.tmp\core-it-support\target\core-it-support-2.1-SNAPSHOT-site.xml}, skip archiving of the artifacts
[winJava8] java.lang.IllegalArgumentException: Cannot relativize 'C:\mvn-it-1.tmp\core-it-support\target\core-it-support-2.1-SNAPSHOT-site.xml' relatively to '/mvn-it-1.tmp'
[winJava8] at org.jenkinsci.plugins.pipeline.maven.util.XmlUtils.getPathInWorkspace(XmlUtils.java:319)
[winJava8] at org.jenkinsci.plugins.pipeline.maven.publishers.GeneratedArtifactsPublisher.process(GeneratedArtifactsPublisher.java:95)
[winJava8] at org.jenkinsci.plugins.pipeline.maven.MavenSpyLogProcessor.processMavenSpyLogs(MavenSpyLogProcessor.java:109)
[winJava8] at org.jenkinsci.plugins.pipeline.maven.WithMavenStepExecution$WorkspaceCleanupCallback.finished(WithMavenStepExecution.java:913)
[winJava8] at org.jenkinsci.plugins.workflow.steps.BodyExecutionCallback$TailCall.onSuccess(BodyExecutionCallback.java:114)
[winJava8] at org.jenkinsci.plugins.workflow.cps.CpsBodyExecution$SuccessAdapter.receive(CpsBodyExecution.java:362)
[winJava8] at com.cloudbees.groovy.cps.Outcome.resumeFrom(Outcome.java:73)
[winJava8] at com.cloudbees.groovy.cps.Continuable$1.call(Continuable.java:166)
[winJava8] at com.cloudbees.groovy.cps.Continuable$1.call(Continuable.java:163)
[winJava8] at org.codehaus.groovy.runtime.GroovyCategorySupport$ThreadCategoryInfo.use(GroovyCategorySupport.java:122)
[winJava8] at org.codehaus.groovy.runtime.GroovyCategorySupport.use(GroovyCategorySupport.java:261)
[winJava8] at com.cloudbees.groovy.cps.Continuable.run0(Continuable.java:163)
[winJava8] at org.jenkinsci.plugins.workflow.cps.SandboxContinuable.access$001(SandboxContinuable.java:19)
[winJava8] at org.jenkinsci.plugins.workflow.cps.SandboxContinuable$1.call(SandboxContinuable.java:35)
[winJava8] at org.jenkinsci.plugins.workflow.cps.SandboxContinuable$1.call(SandboxContinuable.java:32)
[winJava8] at org.jenkinsci.plugins.scriptsecurity.sandbox.groovy.GroovySandbox.runInSandbox(GroovySandbox.java:108)
[winJava8] at org.jenkinsci.plugins.workflow.cps.SandboxContinuable.run0(SandboxContinuable.java:32)
[winJava8] at org.jenkinsci.plugins.workflow.cps.CpsThread.runNextChunk(CpsThread.java:174)
[winJava8] at org.jenkinsci.plugins.workflow.cps.CpsThreadGroup.run(CpsThreadGroup.java:330)
[winJava8] at org.jenkinsci.plugins.workflow.cps.CpsThreadGroup.access$100(CpsThreadGroup.java:82)
[winJava8] at org.jenkinsci.plugins.workflow.cps.CpsThreadGroup$2.call(CpsThreadGroup.java:242)
[winJava8] at org.jenkinsci.plugins.workflow.cps.CpsThreadGroup$2.call(CpsThreadGroup.java:230)
[winJava8] at org.jenkinsci.plugins.workflow.cps.CpsVmExecutorService$2.call(CpsVmExecutorService.java:64)
[winJava8] at java.util.concurrent.FutureTask.run(FutureTask.java:266)
[winJava8] at hudson.remoting.SingleLaneExecutorService$1.run(SingleLaneExecutorService.java:112)
[winJava8] at jenkins.util.ContextResettingExecutorService$1.run(ContextResettingExecutorService.java:28)
[winJava8] at java.util.concurrent.Executors$RunnableAdapter.call(Executors.java:511)
[winJava8] at java.util.concurrent.FutureTask.run(FutureTask.java:266)
[winJava8] at java.util.concurrent.ThreadPoolExecutor.runWorker(ThreadPoolExecutor.java:1149)
[winJava8] at java.util.concurrent.ThreadPoolExecutor$Worker.run(ThreadPoolExecutor.java:624)
[winJava8] at java.lang.Thread.run(Thread.java:748)
[winJava8] ERROR: [withMaven] artifactsPublisher - WARNING: Exception archiving and fingerprinting MavenArtifact{org.apache.maven.its.plugins:maven-it-plugins:xml:site:2.1-SNAPSHOT(version: 2.1-SNAPSHOT, snapshot:true)  C:\mvn-it-1.tmp\core-it-support\core-it-plugins\target\maven-it-plugins-2.1-SNAPSHOT-site.xml}, skip archiving of the artifacts
[winJava8] java.lang.IllegalArgumentException: Cannot relativize 'C:\mvn-it-1.tmp\core-it-support\core-it-plugins\target\maven-it-plugins-2.1-SNAPSHOT-site.xml' relatively to '/mvn-it-1.tmp'
[winJava8] at org.jenkinsci.plugins.pipeline.maven.util.XmlUtils.getPathInWorkspace(XmlUtils.java:319)
[winJava8] at org.jenkinsci.plugins.pipeline.maven.publishers.GeneratedArtifactsPublisher.process(GeneratedArtifactsPublisher.java:95)
[winJava8] at org.jenkinsci.plugins.pipeline.maven.MavenSpyLogProcessor.processMavenSpyLogs(MavenSpyLogProcessor.java:109)
[winJava8] at org.jenkinsci.plugins.pipeline.maven.WithMavenStepExecution$WorkspaceCleanupCallback.finished(WithMavenStepExecution.java:913)
[winJava8] at org.jenkinsci.plugins.workflow.steps.BodyExecutionCallback$TailCall.onSuccess(BodyExecutionCallback.java:114)
[winJava8] at org.jenkinsci.plugins.workflow.cps.CpsBodyExecution$SuccessAdapter.receive(CpsBodyExecution.java:362)
[winJava8] at com.cloudbees.groovy.cps.Outcome.resumeFrom(Outcome.java:73)
[winJava8] at com.cloudbees.groovy.cps.Continuable$1.call(Continuable.java:166)
[winJava8] at com.cloudbees.groovy.cps.Continuable$1.call(Continuable.java:163)
[winJava8] at org.codehaus.groovy.runtime.GroovyCategorySupport$ThreadCategoryInfo.use(GroovyCategorySupport.java:122)
[winJava8] at org.codehaus.groovy.runtime.GroovyCategorySupport.use(GroovyCategorySupport.java:261)
[winJava8] at com.cloudbees.groovy.cps.Continuable.run0(Continuable.java:163)
[winJava8] at org.jenkinsci.plugins.workflow.cps.SandboxContinuable.access$001(SandboxContinuable.java:19)
[winJava8] at org.jenkinsci.plugins.workflow.cps.SandboxContinuable$1.call(SandboxContinuable.java:35)
[winJava8] at org.jenkinsci.plugins.workflow.cps.SandboxContinuable$1.call(SandboxContinuable.java:32)
[winJava8] at org.jenkinsci.plugins.scriptsecurity.sandbox.groovy.GroovySandbox.runInSandbox(GroovySandbox.java:108)
[winJava8] at org.jenkinsci.plugins.workflow.cps.SandboxContinuable.run0(SandboxContinuable.java:32)
[winJava8] at org.jenkinsci.plugins.workflow.cps.CpsThread.runNextChunk(CpsThread.java:174)
[winJava8] at org.jenkinsci.plugins.workflow.cps.CpsThreadGroup.run(CpsThreadGroup.java:330)
[winJava8] at org.jenkinsci.plugins.workflow.cps.CpsThreadGroup.access$100(CpsThreadGroup.java:82)
[winJava8] at org.jenkinsci.plugins.workflow.cps.CpsThreadGroup$2.call(CpsThreadGroup.java:242)
[winJava8] at org.jenkinsci.plugins.workflow.cps.CpsThreadGroup$2.call(CpsThreadGroup.java:230)
[winJava8] at org.jenkinsci.plugins.workflow.cps.CpsVmExecutorService$2.call(CpsVmExecutorService.java:64)
[winJava8] at java.util.concurrent.FutureTask.run(FutureTask.java:266)
[winJava8] at hudson.remoting.SingleLaneExecutorService$1.run(SingleLaneExecutorService.java:112)
[winJava8] at jenkins.util.ContextResettingExecutorService$1.run(ContextResettingExecutorService.java:28)
[winJava8] at java.util.concurrent.Executors$RunnableAdapter.call(Executors.java:511)
[winJava8] at java.util.concurrent.FutureTask.run(FutureTask.java:266)
[winJava8] at java.util.concurrent.ThreadPoolExecutor.runWorker(ThreadPoolExecutor.java:1149)
[winJava8] at java.util.concurrent.ThreadPoolExecutor$Worker.run(ThreadPoolExecutor.java:624)
[winJava8] at java.lang.Thread.run(Thread.java:748)
[winJava8] ERROR: [withMaven] artifactsPublisher - WARNING: Exception archiving and fingerprinting MavenArtifact{org.apache.maven.its.plugins:maven-it-plugin-core-stubs:xml:site:2.1-SNAPSHOT(version: 2.1-SNAPSHOT, snapshot:true)  C:\mvn-it-1.tmp\core-it-support\core-it-plugins\maven-it-plugin-core-stubs\target\maven-it-plugin-core-stubs-2.1-SNAPSHOT-site.xml}, skip archiving of the artifacts
[winJava8] java.lang.IllegalArgumentException: Cannot relativize 'C:\mvn-it-1.tmp\core-it-support\core-it-plugins\maven-it-plugin-core-stubs\target\maven-it-plugin-core-stubs-2.1-SNAPSHOT-site.xml' relatively to '/mvn-it-1.tmp'
[winJava8] at org.jenkinsci.plugins.pipeline.maven.util.XmlUtils.getPathInWorkspace(XmlUtils.java:319)
[winJava8] at org.jenkinsci.plugins.pipeline.maven.publishers.GeneratedArtifactsPublisher.process(GeneratedArtifactsPublisher.java:95)
[winJava8] at org.jenkinsci.plugins.pipeline.maven.MavenSpyLogProcessor.processMavenSpyLogs(MavenSpyLogProcessor.java:109)
[winJava8] at org.jenkinsci.plugins.pipeline.maven.WithMavenStepExecution$WorkspaceCleanupCallback.finished(WithMavenStepExecution.java:913)
[winJava8] at org.jenkinsci.plugins.workflow.steps.BodyExecutionCallback$TailCall.onSuccess(BodyExecutionCallback.java:114)
[winJava8] at org.jenkinsci.plugins.workflow.cps.CpsBodyExecution$SuccessAdapter.receive(CpsBodyExecution.java:362)
[winJava8] at com.cloudbees.groovy.cps.Outcome.resumeFrom(Outcome.java:73)
[winJava8] at com.cloudbees.groovy.cps.Continuable$1.call(Continuable.java:166)
[winJava8] at com.cloudbees.groovy.cps.Continuable$1.call(Continuable.java:163)
[winJava8] at org.codehaus.groovy.runtime.GroovyCategorySupport$ThreadCategoryInfo.use(GroovyCategorySupport.java:122)
[winJava8] at org.codehaus.groovy.runtime.GroovyCategorySupport.use(GroovyCategorySupport.java:261)
[winJava8] at com.cloudbees.groovy.cps.Continuable.run0(Continuable.java:163)
[winJava8] at org.jenkinsci.plugins.workflow.cps.SandboxContinuable.access$001(SandboxContinuable.java:19)
[winJava8] at org.jenkinsci.plugins.workflow.cps.SandboxContinuable$1.call(SandboxContinuable.java:35)
[winJava8] at org.jenkinsci.plugins.workflow.cps.SandboxContinuable$1.call(SandboxContinuable.java:32)
[winJava8] at org.jenkinsci.plugins.scriptsecurity.sandbox.groovy.GroovySandbox.runInSandbox(GroovySandbox.java:108)
[winJava8] at org.jenkinsci.plugins.workflow.cps.SandboxContinuable.run0(SandboxContinuable.java:32)
[winJava8] at org.jenkinsci.plugins.workflow.cps.CpsThread.runNextChunk(CpsThread.java:174)
[winJava8] at org.jenkinsci.plugins.workflow.cps.CpsThreadGroup.run(CpsThreadGroup.java:330)
[winJava8] at org.jenkinsci.plugins.workflow.cps.CpsThreadGroup.access$100(CpsThreadGroup.java:82)
[winJava8] at org.jenkinsci.plugins.workflow.cps.CpsThreadGroup$2.call(CpsThreadGroup.java:242)
[winJava8] at org.jenkinsci.plugins.workflow.cps.CpsThreadGroup$2.call(CpsThreadGroup.java:230)
[winJava8] at org.jenkinsci.plugins.workflow.cps.CpsVmExecutorService$2.call(CpsVmExecutorService.java:64)
[winJava8] at java.util.concurrent.FutureTask.run(FutureTask.java:266)
[winJava8] at hudson.remoting.SingleLaneExecutorService$1.run(SingleLaneExecutorService.java:112)
[winJava8] at jenkins.util.ContextResettingExecutorService$1.run(ContextResettingExecutorService.java:28)
[winJava8] at java.util.concurrent.Executors$RunnableAdapter.call(Executors.java:511)
[winJava8] at java.util.concurrent.FutureTask.run(FutureTask.java:266)
[winJava8] at java.util.concurrent.ThreadPoolExecutor.runWorker(ThreadPoolExecutor.java:1149)
[winJava8] at java.util.concurrent.ThreadPoolExecutor$Worker.run(ThreadPoolExecutor.java:624)
[winJava8] at java.lang.Thread.run(Thread.java:748)
[winJava8] ERROR: [withMaven] artifactsPublisher - WARNING: Exception archiving and fingerprinting MavenArtifact{org.apache.maven.its:core-it-support-artifacts:zip:repo:2.1-SNAPSHOT(version: 2.1-SNAPSHOT, snapshot:true)  C:\mvn-it-1.tmp\core-it-support\core-it-support-artifacts\target\core-it-support-artifacts-2.1-SNAPSHOT-repo.zip}, skip archiving of the artifacts
[winJava8] java.lang.IllegalArgumentException: Cannot relativize 'C:\mvn-it-1.tmp\core-it-support\core-it-support-artifacts\target\core-it-support-artifacts-2.1-SNAPSHOT-repo.zip' relatively to '/mvn-it-1.tmp'
[winJava8] at org.jenkinsci.plugins.pipeline.maven.util.XmlUtils.getPathInWorkspace(XmlUtils.java:319)
[winJava8] at org.jenkinsci.plugins.pipeline.maven.publishers.GeneratedArtifactsPublisher.process(GeneratedArtifactsPublisher.java:95)
[winJava8] at org.jenkinsci.plugins.pipeline.maven.MavenSpyLogProcessor.processMavenSpyLogs(MavenSpyLogProcessor.java:109)
[winJava8] at org.jenkinsci.plugins.pipeline.maven.WithMavenStepExecution$WorkspaceCleanupCallback.finished(WithMavenStepExecution.java:913)
[winJava8] at org.jenkinsci.plugins.workflow.steps.BodyExecutionCallback$TailCall.onSuccess(BodyExecutionCallback.java:114)
[winJava8] at org.jenkinsci.plugins.workflow.cps.CpsBodyExecution$SuccessAdapter.receive(CpsBodyExecution.java:362)
[winJava8] at com.cloudbees.groovy.cps.Outcome.resumeFrom(Outcome.java:73)
[winJava8] at com.cloudbees.groovy.cps.Continuable$1.call(Continuable.java:166)
[winJava8] at com.cloudbees.groovy.cps.Continuable$1.call(Continuable.java:163)
[winJava8] at org.codehaus.groovy.runtime.GroovyCategorySupport$ThreadCategoryInfo.use(GroovyCategorySupport.java:122)
[winJava8] at org.codehaus.groovy.runtime.GroovyCategorySupport.use(GroovyCategorySupport.java:261)
[winJava8] at com.cloudbees.groovy.cps.Continuable.run0(Continuable.java:163)
[winJava8] at org.jenkinsci.plugins.workflow.cps.SandboxContinuable.access$001(SandboxContinuable.java:19)
[winJava8] at org.jenkinsci.plugins.workflow.cps.SandboxContinuable$1.call(SandboxContinuable.java:35)
[winJava8] at org.jenkinsci.plugins.workflow.cps.SandboxContinuable$1.call(SandboxContinuable.java:32)
[winJava8] at org.jenkinsci.plugins.scriptsecurity.sandbox.groovy.GroovySandbox.runInSandbox(GroovySandbox.java:108)
[winJava8] at org.jenkinsci.plugins.workflow.cps.SandboxContinuable.run0(SandboxContinuable.java:32)
[winJava8] at org.jenkinsci.plugins.workflow.cps.CpsThread.runNextChunk(CpsThread.java:174)
[winJava8] at org.jenkinsci.plugins.workflow.cps.CpsThreadGroup.run(CpsThreadGroup.java:330)
[winJava8] at org.jenkinsci.plugins.workflow.cps.CpsThreadGroup.access$100(CpsThreadGroup.java:82)
[winJava8] at org.jenkinsci.plugins.workflow.cps.CpsThreadGroup$2.call(CpsThreadGroup.java:242)
[winJava8] at org.jenkinsci.plugins.workflow.cps.CpsThreadGroup$2.call(CpsThreadGroup.java:230)
[winJava8] at org.jenkinsci.plugins.workflow.cps.CpsVmExecutorService$2.call(CpsVmExecutorService.java:64)
[winJava8] at java.util.concurrent.FutureTask.run(FutureTask.java:266)
[winJava8] at hudson.remoting.SingleLaneExecutorService$1.run(SingleLaneExecutorService.java:112)
[winJava8] at jenkins.util.ContextResettingExecutorService$1.run(ContextResettingExecutorService.java:28)
[winJava8] at java.util.concurrent.Executors$RunnableAdapter.call(Executors.java:511)
[winJava8] at java.util.concurrent.FutureTask.run(FutureTask.java:266)
[winJava8] at java.util.concurrent.ThreadPoolExecutor.runWorker(ThreadPoolExecutor.java:1149)
[winJava8] at java.util.concurrent.ThreadPoolExecutor$Worker.run(ThreadPoolExecutor.java:624)
[winJava8] at java.lang.Thread.run(Thread.java:748)
[winJava8] ERROR: [withMaven] artifactsPublisher - WARNING: Exception archiving and fingerprinting MavenArtifact{org.apache.maven.its:core-it-suite:test-jar:tests:2.1-SNAPSHOT(version: 2.1-SNAPSHOT, snapshot:true)  C:\mvn-it-1.tmp\core-it-suite\target\core-it-suite-2.1-SNAPSHOT-tests.jar}, skip archiving of the artifacts
[winJava8] java.lang.IllegalArgumentException: Cannot relativize 'C:\mvn-it-1.tmp\core-it-suite\target\core-it-suite-2.1-SNAPSHOT-tests.jar' relatively to '/mvn-it-1.tmp'
[winJava8] at org.jenkinsci.plugins.pipeline.maven.util.XmlUtils.getPathInWorkspace(XmlUtils.java:319)
[winJava8] at org.jenkinsci.plugins.pipeline.maven.publishers.GeneratedArtifactsPublisher.process(GeneratedArtifactsPublisher.java:95)
[winJava8] at org.jenkinsci.plugins.pipeline.maven.MavenSpyLogProcessor.processMavenSpyLogs(MavenSpyLogProcessor.java:109)
[winJava8] at org.jenkinsci.plugins.pipeline.maven.WithMavenStepExecution$WorkspaceCleanupCallback.finished(WithMavenStepExecution.java:913)
[winJava8] at org.jenkinsci.plugins.workflow.steps.BodyExecutionCallback$TailCall.onSuccess(BodyExecutionCallback.java:114)
[winJava8] at org.jenkinsci.plugins.workflow.cps.CpsBodyExecution$SuccessAdapter.receive(CpsBodyExecution.java:362)
[winJava8] at com.cloudbees.groovy.cps.Outcome.resumeFrom(Outcome.java:73)
[winJava8] at com.cloudbees.groovy.cps.Continuable$1.call(Continuable.java:166)
[winJava8] at com.cloudbees.groovy.cps.Continuable$1.call(Continuable.java:163)
[winJava8] at org.codehaus.groovy.runtime.GroovyCategorySupport$ThreadCategoryInfo.use(GroovyCategorySupport.java:122)
[winJava8] at org.codehaus.groovy.runtime.GroovyCategorySupport.use(GroovyCategorySupport.java:261)
[winJava8] at com.cloudbees.groovy.cps.Continuable.run0(Continuable.java:163)
[winJava8] at org.jenkinsci.plugins.workflow.cps.SandboxContinuable.access$001(SandboxContinuable.java:19)
[winJava8] at org.jenkinsci.plugins.workflow.cps.SandboxContinuable$1.call(SandboxContinuable.java:35)
[winJava8] at org.jenkinsci.plugins.workflow.cps.SandboxContinuable$1.call(SandboxContinuable.java:32)
[winJava8] at org.jenkinsci.plugins.scriptsecurity.sandbox.groovy.GroovySandbox.runInSandbox(GroovySandbox.java:108)
[winJava8] at org.jenkinsci.plugins.workflow.cps.SandboxContinuable.run0(SandboxContinuable.java:32)
[winJava8] at org.jenkinsci.plugins.workflow.cps.CpsThread.runNextChunk(CpsThread.java:174)
[winJava8] at org.jenkinsci.plugins.workflow.cps.CpsThreadGroup.run(CpsThreadGroup.java:330)
[winJava8] at org.jenkinsci.plugins.workflow.cps.CpsThreadGroup.access$100(CpsThreadGroup.java:82)
[winJava8] at org.jenkinsci.plugins.workflow.cps.CpsThreadGroup$2.call(CpsThreadGroup.java:242)
[winJava8] at org.jenkinsci.plugins.workflow.cps.CpsThreadGroup$2.call(CpsThreadGroup.java:230)
[winJava8] at org.jenkinsci.plugins.workflow.cps.CpsVmExecutorService$2.call(CpsVmExecutorService.java:64)
[winJava8] at java.util.concurrent.FutureTask.run(FutureTask.java:266)
[winJava8] at hudson.remoting.SingleLaneExecutorService$1.run(SingleLaneExecutorService.java:112)
[winJava8] at jenkins.util.ContextResettingExecutorService$1.run(ContextResettingExecutorService.java:28)
[winJava8] at java.util.concurrent.Executors$RunnableAdapter.call(Executors.java:511)
[winJava8] at java.util.concurrent.FutureTask.run(FutureTask.java:266)
[winJava8] at java.util.concurrent.ThreadPoolExecutor.runWorker(ThreadPoolExecutor.java:1149)
[winJava8] at java.util.concurrent.ThreadPoolExecutor$Worker.run(ThreadPoolExecutor.java:624)
[winJava8] at java.lang.Thread.run(Thread.java:748)
[winJava8] ERROR: [withMaven] WARNING Exception executing Maven reporter 'Junit Publisher' / org.jenkinsci.plugins.pipeline.maven.publishers.JunitTestsPublisher. Please report a bug associated for the component 'pipeline-maven-plugin' at https://issues.jenkins-ci.org 
[winJava8] java.lang.IllegalArgumentException: Cannot relativize 'C:\mvn-it-1.tmp\core-it-support\core-it-plugins\maven-it-plugin-active-collection\target/surefire-reports' relatively to '/mvn-it-1.tmp'
[winJava8] at org.jenkinsci.plugins.pipeline.maven.util.XmlUtils.getPathInWorkspace(XmlUtils.java:319)
[winJava8] at org.jenkinsci.plugins.pipeline.maven.publishers.JunitTestsPublisher.executeReporter(JunitTestsPublisher.java:235)
[winJava8] at org.jenkinsci.plugins.pipeline.maven.publishers.JunitTestsPublisher.process(JunitTestsPublisher.java:181)
[winJava8] at org.jenkinsci.plugins.pipeline.maven.MavenSpyLogProcessor.processMavenSpyLogs(MavenSpyLogProcessor.java:109)
[winJava8] at org.jenkinsci.plugins.pipeline.maven.WithMavenStepExecution$WorkspaceCleanupCallback.finished(WithMavenStepExecution.java:913)
[winJava8] at org.jenkinsci.plugins.workflow.steps.BodyExecutionCallback$TailCall.onSuccess(BodyExecutionCallback.java:114)
[winJava8] at org.jenkinsci.plugins.workflow.cps.CpsBodyExecution$SuccessAdapter.receive(CpsBodyExecution.java:362)
[winJava8] at com.cloudbees.groovy.cps.Outcome.resumeFrom(Outcome.java:73)
[winJava8] at com.cloudbees.groovy.cps.Continuable$1.call(Continuable.java:166)
[winJava8] at com.cloudbees.groovy.cps.Continuable$1.call(Continuable.java:163)
[winJava8] at org.codehaus.groovy.runtime.GroovyCategorySupport$ThreadCategoryInfo.use(GroovyCategorySupport.java:122)
[winJava8] at org.codehaus.groovy.runtime.GroovyCategorySupport.use(GroovyCategorySupport.java:261)
[winJava8] at com.cloudbees.groovy.cps.Continuable.run0(Continuable.java:163)
[winJava8] at org.jenkinsci.plugins.workflow.cps.SandboxContinuable.access$001(SandboxContinuable.java:19)
[winJava8] at org.jenkinsci.plugins.workflow.cps.SandboxContinuable$1.call(SandboxContinuable.java:35)
[winJava8] at org.jenkinsci.plugins.workflow.cps.SandboxContinuable$1.call(SandboxContinuable.java:32)
[winJava8] at org.jenkinsci.plugins.scriptsecurity.sandbox.groovy.GroovySandbox.runInSandbox(GroovySandbox.java:108)
[winJava8] at org.jenkinsci.plugins.workflow.cps.SandboxContinuable.run0(SandboxContinuable.java:32)
[winJava8] at org.jenkinsci.plugins.workflow.cps.CpsThread.runNextChunk(CpsThread.java:174)
[winJava8] at org.jenkinsci.plugins.workflow.cps.CpsThreadGroup.run(CpsThreadGroup.java:330)
[winJava8] at org.jenkinsci.plugins.workflow.cps.CpsThreadGroup.access$100(CpsThreadGroup.java:82)
[winJava8] at org.jenkinsci.plugins.workflow.cps.CpsThreadGroup$2.call(CpsThreadGroup.java:242)
[winJava8] at org.jenkinsci.plugins.workflow.cps.CpsThreadGroup$2.call(CpsThreadGroup.java:230)
[winJava8] at org.jenkinsci.plugins.workflow.cps.CpsVmExecutorService$2.call(CpsVmExecutorService.java:64)
[winJava8] at java.util.concurrent.FutureTask.run(FutureTask.java:266)
[winJava8] at hudson.remoting.SingleLaneExecutorService$1.run(SingleLaneExecutorService.java:112)
[winJava8] at jenkins.util.ContextResettingExecutorService$1.run(ContextResettingExecutorService.java:28)
[winJava8] at java.util.concurrent.Executors$RunnableAdapter.call(Executors.java:511)
[winJava8] at java.util.concurrent.FutureTask.run(FutureTask.java:266)
[winJava8] at java.util.concurrent.ThreadPoolExecutor.runWorker(ThreadPoolExecutor.java:1149)
[winJava8] at java.util.concurrent.ThreadPoolExecutor$Worker.run(ThreadPoolExecutor.java:624)
[winJava8] at java.lang.Thread.run(Thread.java:748)
[winJava8] ERROR: [withMaven] WARNING Exception executing Maven reporter 'Open Task Scanner Publisher' / org.jenkinsci.plugins.pipeline.maven.publishers.TasksScannerPublisher. Please report a bug associated for the component 'pipeline-maven-plugin' at https://issues.jenkins-ci.org 
[winJava8] java.lang.IllegalArgumentException: Cannot relativize 'C:\mvn-it-1.tmp\src\main\java' relatively to '/mvn-it-1.tmp'
[winJava8] at org.jenkinsci.plugins.pipeline.maven.util.XmlUtils.getPathInWorkspace(XmlUtils.java:319)
[winJava8] at org.jenkinsci.plugins.pipeline.maven.publishers.TasksScannerPublisher.process(TasksScannerPublisher.java:128)
[winJava8] at org.jenkinsci.plugins.pipeline.maven.MavenSpyLogProcessor.processMavenSpyLogs(MavenSpyLogProcessor.java:109)
[winJava8] at org.jenkinsci.plugins.pipeline.maven.WithMavenStepExecution$WorkspaceCleanupCallback.finished(WithMavenStepExecution.java:913)
[winJava8] at org.jenkinsci.plugins.workflow.steps.BodyExecutionCallback$TailCall.onSuccess(BodyExecutionCallback.java:114)
[winJava8] at org.jenkinsci.plugins.workflow.cps.CpsBodyExecution$SuccessAdapter.receive(CpsBodyExecution.java:362)
[winJava8] at com.cloudbees.groovy.cps.Outcome.resumeFrom(Outcome.java:73)
[winJava8] at com.cloudbees.groovy.cps.Continuable$1.call(Continuable.java:166)
[winJava8] at com.cloudbees.groovy.cps.Continuable$1.call(Continuable.java:163)
[winJava8] at org.codehaus.groovy.runtime.GroovyCategorySupport$ThreadCategoryInfo.use(GroovyCategorySupport.java:122)
[winJava8] at org.codehaus.groovy.runtime.GroovyCategorySupport.use(GroovyCategorySupport.java:261)
[winJava8] at com.cloudbees.groovy.cps.Continuable.run0(Continuable.java:163)
[winJava8] at org.jenkinsci.plugins.workflow.cps.SandboxContinuable.access$001(SandboxContinuable.java:19)
[winJava8] at org.jenkinsci.plugins.workflow.cps.SandboxContinuable$1.call(SandboxContinuable.java:35)
[winJava8] at org.jenkinsci.plugins.workflow.cps.SandboxContinuable$1.call(SandboxContinuable.java:32)
[winJava8] at org.jenkinsci.plugins.scriptsecurity.sandbox.groovy.GroovySandbox.runInSandbox(GroovySandbox.java:108)
[winJava8] at org.jenkinsci.plugins.workflow.cps.SandboxContinuable.run0(SandboxContinuable.java:32)
[winJava8] at org.jenkinsci.plugins.workflow.cps.CpsThread.runNextChunk(CpsThread.java:174)
[winJava8] at org.jenkinsci.plugins.workflow.cps.CpsThreadGroup.run(CpsThreadGroup.java:330)
[winJava8] at org.jenkinsci.plugins.workflow.cps.CpsThreadGroup.access$100(CpsThreadGroup.java:82)
[winJava8] at org.jenkinsci.plugins.workflow.cps.CpsThreadGroup$2.call(CpsThreadGroup.java:242)
[winJava8] at org.jenkinsci.plugins.workflow.cps.CpsThreadGroup$2.call(CpsThreadGroup.java:230)
[winJava8] at org.jenkinsci.plugins.workflow.cps.CpsVmExecutorService$2.call(CpsVmExecutorService.java:64)
[winJava8] at java.util.concurrent.FutureTask.run(FutureTask.java:266)
[winJava8] at hudson.remoting.SingleLaneExecutorService$1.run(SingleLaneExecutorService.java:112)
[winJava8] at jenkins.util.ContextResettingExecutorService$1.run(ContextResettingExecutorService.java:28)
[winJava8] at java.util.concurrent.Executors$RunnableAdapter.call(Executors.java:511)
[winJava8] at java.util.concurrent.FutureTask.run(FutureTask.java:266)
[winJava8] at java.util.concurrent.ThreadPoolExecutor.runWorker(ThreadPoolExecutor.java:1149)
[winJava8] at java.util.concurrent.ThreadPoolExecutor$Worker.run(ThreadPoolExecutor.java:624)
[winJava8] at java.lang.Thread.run(Thread.java:748)
[Pipeline] [winJava8] // withMaven
[Pipeline] [winJava8] deleteDir
[Pipeline] [winJava8] }
[Pipeline] [winJava8] // dir
[Pipeline] [winJava8] }
[Pipeline] [winJava8] // stage
[Pipeline] [winJava8] }
[Pipeline] [winJava8] // node
[Pipeline] [winJava8] }
[Pipeline] // parallel
[Pipeline] stage
[Pipeline] { (Notifications)
[Pipeline] echo
Build result: UNSTABLE
[Pipeline] jiraIssueSelector
[Pipeline] jiraComment
[Pipeline] emailext
Reply | Threaded
Open this post in threaded view
|

Build unstable in Jenkins: maven-3.x-jenkinsfile » MNG-6308_display_packaging #10

Apache Jenkins Server-2
See https://builds.apache.org/job/maven-3.x-jenkinsfile/job/MNG-6308_display_packaging/10/

Changes:

* added space around packaging
* [MNG-6308] make IT more tolerant on format change

2 tests failed.
FAILED:  org.apache.maven.it.MavenITmng4387QuietLoggingTest.testit

Error Message:
expected:<[]> but was:<[[jenkins-maven-event-spy] INFO Jenkins Maven Event Spy is disabled]>

Stack Trace:
junit.framework.AssertionFailedError: expected:<[]> but was:<[[jenkins-maven-event-spy] INFO Jenkins Maven Event Spy is disabled]>
        at junit.framework.Assert.fail(Assert.java:47)
        at junit.framework.Assert.failNotEquals(Assert.java:283)
        at junit.framework.Assert.assertEquals(Assert.java:64)
        at junit.framework.Assert.assertEquals(Assert.java:71)
        at org.apache.maven.it.MavenITmng4387QuietLoggingTest.testit(MavenITmng4387QuietLoggingTest.java:71)


FAILED:  org.apache.maven.it.MavenITmng4387QuietLoggingTest.testit

Error Message:
expected:<[]> but was:<[[jenkins-maven-event-spy] INFO Jenkins Maven Event Spy is disabled]>

Stack Trace:
junit.framework.AssertionFailedError: expected:<[]> but was:<[[jenkins-maven-event-spy] INFO Jenkins Maven Event Spy is disabled]>
        at junit.framework.Assert.fail(Assert.java:47)
        at junit.framework.Assert.failNotEquals(Assert.java:283)
        at junit.framework.Assert.assertEquals(Assert.java:64)
        at junit.framework.Assert.assertEquals(Assert.java:71)
        at org.apache.maven.it.MavenITmng4387QuietLoggingTest.testit(MavenITmng4387QuietLoggingTest.java:71)




Build log:
[...truncated 6.00 MB...]
[winJava8] ERROR: [withMaven] artifactsPublisher - WARNING: Exception archiving and fingerprinting MavenArtifact{org.apache.maven.its:core-it-support:xml:site:2.1-SNAPSHOT(version: 2.1-SNAPSHOT, snapshot:true)  C:\mvn-it-1.tmp\core-it-support\target\core-it-support-2.1-SNAPSHOT-site.xml}, skip archiving of the artifacts
[winJava8] java.lang.IllegalArgumentException: Cannot relativize 'C:\mvn-it-1.tmp\core-it-support\target\core-it-support-2.1-SNAPSHOT-site.xml' relatively to '/mvn-it-1.tmp'
[winJava8] at org.jenkinsci.plugins.pipeline.maven.util.XmlUtils.getPathInWorkspace(XmlUtils.java:319)
[winJava8] at org.jenkinsci.plugins.pipeline.maven.publishers.GeneratedArtifactsPublisher.process(GeneratedArtifactsPublisher.java:95)
[winJava8] at org.jenkinsci.plugins.pipeline.maven.MavenSpyLogProcessor.processMavenSpyLogs(MavenSpyLogProcessor.java:109)
[winJava8] at org.jenkinsci.plugins.pipeline.maven.WithMavenStepExecution$WorkspaceCleanupCallback.finished(WithMavenStepExecution.java:913)
[winJava8] at org.jenkinsci.plugins.workflow.steps.BodyExecutionCallback$TailCall.onSuccess(BodyExecutionCallback.java:114)
[winJava8] at org.jenkinsci.plugins.workflow.cps.CpsBodyExecution$SuccessAdapter.receive(CpsBodyExecution.java:362)
[winJava8] at com.cloudbees.groovy.cps.Outcome.resumeFrom(Outcome.java:73)
[winJava8] at com.cloudbees.groovy.cps.Continuable$1.call(Continuable.java:166)
[winJava8] at com.cloudbees.groovy.cps.Continuable$1.call(Continuable.java:163)
[winJava8] at org.codehaus.groovy.runtime.GroovyCategorySupport$ThreadCategoryInfo.use(GroovyCategorySupport.java:122)
[winJava8] at org.codehaus.groovy.runtime.GroovyCategorySupport.use(GroovyCategorySupport.java:261)
[winJava8] at com.cloudbees.groovy.cps.Continuable.run0(Continuable.java:163)
[winJava8] at org.jenkinsci.plugins.workflow.cps.SandboxContinuable.access$001(SandboxContinuable.java:19)
[winJava8] at org.jenkinsci.plugins.workflow.cps.SandboxContinuable$1.call(SandboxContinuable.java:35)
[winJava8] at org.jenkinsci.plugins.workflow.cps.SandboxContinuable$1.call(SandboxContinuable.java:32)
[winJava8] at org.jenkinsci.plugins.scriptsecurity.sandbox.groovy.GroovySandbox.runInSandbox(GroovySandbox.java:108)
[winJava8] at org.jenkinsci.plugins.workflow.cps.SandboxContinuable.run0(SandboxContinuable.java:32)
[winJava8] at org.jenkinsci.plugins.workflow.cps.CpsThread.runNextChunk(CpsThread.java:174)
[winJava8] at org.jenkinsci.plugins.workflow.cps.CpsThreadGroup.run(CpsThreadGroup.java:330)
[winJava8] at org.jenkinsci.plugins.workflow.cps.CpsThreadGroup.access$100(CpsThreadGroup.java:82)
[winJava8] at org.jenkinsci.plugins.workflow.cps.CpsThreadGroup$2.call(CpsThreadGroup.java:242)
[winJava8] at org.jenkinsci.plugins.workflow.cps.CpsThreadGroup$2.call(CpsThreadGroup.java:230)
[winJava8] at org.jenkinsci.plugins.workflow.cps.CpsVmExecutorService$2.call(CpsVmExecutorService.java:64)
[winJava8] at java.util.concurrent.FutureTask.run(FutureTask.java:266)
[winJava8] at hudson.remoting.SingleLaneExecutorService$1.run(SingleLaneExecutorService.java:112)
[winJava8] at jenkins.util.ContextResettingExecutorService$1.run(ContextResettingExecutorService.java:28)
[winJava8] at java.util.concurrent.Executors$RunnableAdapter.call(Executors.java:511)
[winJava8] at java.util.concurrent.FutureTask.run(FutureTask.java:266)
[winJava8] at java.util.concurrent.ThreadPoolExecutor.runWorker(ThreadPoolExecutor.java:1149)
[winJava8] at java.util.concurrent.ThreadPoolExecutor$Worker.run(ThreadPoolExecutor.java:624)
[winJava8] at java.lang.Thread.run(Thread.java:748)
[winJava8] ERROR: [withMaven] artifactsPublisher - WARNING: Exception archiving and fingerprinting MavenArtifact{org.apache.maven.its.plugins:maven-it-plugins:xml:site:2.1-SNAPSHOT(version: 2.1-SNAPSHOT, snapshot:true)  C:\mvn-it-1.tmp\core-it-support\core-it-plugins\target\maven-it-plugins-2.1-SNAPSHOT-site.xml}, skip archiving of the artifacts
[winJava8] java.lang.IllegalArgumentException: Cannot relativize 'C:\mvn-it-1.tmp\core-it-support\core-it-plugins\target\maven-it-plugins-2.1-SNAPSHOT-site.xml' relatively to '/mvn-it-1.tmp'
[winJava8] at org.jenkinsci.plugins.pipeline.maven.util.XmlUtils.getPathInWorkspace(XmlUtils.java:319)
[winJava8] at org.jenkinsci.plugins.pipeline.maven.publishers.GeneratedArtifactsPublisher.process(GeneratedArtifactsPublisher.java:95)
[winJava8] at org.jenkinsci.plugins.pipeline.maven.MavenSpyLogProcessor.processMavenSpyLogs(MavenSpyLogProcessor.java:109)
[winJava8] at org.jenkinsci.plugins.pipeline.maven.WithMavenStepExecution$WorkspaceCleanupCallback.finished(WithMavenStepExecution.java:913)
[winJava8] at org.jenkinsci.plugins.workflow.steps.BodyExecutionCallback$TailCall.onSuccess(BodyExecutionCallback.java:114)
[winJava8] at org.jenkinsci.plugins.workflow.cps.CpsBodyExecution$SuccessAdapter.receive(CpsBodyExecution.java:362)
[winJava8] at com.cloudbees.groovy.cps.Outcome.resumeFrom(Outcome.java:73)
[winJava8] at com.cloudbees.groovy.cps.Continuable$1.call(Continuable.java:166)
[winJava8] at com.cloudbees.groovy.cps.Continuable$1.call(Continuable.java:163)
[winJava8] at org.codehaus.groovy.runtime.GroovyCategorySupport$ThreadCategoryInfo.use(GroovyCategorySupport.java:122)
[winJava8] at org.codehaus.groovy.runtime.GroovyCategorySupport.use(GroovyCategorySupport.java:261)
[winJava8] at com.cloudbees.groovy.cps.Continuable.run0(Continuable.java:163)
[winJava8] at org.jenkinsci.plugins.workflow.cps.SandboxContinuable.access$001(SandboxContinuable.java:19)
[winJava8] at org.jenkinsci.plugins.workflow.cps.SandboxContinuable$1.call(SandboxContinuable.java:35)
[winJava8] at org.jenkinsci.plugins.workflow.cps.SandboxContinuable$1.call(SandboxContinuable.java:32)
[winJava8] at org.jenkinsci.plugins.scriptsecurity.sandbox.groovy.GroovySandbox.runInSandbox(GroovySandbox.java:108)
[winJava8] at org.jenkinsci.plugins.workflow.cps.SandboxContinuable.run0(SandboxContinuable.java:32)
[winJava8] at org.jenkinsci.plugins.workflow.cps.CpsThread.runNextChunk(CpsThread.java:174)
[winJava8] at org.jenkinsci.plugins.workflow.cps.CpsThreadGroup.run(CpsThreadGroup.java:330)
[winJava8] at org.jenkinsci.plugins.workflow.cps.CpsThreadGroup.access$100(CpsThreadGroup.java:82)
[winJava8] at org.jenkinsci.plugins.workflow.cps.CpsThreadGroup$2.call(CpsThreadGroup.java:242)
[winJava8] at org.jenkinsci.plugins.workflow.cps.CpsThreadGroup$2.call(CpsThreadGroup.java:230)
[winJava8] at org.jenkinsci.plugins.workflow.cps.CpsVmExecutorService$2.call(CpsVmExecutorService.java:64)
[winJava8] at java.util.concurrent.FutureTask.run(FutureTask.java:266)
[winJava8] at hudson.remoting.SingleLaneExecutorService$1.run(SingleLaneExecutorService.java:112)
[winJava8] at jenkins.util.ContextResettingExecutorService$1.run(ContextResettingExecutorService.java:28)
[winJava8] at java.util.concurrent.Executors$RunnableAdapter.call(Executors.java:511)
[winJava8] at java.util.concurrent.FutureTask.run(FutureTask.java:266)
[winJava8] at java.util.concurrent.ThreadPoolExecutor.runWorker(ThreadPoolExecutor.java:1149)
[winJava8] at java.util.concurrent.ThreadPoolExecutor$Worker.run(ThreadPoolExecutor.java:624)
[winJava8] at java.lang.Thread.run(Thread.java:748)
[winJava8] ERROR: [withMaven] artifactsPublisher - WARNING: Exception archiving and fingerprinting MavenArtifact{org.apache.maven.its.plugins:maven-it-plugin-core-stubs:xml:site:2.1-SNAPSHOT(version: 2.1-SNAPSHOT, snapshot:true)  C:\mvn-it-1.tmp\core-it-support\core-it-plugins\maven-it-plugin-core-stubs\target\maven-it-plugin-core-stubs-2.1-SNAPSHOT-site.xml}, skip archiving of the artifacts
[winJava8] java.lang.IllegalArgumentException: Cannot relativize 'C:\mvn-it-1.tmp\core-it-support\core-it-plugins\maven-it-plugin-core-stubs\target\maven-it-plugin-core-stubs-2.1-SNAPSHOT-site.xml' relatively to '/mvn-it-1.tmp'
[winJava8] at org.jenkinsci.plugins.pipeline.maven.util.XmlUtils.getPathInWorkspace(XmlUtils.java:319)
[winJava8] at org.jenkinsci.plugins.pipeline.maven.publishers.GeneratedArtifactsPublisher.process(GeneratedArtifactsPublisher.java:95)
[winJava8] at org.jenkinsci.plugins.pipeline.maven.MavenSpyLogProcessor.processMavenSpyLogs(MavenSpyLogProcessor.java:109)
[winJava8] at org.jenkinsci.plugins.pipeline.maven.WithMavenStepExecution$WorkspaceCleanupCallback.finished(WithMavenStepExecution.java:913)
[winJava8] at org.jenkinsci.plugins.workflow.steps.BodyExecutionCallback$TailCall.onSuccess(BodyExecutionCallback.java:114)
[winJava8] at org.jenkinsci.plugins.workflow.cps.CpsBodyExecution$SuccessAdapter.receive(CpsBodyExecution.java:362)
[winJava8] at com.cloudbees.groovy.cps.Outcome.resumeFrom(Outcome.java:73)
[winJava8] at com.cloudbees.groovy.cps.Continuable$1.call(Continuable.java:166)
[winJava8] at com.cloudbees.groovy.cps.Continuable$1.call(Continuable.java:163)
[winJava8] at org.codehaus.groovy.runtime.GroovyCategorySupport$ThreadCategoryInfo.use(GroovyCategorySupport.java:122)
[winJava8] at org.codehaus.groovy.runtime.GroovyCategorySupport.use(GroovyCategorySupport.java:261)
[winJava8] at com.cloudbees.groovy.cps.Continuable.run0(Continuable.java:163)
[winJava8] at org.jenkinsci.plugins.workflow.cps.SandboxContinuable.access$001(SandboxContinuable.java:19)
[winJava8] at org.jenkinsci.plugins.workflow.cps.SandboxContinuable$1.call(SandboxContinuable.java:35)
[winJava8] at org.jenkinsci.plugins.workflow.cps.SandboxContinuable$1.call(SandboxContinuable.java:32)
[winJava8] at org.jenkinsci.plugins.scriptsecurity.sandbox.groovy.GroovySandbox.runInSandbox(GroovySandbox.java:108)
[winJava8] at org.jenkinsci.plugins.workflow.cps.SandboxContinuable.run0(SandboxContinuable.java:32)
[winJava8] at org.jenkinsci.plugins.workflow.cps.CpsThread.runNextChunk(CpsThread.java:174)
[winJava8] at org.jenkinsci.plugins.workflow.cps.CpsThreadGroup.run(CpsThreadGroup.java:330)
[winJava8] at org.jenkinsci.plugins.workflow.cps.CpsThreadGroup.access$100(CpsThreadGroup.java:82)
[winJava8] at org.jenkinsci.plugins.workflow.cps.CpsThreadGroup$2.call(CpsThreadGroup.java:242)
[winJava8] at org.jenkinsci.plugins.workflow.cps.CpsThreadGroup$2.call(CpsThreadGroup.java:230)
[winJava8] at org.jenkinsci.plugins.workflow.cps.CpsVmExecutorService$2.call(CpsVmExecutorService.java:64)
[winJava8] at java.util.concurrent.FutureTask.run(FutureTask.java:266)
[winJava8] at hudson.remoting.SingleLaneExecutorService$1.run(SingleLaneExecutorService.java:112)
[winJava8] at jenkins.util.ContextResettingExecutorService$1.run(ContextResettingExecutorService.java:28)
[winJava8] at java.util.concurrent.Executors$RunnableAdapter.call(Executors.java:511)
[winJava8] at java.util.concurrent.FutureTask.run(FutureTask.java:266)
[winJava8] at java.util.concurrent.ThreadPoolExecutor.runWorker(ThreadPoolExecutor.java:1149)
[winJava8] at java.util.concurrent.ThreadPoolExecutor$Worker.run(ThreadPoolExecutor.java:624)
[winJava8] at java.lang.Thread.run(Thread.java:748)
[winJava8] ERROR: [withMaven] artifactsPublisher - WARNING: Exception archiving and fingerprinting MavenArtifact{org.apache.maven.its:core-it-support-artifacts:zip:repo:2.1-SNAPSHOT(version: 2.1-SNAPSHOT, snapshot:true)  C:\mvn-it-1.tmp\core-it-support\core-it-support-artifacts\target\core-it-support-artifacts-2.1-SNAPSHOT-repo.zip}, skip archiving of the artifacts
[winJava8] java.lang.IllegalArgumentException: Cannot relativize 'C:\mvn-it-1.tmp\core-it-support\core-it-support-artifacts\target\core-it-support-artifacts-2.1-SNAPSHOT-repo.zip' relatively to '/mvn-it-1.tmp'
[winJava8] at org.jenkinsci.plugins.pipeline.maven.util.XmlUtils.getPathInWorkspace(XmlUtils.java:319)
[winJava8] at org.jenkinsci.plugins.pipeline.maven.publishers.GeneratedArtifactsPublisher.process(GeneratedArtifactsPublisher.java:95)
[winJava8] at org.jenkinsci.plugins.pipeline.maven.MavenSpyLogProcessor.processMavenSpyLogs(MavenSpyLogProcessor.java:109)
[winJava8] at org.jenkinsci.plugins.pipeline.maven.WithMavenStepExecution$WorkspaceCleanupCallback.finished(WithMavenStepExecution.java:913)
[winJava8] at org.jenkinsci.plugins.workflow.steps.BodyExecutionCallback$TailCall.onSuccess(BodyExecutionCallback.java:114)
[winJava8] at org.jenkinsci.plugins.workflow.cps.CpsBodyExecution$SuccessAdapter.receive(CpsBodyExecution.java:362)
[winJava8] at com.cloudbees.groovy.cps.Outcome.resumeFrom(Outcome.java:73)
[winJava8] at com.cloudbees.groovy.cps.Continuable$1.call(Continuable.java:166)
[winJava8] at com.cloudbees.groovy.cps.Continuable$1.call(Continuable.java:163)
[winJava8] at org.codehaus.groovy.runtime.GroovyCategorySupport$ThreadCategoryInfo.use(GroovyCategorySupport.java:122)
[winJava8] at org.codehaus.groovy.runtime.GroovyCategorySupport.use(GroovyCategorySupport.java:261)
[winJava8] at com.cloudbees.groovy.cps.Continuable.run0(Continuable.java:163)
[winJava8] at org.jenkinsci.plugins.workflow.cps.SandboxContinuable.access$001(SandboxContinuable.java:19)
[winJava8] at org.jenkinsci.plugins.workflow.cps.SandboxContinuable$1.call(SandboxContinuable.java:35)
[winJava8] at org.jenkinsci.plugins.workflow.cps.SandboxContinuable$1.call(SandboxContinuable.java:32)
[winJava8] at org.jenkinsci.plugins.scriptsecurity.sandbox.groovy.GroovySandbox.runInSandbox(GroovySandbox.java:108)
[winJava8] at org.jenkinsci.plugins.workflow.cps.SandboxContinuable.run0(SandboxContinuable.java:32)
[winJava8] at org.jenkinsci.plugins.workflow.cps.CpsThread.runNextChunk(CpsThread.java:174)
[winJava8] at org.jenkinsci.plugins.workflow.cps.CpsThreadGroup.run(CpsThreadGroup.java:330)
[winJava8] at org.jenkinsci.plugins.workflow.cps.CpsThreadGroup.access$100(CpsThreadGroup.java:82)
[winJava8] at org.jenkinsci.plugins.workflow.cps.CpsThreadGroup$2.call(CpsThreadGroup.java:242)
[winJava8] at org.jenkinsci.plugins.workflow.cps.CpsThreadGroup$2.call(CpsThreadGroup.java:230)
[winJava8] at org.jenkinsci.plugins.workflow.cps.CpsVmExecutorService$2.call(CpsVmExecutorService.java:64)
[winJava8] at java.util.concurrent.FutureTask.run(FutureTask.java:266)
[winJava8] at hudson.remoting.SingleLaneExecutorService$1.run(SingleLaneExecutorService.java:112)
[winJava8] at jenkins.util.ContextResettingExecutorService$1.run(ContextResettingExecutorService.java:28)
[winJava8] at java.util.concurrent.Executors$RunnableAdapter.call(Executors.java:511)
[winJava8] at java.util.concurrent.FutureTask.run(FutureTask.java:266)
[winJava8] at java.util.concurrent.ThreadPoolExecutor.runWorker(ThreadPoolExecutor.java:1149)
[winJava8] at java.util.concurrent.ThreadPoolExecutor$Worker.run(ThreadPoolExecutor.java:624)
[winJava8] at java.lang.Thread.run(Thread.java:748)
[winJava8] ERROR: [withMaven] artifactsPublisher - WARNING: Exception archiving and fingerprinting MavenArtifact{org.apache.maven.its:core-it-suite:test-jar:tests:2.1-SNAPSHOT(version: 2.1-SNAPSHOT, snapshot:true)  C:\mvn-it-1.tmp\core-it-suite\target\core-it-suite-2.1-SNAPSHOT-tests.jar}, skip archiving of the artifacts
[winJava8] java.lang.IllegalArgumentException: Cannot relativize 'C:\mvn-it-1.tmp\core-it-suite\target\core-it-suite-2.1-SNAPSHOT-tests.jar' relatively to '/mvn-it-1.tmp'
[winJava8] at org.jenkinsci.plugins.pipeline.maven.util.XmlUtils.getPathInWorkspace(XmlUtils.java:319)
[winJava8] at org.jenkinsci.plugins.pipeline.maven.publishers.GeneratedArtifactsPublisher.process(GeneratedArtifactsPublisher.java:95)
[winJava8] at org.jenkinsci.plugins.pipeline.maven.MavenSpyLogProcessor.processMavenSpyLogs(MavenSpyLogProcessor.java:109)
[winJava8] at org.jenkinsci.plugins.pipeline.maven.WithMavenStepExecution$WorkspaceCleanupCallback.finished(WithMavenStepExecution.java:913)
[winJava8] at org.jenkinsci.plugins.workflow.steps.BodyExecutionCallback$TailCall.onSuccess(BodyExecutionCallback.java:114)
[winJava8] at org.jenkinsci.plugins.workflow.cps.CpsBodyExecution$SuccessAdapter.receive(CpsBodyExecution.java:362)
[winJava8] at com.cloudbees.groovy.cps.Outcome.resumeFrom(Outcome.java:73)
[winJava8] at com.cloudbees.groovy.cps.Continuable$1.call(Continuable.java:166)
[winJava8] at com.cloudbees.groovy.cps.Continuable$1.call(Continuable.java:163)
[winJava8] at org.codehaus.groovy.runtime.GroovyCategorySupport$ThreadCategoryInfo.use(GroovyCategorySupport.java:122)
[winJava8] at org.codehaus.groovy.runtime.GroovyCategorySupport.use(GroovyCategorySupport.java:261)
[winJava8] at com.cloudbees.groovy.cps.Continuable.run0(Continuable.java:163)
[winJava8] at org.jenkinsci.plugins.workflow.cps.SandboxContinuable.access$001(SandboxContinuable.java:19)
[winJava8] at org.jenkinsci.plugins.workflow.cps.SandboxContinuable$1.call(SandboxContinuable.java:35)
[winJava8] at org.jenkinsci.plugins.workflow.cps.SandboxContinuable$1.call(SandboxContinuable.java:32)
[winJava8] at org.jenkinsci.plugins.scriptsecurity.sandbox.groovy.GroovySandbox.runInSandbox(GroovySandbox.java:108)
[winJava8] at org.jenkinsci.plugins.workflow.cps.SandboxContinuable.run0(SandboxContinuable.java:32)
[winJava8] at org.jenkinsci.plugins.workflow.cps.CpsThread.runNextChunk(CpsThread.java:174)
[winJava8] at org.jenkinsci.plugins.workflow.cps.CpsThreadGroup.run(CpsThreadGroup.java:330)
[winJava8] at org.jenkinsci.plugins.workflow.cps.CpsThreadGroup.access$100(CpsThreadGroup.java:82)
[winJava8] at org.jenkinsci.plugins.workflow.cps.CpsThreadGroup$2.call(CpsThreadGroup.java:242)
[winJava8] at org.jenkinsci.plugins.workflow.cps.CpsThreadGroup$2.call(CpsThreadGroup.java:230)
[winJava8] at org.jenkinsci.plugins.workflow.cps.CpsVmExecutorService$2.call(CpsVmExecutorService.java:64)
[winJava8] at java.util.concurrent.FutureTask.run(FutureTask.java:266)
[winJava8] at hudson.remoting.SingleLaneExecutorService$1.run(SingleLaneExecutorService.java:112)
[winJava8] at jenkins.util.ContextResettingExecutorService$1.run(ContextResettingExecutorService.java:28)
[winJava8] at java.util.concurrent.Executors$RunnableAdapter.call(Executors.java:511)
[winJava8] at java.util.concurrent.FutureTask.run(FutureTask.java:266)
[winJava8] at java.util.concurrent.ThreadPoolExecutor.runWorker(ThreadPoolExecutor.java:1149)
[winJava8] at java.util.concurrent.ThreadPoolExecutor$Worker.run(ThreadPoolExecutor.java:624)
[winJava8] at java.lang.Thread.run(Thread.java:748)
[winJava8] ERROR: [withMaven] WARNING Exception executing Maven reporter 'Junit Publisher' / org.jenkinsci.plugins.pipeline.maven.publishers.JunitTestsPublisher. Please report a bug associated for the component 'pipeline-maven-plugin' at https://issues.jenkins-ci.org 
[winJava8] java.lang.IllegalArgumentException: Cannot relativize 'C:\mvn-it-1.tmp\core-it-support\core-it-plugins\maven-it-plugin-active-collection\target/surefire-reports' relatively to '/mvn-it-1.tmp'
[winJava8] at org.jenkinsci.plugins.pipeline.maven.util.XmlUtils.getPathInWorkspace(XmlUtils.java:319)
[winJava8] at org.jenkinsci.plugins.pipeline.maven.publishers.JunitTestsPublisher.executeReporter(JunitTestsPublisher.java:235)
[winJava8] at org.jenkinsci.plugins.pipeline.maven.publishers.JunitTestsPublisher.process(JunitTestsPublisher.java:181)
[winJava8] at org.jenkinsci.plugins.pipeline.maven.MavenSpyLogProcessor.processMavenSpyLogs(MavenSpyLogProcessor.java:109)
[winJava8] at org.jenkinsci.plugins.pipeline.maven.WithMavenStepExecution$WorkspaceCleanupCallback.finished(WithMavenStepExecution.java:913)
[winJava8] at org.jenkinsci.plugins.workflow.steps.BodyExecutionCallback$TailCall.onSuccess(BodyExecutionCallback.java:114)
[winJava8] at org.jenkinsci.plugins.workflow.cps.CpsBodyExecution$SuccessAdapter.receive(CpsBodyExecution.java:362)
[winJava8] at com.cloudbees.groovy.cps.Outcome.resumeFrom(Outcome.java:73)
[winJava8] at com.cloudbees.groovy.cps.Continuable$1.call(Continuable.java:166)
[winJava8] at com.cloudbees.groovy.cps.Continuable$1.call(Continuable.java:163)
[winJava8] at org.codehaus.groovy.runtime.GroovyCategorySupport$ThreadCategoryInfo.use(GroovyCategorySupport.java:122)
[winJava8] at org.codehaus.groovy.runtime.GroovyCategorySupport.use(GroovyCategorySupport.java:261)
[winJava8] at com.cloudbees.groovy.cps.Continuable.run0(Continuable.java:163)
[winJava8] at org.jenkinsci.plugins.workflow.cps.SandboxContinuable.access$001(SandboxContinuable.java:19)
[winJava8] at org.jenkinsci.plugins.workflow.cps.SandboxContinuable$1.call(SandboxContinuable.java:35)
[winJava8] at org.jenkinsci.plugins.workflow.cps.SandboxContinuable$1.call(SandboxContinuable.java:32)
[winJava8] at org.jenkinsci.plugins.scriptsecurity.sandbox.groovy.GroovySandbox.runInSandbox(GroovySandbox.java:108)
[winJava8] at org.jenkinsci.plugins.workflow.cps.SandboxContinuable.run0(SandboxContinuable.java:32)
[winJava8] at org.jenkinsci.plugins.workflow.cps.CpsThread.runNextChunk(CpsThread.java:174)
[winJava8] at org.jenkinsci.plugins.workflow.cps.CpsThreadGroup.run(CpsThreadGroup.java:330)
[winJava8] at org.jenkinsci.plugins.workflow.cps.CpsThreadGroup.access$100(CpsThreadGroup.java:82)
[winJava8] at org.jenkinsci.plugins.workflow.cps.CpsThreadGroup$2.call(CpsThreadGroup.java:242)
[winJava8] at org.jenkinsci.plugins.workflow.cps.CpsThreadGroup$2.call(CpsThreadGroup.java:230)
[winJava8] at org.jenkinsci.plugins.workflow.cps.CpsVmExecutorService$2.call(CpsVmExecutorService.java:64)
[winJava8] at java.util.concurrent.FutureTask.run(FutureTask.java:266)
[winJava8] at hudson.remoting.SingleLaneExecutorService$1.run(SingleLaneExecutorService.java:112)
[winJava8] at jenkins.util.ContextResettingExecutorService$1.run(ContextResettingExecutorService.java:28)
[winJava8] at java.util.concurrent.Executors$RunnableAdapter.call(Executors.java:511)
[winJava8] at java.util.concurrent.FutureTask.run(FutureTask.java:266)
[winJava8] at java.util.concurrent.ThreadPoolExecutor.runWorker(ThreadPoolExecutor.java:1149)
[winJava8] at java.util.concurrent.ThreadPoolExecutor$Worker.run(ThreadPoolExecutor.java:624)
[winJava8] at java.lang.Thread.run(Thread.java:748)
[winJava8] ERROR: [withMaven] WARNING Exception executing Maven reporter 'Open Task Scanner Publisher' / org.jenkinsci.plugins.pipeline.maven.publishers.TasksScannerPublisher. Please report a bug associated for the component 'pipeline-maven-plugin' at https://issues.jenkins-ci.org 
[winJava8] java.lang.IllegalArgumentException: Cannot relativize 'C:\mvn-it-1.tmp\src\main\java' relatively to '/mvn-it-1.tmp'
[winJava8] at org.jenkinsci.plugins.pipeline.maven.util.XmlUtils.getPathInWorkspace(XmlUtils.java:319)
[winJava8] at org.jenkinsci.plugins.pipeline.maven.publishers.TasksScannerPublisher.process(TasksScannerPublisher.java:128)
[winJava8] at org.jenkinsci.plugins.pipeline.maven.MavenSpyLogProcessor.processMavenSpyLogs(MavenSpyLogProcessor.java:109)
[winJava8] at org.jenkinsci.plugins.pipeline.maven.WithMavenStepExecution$WorkspaceCleanupCallback.finished(WithMavenStepExecution.java:913)
[winJava8] at org.jenkinsci.plugins.workflow.steps.BodyExecutionCallback$TailCall.onSuccess(BodyExecutionCallback.java:114)
[winJava8] at org.jenkinsci.plugins.workflow.cps.CpsBodyExecution$SuccessAdapter.receive(CpsBodyExecution.java:362)
[winJava8] at com.cloudbees.groovy.cps.Outcome.resumeFrom(Outcome.java:73)
[winJava8] at com.cloudbees.groovy.cps.Continuable$1.call(Continuable.java:166)
[winJava8] at com.cloudbees.groovy.cps.Continuable$1.call(Continuable.java:163)
[winJava8] at org.codehaus.groovy.runtime.GroovyCategorySupport$ThreadCategoryInfo.use(GroovyCategorySupport.java:122)
[winJava8] at org.codehaus.groovy.runtime.GroovyCategorySupport.use(GroovyCategorySupport.java:261)
[winJava8] at com.cloudbees.groovy.cps.Continuable.run0(Continuable.java:163)
[winJava8] at org.jenkinsci.plugins.workflow.cps.SandboxContinuable.access$001(SandboxContinuable.java:19)
[winJava8] at org.jenkinsci.plugins.workflow.cps.SandboxContinuable$1.call(SandboxContinuable.java:35)
[winJava8] at org.jenkinsci.plugins.workflow.cps.SandboxContinuable$1.call(SandboxContinuable.java:32)
[winJava8] at org.jenkinsci.plugins.scriptsecurity.sandbox.groovy.GroovySandbox.runInSandbox(GroovySandbox.java:108)
[winJava8] at org.jenkinsci.plugins.workflow.cps.SandboxContinuable.run0(SandboxContinuable.java:32)
[winJava8] at org.jenkinsci.plugins.workflow.cps.CpsThread.runNextChunk(CpsThread.java:174)
[winJava8] at org.jenkinsci.plugins.workflow.cps.CpsThreadGroup.run(CpsThreadGroup.java:330)
[winJava8] at org.jenkinsci.plugins.workflow.cps.CpsThreadGroup.access$100(CpsThreadGroup.java:82)
[winJava8] at org.jenkinsci.plugins.workflow.cps.CpsThreadGroup$2.call(CpsThreadGroup.java:242)
[winJava8] at org.jenkinsci.plugins.workflow.cps.CpsThreadGroup$2.call(CpsThreadGroup.java:230)
[winJava8] at org.jenkinsci.plugins.workflow.cps.CpsVmExecutorService$2.call(CpsVmExecutorService.java:64)
[winJava8] at java.util.concurrent.FutureTask.run(FutureTask.java:266)
[winJava8] at hudson.remoting.SingleLaneExecutorService$1.run(SingleLaneExecutorService.java:112)
[winJava8] at jenkins.util.ContextResettingExecutorService$1.run(ContextResettingExecutorService.java:28)
[winJava8] at java.util.concurrent.Executors$RunnableAdapter.call(Executors.java:511)
[winJava8] at java.util.concurrent.FutureTask.run(FutureTask.java:266)
[winJava8] at java.util.concurrent.ThreadPoolExecutor.runWorker(ThreadPoolExecutor.java:1149)
[winJava8] at java.util.concurrent.ThreadPoolExecutor$Worker.run(ThreadPoolExecutor.java:624)
[winJava8] at java.lang.Thread.run(Thread.java:748)
[Pipeline] [winJava8] // withMaven
[Pipeline] [winJava8] deleteDir
[Pipeline] [winJava8] }
[Pipeline] [winJava8] // dir
[Pipeline] [winJava8] }
[Pipeline] [winJava8] // stage
[Pipeline] [winJava8] }
[Pipeline] [winJava8] // node
[Pipeline] [winJava8] }
[Pipeline] // parallel
[Pipeline] stage
[Pipeline] { (Notifications)
[Pipeline] echo
Build result: UNSTABLE
[Pipeline] jiraIssueSelector
[Pipeline] jiraComment
[Pipeline] emailext
Reply | Threaded
Open this post in threaded view
|

Build succeeded in Jenkins: maven-3.x-jenkinsfile » MNG-6308_display_packaging #11

Apache Jenkins Server-2
See https://builds.apache.org/job/maven-3.x-jenkinsfile/job/MNG-6308_display_packaging/11/

Changes:

* [CLOSES INFRA-15651] ubuntu-4 is confirmed fixed
* Better fail-fast diagnostics (hopefully)
* Better fail-fast diagnostics (hopefully)
* fix scoping
* Correctly attribute fast failure root node
* Correctly attribute fast failure root node
* Handle other parts of the parallel being interrupted by fast fail
* suppress duplicate changelogs
* take 2 on changelog optimization
* debug
* Seems we have to live with duplicate changelogs
* [MNG-6330] Parents relativePath not verified anymore
* [MNG-6330] Parents relativePath not verified anymore
* [MNG-6330] Parents relativePath not verified anymore

All tests passed