Build unstable in Jenkins: Maven TLP (wip) » maven-wagon » master #1

Previous Topic Next Topic
 
classic Classic list List threaded Threaded
2 messages Options
Reply | Threaded
Open this post in threaded view
|

Build unstable in Jenkins: Maven TLP (wip) » maven-wagon » master #1

Apache Jenkins Server-2
See https://builds.apache.org/job/maven-wip/job/maven-wagon/job/master/1/

No changes.

6 tests failed.
FAILED:  org.apache.maven.wagon.providers.scm.ScmSvnExeWagonTest.testWagonPutDirectoryDeepDestination

Error Message:
Error checking out: Unable to commit file. The svn command failed. svn: E180001: Unable to connect to a repository at URL 'file://2/m/wagon-providers/wagon-scm/target/test-classes/test-repo-svn-test'
svn: E180001: Unable to open an ra_local session to URL
svn: E180001: Unable to open repository 'file://2/m/wagon-providers/wagon-scm/target/test-classes/test-repo-svn-test'


Stack Trace:
org.apache.maven.wagon.TransferFailedException:
Error checking out: Unable to commit file. The svn command failed. svn: E180001: Unable to connect to a repository at URL 'file://2/m/wagon-providers/wagon-scm/target/test-classes/test-repo-svn-test'
svn: E180001: Unable to open an ra_local session to URL
svn: E180001: Unable to open repository 'file://2/m/wagon-providers/wagon-scm/target/test-classes/test-repo-svn-test'

Caused by: org.apache.maven.scm.ScmException:
Unable to commit file. The svn command failed. svn: E180001: Unable to connect to a repository at URL 'file://2/m/wagon-providers/wagon-scm/target/test-classes/test-repo-svn-test'
svn: E180001: Unable to open an ra_local session to URL
svn: E180001: Unable to open repository 'file://2/m/wagon-providers/wagon-scm/target/test-classes/test-repo-svn-test'



FAILED:  org.apache.maven.wagon.providers.scm.ScmSvnExeWagonTest.testWagonPutDirectoryForDot

Error Message:
Error checking out: Unable to commit file. The svn command failed. svn: E180001: Unable to connect to a repository at URL 'file://2/m/wagon-providers/wagon-scm/target/test-classes/test-repo-svn-test'
svn: E180001: Unable to open an ra_local session to URL
svn: E180001: Unable to open repository 'file://2/m/wagon-providers/wagon-scm/target/test-classes/test-repo-svn-test'


Stack Trace:
org.apache.maven.wagon.TransferFailedException:
Error checking out: Unable to commit file. The svn command failed. svn: E180001: Unable to connect to a repository at URL 'file://2/m/wagon-providers/wagon-scm/target/test-classes/test-repo-svn-test'
svn: E180001: Unable to open an ra_local session to URL
svn: E180001: Unable to open repository 'file://2/m/wagon-providers/wagon-scm/target/test-classes/test-repo-svn-test'

Caused by: org.apache.maven.scm.ScmException:
Unable to commit file. The svn command failed. svn: E180001: Unable to connect to a repository at URL 'file://2/m/wagon-providers/wagon-scm/target/test-classes/test-repo-svn-test'
svn: E180001: Unable to open an ra_local session to URL
svn: E180001: Unable to open repository 'file://2/m/wagon-providers/wagon-scm/target/test-classes/test-repo-svn-test'



FAILED:  org.apache.maven.wagon.providers.scm.ScmSvnExeWagonTest.testWagonGetFileList

Error Message:

  Unexpected method call TransferListener.transferError(TransferEvent[GET|ERROR|Repository[scm:svn:file://2/m/wagon-providers/wagon-scm/target/test-classes/test-repo-svn-test]|null|file-list/test-resource.txt[len = 18; mod = 1511997218422]]):
    TransferListener.transferCompleted(TransferEvent[PUT|COMPLETED|Repository[scm:svn:file://2/m/wagon-providers/wagon-scm/target/test-classes/test-repo-svn-test]|F:\jenkins\jenkins-slave\workspace\aven-wip_maven-wagon_master-5K354YLK5AXXQUUW5V5Z77PJKZZHHNUK4T63UGJYZBOC7XIFPWDA@2\m\wagon-providers\wagon-scm\target\test-output\file-list\test-resource.txt|file-list/test-resource.txt[len = 18; mod = 1511997218422]]): expected: 1, actual: 0

Stack Trace:
java.lang.AssertionError:

  Unexpected method call TransferListener.transferError(TransferEvent[GET|ERROR|Repository[scm:svn:file://2/m/wagon-providers/wagon-scm/target/test-classes/test-repo-svn-test]|null|file-list/test-resource.txt[len = 18; mod = 1511997218422]]):
    TransferListener.transferCompleted(TransferEvent[PUT|COMPLETED|Repository[scm:svn:file://2/m/wagon-providers/wagon-scm/target/test-classes/test-repo-svn-test]|F:\jenkins\jenkins-slave\workspace\aven-wip_maven-wagon_master-5K354YLK5AXXQUUW5V5Z77PJKZZHHNUK4T63UGJYZBOC7XIFPWDA@2\m\wagon-providers\wagon-scm\target\test-output\file-list\test-resource.txt|file-list/test-resource.txt[len = 18; mod = 1511997218422]]): expected: 1, actual: 0


FAILED:  org.apache.maven.wagon.providers.scm.ScmSvnExeWagonTest.testWagonPutDirectoryWhenDirectoryAlreadyExists

Error Message:
Error checking out: Unable to commit file. The svn command failed. svn: E180001: Unable to connect to a repository at URL 'file://2/m/wagon-providers/wagon-scm/target/test-classes/test-repo-svn-test'
svn: E180001: Unable to open an ra_local session to URL
svn: E180001: Unable to open repository 'file://2/m/wagon-providers/wagon-scm/target/test-classes/test-repo-svn-test'


Stack Trace:
org.apache.maven.wagon.TransferFailedException:
Error checking out: Unable to commit file. The svn command failed. svn: E180001: Unable to connect to a repository at URL 'file://2/m/wagon-providers/wagon-scm/target/test-classes/test-repo-svn-test'
svn: E180001: Unable to open an ra_local session to URL
svn: E180001: Unable to open repository 'file://2/m/wagon-providers/wagon-scm/target/test-classes/test-repo-svn-test'

Caused by: org.apache.maven.scm.ScmException:
Unable to commit file. The svn command failed. svn: E180001: Unable to connect to a repository at URL 'file://2/m/wagon-providers/wagon-scm/target/test-classes/test-repo-svn-test'
svn: E180001: Unable to open an ra_local session to URL
svn: E180001: Unable to open repository 'file://2/m/wagon-providers/wagon-scm/target/test-classes/test-repo-svn-test'



FAILED:  org.apache.maven.wagon.providers.scm.ScmSvnExeWagonTest.testWagonResourceExists

Error Message:

  Unexpected method call TransferListener.transferError(TransferEvent[GET|ERROR|Repository[scm:svn:file://2/m/wagon-providers/wagon-scm/target/test-classes/test-repo-svn-test]|null|test-resource[len = 18; mod = 1511997218814]]):
    TransferListener.transferCompleted(TransferEvent[PUT|COMPLETED|Repository[scm:svn:file://2/m/wagon-providers/wagon-scm/target/test-classes/test-repo-svn-test]|F:\jenkins\jenkins-slave\workspace\aven-wip_maven-wagon_master-5K354YLK5AXXQUUW5V5Z77PJKZZHHNUK4T63UGJYZBOC7XIFPWDA@2\m\wagon-providers\wagon-scm\target\test-output\test-resource|test-resource[len = 18; mod = 1511997218814]]): expected: 1, actual: 0

Stack Trace:
java.lang.AssertionError:

  Unexpected method call TransferListener.transferError(TransferEvent[GET|ERROR|Repository[scm:svn:file://2/m/wagon-providers/wagon-scm/target/test-classes/test-repo-svn-test]|null|test-resource[len = 18; mod = 1511997218814]]):
    TransferListener.transferCompleted(TransferEvent[PUT|COMPLETED|Repository[scm:svn:file://2/m/wagon-providers/wagon-scm/target/test-classes/test-repo-svn-test]|F:\jenkins\jenkins-slave\workspace\aven-wip_maven-wagon_master-5K354YLK5AXXQUUW5V5Z77PJKZZHHNUK4T63UGJYZBOC7XIFPWDA@2\m\wagon-providers\wagon-scm\target\test-output\test-resource|test-resource[len = 18; mod = 1511997218814]]): expected: 1, actual: 0


FAILED:  org.apache.maven.wagon.providers.scm.ScmSvnExeWagonTest.testWagonPutDirectory

Error Message:
Error checking out: Unable to commit file. The svn command failed. svn: E180001: Unable to connect to a repository at URL 'file://2/m/wagon-providers/wagon-scm/target/test-classes/test-repo-svn-test'
svn: E180001: Unable to open an ra_local session to URL
svn: E180001: Unable to open repository 'file://2/m/wagon-providers/wagon-scm/target/test-classes/test-repo-svn-test'


Stack Trace:
org.apache.maven.wagon.TransferFailedException:
Error checking out: Unable to commit file. The svn command failed. svn: E180001: Unable to connect to a repository at URL 'file://2/m/wagon-providers/wagon-scm/target/test-classes/test-repo-svn-test'
svn: E180001: Unable to open an ra_local session to URL
svn: E180001: Unable to open repository 'file://2/m/wagon-providers/wagon-scm/target/test-classes/test-repo-svn-test'

Caused by: org.apache.maven.scm.ScmException:
Unable to commit file. The svn command failed. svn: E180001: Unable to connect to a repository at URL 'file://2/m/wagon-providers/wagon-scm/target/test-classes/test-repo-svn-test'
svn: E180001: Unable to open an ra_local session to URL
svn: E180001: Unable to open repository 'file://2/m/wagon-providers/wagon-scm/target/test-classes/test-repo-svn-test'





Build log:
[...truncated 2.49 MB...]
[windows-jdk9] [INFO] ------------------------------------------------------------------------
[windows-jdk9] [INFO] BUILD SUCCESS
[windows-jdk9] [INFO] ------------------------------------------------------------------------
[windows-jdk9] [INFO] Total time: 12:19 min
[windows-jdk9] [INFO] Finished at: 2017-11-29T23:14:29Z
[windows-jdk9] [INFO] Final Memory: 54M/180M
[windows-jdk9] [INFO] ------------------------------------------------------------------------
[windows-jdk9] [jenkins-maven-event-spy] INFO generated F:\jenkins\jenkins-slave\workspace\aven-wip_maven-wagon_master-5K354YLK5AXXQUUW5V5Z77PJKZZHHNUK4T63UGJYZBOC7XIFPWDA@tmp\withMaven65417221\maven-spy-20171129-230209-514983834687462687278.log
[Pipeline] [windows-jdk9] }
[Pipeline] [windows-jdk9] // dir
[Pipeline] [windows-jdk9] }
[windows-jdk9] [withMaven] artifactsPublisher - Archive artifact m\pom.xml under org\apache\maven\wagon\wagon\3.0.1-SNAPSHOT\wagon-3.0.1-SNAPSHOT.pom
[windows-jdk9] [withMaven] artifactsPublisher - Archive artifact m\wagon-provider-api\pom.xml under org\apache\maven\wagon\wagon-provider-api\3.0.1-SNAPSHOT\wagon-provider-api-3.0.1-SNAPSHOT.pom
[windows-jdk9] [withMaven] artifactsPublisher - Archive artifact m\wagon-provider-api\target\wagon-provider-api-3.0.1-SNAPSHOT.jar under org\apache\maven\wagon\wagon-provider-api\3.0.1-SNAPSHOT\wagon-provider-api-3.0.1-SNAPSHOT.jar
[windows-jdk9] [withMaven] artifactsPublisher - Archive artifact m\wagon-provider-test\pom.xml under org\apache\maven\wagon\wagon-provider-test\3.0.1-SNAPSHOT\wagon-provider-test-3.0.1-SNAPSHOT.pom
[windows-jdk9] [withMaven] artifactsPublisher - Archive artifact m\wagon-provider-test\target\wagon-provider-test-3.0.1-SNAPSHOT.jar under org\apache\maven\wagon\wagon-provider-test\3.0.1-SNAPSHOT\wagon-provider-test-3.0.1-SNAPSHOT.jar
[windows-jdk9] [withMaven] artifactsPublisher - Archive artifact m\wagon-providers\pom.xml under org\apache\maven\wagon\wagon-providers\3.0.1-SNAPSHOT\wagon-providers-3.0.1-SNAPSHOT.pom
[windows-jdk9] [withMaven] artifactsPublisher - Archive artifact m\wagon-providers\wagon-file\pom.xml under org\apache\maven\wagon\wagon-file\3.0.1-SNAPSHOT\wagon-file-3.0.1-SNAPSHOT.pom
[windows-jdk9] [withMaven] artifactsPublisher - Archive artifact m\wagon-providers\wagon-file\target\wagon-file-3.0.1-SNAPSHOT.jar under org\apache\maven\wagon\wagon-file\3.0.1-SNAPSHOT\wagon-file-3.0.1-SNAPSHOT.jar
[windows-jdk9] [withMaven] artifactsPublisher - Archive artifact m\wagon-providers\wagon-ftp\pom.xml under org\apache\maven\wagon\wagon-ftp\3.0.1-SNAPSHOT\wagon-ftp-3.0.1-SNAPSHOT.pom
[windows-jdk9] [withMaven] artifactsPublisher - Archive artifact m\wagon-providers\wagon-ftp\target\wagon-ftp-3.0.1-SNAPSHOT.jar under org\apache\maven\wagon\wagon-ftp\3.0.1-SNAPSHOT\wagon-ftp-3.0.1-SNAPSHOT.jar
[windows-jdk9] [withMaven] artifactsPublisher - Archive artifact m\wagon-providers\wagon-http-shared\pom.xml under org\apache\maven\wagon\wagon-http-shared\3.0.1-SNAPSHOT\wagon-http-shared-3.0.1-SNAPSHOT.pom
[windows-jdk9] [withMaven] artifactsPublisher - Archive artifact m\wagon-providers\wagon-http-shared\target\wagon-http-shared-3.0.1-SNAPSHOT.jar under org\apache\maven\wagon\wagon-http-shared\3.0.1-SNAPSHOT\wagon-http-shared-3.0.1-SNAPSHOT.jar
[windows-jdk9] [withMaven] artifactsPublisher - Archive artifact m\wagon-tcks\pom.xml under org\apache\maven\wagon\wagon-tcks\3.0.1-SNAPSHOT\wagon-tcks-3.0.1-SNAPSHOT.pom
[windows-jdk9] [withMaven] artifactsPublisher - Archive artifact m\wagon-tcks\wagon-tck-http\pom.xml under org\apache\maven\wagon\wagon-tck-http\3.0.1-SNAPSHOT\wagon-tck-http-3.0.1-SNAPSHOT.pom
[windows-jdk9] [withMaven] artifactsPublisher - Archive artifact m\wagon-tcks\wagon-tck-http\target\wagon-tck-http-3.0.1-SNAPSHOT.jar under org\apache\maven\wagon\wagon-tck-http\3.0.1-SNAPSHOT\wagon-tck-http-3.0.1-SNAPSHOT.jar
[windows-jdk9] [withMaven] artifactsPublisher - Archive artifact m\wagon-providers\wagon-http\pom.xml under org\apache\maven\wagon\wagon-http\3.0.1-SNAPSHOT\wagon-http-3.0.1-SNAPSHOT.pom
[windows-jdk9] [withMaven] artifactsPublisher - Archive artifact m\wagon-providers\wagon-http\target\wagon-http-3.0.1-SNAPSHOT.jar under org\apache\maven\wagon\wagon-http\3.0.1-SNAPSHOT\wagon-http-3.0.1-SNAPSHOT.jar
[windows-jdk9] [withMaven] artifactsPublisher - Archive artifact m\wagon-providers\wagon-http-lightweight\pom.xml under org\apache\maven\wagon\wagon-http-lightweight\3.0.1-SNAPSHOT\wagon-http-lightweight-3.0.1-SNAPSHOT.pom
[windows-jdk9] [withMaven] artifactsPublisher - Archive artifact m\wagon-providers\wagon-http-lightweight\target\wagon-http-lightweight-3.0.1-SNAPSHOT.jar under org\apache\maven\wagon\wagon-http-lightweight\3.0.1-SNAPSHOT\wagon-http-lightweight-3.0.1-SNAPSHOT.jar
[windows-jdk9] [withMaven] artifactsPublisher - Archive artifact m\wagon-providers\wagon-scm\pom.xml under org\apache\maven\wagon\wagon-scm\3.0.1-SNAPSHOT\wagon-scm-3.0.1-SNAPSHOT.pom
[windows-jdk9] [withMaven] artifactsPublisher - Archive artifact m\wagon-providers\wagon-scm\target\wagon-scm-3.0.1-SNAPSHOT.jar under org\apache\maven\wagon\wagon-scm\3.0.1-SNAPSHOT\wagon-scm-3.0.1-SNAPSHOT.jar
[windows-jdk9] [withMaven] artifactsPublisher - Archive artifact m\wagon-providers\wagon-ssh-common\pom.xml under org\apache\maven\wagon\wagon-ssh-common\3.0.1-SNAPSHOT\wagon-ssh-common-3.0.1-SNAPSHOT.pom
[windows-jdk9] [withMaven] artifactsPublisher - Archive artifact m\wagon-providers\wagon-ssh-common\target\wagon-ssh-common-3.0.1-SNAPSHOT.jar under org\apache\maven\wagon\wagon-ssh-common\3.0.1-SNAPSHOT\wagon-ssh-common-3.0.1-SNAPSHOT.jar
[windows-jdk9] [withMaven] artifactsPublisher - Archive artifact m\wagon-providers\wagon-ssh-common-test\pom.xml under org\apache\maven\wagon\wagon-ssh-common-test\3.0.1-SNAPSHOT\wagon-ssh-common-test-3.0.1-SNAPSHOT.pom
[windows-jdk9] [withMaven] artifactsPublisher - Archive artifact m\wagon-providers\wagon-ssh-common-test\target\wagon-ssh-common-test-3.0.1-SNAPSHOT.jar under org\apache\maven\wagon\wagon-ssh-common-test\3.0.1-SNAPSHOT\wagon-ssh-common-test-3.0.1-SNAPSHOT.jar
[windows-jdk9] [withMaven] artifactsPublisher - Archive artifact m\wagon-providers\wagon-ssh-external\pom.xml under org\apache\maven\wagon\wagon-ssh-external\3.0.1-SNAPSHOT\wagon-ssh-external-3.0.1-SNAPSHOT.pom
[windows-jdk9] [withMaven] artifactsPublisher - Archive artifact m\wagon-providers\wagon-ssh-external\target\wagon-ssh-external-3.0.1-SNAPSHOT.jar under org\apache\maven\wagon\wagon-ssh-external\3.0.1-SNAPSHOT\wagon-ssh-external-3.0.1-SNAPSHOT.jar
[windows-jdk9] [withMaven] artifactsPublisher - Archive artifact m\wagon-providers\wagon-ssh\pom.xml under org\apache\maven\wagon\wagon-ssh\3.0.1-SNAPSHOT\wagon-ssh-3.0.1-SNAPSHOT.pom
[windows-jdk9] [withMaven] artifactsPublisher - Archive artifact m\wagon-providers\wagon-ssh\target\wagon-ssh-3.0.1-SNAPSHOT.jar under org\apache\maven\wagon\wagon-ssh\3.0.1-SNAPSHOT\wagon-ssh-3.0.1-SNAPSHOT.jar
[windows-jdk9] [withMaven] artifactsPublisher - Archive artifact m\wagon-providers\wagon-webdav-jackrabbit\pom.xml under org\apache\maven\wagon\wagon-webdav-jackrabbit\3.0.1-SNAPSHOT\wagon-webdav-jackrabbit-3.0.1-SNAPSHOT.pom
[windows-jdk9] [withMaven] artifactsPublisher - Archive artifact m\wagon-providers\wagon-webdav-jackrabbit\target\wagon-webdav-jackrabbit-3.0.1-SNAPSHOT.jar under org\apache\maven\wagon\wagon-webdav-jackrabbit\3.0.1-SNAPSHOT\wagon-webdav-jackrabbit-3.0.1-SNAPSHOT.jar
[windows-jdk9] [withMaven] artifactsPublisher - Archive artifact m\target\wagon-3.0.1-SNAPSHOT-site.xml under org\apache\maven\wagon\wagon\3.0.1-SNAPSHOT\wagon-3.0.1-SNAPSHOT-site.xml
[windows-jdk9] [withMaven] artifactsPublisher - Archive artifact m\wagon-providers\target\wagon-providers-3.0.1-SNAPSHOT-site.xml under org\apache\maven\wagon\wagon-providers\3.0.1-SNAPSHOT\wagon-providers-3.0.1-SNAPSHOT-site.xml
[windows-jdk9] [withMaven] artifactsPublisher - Archive artifact m\wagon-tcks\target\wagon-tcks-3.0.1-SNAPSHOT-site.xml under org\apache\maven\wagon\wagon-tcks\3.0.1-SNAPSHOT\wagon-tcks-3.0.1-SNAPSHOT-site.xml
[windows-jdk9] [withMaven] artifactsPublisher - Archive artifact m\wagon-providers\wagon-http\target\wagon-http-3.0.1-SNAPSHOT-shaded.jar under org\apache\maven\wagon\wagon-http\3.0.1-SNAPSHOT\wagon-http-3.0.1-SNAPSHOT-shaded.jar
[windows-jdk9] [Fast Archiver] No prior successful build to compare, so performing full copy of artifacts
[windows-jdk9] [withMaven] junitPublisher - Archive test results for Maven artifact org.apache.maven.wagon:wagon-provider-api:3.0.1-SNAPSHOT generated by maven-surefire-plugin:test (default-test): m\wagon-provider-api\target\surefire-reports\*.xml
[windows-jdk9] [withMaven] junitPublisher - Jenkins JUnit Attachments Plugin not found, can't publish test attachments.Recording test results
[windows-jdk9] [withMaven] junitPublisher - Archive test results for Maven artifact org.apache.maven.wagon:wagon-provider-test:3.0.1-SNAPSHOT generated by maven-surefire-plugin:test (default-test): m\wagon-provider-test\target\surefire-reports\*.xml
[windows-jdk9] [withMaven] junitPublisher - Jenkins JUnit Attachments Plugin not found, can't publish test attachments.Recording test results
[windows-jdk9] None of the test reports contained any result
[windows-jdk9] [withMaven] junitPublisher - Archive test results for Maven artifact org.apache.maven.wagon:wagon-file:3.0.1-SNAPSHOT generated by maven-surefire-plugin:test (default-test): m\wagon-providers\wagon-file\target\surefire-reports\*.xml
[windows-jdk9] [withMaven] junitPublisher - Jenkins JUnit Attachments Plugin not found, can't publish test attachments.Recording test results
[windows-jdk9] [withMaven] junitPublisher - Archive test results for Maven artifact org.apache.maven.wagon:wagon-ftp:3.0.1-SNAPSHOT generated by maven-surefire-plugin:test (default-test): m\wagon-providers\wagon-ftp\target\surefire-reports\*.xml
[windows-jdk9] [withMaven] junitPublisher - Jenkins JUnit Attachments Plugin not found, can't publish test attachments.Recording test results
[windows-jdk9] [withMaven] junitPublisher - Archive test results for Maven artifact org.apache.maven.wagon:wagon-http-shared:3.0.1-SNAPSHOT generated by maven-surefire-plugin:test (default-test): m\wagon-providers\wagon-http-shared\target\surefire-reports\*.xml
[windows-jdk9] [withMaven] junitPublisher - Jenkins JUnit Attachments Plugin not found, can't publish test attachments.Recording test results
[windows-jdk9] [withMaven] junitPublisher - Archive test results for Maven artifact org.apache.maven.wagon:wagon-tck-http:3.0.1-SNAPSHOT generated by maven-surefire-plugin:test (default-test): m\wagon-tcks\wagon-tck-http\target\surefire-reports\*.xml
[windows-jdk9] [withMaven] junitPublisher - Jenkins JUnit Attachments Plugin not found, can't publish test attachments.Recording test results
[windows-jdk9] None of the test reports contained any result
[windows-jdk9] [withMaven] junitPublisher - Archive test results for Maven artifact org.apache.maven.wagon:wagon-http:3.0.1-SNAPSHOT generated by maven-surefire-plugin:test (default-test): m\wagon-providers\wagon-http\target\surefire-reports\*.xml
[windows-jdk9] [withMaven] junitPublisher - Jenkins JUnit Attachments Plugin not found, can't publish test attachments.Recording test results
[windows-jdk9] [withMaven] junitPublisher - Archive test results for Maven artifact org.apache.maven.wagon:wagon-http-lightweight:3.0.1-SNAPSHOT generated by maven-surefire-plugin:test (default-test): m\wagon-providers\wagon-http-lightweight\target\surefire-reports\*.xml
[windows-jdk9] [withMaven] junitPublisher - Jenkins JUnit Attachments Plugin not found, can't publish test attachments.Recording test results
[windows-jdk9] [withMaven] junitPublisher - Archive test results for Maven artifact org.apache.maven.wagon:wagon-scm:3.0.1-SNAPSHOT generated by maven-surefire-plugin:test (default-test): m\wagon-providers\wagon-scm\target\surefire-reports\*.xml
[windows-jdk9] [withMaven] junitPublisher - Jenkins JUnit Attachments Plugin not found, can't publish test attachments.Recording test results
[windows-jdk9] [withMaven] junitPublisher - Archive test results for Maven artifact org.apache.maven.wagon:wagon-ssh-common:3.0.1-SNAPSHOT generated by maven-surefire-plugin:test (default-test): m\wagon-providers\wagon-ssh-common\target\surefire-reports\*.xml
[windows-jdk9] [withMaven] junitPublisher - Jenkins JUnit Attachments Plugin not found, can't publish test attachments.Recording test results
[windows-jdk9] [withMaven] junitPublisher - Archive test results for Maven artifact org.apache.maven.wagon:wagon-ssh-common-test:3.0.1-SNAPSHOT generated by maven-surefire-plugin:test (default-test): m\wagon-providers\wagon-ssh-common-test\target\surefire-reports\*.xml
[windows-jdk9] [withMaven] junitPublisher - Jenkins JUnit Attachments Plugin not found, can't publish test attachments.Recording test results
[windows-jdk9] None of the test reports contained any result
[windows-jdk9] [withMaven] junitPublisher - Archive test results for Maven artifact org.apache.maven.wagon:wagon-ssh-external:3.0.1-SNAPSHOT generated by maven-surefire-plugin:test (default-test): m\wagon-providers\wagon-ssh-external\target\surefire-reports\*.xml
[windows-jdk9] [withMaven] junitPublisher - Jenkins JUnit Attachments Plugin not found, can't publish test attachments.Recording test results
[windows-jdk9] None of the test reports contained any result
[windows-jdk9] [withMaven] junitPublisher - Archive test results for Maven artifact org.apache.maven.wagon:wagon-ssh:3.0.1-SNAPSHOT generated by maven-surefire-plugin:test (default-test): m\wagon-providers\wagon-ssh\target\surefire-reports\*.xml
[windows-jdk9] [withMaven] junitPublisher - Jenkins JUnit Attachments Plugin not found, can't publish test attachments.Recording test results
[windows-jdk9] None of the test reports contained any result
[windows-jdk9] [withMaven] junitPublisher - Archive test results for Maven artifact org.apache.maven.wagon:wagon-webdav-jackrabbit:3.0.1-SNAPSHOT generated by maven-surefire-plugin:test (default-test): m\wagon-providers\wagon-webdav-jackrabbit\target\surefire-reports\*.xml
[windows-jdk9] [withMaven] junitPublisher - Jenkins JUnit Attachments Plugin not found, can't publish test attachments.Recording test results
[windows-jdk9] [withMaven] openTasksPublisher - Scan Tasks for Maven artifact org.apache.maven.wagon:wagon-provider-api:3.0.1-SNAPSHOT in source directory m\wagon-provider-api\src\main\java
[windows-jdk9] [withMaven] openTasksPublisher - Scan Tasks for Maven artifact org.apache.maven.wagon:wagon-provider-test:3.0.1-SNAPSHOT in source directory m\wagon-provider-test\src\main\java
[windows-jdk9] [withMaven] openTasksPublisher - Scan Tasks for Maven artifact org.apache.maven.wagon:wagon-file:3.0.1-SNAPSHOT in source directory m\wagon-providers\wagon-file\src\main\java
[windows-jdk9] [withMaven] openTasksPublisher - Scan Tasks for Maven artifact org.apache.maven.wagon:wagon-ftp:3.0.1-SNAPSHOT in source directory m\wagon-providers\wagon-ftp\src\main\java
[windows-jdk9] [withMaven] openTasksPublisher - Scan Tasks for Maven artifact org.apache.maven.wagon:wagon-http-shared:3.0.1-SNAPSHOT in source directory m\wagon-providers\wagon-http-shared\src\main\java
[windows-jdk9] [withMaven] openTasksPublisher - Scan Tasks for Maven artifact org.apache.maven.wagon:wagon-tck-http:3.0.1-SNAPSHOT in source directory m\wagon-tcks\wagon-tck-http\src\main\java
[windows-jdk9] [withMaven] openTasksPublisher - Scan Tasks for Maven artifact org.apache.maven.wagon:wagon-http:3.0.1-SNAPSHOT in source directory m\wagon-providers\wagon-http\src\main\java
[windows-jdk9] [withMaven] openTasksPublisher - Scan Tasks for Maven artifact org.apache.maven.wagon:wagon-http-lightweight:3.0.1-SNAPSHOT in source directory m\wagon-providers\wagon-http-lightweight\src\main\java
[windows-jdk9] [withMaven] openTasksPublisher - Scan Tasks for Maven artifact org.apache.maven.wagon:wagon-scm:3.0.1-SNAPSHOT in source directory m\wagon-providers\wagon-scm\src\main\java
[windows-jdk9] [withMaven] openTasksPublisher - Scan Tasks for Maven artifact org.apache.maven.wagon:wagon-ssh-common:3.0.1-SNAPSHOT in source directory m\wagon-providers\wagon-ssh-common\src\main\java
[windows-jdk9] [withMaven] openTasksPublisher - Scan Tasks for Maven artifact org.apache.maven.wagon:wagon-ssh-common-test:3.0.1-SNAPSHOT in source directory m\wagon-providers\wagon-ssh-common-test\src\main\java
[windows-jdk9] [withMaven] openTasksPublisher - Scan Tasks for Maven artifact org.apache.maven.wagon:wagon-ssh-external:3.0.1-SNAPSHOT in source directory m\wagon-providers\wagon-ssh-external\src\main\java
[windows-jdk9] [withMaven] openTasksPublisher - Scan Tasks for Maven artifact org.apache.maven.wagon:wagon-ssh:3.0.1-SNAPSHOT in source directory m\wagon-providers\wagon-ssh\src\main\java
[windows-jdk9] [withMaven] openTasksPublisher - Scan Tasks for Maven artifact org.apache.maven.wagon:wagon-webdav-jackrabbit:3.0.1-SNAPSHOT in source directory m\wagon-providers\wagon-webdav-jackrabbit\src\main\java
[windows-jdk9] [TASKS] Scanning folder 'f:\jenkins\jenkins-slave\workspace\aven-wip_maven-wagon_master-5K354YLK5AXXQUUW5V5Z77PJKZZHHNUK4T63UGJYZBOC7XIFPWDA' for files matching the pattern 'm\wagon-provider-api\src\main\java\**\*,m\wagon-provider-test\src\main\java\**\*,m\wagon-providers\wagon-file\src\main\java\**\*,m\wagon-providers\wagon-ftp\src\main\java\**\*,m\wagon-providers\wagon-http-shared\src\main\java\**\*,m\wagon-tcks\wagon-tck-http\src\main\java\**\*,m\wagon-providers\wagon-http\src\main\java\**\*,m\wagon-providers\wagon-http-lightweight\src\main\java\**\*,m\wagon-providers\wagon-scm\src\main\java\**\*,m\wagon-providers\wagon-ssh-common\src\main\java\**\*,m\wagon-providers\wagon-ssh-common-test\src\main\java\**\*,m\wagon-providers\wagon-ssh-external\src\main\java\**\*,m\wagon-providers\wagon-ssh\src\main\java\**\*,m\wagon-providers\wagon-webdav-jackrabbit\src\main\java\**\*' - excludes: null
[windows-jdk9] [TASKS] Found 114 files to scan for tasks
[windows-jdk9] [TASKS] Found 31 open tasks.
[windows-jdk9] Skipping warnings blame since pipelines do not have an SCM link.%n
[Pipeline] [windows-jdk9] // withMaven
[Pipeline] [windows-jdk9] }
[Pipeline] [windows-jdk9] // stage
[Pipeline] [windows-jdk9] }
[Pipeline] [windows-jdk9] // node
[Pipeline] [windows-jdk9] }
[windows-jdk8] [INFO] Tests run: 69, Failures: 0, Errors: 0, Skipped: 0, Time elapsed: 27.228 s - in org.apache.maven.wagon.providers.webdav.WebDavWagonTest
[windows-jdk8] [INFO]
[windows-jdk8] [INFO] Results:
[windows-jdk8] [INFO]
[windows-jdk8] [INFO] Tests run: 145, Failures: 0, Errors: 0, Skipped: 0
[windows-jdk8] [INFO]
[windows-jdk8] [INFO]
[windows-jdk8] [INFO] --- maven-jar-plugin:2.5:jar (default-jar) @ wagon-webdav-jackrabbit ---
[windows-jdk8] [INFO] Building jar: F:\jenkins\jenkins-slave\workspace\aven-wip_maven-wagon_master-5K354YLK5AXXQUUW5V5Z77PJKZZHHNUK4T63UGJYZBOC7XIFPWDA@2\m\wagon-providers\wagon-webdav-jackrabbit\target\wagon-webdav-jackrabbit-3.0.1-SNAPSHOT.jar
[windows-jdk8] [INFO]
[windows-jdk8] [INFO] --- maven-site-plugin:3.4:attach-descriptor (attach-descriptor) @ wagon-webdav-jackrabbit ---
[windows-jdk8] [INFO]
[windows-jdk8] [INFO] --- maven-checkstyle-plugin:2.15:check (checkstyle-check) @ wagon-webdav-jackrabbit ---
[windows-jdk8] [INFO] ------------------------------------------------------------------------
[windows-jdk8] [INFO] Reactor Summary:
[windows-jdk8] [INFO]
[windows-jdk8] [INFO] Apache Maven Wagon ................................. SUCCESS [ 24.220 s]
[windows-jdk8] [INFO] Apache Maven Wagon :: API .......................... SUCCESS [  8.753 s]
[windows-jdk8] [INFO] Apache Maven Wagon :: Provider Test ................ SUCCESS [  3.398 s]
[windows-jdk8] [INFO] Apache Maven Wagon :: Providers .................... SUCCESS [  1.466 s]
[windows-jdk8] [INFO] Apache Maven Wagon :: Providers :: File Provider ... SUCCESS [  3.952 s]
[windows-jdk8] [INFO] Apache Maven Wagon :: Providers :: FTP Provider .... SUCCESS [  6.766 s]
[windows-jdk8] [INFO] Apache Maven Wagon :: Providers :: HTTP Shared Library SUCCESS [  3.916 s]
[windows-jdk8] [INFO] Apache Maven Wagon :: Test Compatibility Kits ...... SUCCESS [  1.311 s]
[windows-jdk8] [INFO] Apache Maven Wagon :: HTTP Test Compatibility Kit .. SUCCESS [  2.067 s]
[windows-jdk8] [INFO] Apache Maven Wagon :: Providers :: HTTP Provider ... SUCCESS [08:22 min]
[windows-jdk8] [INFO] Apache Maven Wagon :: Providers :: Lightweight HTTP Provider SUCCESS [02:07 min]
[windows-jdk8] [INFO] Apache Maven Wagon :: Providers :: SCM Provider .... SUCCESS [  7.990 s]
[windows-jdk8] [INFO] Apache Maven Wagon :: Providers :: SSH Common Library SUCCESS [  3.021 s]
[windows-jdk8] [INFO] Apache Maven Wagon :: Providers :: SSH Common Tests  SUCCESS [  2.489 s]
[windows-jdk8] [INFO] Apache Maven Wagon :: Providers :: SSH External Provider SUCCESS [  1.768 s]
[windows-jdk8] [INFO] Apache Maven Wagon :: Providers :: SSH Provider .... SUCCESS [  2.879 s]
[windows-jdk8] [INFO] Apache Maven Wagon :: Providers :: WebDAV Provider . SUCCESS [01:02 min]
[windows-jdk8] [INFO] ------------------------------------------------------------------------
[windows-jdk8] [INFO] BUILD SUCCESS
[windows-jdk8] [INFO] ------------------------------------------------------------------------
[windows-jdk8] [INFO] Total time: 12:49 min
[windows-jdk8] [INFO] Finished at: 2017-11-29T23:14:53Z
[windows-jdk8] [INFO] Final Memory: 67M/977M
[windows-jdk8] [INFO] ------------------------------------------------------------------------
[windows-jdk8] [jenkins-maven-event-spy] INFO generated F:\jenkins\jenkins-slave\workspace\aven-wip_maven-wagon_master-5K354YLK5AXXQUUW5V5Z77PJKZZHHNUK4T63UGJYZBOC7XIFPWDA@2@tmp\withMavena81d68cc\maven-spy-20171129-230203-5804399528661907634774.log
[windows-jdk8] Picked up JAVA_TOOL_OPTIONS: -Dmaven.ext.class.path="f:\jenkins\jenkins-slave\workspace\aven-wip_maven-wagon_master-5K354YLK5AXXQUUW5V5Z77PJKZZHHNUK4T63UGJYZBOC7XIFPWDA@2@tmp\withMavena81d68cc\pipeline-maven-spy.jar" -Dorg.jenkinsci.plugins.pipeline.maven.reportsFolder="f:\jenkins\jenkins-slave\workspace\aven-wip_maven-wagon_master-5K354YLK5AXXQUUW5V5Z77PJKZZHHNUK4T63UGJYZBOC7XIFPWDA@2@tmp\withMavena81d68cc"
[Pipeline] [windows-jdk8] }
[Pipeline] [windows-jdk8] // dir
[Pipeline] [windows-jdk8] }
[windows-jdk8] [withMaven] artifactsPublisher - Archive artifact m\pom.xml under org\apache\maven\wagon\wagon\3.0.1-SNAPSHOT\wagon-3.0.1-SNAPSHOT.pom
[windows-jdk8] [withMaven] artifactsPublisher - Archive artifact m\wagon-provider-api\pom.xml under org\apache\maven\wagon\wagon-provider-api\3.0.1-SNAPSHOT\wagon-provider-api-3.0.1-SNAPSHOT.pom
[windows-jdk8] [withMaven] artifactsPublisher - Archive artifact m\wagon-provider-api\target\wagon-provider-api-3.0.1-SNAPSHOT.jar under org\apache\maven\wagon\wagon-provider-api\3.0.1-SNAPSHOT\wagon-provider-api-3.0.1-SNAPSHOT.jar
[windows-jdk8] [withMaven] artifactsPublisher - Archive artifact m\wagon-provider-test\pom.xml under org\apache\maven\wagon\wagon-provider-test\3.0.1-SNAPSHOT\wagon-provider-test-3.0.1-SNAPSHOT.pom
[windows-jdk8] [withMaven] artifactsPublisher - Archive artifact m\wagon-provider-test\target\wagon-provider-test-3.0.1-SNAPSHOT.jar under org\apache\maven\wagon\wagon-provider-test\3.0.1-SNAPSHOT\wagon-provider-test-3.0.1-SNAPSHOT.jar
[windows-jdk8] [withMaven] artifactsPublisher - Archive artifact m\wagon-providers\pom.xml under org\apache\maven\wagon\wagon-providers\3.0.1-SNAPSHOT\wagon-providers-3.0.1-SNAPSHOT.pom
[windows-jdk8] [withMaven] artifactsPublisher - Archive artifact m\wagon-providers\wagon-file\pom.xml under org\apache\maven\wagon\wagon-file\3.0.1-SNAPSHOT\wagon-file-3.0.1-SNAPSHOT.pom
[windows-jdk8] [withMaven] artifactsPublisher - Archive artifact m\wagon-providers\wagon-file\target\wagon-file-3.0.1-SNAPSHOT.jar under org\apache\maven\wagon\wagon-file\3.0.1-SNAPSHOT\wagon-file-3.0.1-SNAPSHOT.jar
[windows-jdk8] [withMaven] artifactsPublisher - Archive artifact m\wagon-providers\wagon-ftp\pom.xml under org\apache\maven\wagon\wagon-ftp\3.0.1-SNAPSHOT\wagon-ftp-3.0.1-SNAPSHOT.pom
[windows-jdk8] [withMaven] artifactsPublisher - Archive artifact m\wagon-providers\wagon-ftp\target\wagon-ftp-3.0.1-SNAPSHOT.jar under org\apache\maven\wagon\wagon-ftp\3.0.1-SNAPSHOT\wagon-ftp-3.0.1-SNAPSHOT.jar
[windows-jdk8] [withMaven] artifactsPublisher - Archive artifact m\wagon-providers\wagon-http-shared\pom.xml under org\apache\maven\wagon\wagon-http-shared\3.0.1-SNAPSHOT\wagon-http-shared-3.0.1-SNAPSHOT.pom
[windows-jdk8] [withMaven] artifactsPublisher - Archive artifact m\wagon-providers\wagon-http-shared\target\wagon-http-shared-3.0.1-SNAPSHOT.jar under org\apache\maven\wagon\wagon-http-shared\3.0.1-SNAPSHOT\wagon-http-shared-3.0.1-SNAPSHOT.jar
[windows-jdk8] [withMaven] artifactsPublisher - Archive artifact m\wagon-tcks\pom.xml under org\apache\maven\wagon\wagon-tcks\3.0.1-SNAPSHOT\wagon-tcks-3.0.1-SNAPSHOT.pom
[windows-jdk8] [withMaven] artifactsPublisher - Archive artifact m\wagon-tcks\wagon-tck-http\pom.xml under org\apache\maven\wagon\wagon-tck-http\3.0.1-SNAPSHOT\wagon-tck-http-3.0.1-SNAPSHOT.pom
[windows-jdk8] [withMaven] artifactsPublisher - Archive artifact m\wagon-tcks\wagon-tck-http\target\wagon-tck-http-3.0.1-SNAPSHOT.jar under org\apache\maven\wagon\wagon-tck-http\3.0.1-SNAPSHOT\wagon-tck-http-3.0.1-SNAPSHOT.jar
[windows-jdk8] [withMaven] artifactsPublisher - Archive artifact m\wagon-providers\wagon-http\pom.xml under org\apache\maven\wagon\wagon-http\3.0.1-SNAPSHOT\wagon-http-3.0.1-SNAPSHOT.pom
[windows-jdk8] [withMaven] artifactsPublisher - Archive artifact m\wagon-providers\wagon-http\target\wagon-http-3.0.1-SNAPSHOT.jar under org\apache\maven\wagon\wagon-http\3.0.1-SNAPSHOT\wagon-http-3.0.1-SNAPSHOT.jar
[windows-jdk8] [withMaven] artifactsPublisher - Archive artifact m\wagon-providers\wagon-http-lightweight\pom.xml under org\apache\maven\wagon\wagon-http-lightweight\3.0.1-SNAPSHOT\wagon-http-lightweight-3.0.1-SNAPSHOT.pom
[windows-jdk8] [withMaven] artifactsPublisher - Archive artifact m\wagon-providers\wagon-http-lightweight\target\wagon-http-lightweight-3.0.1-SNAPSHOT.jar under org\apache\maven\wagon\wagon-http-lightweight\3.0.1-SNAPSHOT\wagon-http-lightweight-3.0.1-SNAPSHOT.jar
[windows-jdk8] [withMaven] artifactsPublisher - Archive artifact m\wagon-providers\wagon-scm\pom.xml under org\apache\maven\wagon\wagon-scm\3.0.1-SNAPSHOT\wagon-scm-3.0.1-SNAPSHOT.pom
[windows-jdk8] [withMaven] artifactsPublisher - Archive artifact m\wagon-providers\wagon-scm\target\wagon-scm-3.0.1-SNAPSHOT.jar under org\apache\maven\wagon\wagon-scm\3.0.1-SNAPSHOT\wagon-scm-3.0.1-SNAPSHOT.jar
[windows-jdk8] [withMaven] artifactsPublisher - Archive artifact m\wagon-providers\wagon-ssh-common\pom.xml under org\apache\maven\wagon\wagon-ssh-common\3.0.1-SNAPSHOT\wagon-ssh-common-3.0.1-SNAPSHOT.pom
[windows-jdk8] [withMaven] artifactsPublisher - Archive artifact m\wagon-providers\wagon-ssh-common\target\wagon-ssh-common-3.0.1-SNAPSHOT.jar under org\apache\maven\wagon\wagon-ssh-common\3.0.1-SNAPSHOT\wagon-ssh-common-3.0.1-SNAPSHOT.jar
[windows-jdk8] [withMaven] artifactsPublisher - Archive artifact m\wagon-providers\wagon-ssh-common-test\pom.xml under org\apache\maven\wagon\wagon-ssh-common-test\3.0.1-SNAPSHOT\wagon-ssh-common-test-3.0.1-SNAPSHOT.pom
[windows-jdk8] [withMaven] artifactsPublisher - Archive artifact m\wagon-providers\wagon-ssh-common-test\target\wagon-ssh-common-test-3.0.1-SNAPSHOT.jar under org\apache\maven\wagon\wagon-ssh-common-test\3.0.1-SNAPSHOT\wagon-ssh-common-test-3.0.1-SNAPSHOT.jar
[windows-jdk8] [withMaven] artifactsPublisher - Archive artifact m\wagon-providers\wagon-ssh-external\pom.xml under org\apache\maven\wagon\wagon-ssh-external\3.0.1-SNAPSHOT\wagon-ssh-external-3.0.1-SNAPSHOT.pom
[windows-jdk8] [withMaven] artifactsPublisher - Archive artifact m\wagon-providers\wagon-ssh-external\target\wagon-ssh-external-3.0.1-SNAPSHOT.jar under org\apache\maven\wagon\wagon-ssh-external\3.0.1-SNAPSHOT\wagon-ssh-external-3.0.1-SNAPSHOT.jar
[windows-jdk8] [withMaven] artifactsPublisher - Archive artifact m\wagon-providers\wagon-ssh\pom.xml under org\apache\maven\wagon\wagon-ssh\3.0.1-SNAPSHOT\wagon-ssh-3.0.1-SNAPSHOT.pom
[windows-jdk8] [withMaven] artifactsPublisher - Archive artifact m\wagon-providers\wagon-ssh\target\wagon-ssh-3.0.1-SNAPSHOT.jar under org\apache\maven\wagon\wagon-ssh\3.0.1-SNAPSHOT\wagon-ssh-3.0.1-SNAPSHOT.jar
[windows-jdk8] [withMaven] artifactsPublisher - Archive artifact m\wagon-providers\wagon-webdav-jackrabbit\pom.xml under org\apache\maven\wagon\wagon-webdav-jackrabbit\3.0.1-SNAPSHOT\wagon-webdav-jackrabbit-3.0.1-SNAPSHOT.pom
[windows-jdk8] [withMaven] artifactsPublisher - Archive artifact m\wagon-providers\wagon-webdav-jackrabbit\target\wagon-webdav-jackrabbit-3.0.1-SNAPSHOT.jar under org\apache\maven\wagon\wagon-webdav-jackrabbit\3.0.1-SNAPSHOT\wagon-webdav-jackrabbit-3.0.1-SNAPSHOT.jar
[windows-jdk8] [withMaven] artifactsPublisher - Archive artifact m\target\wagon-3.0.1-SNAPSHOT-site.xml under org\apache\maven\wagon\wagon\3.0.1-SNAPSHOT\wagon-3.0.1-SNAPSHOT-site.xml
[windows-jdk8] [withMaven] artifactsPublisher - Archive artifact m\wagon-providers\target\wagon-providers-3.0.1-SNAPSHOT-site.xml under org\apache\maven\wagon\wagon-providers\3.0.1-SNAPSHOT\wagon-providers-3.0.1-SNAPSHOT-site.xml
[windows-jdk8] [withMaven] artifactsPublisher - Archive artifact m\wagon-tcks\target\wagon-tcks-3.0.1-SNAPSHOT-site.xml under org\apache\maven\wagon\wagon-tcks\3.0.1-SNAPSHOT\wagon-tcks-3.0.1-SNAPSHOT-site.xml
[windows-jdk8] [withMaven] artifactsPublisher - Archive artifact m\wagon-providers\wagon-http\target\wagon-http-3.0.1-SNAPSHOT-shaded.jar under org\apache\maven\wagon\wagon-http\3.0.1-SNAPSHOT\wagon-http-3.0.1-SNAPSHOT-shaded.jar
[windows-jdk8] [Fast Archiver] No prior successful build to compare, so performing full copy of artifacts
[windows-jdk8] [withMaven] junitPublisher - Archive test results for Maven artifact org.apache.maven.wagon:wagon-provider-api:3.0.1-SNAPSHOT generated by maven-surefire-plugin:test (default-test): m\wagon-provider-api\target\surefire-reports\*.xml
[windows-jdk8] [withMaven] junitPublisher - Jenkins JUnit Attachments Plugin not found, can't publish test attachments.Recording test results
[windows-jdk8] [withMaven] junitPublisher - Archive test results for Maven artifact org.apache.maven.wagon:wagon-provider-test:3.0.1-SNAPSHOT generated by maven-surefire-plugin:test (default-test): m\wagon-provider-test\target\surefire-reports\*.xml
[windows-jdk8] [withMaven] junitPublisher - Jenkins JUnit Attachments Plugin not found, can't publish test attachments.Recording test results
[windows-jdk8] None of the test reports contained any result
[windows-jdk8] [withMaven] junitPublisher - Archive test results for Maven artifact org.apache.maven.wagon:wagon-file:3.0.1-SNAPSHOT generated by maven-surefire-plugin:test (default-test): m\wagon-providers\wagon-file\target\surefire-reports\*.xml
[windows-jdk8] [withMaven] junitPublisher - Jenkins JUnit Attachments Plugin not found, can't publish test attachments.Recording test results
[windows-jdk8] [withMaven] junitPublisher - Archive test results for Maven artifact org.apache.maven.wagon:wagon-ftp:3.0.1-SNAPSHOT generated by maven-surefire-plugin:test (default-test): m\wagon-providers\wagon-ftp\target\surefire-reports\*.xml
[windows-jdk8] [withMaven] junitPublisher - Jenkins JUnit Attachments Plugin not found, can't publish test attachments.Recording test results
[windows-jdk8] [withMaven] junitPublisher - Archive test results for Maven artifact org.apache.maven.wagon:wagon-http-shared:3.0.1-SNAPSHOT generated by maven-surefire-plugin:test (default-test): m\wagon-providers\wagon-http-shared\target\surefire-reports\*.xml
[windows-jdk8] [withMaven] junitPublisher - Jenkins JUnit Attachments Plugin not found, can't publish test attachments.Recording test results
[windows-jdk8] [withMaven] junitPublisher - Archive test results for Maven artifact org.apache.maven.wagon:wagon-tck-http:3.0.1-SNAPSHOT generated by maven-surefire-plugin:test (default-test): m\wagon-tcks\wagon-tck-http\target\surefire-reports\*.xml
[windows-jdk8] [withMaven] junitPublisher - Jenkins JUnit Attachments Plugin not found, can't publish test attachments.Recording test results
[windows-jdk8] None of the test reports contained any result
[windows-jdk8] [withMaven] junitPublisher - Archive test results for Maven artifact org.apache.maven.wagon:wagon-http:3.0.1-SNAPSHOT generated by maven-surefire-plugin:test (default-test): m\wagon-providers\wagon-http\target\surefire-reports\*.xml
[windows-jdk8] [withMaven] junitPublisher - Jenkins JUnit Attachments Plugin not found, can't publish test attachments.Recording test results
[windows-jdk8] [withMaven] junitPublisher - Archive test results for Maven artifact org.apache.maven.wagon:wagon-http-lightweight:3.0.1-SNAPSHOT generated by maven-surefire-plugin:test (default-test): m\wagon-providers\wagon-http-lightweight\target\surefire-reports\*.xml
[windows-jdk8] [withMaven] junitPublisher - Jenkins JUnit Attachments Plugin not found, can't publish test attachments.Recording test results
[windows-jdk8] [withMaven] junitPublisher - Archive test results for Maven artifact org.apache.maven.wagon:wagon-scm:3.0.1-SNAPSHOT generated by maven-surefire-plugin:test (default-test): m\wagon-providers\wagon-scm\target\surefire-reports\*.xml
[windows-jdk8] [withMaven] junitPublisher - Jenkins JUnit Attachments Plugin not found, can't publish test attachments.Recording test results
[windows-jdk8] [withMaven] junitPublisher - Archive test results for Maven artifact org.apache.maven.wagon:wagon-ssh-common:3.0.1-SNAPSHOT generated by maven-surefire-plugin:test (default-test): m\wagon-providers\wagon-ssh-common\target\surefire-reports\*.xml
[windows-jdk8] [withMaven] junitPublisher - Jenkins JUnit Attachments Plugin not found, can't publish test attachments.Recording test results
[windows-jdk8] [withMaven] junitPublisher - Archive test results for Maven artifact org.apache.maven.wagon:wagon-ssh-common-test:3.0.1-SNAPSHOT generated by maven-surefire-plugin:test (default-test): m\wagon-providers\wagon-ssh-common-test\target\surefire-reports\*.xml
[windows-jdk8] [withMaven] junitPublisher - Jenkins JUnit Attachments Plugin not found, can't publish test attachments.Recording test results
[windows-jdk8] None of the test reports contained any result
[windows-jdk8] [withMaven] junitPublisher - Archive test results for Maven artifact org.apache.maven.wagon:wagon-ssh-external:3.0.1-SNAPSHOT generated by maven-surefire-plugin:test (default-test): m\wagon-providers\wagon-ssh-external\target\surefire-reports\*.xml
[windows-jdk8] [withMaven] junitPublisher - Jenkins JUnit Attachments Plugin not found, can't publish test attachments.Recording test results
[windows-jdk8] None of the test reports contained any result
[windows-jdk8] [withMaven] junitPublisher - Archive test results for Maven artifact org.apache.maven.wagon:wagon-ssh:3.0.1-SNAPSHOT generated by maven-surefire-plugin:test (default-test): m\wagon-providers\wagon-ssh\target\surefire-reports\*.xml
[windows-jdk8] [withMaven] junitPublisher - Jenkins JUnit Attachments Plugin not found, can't publish test attachments.Recording test results
[windows-jdk8] None of the test reports contained any result
[windows-jdk8] [withMaven] junitPublisher - Archive test results for Maven artifact org.apache.maven.wagon:wagon-webdav-jackrabbit:3.0.1-SNAPSHOT generated by maven-surefire-plugin:test (default-test): m\wagon-providers\wagon-webdav-jackrabbit\target\surefire-reports\*.xml
[windows-jdk8] [withMaven] junitPublisher - Jenkins JUnit Attachments Plugin not found, can't publish test attachments.Recording test results
[windows-jdk8] [withMaven] openTasksPublisher - Scan Tasks for Maven artifact org.apache.maven.wagon:wagon-provider-api:3.0.1-SNAPSHOT in source directory m\wagon-provider-api\src\main\java
[windows-jdk8] [withMaven] openTasksPublisher - Scan Tasks for Maven artifact org.apache.maven.wagon:wagon-provider-test:3.0.1-SNAPSHOT in source directory m\wagon-provider-test\src\main\java
[windows-jdk8] [withMaven] openTasksPublisher - Scan Tasks for Maven artifact org.apache.maven.wagon:wagon-file:3.0.1-SNAPSHOT in source directory m\wagon-providers\wagon-file\src\main\java
[windows-jdk8] [withMaven] openTasksPublisher - Scan Tasks for Maven artifact org.apache.maven.wagon:wagon-ftp:3.0.1-SNAPSHOT in source directory m\wagon-providers\wagon-ftp\src\main\java
[windows-jdk8] [withMaven] openTasksPublisher - Scan Tasks for Maven artifact org.apache.maven.wagon:wagon-http-shared:3.0.1-SNAPSHOT in source directory m\wagon-providers\wagon-http-shared\src\main\java
[windows-jdk8] [withMaven] openTasksPublisher - Scan Tasks for Maven artifact org.apache.maven.wagon:wagon-tck-http:3.0.1-SNAPSHOT in source directory m\wagon-tcks\wagon-tck-http\src\main\java
[windows-jdk8] [withMaven] openTasksPublisher - Scan Tasks for Maven artifact org.apache.maven.wagon:wagon-http:3.0.1-SNAPSHOT in source directory m\wagon-providers\wagon-http\src\main\java
[windows-jdk8] [withMaven] openTasksPublisher - Scan Tasks for Maven artifact org.apache.maven.wagon:wagon-http-lightweight:3.0.1-SNAPSHOT in source directory m\wagon-providers\wagon-http-lightweight\src\main\java
[windows-jdk8] [withMaven] openTasksPublisher - Scan Tasks for Maven artifact org.apache.maven.wagon:wagon-scm:3.0.1-SNAPSHOT in source directory m\wagon-providers\wagon-scm\src\main\java
[windows-jdk8] [withMaven] openTasksPublisher - Scan Tasks for Maven artifact org.apache.maven.wagon:wagon-ssh-common:3.0.1-SNAPSHOT in source directory m\wagon-providers\wagon-ssh-common\src\main\java
[windows-jdk8] [withMaven] openTasksPublisher - Scan Tasks for Maven artifact org.apache.maven.wagon:wagon-ssh-common-test:3.0.1-SNAPSHOT in source directory m\wagon-providers\wagon-ssh-common-test\src\main\java
[windows-jdk8] [withMaven] openTasksPublisher - Scan Tasks for Maven artifact org.apache.maven.wagon:wagon-ssh-external:3.0.1-SNAPSHOT in source directory m\wagon-providers\wagon-ssh-external\src\main\java
[windows-jdk8] [withMaven] openTasksPublisher - Scan Tasks for Maven artifact org.apache.maven.wagon:wagon-ssh:3.0.1-SNAPSHOT in source directory m\wagon-providers\wagon-ssh\src\main\java
[windows-jdk8] [withMaven] openTasksPublisher - Scan Tasks for Maven artifact org.apache.maven.wagon:wagon-webdav-jackrabbit:3.0.1-SNAPSHOT in source directory m\wagon-providers\wagon-webdav-jackrabbit\src\main\java
[windows-jdk8] [TASKS] Scanning folder 'f:\jenkins\jenkins-slave\workspace\aven-wip_maven-wagon_master-5K354YLK5AXXQUUW5V5Z77PJKZZHHNUK4T63UGJYZBOC7XIFPWDA@2' for files matching the pattern 'm\wagon-provider-api\src\main\java\**\*,m\wagon-provider-test\src\main\java\**\*,m\wagon-providers\wagon-file\src\main\java\**\*,m\wagon-providers\wagon-ftp\src\main\java\**\*,m\wagon-providers\wagon-http-shared\src\main\java\**\*,m\wagon-tcks\wagon-tck-http\src\main\java\**\*,m\wagon-providers\wagon-http\src\main\java\**\*,m\wagon-providers\wagon-http-lightweight\src\main\java\**\*,m\wagon-providers\wagon-scm\src\main\java\**\*,m\wagon-providers\wagon-ssh-common\src\main\java\**\*,m\wagon-providers\wagon-ssh-common-test\src\main\java\**\*,m\wagon-providers\wagon-ssh-external\src\main\java\**\*,m\wagon-providers\wagon-ssh\src\main\java\**\*,m\wagon-providers\wagon-webdav-jackrabbit\src\main\java\**\*' - excludes: null
[windows-jdk8] [TASKS] Found 114 files to scan for tasks
[windows-jdk8] [TASKS] Found 31 open tasks.
[windows-jdk8] Skipping warnings blame since pipelines do not have an SCM link.%n
[Pipeline] [windows-jdk8] // withMaven
[Pipeline] [windows-jdk8] }
[Pipeline] [windows-jdk8] // stage
[Pipeline] [windows-jdk8] }
[Pipeline] [windows-jdk8] // node
[Pipeline] [windows-jdk8] }
[Pipeline] // parallel
[Pipeline] stage
[Pipeline] { (Notifications)
[Pipeline] echo
Build result: UNSTABLE
[Pipeline] jiraIssueSelector
[Pipeline] emailext
Reply | Threaded
Open this post in threaded view
|

Build succeeded in Jenkins: Maven TLP (wip) » maven-wagon » master #2

Apache Jenkins Server-2
See https://builds.apache.org/job/maven-wip/job/maven-wagon/job/master/2/

Changes:

* No need to collect findbugs etc on anything other than the first
* syntax
* syntax again
* Allow 'jdk' or 'jdks'
* Better report collection optimization
* syntax ftw
* syntax take 5
* build the command line in more extensible way
* Aha\! first was being evaluated after adding the task
* capture another

All tests passed