Build unstable in Jenkins: Maven TLP (wip) » maven-scm » master #1

Previous Topic Next Topic
 
classic Classic list List threaded Threaded
3 messages Options
Reply | Threaded
Open this post in threaded view
|

Build unstable in Jenkins: Maven TLP (wip) » maven-scm » master #1

Apache Jenkins Server-2
See https://builds.apache.org/job/maven-wip/job/maven-scm/job/master/1/

No changes.

36 tests failed.
FAILED:  org.apache.maven.scm.provider.git.gitexe.command.checkin.GitCheckInCommandNoBranchTest.testCheckinNoBranch

Error Message:
The check out result success flag was false.

Stack Trace:
junit.framework.AssertionFailedError: The check out result success flag was false.
        at org.apache.maven.scm.provider.git.gitexe.command.checkin.GitCheckInCommandNoBranchTest.checkoutRepo(GitCheckInCommandNoBranchTest.java:93)
        at org.apache.maven.scm.provider.git.gitexe.command.checkin.GitCheckInCommandNoBranchTest.testCheckinNoBranch(GitCheckInCommandNoBranchTest.java:79)


FAILED:  org.apache.maven.scm.provider.git.gitexe.command.checkin.GitCheckInCommandNoBranchTest.testCheckinNoBranch

Error Message:
The check out result success flag was false.

Stack Trace:
junit.framework.AssertionFailedError: The check out result success flag was false.
        at org.apache.maven.scm.provider.git.gitexe.command.checkin.GitCheckInCommandNoBranchTest.checkoutRepo(GitCheckInCommandNoBranchTest.java:93)
        at org.apache.maven.scm.provider.git.gitexe.command.checkin.GitCheckInCommandNoBranchTest.testCheckinNoBranch(GitCheckInCommandNoBranchTest.java:79)


FAILED:  org.apache.maven.scm.provider.git.gitexe.command.checkin.GitCheckInCommandNoBranchTest.testCheckinNoBranch

Error Message:
The check out result success flag was false.

Stack Trace:
junit.framework.AssertionFailedError: The check out result success flag was false.
        at org.apache.maven.scm.provider.git.gitexe.command.checkin.GitCheckInCommandNoBranchTest.testCheckinNoBranch(GitCheckInCommandNoBranchTest.java:75)


FAILED:  org.apache.maven.scm.provider.git.gitexe.command.checkin.GitCheckInCommandNoBranchTest.testCheckinNoBranch

Error Message:
The check out result success flag was false.

Stack Trace:
junit.framework.AssertionFailedError: The check out result success flag was false.
        at org.apache.maven.scm.provider.git.gitexe.command.checkin.GitCheckInCommandNoBranchTest.checkoutRepo(GitCheckInCommandNoBranchTest.java:93)
        at org.apache.maven.scm.provider.git.gitexe.command.checkin.GitCheckInCommandNoBranchTest.testCheckinNoBranch(GitCheckInCommandNoBranchTest.java:64)


FAILED:  org.apache.maven.scm.provider.git.gitexe.command.checkin.GitCheckInCommandNoBranchTest.testCheckinNoBranch

Error Message:
The check out result success flag was false.

Stack Trace:
junit.framework.AssertionFailedError: The check out result success flag was false.
        at org.apache.maven.scm.provider.git.gitexe.command.checkin.GitCheckInCommandNoBranchTest.testCheckinNoBranch(GitCheckInCommandNoBranchTest.java:75)


FAILED:  org.apache.maven.scm.provider.git.gitexe.command.checkin.GitCheckInCommandNoBranchTest.testCheckinNoBranch

Error Message:
The check out result success flag was false.

Stack Trace:
junit.framework.AssertionFailedError: The check out result success flag was false.
        at org.apache.maven.scm.provider.git.gitexe.command.checkin.GitCheckInCommandNoBranchTest.testCheckinNoBranch(GitCheckInCommandNoBranchTest.java:75)


FAILED:  org.apache.maven.scm.provider.git.gitexe.command.checkin.GitCheckInCommandTest.testCheckinAfterRename

Error Message:
The check out result success flag was false.

Stack Trace:
junit.framework.AssertionFailedError: The check out result success flag was false.
        at org.apache.maven.scm.provider.git.gitexe.command.checkin.GitCheckInCommandTest.checkoutRepoInto(GitCheckInCommandTest.java:143)
        at org.apache.maven.scm.provider.git.gitexe.command.checkin.GitCheckInCommandTest.testCheckinAfterRename(GitCheckInCommandTest.java:99)


FAILED:  org.apache.maven.scm.provider.git.gitexe.command.checkin.GitCheckInCommandTest.testCheckinAfterRename

Error Message:
The check out result success flag was false.

Stack Trace:
junit.framework.AssertionFailedError: The check out result success flag was false.
        at org.apache.maven.scm.provider.git.gitexe.command.checkin.GitCheckInCommandTest.checkoutRepoInto(GitCheckInCommandTest.java:143)
        at org.apache.maven.scm.provider.git.gitexe.command.checkin.GitCheckInCommandTest.testCheckinAfterRename(GitCheckInCommandTest.java:99)


FAILED:  org.apache.maven.scm.provider.git.gitexe.command.checkin.GitCheckInCommandTest.testCheckinAfterRename

Error Message:
The check out result success flag was false.

Stack Trace:
junit.framework.AssertionFailedError: The check out result success flag was false.
        at org.apache.maven.scm.provider.git.gitexe.command.checkin.GitCheckInCommandTest.testCheckinAfterRename(GitCheckInCommandTest.java:113)


FAILED:  org.apache.maven.scm.provider.git.gitexe.command.checkin.GitCheckInCommandTest.testCheckinAfterRename

Error Message:
The check out result success flag was false.

Stack Trace:
junit.framework.AssertionFailedError: The check out result success flag was false.
        at org.apache.maven.scm.provider.git.gitexe.command.checkin.GitCheckInCommandTest.checkoutRepoInto(GitCheckInCommandTest.java:143)
        at org.apache.maven.scm.provider.git.gitexe.command.checkin.GitCheckInCommandTest.testCheckinAfterRename(GitCheckInCommandTest.java:99)


FAILED:  org.apache.maven.scm.provider.git.gitexe.command.checkin.GitCheckInCommandTest.testCheckinAfterRename

Error Message:
The check out result success flag was false.

Stack Trace:
junit.framework.AssertionFailedError: The check out result success flag was false.
        at org.apache.maven.scm.provider.git.gitexe.command.checkin.GitCheckInCommandTest.testCheckinAfterRename(GitCheckInCommandTest.java:113)


FAILED:  org.apache.maven.scm.provider.git.gitexe.command.checkin.GitCheckInCommandTest.testCheckinAfterRename

Error Message:
The check out result success flag was false.

Stack Trace:
junit.framework.AssertionFailedError: The check out result success flag was false.
        at org.apache.maven.scm.provider.git.gitexe.command.checkin.GitCheckInCommandTest.testCheckinAfterRename(GitCheckInCommandTest.java:113)


FAILED:  org.apache.maven.scm.provider.git.gitexe.command.checkout.GitExeCheckOutCommandNoBranchTest.testCheckoutNoBranch

Error Message:
The check out result success flag was false.

Stack Trace:
junit.framework.AssertionFailedError: The check out result success flag was false.
        at org.apache.maven.scm.provider.git.gitexe.command.checkout.GitExeCheckOutCommandNoBranchTest.checkoutRepo(GitExeCheckOutCommandNoBranchTest.java:89)
        at org.apache.maven.scm.provider.git.gitexe.command.checkout.GitExeCheckOutCommandNoBranchTest.testCheckoutNoBranch(GitExeCheckOutCommandNoBranchTest.java:65)


FAILED:  org.apache.maven.scm.provider.git.gitexe.command.checkout.GitExeCheckOutCommandNoBranchTest.testDoubleCheckoutNoBranch

Error Message:
The check out result success flag was false.

Stack Trace:
junit.framework.AssertionFailedError: The check out result success flag was false.
        at org.apache.maven.scm.provider.git.gitexe.command.checkout.GitExeCheckOutCommandNoBranchTest.checkoutRepo(GitExeCheckOutCommandNoBranchTest.java:89)
        at org.apache.maven.scm.provider.git.gitexe.command.checkout.GitExeCheckOutCommandNoBranchTest.testDoubleCheckoutNoBranch(GitExeCheckOutCommandNoBranchTest.java:77)


FAILED:  org.apache.maven.scm.provider.git.jgit.command.branch.JGitBranchCommandTckTest.testBranchCommandTest

Error Message:
Exception while executing SCM command.

Stack Trace:
org.apache.maven.scm.ScmException: Exception while executing SCM command.
Caused by: org.apache.maven.scm.ScmException: JGit checkout failure!
Caused by: org.eclipse.jgit.api.errors.JGitInternalException: Exception caught during execution of fetch command
Caused by: org.eclipse.jgit.errors.NotSupportedException: URI not supported: file://2/m/maven-scm-providers/maven-scm-providers-git/maven-scm-provider-jgit/target/scm-test/repository


FAILED:  org.apache.maven.scm.provider.git.jgit.command.changelog.JGitChangeLogCommandTckTest.testChangeLogCommand

Error Message:
Exception while executing SCM command.

Stack Trace:
org.apache.maven.scm.ScmException: Exception while executing SCM command.
Caused by: org.apache.maven.scm.ScmException: JGit checkout failure!
Caused by: org.eclipse.jgit.api.errors.JGitInternalException: Exception caught during execution of fetch command
Caused by: org.eclipse.jgit.errors.NotSupportedException: URI not supported: file://2/m/maven-scm-providers/maven-scm-providers-git/maven-scm-provider-jgit/target/scm-test/repository


FAILED:  org.apache.maven.scm.provider.git.jgit.command.checkin.JGitCheckInCommandCommitterAuthorTckTest.testCheckInCommandTest

Error Message:
Exception while executing SCM command.

Stack Trace:
org.apache.maven.scm.ScmException: Exception while executing SCM command.
        at org.apache.maven.scm.provider.git.jgit.command.checkin.JGitCheckInCommandCommitterAuthorTckTest.setUp(JGitCheckInCommandCommitterAuthorTckTest.java:60)
Caused by: org.apache.maven.scm.ScmException: JGit checkout failure!
        at org.apache.maven.scm.provider.git.jgit.command.checkin.JGitCheckInCommandCommitterAuthorTckTest.setUp(JGitCheckInCommandCommitterAuthorTckTest.java:60)
Caused by: org.eclipse.jgit.api.errors.JGitInternalException: Exception caught during execution of fetch command
        at org.apache.maven.scm.provider.git.jgit.command.checkin.JGitCheckInCommandCommitterAuthorTckTest.setUp(JGitCheckInCommandCommitterAuthorTckTest.java:60)
Caused by: org.eclipse.jgit.errors.NotSupportedException: URI not supported: file://2/m/maven-scm-providers/maven-scm-providers-git/maven-scm-provider-jgit/target/scm-test/repository
        at org.apache.maven.scm.provider.git.jgit.command.checkin.JGitCheckInCommandCommitterAuthorTckTest.setUp(JGitCheckInCommandCommitterAuthorTckTest.java:60)


FAILED:  org.apache.maven.scm.provider.git.jgit.command.checkin.JGitCheckInCommandCommitterAuthorTckTest.testCheckInCommandPartialFileset

Error Message:
Exception while executing SCM command.

Stack Trace:
org.apache.maven.scm.ScmException: Exception while executing SCM command.
        at org.apache.maven.scm.provider.git.jgit.command.checkin.JGitCheckInCommandCommitterAuthorTckTest.setUp(JGitCheckInCommandCommitterAuthorTckTest.java:60)
Caused by: org.apache.maven.scm.ScmException: JGit checkout failure!
        at org.apache.maven.scm.provider.git.jgit.command.checkin.JGitCheckInCommandCommitterAuthorTckTest.setUp(JGitCheckInCommandCommitterAuthorTckTest.java:60)
Caused by: org.eclipse.jgit.api.errors.JGitInternalException: Exception caught during execution of fetch command
        at org.apache.maven.scm.provider.git.jgit.command.checkin.JGitCheckInCommandCommitterAuthorTckTest.setUp(JGitCheckInCommandCommitterAuthorTckTest.java:60)
Caused by: org.eclipse.jgit.errors.NotSupportedException: URI not supported: file://2/m/maven-scm-providers/maven-scm-providers-git/maven-scm-provider-jgit/target/scm-test/repository
        at org.apache.maven.scm.provider.git.jgit.command.checkin.JGitCheckInCommandCommitterAuthorTckTest.setUp(JGitCheckInCommandCommitterAuthorTckTest.java:60)


FAILED:  org.apache.maven.scm.provider.git.jgit.command.checkin.JGitCheckInCommandTckTest.testCheckInCommandTest

Error Message:
Exception while executing SCM command.

Stack Trace:
org.apache.maven.scm.ScmException: Exception while executing SCM command.
Caused by: org.apache.maven.scm.ScmException: JGit checkout failure!
Caused by: org.eclipse.jgit.api.errors.JGitInternalException: Exception caught during execution of fetch command
Caused by: org.eclipse.jgit.errors.NotSupportedException: URI not supported: file://2/m/maven-scm-providers/maven-scm-providers-git/maven-scm-provider-jgit/target/scm-test/repository


FAILED:  org.apache.maven.scm.provider.git.jgit.command.checkin.JGitCheckInCommandTckTest.testCheckInCommandPartialFileset

Error Message:
Exception while executing SCM command.

Stack Trace:
org.apache.maven.scm.ScmException: Exception while executing SCM command.
Caused by: org.apache.maven.scm.ScmException: JGit checkout failure!
Caused by: org.eclipse.jgit.api.errors.JGitInternalException: Exception caught during execution of fetch command
Caused by: org.eclipse.jgit.errors.NotSupportedException: URI not supported: file://2/m/maven-scm-providers/maven-scm-providers-git/maven-scm-provider-jgit/target/scm-test/repository


FAILED:  org.apache.maven.scm.provider.git.jgit.command.checkout.JGitCheckOutCommandTckTest.testCheckOutCommandTest

Error Message:
Exception while executing SCM command.

Stack Trace:
org.apache.maven.scm.ScmException: Exception while executing SCM command.
Caused by: org.apache.maven.scm.ScmException: JGit checkout failure!
Caused by: org.eclipse.jgit.api.errors.JGitInternalException: Exception caught during execution of fetch command
Caused by: org.eclipse.jgit.errors.NotSupportedException: URI not supported: file://2/m/maven-scm-providers/maven-scm-providers-git/maven-scm-provider-jgit/target/scm-test/repository


FAILED:  org.apache.maven.scm.provider.git.jgit.command.diff.JGitDiffCommandTckTest.testDiffCommand

Error Message:
Exception while executing SCM command.

Stack Trace:
org.apache.maven.scm.ScmException: Exception while executing SCM command.
Caused by: org.apache.maven.scm.ScmException: JGit checkout failure!
Caused by: org.eclipse.jgit.api.errors.JGitInternalException: Exception caught during execution of fetch command
Caused by: org.eclipse.jgit.errors.NotSupportedException: URI not supported: file://2/m/maven-scm-providers/maven-scm-providers-git/maven-scm-provider-jgit/target/scm-test/repository


FAILED:  org.apache.maven.scm.provider.git.jgit.command.remoteinfo.JGitRemoteInfoCommandTckTest.testRemoteInfoCommand

Error Message:
Exception while executing SCM command.

Stack Trace:
org.apache.maven.scm.ScmException: Exception while executing SCM command.
Caused by: org.apache.maven.scm.ScmException: JGit checkout failure!
Caused by: org.eclipse.jgit.api.errors.JGitInternalException: Exception caught during execution of fetch command
Caused by: org.eclipse.jgit.errors.NotSupportedException: URI not supported: file://2/m/maven-scm-providers/maven-scm-providers-git/maven-scm-provider-jgit/target/scm-test/repository


FAILED:  org.apache.maven.scm.provider.git.jgit.command.status.JGitStatusCommandTckTest.testStatusCommand

Error Message:
Exception while executing SCM command.

Stack Trace:
org.apache.maven.scm.ScmException: Exception while executing SCM command.
Caused by: org.apache.maven.scm.ScmException: JGit checkout failure!
Caused by: org.eclipse.jgit.api.errors.JGitInternalException: Exception caught during execution of fetch command
Caused by: org.eclipse.jgit.errors.NotSupportedException: URI not supported: file://2/m/maven-scm-providers/maven-scm-providers-git/maven-scm-provider-jgit/target/scm-test/repository


FAILED:  org.apache.maven.scm.provider.git.jgit.command.tag.JGitTagCommandTckTest.testTagCommandTest

Error Message:
Exception while executing SCM command.

Stack Trace:
org.apache.maven.scm.ScmException: Exception while executing SCM command.
Caused by: org.apache.maven.scm.ScmException: JGit checkout failure!
Caused by: org.eclipse.jgit.api.errors.JGitInternalException: Exception caught during execution of fetch command
Caused by: org.eclipse.jgit.errors.NotSupportedException: URI not supported: file://2/m/maven-scm-providers/maven-scm-providers-git/maven-scm-provider-jgit/target/scm-test/repository


FAILED:  org.apache.maven.scm.plugin.BranchMojoTest.testBranch

Error Message:
Command failed.The svn command failed.

Stack Trace:
org.apache.maven.plugin.MojoExecutionException: Command failed.The svn command failed.
        at org.apache.maven.scm.plugin.BranchMojoTest.setUp(BranchMojoTest.java:74)


FAILED:  org.apache.maven.scm.plugin.ChangeLogMojoTest.testChangeLogWithParameters

Error Message:
Command failed.The svn command failed.

Stack Trace:
org.apache.maven.plugin.MojoExecutionException: Command failed.The svn command failed.
        at org.apache.maven.scm.plugin.ChangeLogMojoTest.testChangeLogWithParameters(ChangeLogMojoTest.java:102)


FAILED:  org.apache.maven.scm.plugin.ChangeLogMojoTest.testChangeLog

Error Message:
Command failed.The svn command failed.

Stack Trace:
org.apache.maven.plugin.MojoExecutionException: Command failed.The svn command failed.
        at org.apache.maven.scm.plugin.ChangeLogMojoTest.testChangeLog(ChangeLogMojoTest.java:79)


FAILED:  org.apache.maven.scm.plugin.CheckoutMojoTest.testExcludeInclude

Error Message:
Command failed.The svn command failed.

Stack Trace:
org.apache.maven.plugin.MojoExecutionException: Command failed.The svn command failed.
        at org.apache.maven.scm.plugin.CheckoutMojoTest.testExcludeInclude(CheckoutMojoTest.java:153)


FAILED:  org.apache.maven.scm.plugin.CheckoutMojoTest.testUseExport

Error Message:
Command failed.The svn command failed.

Stack Trace:
org.apache.maven.plugin.MojoExecutionException: Command failed.The svn command failed.
        at org.apache.maven.scm.plugin.CheckoutMojoTest.testUseExport(CheckoutMojoTest.java:132)


FAILED:  org.apache.maven.scm.plugin.CheckoutMojoTest.testSkipCheckoutWithConnectionUrl

Error Message:
Command failed.The svn command failed.

Stack Trace:
org.apache.maven.plugin.MojoExecutionException: Command failed.The svn command failed.
        at org.apache.maven.scm.plugin.CheckoutMojoTest.testSkipCheckoutWithConnectionUrl(CheckoutMojoTest.java:96)


FAILED:  org.apache.maven.scm.plugin.ExportMojoTest.testExcludeInclude

Error Message:
Command failed.The svn command failed.

Stack Trace:
org.apache.maven.plugin.MojoExecutionException: Command failed.The svn command failed.
        at org.apache.maven.scm.plugin.ExportMojoTest.testExcludeInclude(ExportMojoTest.java:90)


FAILED:  org.apache.maven.scm.plugin.ExportMojoTest.testExport

Error Message:
Command failed.The svn command failed.

Stack Trace:
org.apache.maven.plugin.MojoExecutionException: Command failed.The svn command failed.
        at org.apache.maven.scm.plugin.ExportMojoTest.testExport(ExportMojoTest.java:55)


FAILED:  org.apache.maven.scm.plugin.TagMojoTest.testTag

Error Message:
Command failed.The svn command failed.

Stack Trace:
org.apache.maven.plugin.MojoExecutionException: Command failed.The svn command failed.
        at org.apache.maven.scm.plugin.TagMojoTest.setUp(TagMojoTest.java:74)


FAILED:  org.apache.maven.scm.plugin.TagMojoTest.testTagWithTimestamp

Error Message:
Command failed.The svn command failed.

Stack Trace:
org.apache.maven.plugin.MojoExecutionException: Command failed.The svn command failed.
        at org.apache.maven.scm.plugin.TagMojoTest.setUp(TagMojoTest.java:74)


FAILED:  org.apache.maven.scm.plugin.UpdateMojoTest.testSkipCheckoutWithConnectionUrl

Error Message:
Command failed.The svn command failed.

Stack Trace:
org.apache.maven.plugin.MojoExecutionException: Command failed.The svn command failed.
        at org.apache.maven.scm.plugin.UpdateMojoTest.testSkipCheckoutWithConnectionUrl(UpdateMojoTest.java:73)




Build log:
[...truncated 5.65 MB...]
[linux-jdk9] [INFO] Installing /home/jenkins/jenkins-slave/workspace/maven-wip_maven-scm_master-ADXNUB4JTUUV5E57KMRFZSZVGMFJJBVMKSOJS62JASEIC2763EUQ/m/maven-scm-client/pom.xml to /home/jenkins/jenkins-slave/workspace/maven-wip_maven-scm_master-ADXNUB4JTUUV5E57KMRFZSZVGMFJJBVMKSOJS62JASEIC2763EUQ/m/maven-scm-plugin/target/local-repo/org/apache/maven/scm/maven-scm-client/1.9.6-SNAPSHOT/maven-scm-client-1.9.6-SNAPSHOT.pom
[linux-jdk9] [INFO] Installing /home/jenkins/jenkins-slave/workspace/maven-wip_maven-scm_master-ADXNUB4JTUUV5E57KMRFZSZVGMFJJBVMKSOJS62JASEIC2763EUQ/m/maven-scm-client/target/maven-scm-client-1.9.6-SNAPSHOT.jar to /home/jenkins/jenkins-slave/workspace/maven-wip_maven-scm_master-ADXNUB4JTUUV5E57KMRFZSZVGMFJJBVMKSOJS62JASEIC2763EUQ/m/maven-scm-plugin/target/local-repo/org/apache/maven/scm/maven-scm-client/1.9.6-SNAPSHOT/maven-scm-client-1.9.6-SNAPSHOT.jar
[linux-jdk9] [INFO] Installing /home/jenkins/jenkins-slave/workspace/maven-wip_maven-scm_master-ADXNUB4JTUUV5E57KMRFZSZVGMFJJBVMKSOJS62JASEIC2763EUQ/m/maven-scm-client/target/maven-scm-client-1.9.6-SNAPSHOT-jar-with-dependencies.jar to /home/jenkins/jenkins-slave/workspace/maven-wip_maven-scm_master-ADXNUB4JTUUV5E57KMRFZSZVGMFJJBVMKSOJS62JASEIC2763EUQ/m/maven-scm-plugin/target/local-repo/org/apache/maven/scm/maven-scm-client/1.9.6-SNAPSHOT/maven-scm-client-1.9.6-SNAPSHOT-jar-with-dependencies.jar
[linux-jdk9] [INFO] Installing /home/jenkins/jenkins-slave/workspace/maven-wip_maven-scm_master-ADXNUB4JTUUV5E57KMRFZSZVGMFJJBVMKSOJS62JASEIC2763EUQ/m/maven-scm-plugin/pom.xml to /home/jenkins/jenkins-slave/workspace/maven-wip_maven-scm_master-ADXNUB4JTUUV5E57KMRFZSZVGMFJJBVMKSOJS62JASEIC2763EUQ/m/maven-scm-plugin/target/local-repo/org/apache/maven/plugins/maven-scm-plugin/1.9.6-SNAPSHOT/maven-scm-plugin-1.9.6-SNAPSHOT.pom
[linux-jdk9] [INFO] Installing /home/jenkins/jenkins-slave/workspace/maven-wip_maven-scm_master-ADXNUB4JTUUV5E57KMRFZSZVGMFJJBVMKSOJS62JASEIC2763EUQ/m/maven-scm-plugin/target/maven-scm-plugin-1.9.6-SNAPSHOT.jar to /home/jenkins/jenkins-slave/workspace/maven-wip_maven-scm_master-ADXNUB4JTUUV5E57KMRFZSZVGMFJJBVMKSOJS62JASEIC2763EUQ/m/maven-scm-plugin/target/local-repo/org/apache/maven/plugins/maven-scm-plugin/1.9.6-SNAPSHOT/maven-scm-plugin-1.9.6-SNAPSHOT.jar
[linux-jdk9] [jenkins-maven-event-spy] INFO start of goal org.apache.maven.plugins:maven-invoker-plugin:run, disabling spy in IT tests.
[linux-jdk9] [INFO]
[linux-jdk9] [INFO] --- maven-invoker-plugin:2.0.0:run (integration-test) @ maven-scm-plugin ---
[linux-jdk9] [INFO] No projects were selected for execution.
[linux-jdk9] [INFO]
[linux-jdk9] [INFO] --- maven-checkstyle-plugin:2.15:check (checkstyle-check) @ maven-scm-plugin ---
[linux-jdk9] [INFO] There are 5 errors reported by Checkstyle 6.1.1 with config/maven_checks.xml ruleset.
[linux-jdk9] [ERROR] src/main/java/org/apache/maven/scm/plugin/BootstrapMojo.java[3] (header) RegexpHeader: Line does not match expected header line of '^/\*\s*$'.
[linux-jdk9] [ERROR] src/main/java/org/apache/maven/scm/plugin/BootstrapMojo.java[72:53] (whitespace) WhitespaceAround: '=' is not preceded with whitespace.
[linux-jdk9] [ERROR] src/main/java/org/apache/maven/scm/plugin/BootstrapMojo.java[72:54] (whitespace) WhitespaceAround: '=' is not followed by whitespace.
[linux-jdk9] [ERROR] src/main/java/org/apache/maven/scm/plugin/BootstrapMojo.java[72:69] (whitespace) ParenPad: ')' is not preceded with whitespace.
[linux-jdk9] [ERROR] src/main/java/org/apache/maven/scm/plugin/BootstrapMojo.java[120:39] (whitespace) WhitespaceAfter: ';' is not followed by whitespace.
[linux-jdk9] [WARNING] checkstyle:check violations detected but failOnViolation set to false
[linux-jdk9] [INFO] ------------------------------------------------------------------------
[linux-jdk9] [INFO] Reactor Summary:
[linux-jdk9] [INFO]
[linux-jdk9] [INFO] Maven SCM .......................................... SUCCESS [ 13.971 s]
[linux-jdk9] [INFO] Maven SCM API ...................................... SUCCESS [  6.985 s]
[linux-jdk9] [INFO] Maven SCM Managers ................................. SUCCESS [  0.685 s]
[linux-jdk9] [INFO] Maven SCM Manager for Plexus ....................... SUCCESS [  1.701 s]
[linux-jdk9] [INFO] Maven SCM Test ..................................... SUCCESS [  2.704 s]
[linux-jdk9] [INFO] Maven SCM Providers ................................ SUCCESS [  0.901 s]
[linux-jdk9] [INFO] Maven SCM AccuRev Provider ......................... SUCCESS [  6.095 s]
[linux-jdk9] [INFO] Maven SCM Bazaar Provider .......................... SUCCESS [  2.781 s]
[linux-jdk9] [INFO] Maven SCM Clearcase Provider ....................... SUCCESS [  4.552 s]
[linux-jdk9] [INFO] Maven SCM CVS Provider - Parent .................... SUCCESS [  0.640 s]
[linux-jdk9] [INFO] Maven SCM CVS Provider TCK tests ................... SUCCESS [  1.109 s]
[linux-jdk9] [INFO] Maven SCM CVS Provider - Common library ............ SUCCESS [  3.029 s]
[linux-jdk9] [INFO] Maven SCM CVS Provider - CVS Executable Impl. ...... SUCCESS [  2.367 s]
[linux-jdk9] [INFO] Maven SCM CVS Provider - CVS Java Impl. ............ SUCCESS [  2.532 s]
[linux-jdk9] [INFO] Maven SCM Mercurial (Hg) Provider .................. SUCCESS [  2.189 s]
[linux-jdk9] [INFO] Maven SCM Git Provider - Parent .................... SUCCESS [  0.654 s]
[linux-jdk9] [INFO] Maven SCM Git Provider - Common library ............ SUCCESS [  2.488 s]
[linux-jdk9] [INFO] Maven SCM Git Provider TCK Tests ................... SUCCESS [  0.860 s]
[linux-jdk9] [INFO] Maven SCM Git Provider - Git Executable Impl. ...... SUCCESS [  4.323 s]
[linux-jdk9] [INFO] Maven SCM Git Provider - JGit Impl. ................ SUCCESS [ 29.407 s]
[linux-jdk9] [INFO] Maven SCM Local Provider ........................... SUCCESS [  2.289 s]
[linux-jdk9] [INFO] Maven SCM Perforce Provider ........................ SUCCESS [  3.231 s]
[linux-jdk9] [INFO] Maven SCM Starteam Provider ........................ SUCCESS [  4.790 s]
[linux-jdk9] [INFO] Maven SCM Subversion Provider - Parent ............. SUCCESS [  0.591 s]
[linux-jdk9] [INFO] Maven SCM Subversion Provider - Common library ..... SUCCESS [  2.486 s]
[linux-jdk9] [INFO] Maven SCM Subversion Provider TCK Tests ............ SUCCESS [  0.867 s]
[linux-jdk9] [INFO] Maven SCM Subversion Provider - SVN Executable Impl. SUCCESS [  4.109 s]
[linux-jdk9] [INFO] Maven SCM Synergy Provider ......................... SUCCESS [  2.966 s]
[linux-jdk9] [INFO] Maven SCM Visual Source Safe Provider .............. SUCCESS [  3.479 s]
[linux-jdk9] [INFO] Maven SCM TFS Provider ............................. SUCCESS [  2.508 s]
[linux-jdk9] [INFO] Maven SCM MKS Integrity Provider ................... SUCCESS [  3.086 s]
[linux-jdk9] [INFO] Maven SCM Jazz/Rational Team Concert Provider ...... SUCCESS [  3.382 s]
[linux-jdk9] [INFO] Maven SCM Standard Providers ....................... SUCCESS [  1.817 s]
[linux-jdk9] [INFO] Maven SCM Client ................................... SUCCESS [  3.749 s]
[linux-jdk9] [INFO] Maven SCM Plugin ................................... SUCCESS [ 50.038 s]
[linux-jdk9] [INFO] ------------------------------------------------------------------------
[linux-jdk9] [INFO] BUILD SUCCESS
[linux-jdk9] [INFO] ------------------------------------------------------------------------
[linux-jdk9] [INFO] Total time: 03:01 min
[linux-jdk9] [INFO] Finished at: 2017-11-29T23:03:18Z
[linux-jdk9] [INFO] Final Memory: 69M/224M
[linux-jdk9] [INFO] ------------------------------------------------------------------------
[linux-jdk9] [jenkins-maven-event-spy] INFO generated /home/jenkins/jenkins-slave/workspace/maven-wip_maven-scm_master-ADXNUB4JTUUV5E57KMRFZSZVGMFJJBVMKSOJS62JASEIC2763EUQ@tmp/withMaven131b54e5/maven-spy-20171129-230017-151023795365099003980.log
[Pipeline] [linux-jdk9] }
[Pipeline] [linux-jdk9] // dir
[Pipeline] [linux-jdk9] }
[linux-jdk9] [withMaven] artifactsPublisher - Archive artifact m/pom.xml under org/apache/maven/scm/maven-scm/1.9.6-SNAPSHOT/maven-scm-1.9.6-SNAPSHOT.pom
[linux-jdk9] [withMaven] artifactsPublisher - Archive artifact m/maven-scm-api/pom.xml under org/apache/maven/scm/maven-scm-api/1.9.6-SNAPSHOT/maven-scm-api-1.9.6-SNAPSHOT.pom
[linux-jdk9] [withMaven] artifactsPublisher - Archive artifact m/maven-scm-api/target/maven-scm-api-1.9.6-SNAPSHOT.jar under org/apache/maven/scm/maven-scm-api/1.9.6-SNAPSHOT/maven-scm-api-1.9.6-SNAPSHOT.jar
[linux-jdk9] [withMaven] artifactsPublisher - Archive artifact m/maven-scm-managers/pom.xml under org/apache/maven/scm/maven-scm-managers/1.9.6-SNAPSHOT/maven-scm-managers-1.9.6-SNAPSHOT.pom
[linux-jdk9] [withMaven] artifactsPublisher - Archive artifact m/maven-scm-managers/maven-scm-manager-plexus/pom.xml under org/apache/maven/scm/maven-scm-manager-plexus/1.9.6-SNAPSHOT/maven-scm-manager-plexus-1.9.6-SNAPSHOT.pom
[linux-jdk9] [withMaven] artifactsPublisher - Archive artifact m/maven-scm-managers/maven-scm-manager-plexus/target/maven-scm-manager-plexus-1.9.6-SNAPSHOT.jar under org/apache/maven/scm/maven-scm-manager-plexus/1.9.6-SNAPSHOT/maven-scm-manager-plexus-1.9.6-SNAPSHOT.jar
[linux-jdk9] [withMaven] artifactsPublisher - Archive artifact m/maven-scm-test/pom.xml under org/apache/maven/scm/maven-scm-test/1.9.6-SNAPSHOT/maven-scm-test-1.9.6-SNAPSHOT.pom
[linux-jdk9] [withMaven] artifactsPublisher - Archive artifact m/maven-scm-test/target/maven-scm-test-1.9.6-SNAPSHOT.jar under org/apache/maven/scm/maven-scm-test/1.9.6-SNAPSHOT/maven-scm-test-1.9.6-SNAPSHOT.jar
[linux-jdk9] [withMaven] artifactsPublisher - Archive artifact m/maven-scm-providers/pom.xml under org/apache/maven/scm/maven-scm-providers/1.9.6-SNAPSHOT/maven-scm-providers-1.9.6-SNAPSHOT.pom
[linux-jdk9] [withMaven] artifactsPublisher - Archive artifact m/maven-scm-providers/maven-scm-provider-accurev/pom.xml under org/apache/maven/scm/maven-scm-provider-accurev/1.9.6-SNAPSHOT/maven-scm-provider-accurev-1.9.6-SNAPSHOT.pom
[linux-jdk9] [withMaven] artifactsPublisher - Archive artifact m/maven-scm-providers/maven-scm-provider-accurev/target/maven-scm-provider-accurev-1.9.6-SNAPSHOT.jar under org/apache/maven/scm/maven-scm-provider-accurev/1.9.6-SNAPSHOT/maven-scm-provider-accurev-1.9.6-SNAPSHOT.jar
[linux-jdk9] [withMaven] artifactsPublisher - Archive artifact m/maven-scm-providers/maven-scm-provider-bazaar/pom.xml under org/apache/maven/scm/maven-scm-provider-bazaar/1.9.6-SNAPSHOT/maven-scm-provider-bazaar-1.9.6-SNAPSHOT.pom
[linux-jdk9] [withMaven] artifactsPublisher - Archive artifact m/maven-scm-providers/maven-scm-provider-bazaar/target/maven-scm-provider-bazaar-1.9.6-SNAPSHOT.jar under org/apache/maven/scm/maven-scm-provider-bazaar/1.9.6-SNAPSHOT/maven-scm-provider-bazaar-1.9.6-SNAPSHOT.jar
[linux-jdk9] [withMaven] artifactsPublisher - Archive artifact m/maven-scm-providers/maven-scm-provider-clearcase/pom.xml under org/apache/maven/scm/maven-scm-provider-clearcase/1.9.6-SNAPSHOT/maven-scm-provider-clearcase-1.9.6-SNAPSHOT.pom
[linux-jdk9] [withMaven] artifactsPublisher - Archive artifact m/maven-scm-providers/maven-scm-provider-clearcase/target/maven-scm-provider-clearcase-1.9.6-SNAPSHOT.jar under org/apache/maven/scm/maven-scm-provider-clearcase/1.9.6-SNAPSHOT/maven-scm-provider-clearcase-1.9.6-SNAPSHOT.jar
[linux-jdk9] [withMaven] artifactsPublisher - Archive artifact m/maven-scm-providers/maven-scm-providers-cvs/pom.xml under org/apache/maven/scm/maven-scm-providers-cvs/1.9.6-SNAPSHOT/maven-scm-providers-cvs-1.9.6-SNAPSHOT.pom
[linux-jdk9] [withMaven] artifactsPublisher - Archive artifact m/maven-scm-providers/maven-scm-providers-cvs/maven-scm-provider-cvstest/pom.xml under org/apache/maven/scm/maven-scm-provider-cvstest/1.9.6-SNAPSHOT/maven-scm-provider-cvstest-1.9.6-SNAPSHOT.pom
[linux-jdk9] [withMaven] artifactsPublisher - Archive artifact m/maven-scm-providers/maven-scm-providers-cvs/maven-scm-provider-cvstest/target/maven-scm-provider-cvstest-1.9.6-SNAPSHOT.jar under org/apache/maven/scm/maven-scm-provider-cvstest/1.9.6-SNAPSHOT/maven-scm-provider-cvstest-1.9.6-SNAPSHOT.jar
[linux-jdk9] [withMaven] artifactsPublisher - Archive artifact m/maven-scm-providers/maven-scm-providers-cvs/maven-scm-provider-cvs-commons/pom.xml under org/apache/maven/scm/maven-scm-provider-cvs-commons/1.9.6-SNAPSHOT/maven-scm-provider-cvs-commons-1.9.6-SNAPSHOT.pom
[linux-jdk9] [withMaven] artifactsPublisher - Archive artifact m/maven-scm-providers/maven-scm-providers-cvs/maven-scm-provider-cvs-commons/target/maven-scm-provider-cvs-commons-1.9.6-SNAPSHOT.jar under org/apache/maven/scm/maven-scm-provider-cvs-commons/1.9.6-SNAPSHOT/maven-scm-provider-cvs-commons-1.9.6-SNAPSHOT.jar
[linux-jdk9] [withMaven] artifactsPublisher - Archive artifact m/maven-scm-providers/maven-scm-providers-cvs/maven-scm-provider-cvsexe/pom.xml under org/apache/maven/scm/maven-scm-provider-cvsexe/1.9.6-SNAPSHOT/maven-scm-provider-cvsexe-1.9.6-SNAPSHOT.pom
[linux-jdk9] [withMaven] artifactsPublisher - Archive artifact m/maven-scm-providers/maven-scm-providers-cvs/maven-scm-provider-cvsexe/target/maven-scm-provider-cvsexe-1.9.6-SNAPSHOT.jar under org/apache/maven/scm/maven-scm-provider-cvsexe/1.9.6-SNAPSHOT/maven-scm-provider-cvsexe-1.9.6-SNAPSHOT.jar
[linux-jdk9] [withMaven] artifactsPublisher - Archive artifact m/maven-scm-providers/maven-scm-providers-cvs/maven-scm-provider-cvsjava/pom.xml under org/apache/maven/scm/maven-scm-provider-cvsjava/1.9.6-SNAPSHOT/maven-scm-provider-cvsjava-1.9.6-SNAPSHOT.pom
[linux-jdk9] [withMaven] artifactsPublisher - Archive artifact m/maven-scm-providers/maven-scm-providers-cvs/maven-scm-provider-cvsjava/target/maven-scm-provider-cvsjava-1.9.6-SNAPSHOT.jar under org/apache/maven/scm/maven-scm-provider-cvsjava/1.9.6-SNAPSHOT/maven-scm-provider-cvsjava-1.9.6-SNAPSHOT.jar
[linux-jdk9] [withMaven] artifactsPublisher - Archive artifact m/maven-scm-providers/maven-scm-provider-hg/pom.xml under org/apache/maven/scm/maven-scm-provider-hg/1.9.6-SNAPSHOT/maven-scm-provider-hg-1.9.6-SNAPSHOT.pom
[linux-jdk9] [withMaven] artifactsPublisher - Archive artifact m/maven-scm-providers/maven-scm-provider-hg/target/maven-scm-provider-hg-1.9.6-SNAPSHOT.jar under org/apache/maven/scm/maven-scm-provider-hg/1.9.6-SNAPSHOT/maven-scm-provider-hg-1.9.6-SNAPSHOT.jar
[linux-jdk9] [withMaven] artifactsPublisher - Archive artifact m/maven-scm-providers/maven-scm-providers-git/pom.xml under org/apache/maven/scm/maven-scm-providers-git/1.9.6-SNAPSHOT/maven-scm-providers-git-1.9.6-SNAPSHOT.pom
[linux-jdk9] [withMaven] artifactsPublisher - Archive artifact m/maven-scm-providers/maven-scm-providers-git/maven-scm-provider-git-commons/pom.xml under org/apache/maven/scm/maven-scm-provider-git-commons/1.9.6-SNAPSHOT/maven-scm-provider-git-commons-1.9.6-SNAPSHOT.pom
[linux-jdk9] [withMaven] artifactsPublisher - Archive artifact m/maven-scm-providers/maven-scm-providers-git/maven-scm-provider-git-commons/target/maven-scm-provider-git-commons-1.9.6-SNAPSHOT.jar under org/apache/maven/scm/maven-scm-provider-git-commons/1.9.6-SNAPSHOT/maven-scm-provider-git-commons-1.9.6-SNAPSHOT.jar
[linux-jdk9] [withMaven] artifactsPublisher - Archive artifact m/maven-scm-providers/maven-scm-providers-git/maven-scm-provider-gittest/pom.xml under org/apache/maven/scm/maven-scm-provider-gittest/1.9.6-SNAPSHOT/maven-scm-provider-gittest-1.9.6-SNAPSHOT.pom
[linux-jdk9] [withMaven] artifactsPublisher - Archive artifact m/maven-scm-providers/maven-scm-providers-git/maven-scm-provider-gittest/target/maven-scm-provider-gittest-1.9.6-SNAPSHOT.jar under org/apache/maven/scm/maven-scm-provider-gittest/1.9.6-SNAPSHOT/maven-scm-provider-gittest-1.9.6-SNAPSHOT.jar
[linux-jdk9] [withMaven] artifactsPublisher - Archive artifact m/maven-scm-providers/maven-scm-providers-git/maven-scm-provider-gitexe/pom.xml under org/apache/maven/scm/maven-scm-provider-gitexe/1.9.6-SNAPSHOT/maven-scm-provider-gitexe-1.9.6-SNAPSHOT.pom
[linux-jdk9] [withMaven] artifactsPublisher - Archive artifact m/maven-scm-providers/maven-scm-providers-git/maven-scm-provider-gitexe/target/maven-scm-provider-gitexe-1.9.6-SNAPSHOT.jar under org/apache/maven/scm/maven-scm-provider-gitexe/1.9.6-SNAPSHOT/maven-scm-provider-gitexe-1.9.6-SNAPSHOT.jar
[linux-jdk9] [withMaven] artifactsPublisher - Archive artifact m/maven-scm-providers/maven-scm-providers-git/maven-scm-provider-jgit/pom.xml under org/apache/maven/scm/maven-scm-provider-jgit/1.9.6-SNAPSHOT/maven-scm-provider-jgit-1.9.6-SNAPSHOT.pom
[linux-jdk9] [withMaven] artifactsPublisher - Archive artifact m/maven-scm-providers/maven-scm-providers-git/maven-scm-provider-jgit/target/maven-scm-provider-jgit-1.9.6-SNAPSHOT.jar under org/apache/maven/scm/maven-scm-provider-jgit/1.9.6-SNAPSHOT/maven-scm-provider-jgit-1.9.6-SNAPSHOT.jar
[linux-jdk9] [withMaven] artifactsPublisher - Archive artifact m/maven-scm-providers/maven-scm-provider-local/pom.xml under org/apache/maven/scm/maven-scm-provider-local/1.9.6-SNAPSHOT/maven-scm-provider-local-1.9.6-SNAPSHOT.pom
[linux-jdk9] [withMaven] artifactsPublisher - Archive artifact m/maven-scm-providers/maven-scm-provider-local/target/maven-scm-provider-local-1.9.6-SNAPSHOT.jar under org/apache/maven/scm/maven-scm-provider-local/1.9.6-SNAPSHOT/maven-scm-provider-local-1.9.6-SNAPSHOT.jar
[linux-jdk9] [withMaven] artifactsPublisher - Archive artifact m/maven-scm-providers/maven-scm-provider-perforce/pom.xml under org/apache/maven/scm/maven-scm-provider-perforce/1.9.6-SNAPSHOT/maven-scm-provider-perforce-1.9.6-SNAPSHOT.pom
[linux-jdk9] [withMaven] artifactsPublisher - Archive artifact m/maven-scm-providers/maven-scm-provider-perforce/target/maven-scm-provider-perforce-1.9.6-SNAPSHOT.jar under org/apache/maven/scm/maven-scm-provider-perforce/1.9.6-SNAPSHOT/maven-scm-provider-perforce-1.9.6-SNAPSHOT.jar
[linux-jdk9] [withMaven] artifactsPublisher - Archive artifact m/maven-scm-providers/maven-scm-provider-starteam/pom.xml under org/apache/maven/scm/maven-scm-provider-starteam/1.9.6-SNAPSHOT/maven-scm-provider-starteam-1.9.6-SNAPSHOT.pom
[linux-jdk9] [withMaven] artifactsPublisher - Archive artifact m/maven-scm-providers/maven-scm-provider-starteam/target/maven-scm-provider-starteam-1.9.6-SNAPSHOT.jar under org/apache/maven/scm/maven-scm-provider-starteam/1.9.6-SNAPSHOT/maven-scm-provider-starteam-1.9.6-SNAPSHOT.jar
[linux-jdk9] [withMaven] artifactsPublisher - Archive artifact m/maven-scm-providers/maven-scm-providers-svn/pom.xml under org/apache/maven/scm/maven-scm-providers-svn/1.9.6-SNAPSHOT/maven-scm-providers-svn-1.9.6-SNAPSHOT.pom
[linux-jdk9] [withMaven] artifactsPublisher - Archive artifact m/maven-scm-providers/maven-scm-providers-svn/maven-scm-provider-svn-commons/pom.xml under org/apache/maven/scm/maven-scm-provider-svn-commons/1.9.6-SNAPSHOT/maven-scm-provider-svn-commons-1.9.6-SNAPSHOT.pom
[linux-jdk9] [withMaven] artifactsPublisher - Archive artifact m/maven-scm-providers/maven-scm-providers-svn/maven-scm-provider-svn-commons/target/maven-scm-provider-svn-commons-1.9.6-SNAPSHOT.jar under org/apache/maven/scm/maven-scm-provider-svn-commons/1.9.6-SNAPSHOT/maven-scm-provider-svn-commons-1.9.6-SNAPSHOT.jar
[linux-jdk9] [withMaven] artifactsPublisher - Archive artifact m/maven-scm-providers/maven-scm-providers-svn/maven-scm-provider-svntest/pom.xml under org/apache/maven/scm/maven-scm-provider-svntest/1.9.6-SNAPSHOT/maven-scm-provider-svntest-1.9.6-SNAPSHOT.pom
[linux-jdk9] [withMaven] artifactsPublisher - Archive artifact m/maven-scm-providers/maven-scm-providers-svn/maven-scm-provider-svntest/target/maven-scm-provider-svntest-1.9.6-SNAPSHOT.jar under org/apache/maven/scm/maven-scm-provider-svntest/1.9.6-SNAPSHOT/maven-scm-provider-svntest-1.9.6-SNAPSHOT.jar
[linux-jdk9] [withMaven] artifactsPublisher - Archive artifact m/maven-scm-providers/maven-scm-providers-svn/maven-scm-provider-svnexe/pom.xml under org/apache/maven/scm/maven-scm-provider-svnexe/1.9.6-SNAPSHOT/maven-scm-provider-svnexe-1.9.6-SNAPSHOT.pom
[linux-jdk9] [withMaven] artifactsPublisher - Archive artifact m/maven-scm-providers/maven-scm-providers-svn/maven-scm-provider-svnexe/target/maven-scm-provider-svnexe-1.9.6-SNAPSHOT.jar under org/apache/maven/scm/maven-scm-provider-svnexe/1.9.6-SNAPSHOT/maven-scm-provider-svnexe-1.9.6-SNAPSHOT.jar
[linux-jdk9] [withMaven] artifactsPublisher - Archive artifact m/maven-scm-providers/maven-scm-provider-synergy/pom.xml under org/apache/maven/scm/maven-scm-provider-synergy/1.9.6-SNAPSHOT/maven-scm-provider-synergy-1.9.6-SNAPSHOT.pom
[linux-jdk9] [withMaven] artifactsPublisher - Archive artifact m/maven-scm-providers/maven-scm-provider-synergy/target/maven-scm-provider-synergy-1.9.6-SNAPSHOT.jar under org/apache/maven/scm/maven-scm-provider-synergy/1.9.6-SNAPSHOT/maven-scm-provider-synergy-1.9.6-SNAPSHOT.jar
[linux-jdk9] [withMaven] artifactsPublisher - Archive artifact m/maven-scm-providers/maven-scm-provider-vss/pom.xml under org/apache/maven/scm/maven-scm-provider-vss/1.9.6-SNAPSHOT/maven-scm-provider-vss-1.9.6-SNAPSHOT.pom
[linux-jdk9] [withMaven] artifactsPublisher - Archive artifact m/maven-scm-providers/maven-scm-provider-vss/target/maven-scm-provider-vss-1.9.6-SNAPSHOT.jar under org/apache/maven/scm/maven-scm-provider-vss/1.9.6-SNAPSHOT/maven-scm-provider-vss-1.9.6-SNAPSHOT.jar
[linux-jdk9] [withMaven] artifactsPublisher - Archive artifact m/maven-scm-providers/maven-scm-provider-tfs/pom.xml under org/apache/maven/scm/maven-scm-provider-tfs/1.9.6-SNAPSHOT/maven-scm-provider-tfs-1.9.6-SNAPSHOT.pom
[linux-jdk9] [withMaven] artifactsPublisher - Archive artifact m/maven-scm-providers/maven-scm-provider-tfs/target/maven-scm-provider-tfs-1.9.6-SNAPSHOT.jar under org/apache/maven/scm/maven-scm-provider-tfs/1.9.6-SNAPSHOT/maven-scm-provider-tfs-1.9.6-SNAPSHOT.jar
[linux-jdk9] [withMaven] artifactsPublisher - Archive artifact m/maven-scm-providers/maven-scm-provider-integrity/pom.xml under org/apache/maven/scm/maven-scm-provider-integrity/1.9.6-SNAPSHOT/maven-scm-provider-integrity-1.9.6-SNAPSHOT.pom
[linux-jdk9] [withMaven] artifactsPublisher - Archive artifact m/maven-scm-providers/maven-scm-provider-integrity/target/maven-scm-provider-integrity-1.9.6-SNAPSHOT.jar under org/apache/maven/scm/maven-scm-provider-integrity/1.9.6-SNAPSHOT/maven-scm-provider-integrity-1.9.6-SNAPSHOT.jar
[linux-jdk9] [withMaven] artifactsPublisher - Archive artifact m/maven-scm-providers/maven-scm-provider-jazz/pom.xml under org/apache/maven/scm/maven-scm-provider-jazz/1.9.6-SNAPSHOT/maven-scm-provider-jazz-1.9.6-SNAPSHOT.pom
[linux-jdk9] [withMaven] artifactsPublisher - Archive artifact m/maven-scm-providers/maven-scm-provider-jazz/target/maven-scm-provider-jazz-1.9.6-SNAPSHOT.jar under org/apache/maven/scm/maven-scm-provider-jazz/1.9.6-SNAPSHOT/maven-scm-provider-jazz-1.9.6-SNAPSHOT.jar
[linux-jdk9] [withMaven] artifactsPublisher - Archive artifact m/maven-scm-providers/maven-scm-providers-standard/pom.xml under org/apache/maven/scm/maven-scm-providers-standard/1.9.6-SNAPSHOT/maven-scm-providers-standard-1.9.6-SNAPSHOT.pom
[linux-jdk9] [withMaven] artifactsPublisher - Archive artifact m/maven-scm-client/pom.xml under org/apache/maven/scm/maven-scm-client/1.9.6-SNAPSHOT/maven-scm-client-1.9.6-SNAPSHOT.pom
[linux-jdk9] [withMaven] artifactsPublisher - Archive artifact m/maven-scm-client/target/maven-scm-client-1.9.6-SNAPSHOT.jar under org/apache/maven/scm/maven-scm-client/1.9.6-SNAPSHOT/maven-scm-client-1.9.6-SNAPSHOT.jar
[linux-jdk9] [withMaven] artifactsPublisher - Archive artifact m/maven-scm-plugin/pom.xml under org/apache/maven/plugins/maven-scm-plugin/1.9.6-SNAPSHOT/maven-scm-plugin-1.9.6-SNAPSHOT.pom
[linux-jdk9] [withMaven] artifactsPublisher - Archive artifact m/maven-scm-plugin/target/maven-scm-plugin-1.9.6-SNAPSHOT.jar under org/apache/maven/plugins/maven-scm-plugin/1.9.6-SNAPSHOT/maven-scm-plugin-1.9.6-SNAPSHOT.jar
[linux-jdk9] [withMaven] artifactsPublisher - Archive artifact m/target/maven-scm-1.9.6-SNAPSHOT-site.xml under org/apache/maven/scm/maven-scm/1.9.6-SNAPSHOT/maven-scm-1.9.6-SNAPSHOT-site.xml
[linux-jdk9] [withMaven] artifactsPublisher - Archive artifact m/maven-scm-managers/target/maven-scm-managers-1.9.6-SNAPSHOT-site.xml under org/apache/maven/scm/maven-scm-managers/1.9.6-SNAPSHOT/maven-scm-managers-1.9.6-SNAPSHOT-site.xml
[linux-jdk9] [withMaven] artifactsPublisher - Archive artifact m/maven-scm-providers/target/maven-scm-providers-1.9.6-SNAPSHOT-site.xml under org/apache/maven/scm/maven-scm-providers/1.9.6-SNAPSHOT/maven-scm-providers-1.9.6-SNAPSHOT-site.xml
[linux-jdk9] [withMaven] artifactsPublisher - Archive artifact m/maven-scm-providers/maven-scm-providers-cvs/target/maven-scm-providers-cvs-1.9.6-SNAPSHOT-site.xml under org/apache/maven/scm/maven-scm-providers-cvs/1.9.6-SNAPSHOT/maven-scm-providers-cvs-1.9.6-SNAPSHOT-site.xml
[linux-jdk9] [withMaven] artifactsPublisher - Archive artifact m/maven-scm-providers/maven-scm-providers-git/target/maven-scm-providers-git-1.9.6-SNAPSHOT-site.xml under org/apache/maven/scm/maven-scm-providers-git/1.9.6-SNAPSHOT/maven-scm-providers-git-1.9.6-SNAPSHOT-site.xml
[linux-jdk9] [withMaven] artifactsPublisher - Archive artifact m/maven-scm-providers/maven-scm-providers-svn/target/maven-scm-providers-svn-1.9.6-SNAPSHOT-site.xml under org/apache/maven/scm/maven-scm-providers-svn/1.9.6-SNAPSHOT/maven-scm-providers-svn-1.9.6-SNAPSHOT-site.xml
[linux-jdk9] [withMaven] artifactsPublisher - Archive artifact m/maven-scm-client/target/maven-scm-client-1.9.6-SNAPSHOT-jar-with-dependencies.jar under org/apache/maven/scm/maven-scm-client/1.9.6-SNAPSHOT/maven-scm-client-1.9.6-SNAPSHOT-jar-with-dependencies.jar
[linux-jdk9] [Fast Archiver] No prior successful build to compare, so performing full copy of artifacts
[linux-jdk9] [withMaven] invokerPublisher - Archive invoker results for Maven artifact MavenArtifact{org.apache.maven.plugins:maven-scm-plugin::1.9.6-SNAPSHOT(version: 1.9.6-SNAPSHOT, snapshot:false) } generated by PluginInvocation{org.apache.maven.plugins:maven-invoker-plugin:2.0.0@run  integration-test}: m/maven-scm-plugin/target/invoker-reports/*.xml
[linux-jdk9] performing MavenInvokerRecorder, reportsFilenamePattern:'**/m/maven-scm-plugin/target/invoker-reports/BUILD*.xml', invokerBuildDir:'**/m/maven-scm-plugin/target/it'
[linux-jdk9] Found reports:[]
[linux-jdk9] Found logs:[]
[linux-jdk9] Finished parsing Maven Invoker results (found 0)
[linux-jdk9] [withMaven] junitPublisher - Archive test results for Maven artifact org.apache.maven.scm:maven-scm-api:1.9.6-SNAPSHOT generated by maven-surefire-plugin:test (default-test): m/maven-scm-api/target/surefire-reports/*.xml
[linux-jdk9] [withMaven] junitPublisher - Jenkins JUnit Attachments Plugin not found, can't publish test attachments.Recording test results
[linux-jdk9] [withMaven] junitPublisher - Archive test results for Maven artifact org.apache.maven.scm:maven-scm-manager-plexus:1.9.6-SNAPSHOT generated by maven-surefire-plugin:test (default-test): m/maven-scm-managers/maven-scm-manager-plexus/target/surefire-reports/*.xml
[linux-jdk9] [withMaven] junitPublisher - Jenkins JUnit Attachments Plugin not found, can't publish test attachments.Recording test results
[linux-jdk9] None of the test reports contained any result
[linux-jdk9] [withMaven] junitPublisher - Archive test results for Maven artifact org.apache.maven.scm:maven-scm-test:1.9.6-SNAPSHOT generated by maven-surefire-plugin:test (default-test): m/maven-scm-test/target/surefire-reports/*.xml
[linux-jdk9] [withMaven] junitPublisher - Jenkins JUnit Attachments Plugin not found, can't publish test attachments.Recording test results
[linux-jdk9] [withMaven] junitPublisher - Archive test results for Maven artifact org.apache.maven.scm:maven-scm-provider-accurev:1.9.6-SNAPSHOT generated by maven-surefire-plugin:test (default-test): m/maven-scm-providers/maven-scm-provider-accurev/target/surefire-reports/*.xml
[linux-jdk9] [withMaven] junitPublisher - Jenkins JUnit Attachments Plugin not found, can't publish test attachments.Recording test results
[linux-jdk9] [withMaven] junitPublisher - Archive test results for Maven artifact org.apache.maven.scm:maven-scm-provider-bazaar:1.9.6-SNAPSHOT generated by maven-surefire-plugin:test (default-test): m/maven-scm-providers/maven-scm-provider-bazaar/target/surefire-reports/*.xml
[linux-jdk9] [withMaven] junitPublisher - Jenkins JUnit Attachments Plugin not found, can't publish test attachments.Recording test results
[linux-jdk9] [withMaven] junitPublisher - Archive test results for Maven artifact org.apache.maven.scm:maven-scm-provider-clearcase:1.9.6-SNAPSHOT generated by maven-surefire-plugin:test (default-test): m/maven-scm-providers/maven-scm-provider-clearcase/target/surefire-reports/*.xml
[linux-jdk9] [withMaven] junitPublisher - Jenkins JUnit Attachments Plugin not found, can't publish test attachments.Recording test results
[linux-jdk9] [withMaven] junitPublisher - Archive test results for Maven artifact org.apache.maven.scm:maven-scm-provider-cvstest:1.9.6-SNAPSHOT generated by maven-surefire-plugin:test (default-test): m/maven-scm-providers/maven-scm-providers-cvs/maven-scm-provider-cvstest/target/surefire-reports/*.xml
[linux-jdk9] [withMaven] junitPublisher - Jenkins JUnit Attachments Plugin not found, can't publish test attachments.Recording test results
[linux-jdk9] None of the test reports contained any result
[linux-jdk9] [withMaven] junitPublisher - Archive test results for Maven artifact org.apache.maven.scm:maven-scm-provider-cvs-commons:1.9.6-SNAPSHOT generated by maven-surefire-plugin:test (default-test): m/maven-scm-providers/maven-scm-providers-cvs/maven-scm-provider-cvs-commons/target/surefire-reports/*.xml
[linux-jdk9] [withMaven] junitPublisher - Jenkins JUnit Attachments Plugin not found, can't publish test attachments.Recording test results
[linux-jdk9] [withMaven] junitPublisher - Archive test results for Maven artifact org.apache.maven.scm:maven-scm-provider-cvsexe:1.9.6-SNAPSHOT generated by maven-surefire-plugin:test (default-test): m/maven-scm-providers/maven-scm-providers-cvs/maven-scm-provider-cvsexe/target/surefire-reports/*.xml
[linux-jdk9] [withMaven] junitPublisher - Jenkins JUnit Attachments Plugin not found, can't publish test attachments.Recording test results
[linux-jdk9] [withMaven] junitPublisher - Archive test results for Maven artifact org.apache.maven.scm:maven-scm-provider-cvsjava:1.9.6-SNAPSHOT generated by maven-surefire-plugin:test (default-test): m/maven-scm-providers/maven-scm-providers-cvs/maven-scm-provider-cvsjava/target/surefire-reports/*.xml
[linux-jdk9] [withMaven] junitPublisher - Jenkins JUnit Attachments Plugin not found, can't publish test attachments.Recording test results
[linux-jdk9] [withMaven] junitPublisher - Archive test results for Maven artifact org.apache.maven.scm:maven-scm-provider-hg:1.9.6-SNAPSHOT generated by maven-surefire-plugin:test (default-test): m/maven-scm-providers/maven-scm-provider-hg/target/surefire-reports/*.xml
[linux-jdk9] [withMaven] junitPublisher - Jenkins JUnit Attachments Plugin not found, can't publish test attachments.Recording test results
[linux-jdk9] [withMaven] junitPublisher - Archive test results for Maven artifact org.apache.maven.scm:maven-scm-provider-git-commons:1.9.6-SNAPSHOT generated by maven-surefire-plugin:test (default-test): m/maven-scm-providers/maven-scm-providers-git/maven-scm-provider-git-commons/target/surefire-reports/*.xml
[linux-jdk9] [withMaven] junitPublisher - Jenkins JUnit Attachments Plugin not found, can't publish test attachments.Recording test results
[linux-jdk9] [withMaven] junitPublisher - Archive test results for Maven artifact org.apache.maven.scm:maven-scm-provider-gittest:1.9.6-SNAPSHOT generated by maven-surefire-plugin:test (default-test): m/maven-scm-providers/maven-scm-providers-git/maven-scm-provider-gittest/target/surefire-reports/*.xml
[linux-jdk9] [withMaven] junitPublisher - Jenkins JUnit Attachments Plugin not found, can't publish test attachments.Recording test results
[linux-jdk9] None of the test reports contained any result
[linux-jdk9] [withMaven] junitPublisher - Archive test results for Maven artifact org.apache.maven.scm:maven-scm-provider-gitexe:1.9.6-SNAPSHOT generated by maven-surefire-plugin:test (default-test): m/maven-scm-providers/maven-scm-providers-git/maven-scm-provider-gitexe/target/surefire-reports/*.xml
[linux-jdk9] [withMaven] junitPublisher - Jenkins JUnit Attachments Plugin not found, can't publish test attachments.Recording test results
[linux-jdk9] [withMaven] junitPublisher - Archive test results for Maven artifact org.apache.maven.scm:maven-scm-provider-jgit:1.9.6-SNAPSHOT generated by maven-surefire-plugin:test (default-test): m/maven-scm-providers/maven-scm-providers-git/maven-scm-provider-jgit/target/surefire-reports/*.xml
[linux-jdk9] [withMaven] junitPublisher - Jenkins JUnit Attachments Plugin not found, can't publish test attachments.Recording test results
[linux-jdk9] [withMaven] junitPublisher - Archive test results for Maven artifact org.apache.maven.scm:maven-scm-provider-local:1.9.6-SNAPSHOT generated by maven-surefire-plugin:test (default-test): m/maven-scm-providers/maven-scm-provider-local/target/surefire-reports/*.xml
[linux-jdk9] [withMaven] junitPublisher - Jenkins JUnit Attachments Plugin not found, can't publish test attachments.Recording test results
[linux-jdk9] [withMaven] junitPublisher - Archive test results for Maven artifact org.apache.maven.scm:maven-scm-provider-perforce:1.9.6-SNAPSHOT generated by maven-surefire-plugin:test (default-test): m/maven-scm-providers/maven-scm-provider-perforce/target/surefire-reports/*.xml
[linux-jdk9] [withMaven] junitPublisher - Jenkins JUnit Attachments Plugin not found, can't publish test attachments.Recording test results
[linux-jdk9] [withMaven] junitPublisher - Archive test results for Maven artifact org.apache.maven.scm:maven-scm-provider-starteam:1.9.6-SNAPSHOT generated by maven-surefire-plugin:test (default-test): m/maven-scm-providers/maven-scm-provider-starteam/target/surefire-reports/*.xml
[linux-jdk9] [withMaven] junitPublisher - Jenkins JUnit Attachments Plugin not found, can't publish test attachments.Recording test results
[linux-jdk9] [withMaven] junitPublisher - Archive test results for Maven artifact org.apache.maven.scm:maven-scm-provider-svn-commons:1.9.6-SNAPSHOT generated by maven-surefire-plugin:test (default-test): m/maven-scm-providers/maven-scm-providers-svn/maven-scm-provider-svn-commons/target/surefire-reports/*.xml
[linux-jdk9] [withMaven] junitPublisher - Jenkins JUnit Attachments Plugin not found, can't publish test attachments.Recording test results
[linux-jdk9] [withMaven] junitPublisher - Archive test results for Maven artifact org.apache.maven.scm:maven-scm-provider-svntest:1.9.6-SNAPSHOT generated by maven-surefire-plugin:test (default-test): m/maven-scm-providers/maven-scm-providers-svn/maven-scm-provider-svntest/target/surefire-reports/*.xml
[linux-jdk9] [withMaven] junitPublisher - Jenkins JUnit Attachments Plugin not found, can't publish test attachments.Recording test results
[linux-jdk9] None of the test reports contained any result
[linux-jdk9] [withMaven] junitPublisher - Archive test results for Maven artifact org.apache.maven.scm:maven-scm-provider-svnexe:1.9.6-SNAPSHOT generated by maven-surefire-plugin:test (default-test): m/maven-scm-providers/maven-scm-providers-svn/maven-scm-provider-svnexe/target/surefire-reports/*.xml
[linux-jdk9] [withMaven] junitPublisher - Jenkins JUnit Attachments Plugin not found, can't publish test attachments.Recording test results
[linux-jdk9] [withMaven] junitPublisher - Archive test results for Maven artifact org.apache.maven.scm:maven-scm-provider-synergy:1.9.6-SNAPSHOT generated by maven-surefire-plugin:test (default-test): m/maven-scm-providers/maven-scm-provider-synergy/target/surefire-reports/*.xml
[linux-jdk9] [withMaven] junitPublisher - Jenkins JUnit Attachments Plugin not found, can't publish test attachments.Recording test results
[linux-jdk9] [withMaven] junitPublisher - Archive test results for Maven artifact org.apache.maven.scm:maven-scm-provider-vss:1.9.6-SNAPSHOT generated by maven-surefire-plugin:test (default-test): m/maven-scm-providers/maven-scm-provider-vss/target/surefire-reports/*.xml
[linux-jdk9] [withMaven] junitPublisher - Jenkins JUnit Attachments Plugin not found, can't publish test attachments.Recording test results
[linux-jdk9] [withMaven] junitPublisher - Archive test results for Maven artifact org.apache.maven.scm:maven-scm-provider-tfs:1.9.6-SNAPSHOT generated by maven-surefire-plugin:test (default-test): m/maven-scm-providers/maven-scm-provider-tfs/target/surefire-reports/*.xml
[linux-jdk9] [withMaven] junitPublisher - Jenkins JUnit Attachments Plugin not found, can't publish test attachments.Recording test results
[linux-jdk9] [withMaven] junitPublisher - Archive test results for Maven artifact org.apache.maven.scm:maven-scm-provider-integrity:1.9.6-SNAPSHOT generated by maven-surefire-plugin:test (default-test): m/maven-scm-providers/maven-scm-provider-integrity/target/surefire-reports/*.xml
[linux-jdk9] [withMaven] junitPublisher - Jenkins JUnit Attachments Plugin not found, can't publish test attachments.Recording test results
[linux-jdk9] [withMaven] junitPublisher - Archive test results for Maven artifact org.apache.maven.scm:maven-scm-provider-jazz:1.9.6-SNAPSHOT generated by maven-surefire-plugin:test (default-test): m/maven-scm-providers/maven-scm-provider-jazz/target/surefire-reports/*.xml
[linux-jdk9] [withMaven] junitPublisher - Jenkins JUnit Attachments Plugin not found, can't publish test attachments.Recording test results
[linux-jdk9] [withMaven] junitPublisher - Archive test results for Maven artifact org.apache.maven.scm:maven-scm-client:1.9.6-SNAPSHOT generated by maven-surefire-plugin:test (default-test): m/maven-scm-client/target/surefire-reports/*.xml
[linux-jdk9] [withMaven] junitPublisher - Jenkins JUnit Attachments Plugin not found, can't publish test attachments.Recording test results
[linux-jdk9] None of the test reports contained any result
[linux-jdk9] [withMaven] junitPublisher - Archive test results for Maven artifact org.apache.maven.plugins:maven-scm-plugin:1.9.6-SNAPSHOT generated by maven-surefire-plugin:test (default-test): m/maven-scm-plugin/target/surefire-reports/*.xml
[linux-jdk9] [withMaven] junitPublisher - Jenkins JUnit Attachments Plugin not found, can't publish test attachments.Recording test results
[linux-jdk9] [withMaven] openTasksPublisher - Scan Tasks for Maven artifact org.apache.maven.scm:maven-scm-api:1.9.6-SNAPSHOT in source directory m/maven-scm-api/src/main/java
[linux-jdk9] [withMaven] openTasksPublisher - Scan Tasks for Maven artifact org.apache.maven.scm:maven-scm-manager-plexus:1.9.6-SNAPSHOT in source directory m/maven-scm-managers/maven-scm-manager-plexus/src/main/java
[linux-jdk9] [withMaven] openTasksPublisher - Scan Tasks for Maven artifact org.apache.maven.scm:maven-scm-test:1.9.6-SNAPSHOT in source directory m/maven-scm-test/src/main/java
[linux-jdk9] [withMaven] openTasksPublisher - Scan Tasks for Maven artifact org.apache.maven.scm:maven-scm-provider-accurev:1.9.6-SNAPSHOT in source directory m/maven-scm-providers/maven-scm-provider-accurev/src/main/java
[linux-jdk9] [withMaven] openTasksPublisher - Scan Tasks for Maven artifact org.apache.maven.scm:maven-scm-provider-bazaar:1.9.6-SNAPSHOT in source directory m/maven-scm-providers/maven-scm-provider-bazaar/src/main/java
[linux-jdk9] [withMaven] openTasksPublisher - Scan Tasks for Maven artifact org.apache.maven.scm:maven-scm-provider-clearcase:1.9.6-SNAPSHOT in source directory m/maven-scm-providers/maven-scm-provider-clearcase/src/main/java
[linux-jdk9] [withMaven] openTasksPublisher - Scan Tasks for Maven artifact org.apache.maven.scm:maven-scm-provider-cvstest:1.9.6-SNAPSHOT in source directory m/maven-scm-providers/maven-scm-providers-cvs/maven-scm-provider-cvstest/src/main/java
[linux-jdk9] [withMaven] openTasksPublisher - Scan Tasks for Maven artifact org.apache.maven.scm:maven-scm-provider-cvs-commons:1.9.6-SNAPSHOT in source directory m/maven-scm-providers/maven-scm-providers-cvs/maven-scm-provider-cvs-commons/src/main/java
[linux-jdk9] [withMaven] openTasksPublisher - Scan Tasks for Maven artifact org.apache.maven.scm:maven-scm-provider-cvsexe:1.9.6-SNAPSHOT in source directory m/maven-scm-providers/maven-scm-providers-cvs/maven-scm-provider-cvsexe/src/main/java
[linux-jdk9] [withMaven] openTasksPublisher - Scan Tasks for Maven artifact org.apache.maven.scm:maven-scm-provider-cvsjava:1.9.6-SNAPSHOT in source directory m/maven-scm-providers/maven-scm-providers-cvs/maven-scm-provider-cvsjava/src/main/java
[linux-jdk9] [withMaven] openTasksPublisher - Scan Tasks for Maven artifact org.apache.maven.scm:maven-scm-provider-hg:1.9.6-SNAPSHOT in source directory m/maven-scm-providers/maven-scm-provider-hg/src/main/java
[linux-jdk9] [withMaven] openTasksPublisher - Scan Tasks for Maven artifact org.apache.maven.scm:maven-scm-provider-git-commons:1.9.6-SNAPSHOT in source directory m/maven-scm-providers/maven-scm-providers-git/maven-scm-provider-git-commons/src/main/java
[linux-jdk9] [withMaven] openTasksPublisher - Scan Tasks for Maven artifact org.apache.maven.scm:maven-scm-provider-gittest:1.9.6-SNAPSHOT in source directory m/maven-scm-providers/maven-scm-providers-git/maven-scm-provider-gittest/src/main/java
[linux-jdk9] [withMaven] openTasksPublisher - Scan Tasks for Maven artifact org.apache.maven.scm:maven-scm-provider-gitexe:1.9.6-SNAPSHOT in source directory m/maven-scm-providers/maven-scm-providers-git/maven-scm-provider-gitexe/src/main/java
[linux-jdk9] [withMaven] openTasksPublisher - Scan Tasks for Maven artifact org.apache.maven.scm:maven-scm-provider-jgit:1.9.6-SNAPSHOT in source directory m/maven-scm-providers/maven-scm-providers-git/maven-scm-provider-jgit/src/main/java
[linux-jdk9] [withMaven] openTasksPublisher - Scan Tasks for Maven artifact org.apache.maven.scm:maven-scm-provider-local:1.9.6-SNAPSHOT in source directory m/maven-scm-providers/maven-scm-provider-local/src/main/java
[linux-jdk9] [withMaven] openTasksPublisher - Scan Tasks for Maven artifact org.apache.maven.scm:maven-scm-provider-perforce:1.9.6-SNAPSHOT in source directory m/maven-scm-providers/maven-scm-provider-perforce/src/main/java
[linux-jdk9] [withMaven] openTasksPublisher - Scan Tasks for Maven artifact org.apache.maven.scm:maven-scm-provider-starteam:1.9.6-SNAPSHOT in source directory m/maven-scm-providers/maven-scm-provider-starteam/src/main/java
[linux-jdk9] [withMaven] openTasksPublisher - Scan Tasks for Maven artifact org.apache.maven.scm:maven-scm-provider-svn-commons:1.9.6-SNAPSHOT in source directory m/maven-scm-providers/maven-scm-providers-svn/maven-scm-provider-svn-commons/src/main/java
[linux-jdk9] [withMaven] openTasksPublisher - Scan Tasks for Maven artifact org.apache.maven.scm:maven-scm-provider-svntest:1.9.6-SNAPSHOT in source directory m/maven-scm-providers/maven-scm-providers-svn/maven-scm-provider-svntest/src/main/java
[linux-jdk9] [withMaven] openTasksPublisher - Scan Tasks for Maven artifact org.apache.maven.scm:maven-scm-provider-svnexe:1.9.6-SNAPSHOT in source directory m/maven-scm-providers/maven-scm-providers-svn/maven-scm-provider-svnexe/src/main/java
[linux-jdk9] [withMaven] openTasksPublisher - Scan Tasks for Maven artifact org.apache.maven.scm:maven-scm-provider-synergy:1.9.6-SNAPSHOT in source directory m/maven-scm-providers/maven-scm-provider-synergy/src/main/java
[linux-jdk9] [withMaven] openTasksPublisher - Scan Tasks for Maven artifact org.apache.maven.scm:maven-scm-provider-vss:1.9.6-SNAPSHOT in source directory m/maven-scm-providers/maven-scm-provider-vss/src/main/java
[linux-jdk9] [withMaven] openTasksPublisher - Scan Tasks for Maven artifact org.apache.maven.scm:maven-scm-provider-tfs:1.9.6-SNAPSHOT in source directory m/maven-scm-providers/maven-scm-provider-tfs/src/main/java
[linux-jdk9] [withMaven] openTasksPublisher - Scan Tasks for Maven artifact org.apache.maven.scm:maven-scm-provider-integrity:1.9.6-SNAPSHOT in source directory m/maven-scm-providers/maven-scm-provider-integrity/src/main/java
[linux-jdk9] [withMaven] openTasksPublisher - Scan Tasks for Maven artifact org.apache.maven.scm:maven-scm-provider-jazz:1.9.6-SNAPSHOT in source directory m/maven-scm-providers/maven-scm-provider-jazz/src/main/java
[linux-jdk9] [withMaven] openTasksPublisher - Scan Tasks for Maven artifact org.apache.maven.scm:maven-scm-client:1.9.6-SNAPSHOT in source directory m/maven-scm-client/src/main/java
[linux-jdk9] [withMaven] openTasksPublisher - Scan Tasks for Maven artifact org.apache.maven.plugins:maven-scm-plugin:1.9.6-SNAPSHOT in source directory m/maven-scm-plugin/src/main/java
[linux-jdk9] [TASKS] Scanning folder '/home/jenkins/jenkins-slave/workspace/maven-wip_maven-scm_master-ADXNUB4JTUUV5E57KMRFZSZVGMFJJBVMKSOJS62JASEIC2763EUQ' for files matching the pattern 'm/maven-scm-api/src/main/java/**/*,m/maven-scm-managers/maven-scm-manager-plexus/src/main/java/**/*,m/maven-scm-test/src/main/java/**/*,m/maven-scm-providers/maven-scm-provider-accurev/src/main/java/**/*,m/maven-scm-providers/maven-scm-provider-bazaar/src/main/java/**/*,m/maven-scm-providers/maven-scm-provider-clearcase/src/main/java/**/*,m/maven-scm-providers/maven-scm-providers-cvs/maven-scm-provider-cvstest/src/main/java/**/*,m/maven-scm-providers/maven-scm-providers-cvs/maven-scm-provider-cvs-commons/src/main/java/**/*,m/maven-scm-providers/maven-scm-providers-cvs/maven-scm-provider-cvsexe/src/main/java/**/*,m/maven-scm-providers/maven-scm-providers-cvs/maven-scm-provider-cvsjava/src/main/java/**/*,m/maven-scm-providers/maven-scm-provider-hg/src/main/java/**/*,m/maven-scm-providers/maven-scm-providers-git/maven-scm-provider-git-commons/src/main/java/**/*,m/maven-scm-providers/maven-scm-providers-git/maven-scm-provider-gittest/src/main/java/**/*,m/maven-scm-providers/maven-scm-providers-git/maven-scm-provider-gitexe/src/main/java/**/*,m/maven-scm-providers/maven-scm-providers-git/maven-scm-provider-jgit/src/main/java/**/*,m/maven-scm-providers/maven-scm-provider-local/src/main/java/**/*,m/maven-scm-providers/maven-scm-provider-perforce/src/main/java/**/*,m/maven-scm-providers/maven-scm-provider-starteam/src/main/java/**/*,m/maven-scm-providers/maven-scm-providers-svn/maven-scm-provider-svn-commons/src/main/java/**/*,m/maven-scm-providers/maven-scm-providers-svn/maven-scm-provider-svntest/src/main/java/**/*,m/maven-scm-providers/maven-scm-providers-svn/maven-scm-provider-svnexe/src/main/java/**/*,m/maven-scm-providers/maven-scm-provider-synergy/src/main/java/**/*,m/maven-scm-providers/maven-scm-provider-vss/src/main/java/**/*,m/maven-scm-providers/maven-scm-provider-tfs/src/main/java/**/*,m/maven-scm-providers/maven-scm-provider-integrity/src/main/java/**/*,m/maven-scm-providers/maven-scm-provider-jazz/src/main/java/**/*,m/maven-scm-client/src/main/java/**/*,m/maven-scm-plugin/src/main/java/**/*' - excludes: null
[linux-jdk9] [TASKS] Found 655 files to scan for tasks
[linux-jdk9] [TASKS] Found 95 open tasks.
[linux-jdk9] Skipping warnings blame since pipelines do not have an SCM link.%n
[Pipeline] [linux-jdk9] // withMaven
[Pipeline] [linux-jdk9] }
[Pipeline] [linux-jdk9] // stage
[Pipeline] [linux-jdk9] }
[Pipeline] [linux-jdk9] // node
[Pipeline] [linux-jdk9] }
[Pipeline] // parallel
[Pipeline] stage
[Pipeline] { (Notifications)
[Pipeline] echo
Build result: UNSTABLE
[Pipeline] jiraIssueSelector
[Pipeline] emailext
Reply | Threaded
Open this post in threaded view
|

Build unstable in Jenkins: Maven TLP (wip) » maven-scm » master #2

Apache Jenkins Server-2
See https://builds.apache.org/job/maven-wip/job/maven-scm/job/master/2/

No changes.

34 tests failed.
FAILED:  org.apache.maven.scm.provider.git.gitexe.command.checkout.GitExeCheckOutCommandNoBranchTest.testCheckoutNoBranch

Error Message:
The check out result success flag was false.

Stack Trace:
junit.framework.AssertionFailedError: The check out result success flag was false.
        at org.apache.maven.scm.provider.git.gitexe.command.checkout.GitExeCheckOutCommandNoBranchTest.checkoutRepo(GitExeCheckOutCommandNoBranchTest.java:89)
        at org.apache.maven.scm.provider.git.gitexe.command.checkout.GitExeCheckOutCommandNoBranchTest.testCheckoutNoBranch(GitExeCheckOutCommandNoBranchTest.java:65)


FAILED:  org.apache.maven.scm.provider.git.gitexe.command.checkout.GitExeCheckOutCommandNoBranchTest.testDoubleCheckoutNoBranch

Error Message:
The check out result success flag was false.

Stack Trace:
junit.framework.AssertionFailedError: The check out result success flag was false.
        at org.apache.maven.scm.provider.git.gitexe.command.checkout.GitExeCheckOutCommandNoBranchTest.checkoutRepo(GitExeCheckOutCommandNoBranchTest.java:89)
        at org.apache.maven.scm.provider.git.gitexe.command.checkout.GitExeCheckOutCommandNoBranchTest.testDoubleCheckoutNoBranch(GitExeCheckOutCommandNoBranchTest.java:77)


FAILED:  org.apache.maven.scm.provider.git.jgit.command.branch.JGitBranchCommandTckTest.testBranchCommandTest

Error Message:
Exception while executing SCM command.

Stack Trace:
org.apache.maven.scm.ScmException: Exception while executing SCM command.
Caused by: org.apache.maven.scm.ScmException: JGit checkout failure!
Caused by: org.eclipse.jgit.api.errors.JGitInternalException: Exception caught during execution of fetch command
Caused by: org.eclipse.jgit.errors.NotSupportedException: URI not supported: file://2/m/maven-scm-providers/maven-scm-providers-git/maven-scm-provider-jgit/target/scm-test/repository


FAILED:  org.apache.maven.scm.provider.git.jgit.command.changelog.JGitChangeLogCommandTckTest.testChangeLogCommand

Error Message:
Exception while executing SCM command.

Stack Trace:
org.apache.maven.scm.ScmException: Exception while executing SCM command.
Caused by: org.apache.maven.scm.ScmException: JGit checkout failure!
Caused by: org.eclipse.jgit.api.errors.JGitInternalException: Exception caught during execution of fetch command
Caused by: org.eclipse.jgit.errors.NotSupportedException: URI not supported: file://2/m/maven-scm-providers/maven-scm-providers-git/maven-scm-provider-jgit/target/scm-test/repository


FAILED:  org.apache.maven.scm.provider.git.jgit.command.checkin.JGitCheckInCommandCommitterAuthorTckTest.testCheckInCommandTest

Error Message:
Exception while executing SCM command.

Stack Trace:
org.apache.maven.scm.ScmException: Exception while executing SCM command.
        at org.apache.maven.scm.provider.git.jgit.command.checkin.JGitCheckInCommandCommitterAuthorTckTest.setUp(JGitCheckInCommandCommitterAuthorTckTest.java:60)
Caused by: org.apache.maven.scm.ScmException: JGit checkout failure!
        at org.apache.maven.scm.provider.git.jgit.command.checkin.JGitCheckInCommandCommitterAuthorTckTest.setUp(JGitCheckInCommandCommitterAuthorTckTest.java:60)
Caused by: org.eclipse.jgit.api.errors.JGitInternalException: Exception caught during execution of fetch command
        at org.apache.maven.scm.provider.git.jgit.command.checkin.JGitCheckInCommandCommitterAuthorTckTest.setUp(JGitCheckInCommandCommitterAuthorTckTest.java:60)
Caused by: org.eclipse.jgit.errors.NotSupportedException: URI not supported: file://2/m/maven-scm-providers/maven-scm-providers-git/maven-scm-provider-jgit/target/scm-test/repository
        at org.apache.maven.scm.provider.git.jgit.command.checkin.JGitCheckInCommandCommitterAuthorTckTest.setUp(JGitCheckInCommandCommitterAuthorTckTest.java:60)


FAILED:  org.apache.maven.scm.provider.git.jgit.command.checkin.JGitCheckInCommandCommitterAuthorTckTest.testCheckInCommandPartialFileset

Error Message:
Exception while executing SCM command.

Stack Trace:
org.apache.maven.scm.ScmException: Exception while executing SCM command.
        at org.apache.maven.scm.provider.git.jgit.command.checkin.JGitCheckInCommandCommitterAuthorTckTest.setUp(JGitCheckInCommandCommitterAuthorTckTest.java:60)
Caused by: org.apache.maven.scm.ScmException: JGit checkout failure!
        at org.apache.maven.scm.provider.git.jgit.command.checkin.JGitCheckInCommandCommitterAuthorTckTest.setUp(JGitCheckInCommandCommitterAuthorTckTest.java:60)
Caused by: org.eclipse.jgit.api.errors.JGitInternalException: Exception caught during execution of fetch command
        at org.apache.maven.scm.provider.git.jgit.command.checkin.JGitCheckInCommandCommitterAuthorTckTest.setUp(JGitCheckInCommandCommitterAuthorTckTest.java:60)
Caused by: org.eclipse.jgit.errors.NotSupportedException: URI not supported: file://2/m/maven-scm-providers/maven-scm-providers-git/maven-scm-provider-jgit/target/scm-test/repository
        at org.apache.maven.scm.provider.git.jgit.command.checkin.JGitCheckInCommandCommitterAuthorTckTest.setUp(JGitCheckInCommandCommitterAuthorTckTest.java:60)


FAILED:  org.apache.maven.scm.provider.git.jgit.command.checkin.JGitCheckInCommandTckTest.testCheckInCommandTest

Error Message:
Exception while executing SCM command.

Stack Trace:
org.apache.maven.scm.ScmException: Exception while executing SCM command.
Caused by: org.apache.maven.scm.ScmException: JGit checkout failure!
Caused by: org.eclipse.jgit.api.errors.JGitInternalException: Exception caught during execution of fetch command
Caused by: org.eclipse.jgit.errors.NotSupportedException: URI not supported: file://2/m/maven-scm-providers/maven-scm-providers-git/maven-scm-provider-jgit/target/scm-test/repository


FAILED:  org.apache.maven.scm.provider.git.jgit.command.checkin.JGitCheckInCommandTckTest.testCheckInCommandPartialFileset

Error Message:
Exception while executing SCM command.

Stack Trace:
org.apache.maven.scm.ScmException: Exception while executing SCM command.
Caused by: org.apache.maven.scm.ScmException: JGit checkout failure!
Caused by: org.eclipse.jgit.api.errors.JGitInternalException: Exception caught during execution of fetch command
Caused by: org.eclipse.jgit.errors.NotSupportedException: URI not supported: file://2/m/maven-scm-providers/maven-scm-providers-git/maven-scm-provider-jgit/target/scm-test/repository


FAILED:  org.apache.maven.scm.provider.git.jgit.command.checkout.JGitCheckOutCommandTckTest.testCheckOutCommandTest

Error Message:
Exception while executing SCM command.

Stack Trace:
org.apache.maven.scm.ScmException: Exception while executing SCM command.
Caused by: org.apache.maven.scm.ScmException: JGit checkout failure!
Caused by: org.eclipse.jgit.api.errors.JGitInternalException: Exception caught during execution of fetch command
Caused by: org.eclipse.jgit.errors.NotSupportedException: URI not supported: file://2/m/maven-scm-providers/maven-scm-providers-git/maven-scm-provider-jgit/target/scm-test/repository


FAILED:  org.apache.maven.scm.provider.git.jgit.command.diff.JGitDiffCommandTckTest.testDiffCommand

Error Message:
Exception while executing SCM command.

Stack Trace:
org.apache.maven.scm.ScmException: Exception while executing SCM command.
Caused by: org.apache.maven.scm.ScmException: JGit checkout failure!
Caused by: org.eclipse.jgit.api.errors.JGitInternalException: Exception caught during execution of fetch command
Caused by: org.eclipse.jgit.errors.NotSupportedException: URI not supported: file://2/m/maven-scm-providers/maven-scm-providers-git/maven-scm-provider-jgit/target/scm-test/repository


FAILED:  org.apache.maven.scm.provider.git.jgit.command.remoteinfo.JGitRemoteInfoCommandTckTest.testRemoteInfoCommand

Error Message:
Exception while executing SCM command.

Stack Trace:
org.apache.maven.scm.ScmException: Exception while executing SCM command.
Caused by: org.apache.maven.scm.ScmException: JGit checkout failure!
Caused by: org.eclipse.jgit.api.errors.JGitInternalException: Exception caught during execution of fetch command
Caused by: org.eclipse.jgit.errors.NotSupportedException: URI not supported: file://2/m/maven-scm-providers/maven-scm-providers-git/maven-scm-provider-jgit/target/scm-test/repository


FAILED:  org.apache.maven.scm.provider.git.jgit.command.status.JGitStatusCommandTckTest.testStatusCommand

Error Message:
Exception while executing SCM command.

Stack Trace:
org.apache.maven.scm.ScmException: Exception while executing SCM command.
Caused by: org.apache.maven.scm.ScmException: JGit checkout failure!
Caused by: org.eclipse.jgit.api.errors.JGitInternalException: Exception caught during execution of fetch command
Caused by: org.eclipse.jgit.errors.NotSupportedException: URI not supported: file://2/m/maven-scm-providers/maven-scm-providers-git/maven-scm-provider-jgit/target/scm-test/repository


FAILED:  org.apache.maven.scm.provider.git.jgit.command.tag.JGitTagCommandTckTest.testTagCommandTest

Error Message:
Exception while executing SCM command.

Stack Trace:
org.apache.maven.scm.ScmException: Exception while executing SCM command.
Caused by: org.apache.maven.scm.ScmException: JGit checkout failure!
Caused by: org.eclipse.jgit.api.errors.JGitInternalException: Exception caught during execution of fetch command
Caused by: org.eclipse.jgit.errors.NotSupportedException: URI not supported: file://2/m/maven-scm-providers/maven-scm-providers-git/maven-scm-provider-jgit/target/scm-test/repository


FAILED:  org.apache.maven.scm.plugin.BranchMojoTest.testBranch

Error Message:
Command failed.The svn command failed.

Stack Trace:
org.apache.maven.plugin.MojoExecutionException: Command failed.The svn command failed.
        at org.apache.maven.scm.plugin.BranchMojoTest.setUp(BranchMojoTest.java:74)


FAILED:  org.apache.maven.scm.plugin.ChangeLogMojoTest.testChangeLogWithParameters

Error Message:
Command failed.The svn command failed.

Stack Trace:
org.apache.maven.plugin.MojoExecutionException: Command failed.The svn command failed.
        at org.apache.maven.scm.plugin.ChangeLogMojoTest.testChangeLogWithParameters(ChangeLogMojoTest.java:102)


FAILED:  org.apache.maven.scm.plugin.ChangeLogMojoTest.testChangeLog

Error Message:
Command failed.The svn command failed.

Stack Trace:
org.apache.maven.plugin.MojoExecutionException: Command failed.The svn command failed.
        at org.apache.maven.scm.plugin.ChangeLogMojoTest.testChangeLog(ChangeLogMojoTest.java:79)


FAILED:  org.apache.maven.scm.plugin.CheckoutMojoTest.testExcludeInclude

Error Message:
Command failed.The svn command failed.

Stack Trace:
org.apache.maven.plugin.MojoExecutionException: Command failed.The svn command failed.
        at org.apache.maven.scm.plugin.CheckoutMojoTest.testExcludeInclude(CheckoutMojoTest.java:153)


FAILED:  org.apache.maven.scm.plugin.CheckoutMojoTest.testUseExport

Error Message:
Command failed.The svn command failed.

Stack Trace:
org.apache.maven.plugin.MojoExecutionException: Command failed.The svn command failed.
        at org.apache.maven.scm.plugin.CheckoutMojoTest.testUseExport(CheckoutMojoTest.java:132)


FAILED:  org.apache.maven.scm.plugin.CheckoutMojoTest.testSkipCheckoutWithConnectionUrl

Error Message:
Command failed.The svn command failed.

Stack Trace:
org.apache.maven.plugin.MojoExecutionException: Command failed.The svn command failed.
        at org.apache.maven.scm.plugin.CheckoutMojoTest.testSkipCheckoutWithConnectionUrl(CheckoutMojoTest.java:96)


FAILED:  org.apache.maven.scm.plugin.ExportMojoTest.testExcludeInclude

Error Message:
Command failed.The svn command failed.

Stack Trace:
org.apache.maven.plugin.MojoExecutionException: Command failed.The svn command failed.
        at org.apache.maven.scm.plugin.ExportMojoTest.testExcludeInclude(ExportMojoTest.java:90)


FAILED:  org.apache.maven.scm.plugin.ExportMojoTest.testExport

Error Message:
Command failed.The svn command failed.

Stack Trace:
org.apache.maven.plugin.MojoExecutionException: Command failed.The svn command failed.
        at org.apache.maven.scm.plugin.ExportMojoTest.testExport(ExportMojoTest.java:55)


FAILED:  org.apache.maven.scm.plugin.TagMojoTest.testTag

Error Message:
Command failed.The svn command failed.

Stack Trace:
org.apache.maven.plugin.MojoExecutionException: Command failed.The svn command failed.
        at org.apache.maven.scm.plugin.TagMojoTest.setUp(TagMojoTest.java:74)


FAILED:  org.apache.maven.scm.plugin.TagMojoTest.testTagWithTimestamp

Error Message:
Command failed.The svn command failed.

Stack Trace:
org.apache.maven.plugin.MojoExecutionException: Command failed.The svn command failed.
        at org.apache.maven.scm.plugin.TagMojoTest.setUp(TagMojoTest.java:74)


FAILED:  org.apache.maven.scm.plugin.UpdateMojoTest.testSkipCheckoutWithConnectionUrl

Error Message:
Command failed.The svn command failed.

Stack Trace:
org.apache.maven.plugin.MojoExecutionException: Command failed.The svn command failed.
        at org.apache.maven.scm.plugin.UpdateMojoTest.testSkipCheckoutWithConnectionUrl(UpdateMojoTest.java:73)


FAILED:  org.apache.maven.scm.provider.git.gitexe.command.checkin.GitCheckInCommandNoBranchTest.testCheckinNoBranch

Error Message:
The check out result success flag was false.

Stack Trace:
junit.framework.AssertionFailedError: The check out result success flag was false.
        at org.apache.maven.scm.provider.git.gitexe.command.checkin.GitCheckInCommandNoBranchTest.testCheckinNoBranch(GitCheckInCommandNoBranchTest.java:75)


FAILED:  org.apache.maven.scm.provider.git.gitexe.command.checkin.GitCheckInCommandNoBranchTest.testCheckinNoBranch

Error Message:
The check out result success flag was false.

Stack Trace:
junit.framework.AssertionFailedError: The check out result success flag was false.
        at org.apache.maven.scm.provider.git.gitexe.command.checkin.GitCheckInCommandNoBranchTest.checkoutRepo(GitCheckInCommandNoBranchTest.java:93)
        at org.apache.maven.scm.provider.git.gitexe.command.checkin.GitCheckInCommandNoBranchTest.testCheckinNoBranch(GitCheckInCommandNoBranchTest.java:79)


FAILED:  org.apache.maven.scm.provider.git.gitexe.command.checkin.GitCheckInCommandNoBranchTest.testCheckinNoBranch

Error Message:
The check out result success flag was false.

Stack Trace:
junit.framework.AssertionFailedError: The check out result success flag was false.
        at org.apache.maven.scm.provider.git.gitexe.command.checkin.GitCheckInCommandNoBranchTest.checkoutRepo(GitCheckInCommandNoBranchTest.java:93)
        at org.apache.maven.scm.provider.git.gitexe.command.checkin.GitCheckInCommandNoBranchTest.testCheckinNoBranch(GitCheckInCommandNoBranchTest.java:64)


FAILED:  org.apache.maven.scm.provider.git.gitexe.command.checkin.GitCheckInCommandNoBranchTest.testCheckinNoBranch

Error Message:
The check out result success flag was false.

Stack Trace:
junit.framework.AssertionFailedError: The check out result success flag was false.
        at org.apache.maven.scm.provider.git.gitexe.command.checkin.GitCheckInCommandNoBranchTest.checkoutRepo(GitCheckInCommandNoBranchTest.java:93)
        at org.apache.maven.scm.provider.git.gitexe.command.checkin.GitCheckInCommandNoBranchTest.testCheckinNoBranch(GitCheckInCommandNoBranchTest.java:79)


FAILED:  org.apache.maven.scm.provider.git.gitexe.command.checkin.GitCheckInCommandNoBranchTest.testCheckinNoBranch

Error Message:
The check out result success flag was false.

Stack Trace:
junit.framework.AssertionFailedError: The check out result success flag was false.
        at org.apache.maven.scm.provider.git.gitexe.command.checkin.GitCheckInCommandNoBranchTest.checkoutRepo(GitCheckInCommandNoBranchTest.java:93)
        at org.apache.maven.scm.provider.git.gitexe.command.checkin.GitCheckInCommandNoBranchTest.testCheckinNoBranch(GitCheckInCommandNoBranchTest.java:79)


FAILED:  org.apache.maven.scm.provider.git.gitexe.command.checkin.GitCheckInCommandTest.testCheckinAfterRename

Error Message:
The check out result success flag was false.

Stack Trace:
junit.framework.AssertionFailedError: The check out result success flag was false.
        at org.apache.maven.scm.provider.git.gitexe.command.checkin.GitCheckInCommandTest.testCheckinAfterRename(GitCheckInCommandTest.java:113)


FAILED:  org.apache.maven.scm.provider.git.gitexe.command.checkin.GitCheckInCommandTest.testCheckinAfterRename

Error Message:
The check out result success flag was false.

Stack Trace:
junit.framework.AssertionFailedError: The check out result success flag was false.
        at org.apache.maven.scm.provider.git.gitexe.command.checkin.GitCheckInCommandTest.checkoutRepoInto(GitCheckInCommandTest.java:143)
        at org.apache.maven.scm.provider.git.gitexe.command.checkin.GitCheckInCommandTest.testCheckinAfterRename(GitCheckInCommandTest.java:99)


FAILED:  org.apache.maven.scm.provider.git.gitexe.command.checkin.GitCheckInCommandTest.testCheckinAfterRename

Error Message:
The check out result success flag was false.

Stack Trace:
junit.framework.AssertionFailedError: The check out result success flag was false.
        at org.apache.maven.scm.provider.git.gitexe.command.checkin.GitCheckInCommandTest.checkoutRepoInto(GitCheckInCommandTest.java:143)
        at org.apache.maven.scm.provider.git.gitexe.command.checkin.GitCheckInCommandTest.testCheckinAfterRename(GitCheckInCommandTest.java:99)


FAILED:  org.apache.maven.scm.provider.git.gitexe.command.checkin.GitCheckInCommandTest.testCheckinAfterRename

Error Message:
The check out result success flag was false.

Stack Trace:
junit.framework.AssertionFailedError: The check out result success flag was false.
        at org.apache.maven.scm.provider.git.gitexe.command.checkin.GitCheckInCommandTest.checkoutRepoInto(GitCheckInCommandTest.java:143)
        at org.apache.maven.scm.provider.git.gitexe.command.checkin.GitCheckInCommandTest.testCheckinAfterRename(GitCheckInCommandTest.java:99)


FAILED:  org.apache.maven.scm.provider.git.gitexe.command.checkin.GitCheckInCommandTest.testCheckinAfterRename

Error Message:
The check out result success flag was false.

Stack Trace:
junit.framework.AssertionFailedError: The check out result success flag was false.
        at org.apache.maven.scm.provider.git.gitexe.command.checkin.GitCheckInCommandTest.checkoutRepoInto(GitCheckInCommandTest.java:143)
        at org.apache.maven.scm.provider.git.gitexe.command.checkin.GitCheckInCommandTest.testCheckinAfterRename(GitCheckInCommandTest.java:99)




Build log:
[...truncated 5.64 MB...]
[windows-jdk9] [withMaven] junitPublisher - Archive test results for Maven artifact org.apache.maven.scm:maven-scm-provider-svntest:1.9.6-SNAPSHOT generated by maven-surefire-plugin:test (default-test): m\maven-scm-providers\maven-scm-providers-svn\maven-scm-provider-svntest\target\surefire-reports\*.xml
[windows-jdk9] [withMaven] junitPublisher - Jenkins JUnit Attachments Plugin not found, can't publish test attachments.Recording test results
[windows-jdk9] None of the test reports contained any result
[windows-jdk9] [withMaven] junitPublisher - Archive test results for Maven artifact org.apache.maven.scm:maven-scm-provider-svnexe:1.9.6-SNAPSHOT generated by maven-surefire-plugin:test (default-test): m\maven-scm-providers\maven-scm-providers-svn\maven-scm-provider-svnexe\target\surefire-reports\*.xml
[windows-jdk9] [withMaven] junitPublisher - Jenkins JUnit Attachments Plugin not found, can't publish test attachments.Recording test results
[windows-jdk9] [withMaven] junitPublisher - Archive test results for Maven artifact org.apache.maven.scm:maven-scm-provider-synergy:1.9.6-SNAPSHOT generated by maven-surefire-plugin:test (default-test): m\maven-scm-providers\maven-scm-provider-synergy\target\surefire-reports\*.xml
[windows-jdk9] [withMaven] junitPublisher - Jenkins JUnit Attachments Plugin not found, can't publish test attachments.Recording test results
[windows-jdk9] [withMaven] junitPublisher - Archive test results for Maven artifact org.apache.maven.scm:maven-scm-provider-vss:1.9.6-SNAPSHOT generated by maven-surefire-plugin:test (default-test): m\maven-scm-providers\maven-scm-provider-vss\target\surefire-reports\*.xml
[windows-jdk9] [withMaven] junitPublisher - Jenkins JUnit Attachments Plugin not found, can't publish test attachments.Recording test results
[windows-jdk9] [withMaven] junitPublisher - Archive test results for Maven artifact org.apache.maven.scm:maven-scm-provider-tfs:1.9.6-SNAPSHOT generated by maven-surefire-plugin:test (default-test): m\maven-scm-providers\maven-scm-provider-tfs\target\surefire-reports\*.xml
[windows-jdk9] [withMaven] junitPublisher - Jenkins JUnit Attachments Plugin not found, can't publish test attachments.Recording test results
[windows-jdk9] [withMaven] junitPublisher - Archive test results for Maven artifact org.apache.maven.scm:maven-scm-provider-integrity:1.9.6-SNAPSHOT generated by maven-surefire-plugin:test (default-test): m\maven-scm-providers\maven-scm-provider-integrity\target\surefire-reports\*.xml
[windows-jdk9] [withMaven] junitPublisher - Jenkins JUnit Attachments Plugin not found, can't publish test attachments.Recording test results
[windows-jdk9] [withMaven] junitPublisher - Archive test results for Maven artifact org.apache.maven.scm:maven-scm-provider-jazz:1.9.6-SNAPSHOT generated by maven-surefire-plugin:test (default-test): m\maven-scm-providers\maven-scm-provider-jazz\target\surefire-reports\*.xml
[windows-jdk9] [withMaven] junitPublisher - Jenkins JUnit Attachments Plugin not found, can't publish test attachments.Recording test results
[windows-jdk9] [withMaven] junitPublisher - Archive test results for Maven artifact org.apache.maven.scm:maven-scm-client:1.9.6-SNAPSHOT generated by maven-surefire-plugin:test (default-test): m\maven-scm-client\target\surefire-reports\*.xml
[windows-jdk9] [withMaven] junitPublisher - Jenkins JUnit Attachments Plugin not found, can't publish test attachments.Recording test results
[windows-jdk9] None of the test reports contained any result
[windows-jdk9] [withMaven] junitPublisher - Archive test results for Maven artifact org.apache.maven.plugins:maven-scm-plugin:1.9.6-SNAPSHOT generated by maven-surefire-plugin:test (default-test): m\maven-scm-plugin\target\surefire-reports\*.xml
[windows-jdk9] [withMaven] junitPublisher - Jenkins JUnit Attachments Plugin not found, can't publish test attachments.Recording test results
[windows-jdk9] [withMaven] openTasksPublisher - Scan Tasks for Maven artifact org.apache.maven.scm:maven-scm-api:1.9.6-SNAPSHOT in source directory m\maven-scm-api\src\main\java
[windows-jdk9] [withMaven] openTasksPublisher - Scan Tasks for Maven artifact org.apache.maven.scm:maven-scm-manager-plexus:1.9.6-SNAPSHOT in source directory m\maven-scm-managers\maven-scm-manager-plexus\src\main\java
[windows-jdk9] [withMaven] openTasksPublisher - Scan Tasks for Maven artifact org.apache.maven.scm:maven-scm-test:1.9.6-SNAPSHOT in source directory m\maven-scm-test\src\main\java
[windows-jdk9] [withMaven] openTasksPublisher - Scan Tasks for Maven artifact org.apache.maven.scm:maven-scm-provider-accurev:1.9.6-SNAPSHOT in source directory m\maven-scm-providers\maven-scm-provider-accurev\src\main\java
[windows-jdk9] [withMaven] openTasksPublisher - Scan Tasks for Maven artifact org.apache.maven.scm:maven-scm-provider-bazaar:1.9.6-SNAPSHOT in source directory m\maven-scm-providers\maven-scm-provider-bazaar\src\main\java
[windows-jdk9] [withMaven] openTasksPublisher - Scan Tasks for Maven artifact org.apache.maven.scm:maven-scm-provider-clearcase:1.9.6-SNAPSHOT in source directory m\maven-scm-providers\maven-scm-provider-clearcase\src\main\java
[windows-jdk9] [withMaven] openTasksPublisher - Scan Tasks for Maven artifact org.apache.maven.scm:maven-scm-provider-cvstest:1.9.6-SNAPSHOT in source directory m\maven-scm-providers\maven-scm-providers-cvs\maven-scm-provider-cvstest\src\main\java
[windows-jdk9] [withMaven] openTasksPublisher - Scan Tasks for Maven artifact org.apache.maven.scm:maven-scm-provider-cvs-commons:1.9.6-SNAPSHOT in source directory m\maven-scm-providers\maven-scm-providers-cvs\maven-scm-provider-cvs-commons\src\main\java
[windows-jdk9] [withMaven] openTasksPublisher - Scan Tasks for Maven artifact org.apache.maven.scm:maven-scm-provider-cvsexe:1.9.6-SNAPSHOT in source directory m\maven-scm-providers\maven-scm-providers-cvs\maven-scm-provider-cvsexe\src\main\java
[windows-jdk9] [withMaven] openTasksPublisher - Scan Tasks for Maven artifact org.apache.maven.scm:maven-scm-provider-cvsjava:1.9.6-SNAPSHOT in source directory m\maven-scm-providers\maven-scm-providers-cvs\maven-scm-provider-cvsjava\src\main\java
[windows-jdk9] [withMaven] openTasksPublisher - Scan Tasks for Maven artifact org.apache.maven.scm:maven-scm-provider-hg:1.9.6-SNAPSHOT in source directory m\maven-scm-providers\maven-scm-provider-hg\src\main\java
[windows-jdk9] [withMaven] openTasksPublisher - Scan Tasks for Maven artifact org.apache.maven.scm:maven-scm-provider-git-commons:1.9.6-SNAPSHOT in source directory m\maven-scm-providers\maven-scm-providers-git\maven-scm-provider-git-commons\src\main\java
[windows-jdk9] [withMaven] openTasksPublisher - Scan Tasks for Maven artifact org.apache.maven.scm:maven-scm-provider-gittest:1.9.6-SNAPSHOT in source directory m\maven-scm-providers\maven-scm-providers-git\maven-scm-provider-gittest\src\main\java
[windows-jdk9] [withMaven] openTasksPublisher - Scan Tasks for Maven artifact org.apache.maven.scm:maven-scm-provider-gitexe:1.9.6-SNAPSHOT in source directory m\maven-scm-providers\maven-scm-providers-git\maven-scm-provider-gitexe\src\main\java
[windows-jdk9] [withMaven] openTasksPublisher - Scan Tasks for Maven artifact org.apache.maven.scm:maven-scm-provider-jgit:1.9.6-SNAPSHOT in source directory m\maven-scm-providers\maven-scm-providers-git\maven-scm-provider-jgit\src\main\java
[windows-jdk9] [withMaven] openTasksPublisher - Scan Tasks for Maven artifact org.apache.maven.scm:maven-scm-provider-local:1.9.6-SNAPSHOT in source directory m\maven-scm-providers\maven-scm-provider-local\src\main\java
[windows-jdk9] [withMaven] openTasksPublisher - Scan Tasks for Maven artifact org.apache.maven.scm:maven-scm-provider-perforce:1.9.6-SNAPSHOT in source directory m\maven-scm-providers\maven-scm-provider-perforce\src\main\java
[windows-jdk9] [withMaven] openTasksPublisher - Scan Tasks for Maven artifact org.apache.maven.scm:maven-scm-provider-starteam:1.9.6-SNAPSHOT in source directory m\maven-scm-providers\maven-scm-provider-starteam\src\main\java
[windows-jdk9] [withMaven] openTasksPublisher - Scan Tasks for Maven artifact org.apache.maven.scm:maven-scm-provider-svn-commons:1.9.6-SNAPSHOT in source directory m\maven-scm-providers\maven-scm-providers-svn\maven-scm-provider-svn-commons\src\main\java
[windows-jdk9] [withMaven] openTasksPublisher - Scan Tasks for Maven artifact org.apache.maven.scm:maven-scm-provider-svntest:1.9.6-SNAPSHOT in source directory m\maven-scm-providers\maven-scm-providers-svn\maven-scm-provider-svntest\src\main\java
[windows-jdk9] [withMaven] openTasksPublisher - Scan Tasks for Maven artifact org.apache.maven.scm:maven-scm-provider-svnexe:1.9.6-SNAPSHOT in source directory m\maven-scm-providers\maven-scm-providers-svn\maven-scm-provider-svnexe\src\main\java
[windows-jdk9] [withMaven] openTasksPublisher - Scan Tasks for Maven artifact org.apache.maven.scm:maven-scm-provider-synergy:1.9.6-SNAPSHOT in source directory m\maven-scm-providers\maven-scm-provider-synergy\src\main\java
[windows-jdk9] [withMaven] openTasksPublisher - Scan Tasks for Maven artifact org.apache.maven.scm:maven-scm-provider-vss:1.9.6-SNAPSHOT in source directory m\maven-scm-providers\maven-scm-provider-vss\src\main\java
[windows-jdk9] [withMaven] openTasksPublisher - Scan Tasks for Maven artifact org.apache.maven.scm:maven-scm-provider-tfs:1.9.6-SNAPSHOT in source directory m\maven-scm-providers\maven-scm-provider-tfs\src\main\java
[windows-jdk9] [withMaven] openTasksPublisher - Scan Tasks for Maven artifact org.apache.maven.scm:maven-scm-provider-integrity:1.9.6-SNAPSHOT in source directory m\maven-scm-providers\maven-scm-provider-integrity\src\main\java
[windows-jdk9] [withMaven] openTasksPublisher - Scan Tasks for Maven artifact org.apache.maven.scm:maven-scm-provider-jazz:1.9.6-SNAPSHOT in source directory m\maven-scm-providers\maven-scm-provider-jazz\src\main\java
[windows-jdk9] [withMaven] openTasksPublisher - Scan Tasks for Maven artifact org.apache.maven.scm:maven-scm-client:1.9.6-SNAPSHOT in source directory m\maven-scm-client\src\main\java
[windows-jdk9] [withMaven] openTasksPublisher - Scan Tasks for Maven artifact org.apache.maven.plugins:maven-scm-plugin:1.9.6-SNAPSHOT in source directory m\maven-scm-plugin\src\main\java
[windows-jdk9] [TASKS] Scanning folder 'f:\jenkins\jenkins-slave\workspace\maven-wip_maven-scm_master-ADXNUB4JTUUV5E57KMRFZSZVGMFJJBVMKSOJS62JASEIC2763EUQ' for files matching the pattern 'm\maven-scm-api\src\main\java\**\*,m\maven-scm-managers\maven-scm-manager-plexus\src\main\java\**\*,m\maven-scm-test\src\main\java\**\*,m\maven-scm-providers\maven-scm-provider-accurev\src\main\java\**\*,m\maven-scm-providers\maven-scm-provider-bazaar\src\main\java\**\*,m\maven-scm-providers\maven-scm-provider-clearcase\src\main\java\**\*,m\maven-scm-providers\maven-scm-providers-cvs\maven-scm-provider-cvstest\src\main\java\**\*,m\maven-scm-providers\maven-scm-providers-cvs\maven-scm-provider-cvs-commons\src\main\java\**\*,m\maven-scm-providers\maven-scm-providers-cvs\maven-scm-provider-cvsexe\src\main\java\**\*,m\maven-scm-providers\maven-scm-providers-cvs\maven-scm-provider-cvsjava\src\main\java\**\*,m\maven-scm-providers\maven-scm-provider-hg\src\main\java\**\*,m\maven-scm-providers\maven-scm-providers-git\maven-scm-provider-git-commons\src\main\java\**\*,m\maven-scm-providers\maven-scm-providers-git\maven-scm-provider-gittest\src\main\java\**\*,m\maven-scm-providers\maven-scm-providers-git\maven-scm-provider-gitexe\src\main\java\**\*,m\maven-scm-providers\maven-scm-providers-git\maven-scm-provider-jgit\src\main\java\**\*,m\maven-scm-providers\maven-scm-provider-local\src\main\java\**\*,m\maven-scm-providers\maven-scm-provider-perforce\src\main\java\**\*,m\maven-scm-providers\maven-scm-provider-starteam\src\main\java\**\*,m\maven-scm-providers\maven-scm-providers-svn\maven-scm-provider-svn-commons\src\main\java\**\*,m\maven-scm-providers\maven-scm-providers-svn\maven-scm-provider-svntest\src\main\java\**\*,m\maven-scm-providers\maven-scm-providers-svn\maven-scm-provider-svnexe\src\main\java\**\*,m\maven-scm-providers\maven-scm-provider-synergy\src\main\java\**\*,m\maven-scm-providers\maven-scm-provider-vss\src\main\java\**\*,m\maven-scm-providers\maven-scm-provider-tfs\src\main\java\**\*,m\maven-scm-providers\maven-scm-provider-integrity\src\main\java\**\*,m\maven-scm-providers\maven-scm-provider-jazz\src\main\java\**\*,m\maven-scm-client\src\main\java\**\*,m\maven-scm-plugin\src\main\java\**\*' - excludes: null
[windows-jdk9] [TASKS] Found 655 files to scan for tasks
[windows-jdk9] [TASKS] Found 95 open tasks.
[windows-jdk9] Skipping warnings blame since pipelines do not have an SCM link.%n
[windows-jdk9] [TASKS] Computing warning deltas based on reference build #1
[Pipeline] [windows-jdk9] }
[Pipeline] [windows-jdk7] }
[windows-jdk7] [withMaven] artifactsPublisher - Archive artifact m\pom.xml under org\apache\maven\scm\maven-scm\1.9.6-SNAPSHOT\maven-scm-1.9.6-SNAPSHOT.pom
[windows-jdk7] [withMaven] artifactsPublisher - Archive artifact m\maven-scm-api\pom.xml under org\apache\maven\scm\maven-scm-api\1.9.6-SNAPSHOT\maven-scm-api-1.9.6-SNAPSHOT.pom
[windows-jdk7] [withMaven] artifactsPublisher - Archive artifact m\maven-scm-api\target\maven-scm-api-1.9.6-SNAPSHOT.jar under org\apache\maven\scm\maven-scm-api\1.9.6-SNAPSHOT\maven-scm-api-1.9.6-SNAPSHOT.jar
[windows-jdk7] [withMaven] artifactsPublisher - Archive artifact m\maven-scm-managers\pom.xml under org\apache\maven\scm\maven-scm-managers\1.9.6-SNAPSHOT\maven-scm-managers-1.9.6-SNAPSHOT.pom
[windows-jdk7] [withMaven] artifactsPublisher - Archive artifact m\maven-scm-managers\maven-scm-manager-plexus\pom.xml under org\apache\maven\scm\maven-scm-manager-plexus\1.9.6-SNAPSHOT\maven-scm-manager-plexus-1.9.6-SNAPSHOT.pom
[windows-jdk7] [withMaven] artifactsPublisher - Archive artifact m\maven-scm-managers\maven-scm-manager-plexus\target\maven-scm-manager-plexus-1.9.6-SNAPSHOT.jar under org\apache\maven\scm\maven-scm-manager-plexus\1.9.6-SNAPSHOT\maven-scm-manager-plexus-1.9.6-SNAPSHOT.jar
[windows-jdk7] [withMaven] artifactsPublisher - Archive artifact m\maven-scm-test\pom.xml under org\apache\maven\scm\maven-scm-test\1.9.6-SNAPSHOT\maven-scm-test-1.9.6-SNAPSHOT.pom
[windows-jdk7] [withMaven] artifactsPublisher - Archive artifact m\maven-scm-test\target\maven-scm-test-1.9.6-SNAPSHOT.jar under org\apache\maven\scm\maven-scm-test\1.9.6-SNAPSHOT\maven-scm-test-1.9.6-SNAPSHOT.jar
[windows-jdk7] [withMaven] artifactsPublisher - Archive artifact m\maven-scm-providers\pom.xml under org\apache\maven\scm\maven-scm-providers\1.9.6-SNAPSHOT\maven-scm-providers-1.9.6-SNAPSHOT.pom
[windows-jdk7] [withMaven] artifactsPublisher - Archive artifact m\maven-scm-providers\maven-scm-provider-accurev\pom.xml under org\apache\maven\scm\maven-scm-provider-accurev\1.9.6-SNAPSHOT\maven-scm-provider-accurev-1.9.6-SNAPSHOT.pom
[windows-jdk7] [withMaven] artifactsPublisher - Archive artifact m\maven-scm-providers\maven-scm-provider-accurev\target\maven-scm-provider-accurev-1.9.6-SNAPSHOT.jar under org\apache\maven\scm\maven-scm-provider-accurev\1.9.6-SNAPSHOT\maven-scm-provider-accurev-1.9.6-SNAPSHOT.jar
[windows-jdk7] [withMaven] artifactsPublisher - Archive artifact m\maven-scm-providers\maven-scm-provider-bazaar\pom.xml under org\apache\maven\scm\maven-scm-provider-bazaar\1.9.6-SNAPSHOT\maven-scm-provider-bazaar-1.9.6-SNAPSHOT.pom
[windows-jdk7] [withMaven] artifactsPublisher - Archive artifact m\maven-scm-providers\maven-scm-provider-bazaar\target\maven-scm-provider-bazaar-1.9.6-SNAPSHOT.jar under org\apache\maven\scm\maven-scm-provider-bazaar\1.9.6-SNAPSHOT\maven-scm-provider-bazaar-1.9.6-SNAPSHOT.jar
[windows-jdk7] [withMaven] artifactsPublisher - Archive artifact m\maven-scm-providers\maven-scm-provider-clearcase\pom.xml under org\apache\maven\scm\maven-scm-provider-clearcase\1.9.6-SNAPSHOT\maven-scm-provider-clearcase-1.9.6-SNAPSHOT.pom
[windows-jdk7] [withMaven] artifactsPublisher - Archive artifact m\maven-scm-providers\maven-scm-provider-clearcase\target\maven-scm-provider-clearcase-1.9.6-SNAPSHOT.jar under org\apache\maven\scm\maven-scm-provider-clearcase\1.9.6-SNAPSHOT\maven-scm-provider-clearcase-1.9.6-SNAPSHOT.jar
[windows-jdk7] [withMaven] artifactsPublisher - Archive artifact m\maven-scm-providers\maven-scm-providers-cvs\pom.xml under org\apache\maven\scm\maven-scm-providers-cvs\1.9.6-SNAPSHOT\maven-scm-providers-cvs-1.9.6-SNAPSHOT.pom
[windows-jdk7] [withMaven] artifactsPublisher - Archive artifact m\maven-scm-providers\maven-scm-providers-cvs\maven-scm-provider-cvstest\pom.xml under org\apache\maven\scm\maven-scm-provider-cvstest\1.9.6-SNAPSHOT\maven-scm-provider-cvstest-1.9.6-SNAPSHOT.pom
[windows-jdk7] [withMaven] artifactsPublisher - Archive artifact m\maven-scm-providers\maven-scm-providers-cvs\maven-scm-provider-cvstest\target\maven-scm-provider-cvstest-1.9.6-SNAPSHOT.jar under org\apache\maven\scm\maven-scm-provider-cvstest\1.9.6-SNAPSHOT\maven-scm-provider-cvstest-1.9.6-SNAPSHOT.jar
[windows-jdk7] [withMaven] artifactsPublisher - Archive artifact m\maven-scm-providers\maven-scm-providers-cvs\maven-scm-provider-cvs-commons\pom.xml under org\apache\maven\scm\maven-scm-provider-cvs-commons\1.9.6-SNAPSHOT\maven-scm-provider-cvs-commons-1.9.6-SNAPSHOT.pom
[windows-jdk7] [withMaven] artifactsPublisher - Archive artifact m\maven-scm-providers\maven-scm-providers-cvs\maven-scm-provider-cvs-commons\target\maven-scm-provider-cvs-commons-1.9.6-SNAPSHOT.jar under org\apache\maven\scm\maven-scm-provider-cvs-commons\1.9.6-SNAPSHOT\maven-scm-provider-cvs-commons-1.9.6-SNAPSHOT.jar
[windows-jdk7] [withMaven] artifactsPublisher - Archive artifact m\maven-scm-providers\maven-scm-providers-cvs\maven-scm-provider-cvsexe\pom.xml under org\apache\maven\scm\maven-scm-provider-cvsexe\1.9.6-SNAPSHOT\maven-scm-provider-cvsexe-1.9.6-SNAPSHOT.pom
[windows-jdk7] [withMaven] artifactsPublisher - Archive artifact m\maven-scm-providers\maven-scm-providers-cvs\maven-scm-provider-cvsexe\target\maven-scm-provider-cvsexe-1.9.6-SNAPSHOT.jar under org\apache\maven\scm\maven-scm-provider-cvsexe\1.9.6-SNAPSHOT\maven-scm-provider-cvsexe-1.9.6-SNAPSHOT.jar
[windows-jdk7] [withMaven] artifactsPublisher - Archive artifact m\maven-scm-providers\maven-scm-providers-cvs\maven-scm-provider-cvsjava\pom.xml under org\apache\maven\scm\maven-scm-provider-cvsjava\1.9.6-SNAPSHOT\maven-scm-provider-cvsjava-1.9.6-SNAPSHOT.pom
[windows-jdk7] [withMaven] artifactsPublisher - Archive artifact m\maven-scm-providers\maven-scm-providers-cvs\maven-scm-provider-cvsjava\target\maven-scm-provider-cvsjava-1.9.6-SNAPSHOT.jar under org\apache\maven\scm\maven-scm-provider-cvsjava\1.9.6-SNAPSHOT\maven-scm-provider-cvsjava-1.9.6-SNAPSHOT.jar
[windows-jdk7] [withMaven] artifactsPublisher - Archive artifact m\maven-scm-providers\maven-scm-provider-hg\pom.xml under org\apache\maven\scm\maven-scm-provider-hg\1.9.6-SNAPSHOT\maven-scm-provider-hg-1.9.6-SNAPSHOT.pom
[windows-jdk7] [withMaven] artifactsPublisher - Archive artifact m\maven-scm-providers\maven-scm-provider-hg\target\maven-scm-provider-hg-1.9.6-SNAPSHOT.jar under org\apache\maven\scm\maven-scm-provider-hg\1.9.6-SNAPSHOT\maven-scm-provider-hg-1.9.6-SNAPSHOT.jar
[windows-jdk7] [withMaven] artifactsPublisher - Archive artifact m\maven-scm-providers\maven-scm-providers-git\pom.xml under org\apache\maven\scm\maven-scm-providers-git\1.9.6-SNAPSHOT\maven-scm-providers-git-1.9.6-SNAPSHOT.pom
[windows-jdk7] [withMaven] artifactsPublisher - Archive artifact m\maven-scm-providers\maven-scm-providers-git\maven-scm-provider-git-commons\pom.xml under org\apache\maven\scm\maven-scm-provider-git-commons\1.9.6-SNAPSHOT\maven-scm-provider-git-commons-1.9.6-SNAPSHOT.pom
[windows-jdk7] [withMaven] artifactsPublisher - Archive artifact m\maven-scm-providers\maven-scm-providers-git\maven-scm-provider-git-commons\target\maven-scm-provider-git-commons-1.9.6-SNAPSHOT.jar under org\apache\maven\scm\maven-scm-provider-git-commons\1.9.6-SNAPSHOT\maven-scm-provider-git-commons-1.9.6-SNAPSHOT.jar
[windows-jdk7] [withMaven] artifactsPublisher - Archive artifact m\maven-scm-providers\maven-scm-providers-git\maven-scm-provider-gittest\pom.xml under org\apache\maven\scm\maven-scm-provider-gittest\1.9.6-SNAPSHOT\maven-scm-provider-gittest-1.9.6-SNAPSHOT.pom
[windows-jdk7] [withMaven] artifactsPublisher - Archive artifact m\maven-scm-providers\maven-scm-providers-git\maven-scm-provider-gittest\target\maven-scm-provider-gittest-1.9.6-SNAPSHOT.jar under org\apache\maven\scm\maven-scm-provider-gittest\1.9.6-SNAPSHOT\maven-scm-provider-gittest-1.9.6-SNAPSHOT.jar
[windows-jdk7] [withMaven] artifactsPublisher - Archive artifact m\maven-scm-providers\maven-scm-providers-git\maven-scm-provider-gitexe\pom.xml under org\apache\maven\scm\maven-scm-provider-gitexe\1.9.6-SNAPSHOT\maven-scm-provider-gitexe-1.9.6-SNAPSHOT.pom
[windows-jdk7] [withMaven] artifactsPublisher - Archive artifact m\maven-scm-providers\maven-scm-providers-git\maven-scm-provider-gitexe\target\maven-scm-provider-gitexe-1.9.6-SNAPSHOT.jar under org\apache\maven\scm\maven-scm-provider-gitexe\1.9.6-SNAPSHOT\maven-scm-provider-gitexe-1.9.6-SNAPSHOT.jar
[windows-jdk7] [withMaven] artifactsPublisher - Archive artifact m\maven-scm-providers\maven-scm-providers-git\maven-scm-provider-jgit\pom.xml under org\apache\maven\scm\maven-scm-provider-jgit\1.9.6-SNAPSHOT\maven-scm-provider-jgit-1.9.6-SNAPSHOT.pom
[windows-jdk7] [withMaven] artifactsPublisher - Archive artifact m\maven-scm-providers\maven-scm-providers-git\maven-scm-provider-jgit\target\maven-scm-provider-jgit-1.9.6-SNAPSHOT.jar under org\apache\maven\scm\maven-scm-provider-jgit\1.9.6-SNAPSHOT\maven-scm-provider-jgit-1.9.6-SNAPSHOT.jar
[windows-jdk7] [withMaven] artifactsPublisher - Archive artifact m\maven-scm-providers\maven-scm-provider-local\pom.xml under org\apache\maven\scm\maven-scm-provider-local\1.9.6-SNAPSHOT\maven-scm-provider-local-1.9.6-SNAPSHOT.pom
[windows-jdk7] [withMaven] artifactsPublisher - Archive artifact m\maven-scm-providers\maven-scm-provider-local\target\maven-scm-provider-local-1.9.6-SNAPSHOT.jar under org\apache\maven\scm\maven-scm-provider-local\1.9.6-SNAPSHOT\maven-scm-provider-local-1.9.6-SNAPSHOT.jar
[windows-jdk7] [withMaven] artifactsPublisher - Archive artifact m\maven-scm-providers\maven-scm-provider-perforce\pom.xml under org\apache\maven\scm\maven-scm-provider-perforce\1.9.6-SNAPSHOT\maven-scm-provider-perforce-1.9.6-SNAPSHOT.pom
[windows-jdk7] [withMaven] artifactsPublisher - Archive artifact m\maven-scm-providers\maven-scm-provider-perforce\target\maven-scm-provider-perforce-1.9.6-SNAPSHOT.jar under org\apache\maven\scm\maven-scm-provider-perforce\1.9.6-SNAPSHOT\maven-scm-provider-perforce-1.9.6-SNAPSHOT.jar
[windows-jdk7] [withMaven] artifactsPublisher - Archive artifact m\maven-scm-providers\maven-scm-provider-starteam\pom.xml under org\apache\maven\scm\maven-scm-provider-starteam\1.9.6-SNAPSHOT\maven-scm-provider-starteam-1.9.6-SNAPSHOT.pom
[windows-jdk7] [withMaven] artifactsPublisher - Archive artifact m\maven-scm-providers\maven-scm-provider-starteam\target\maven-scm-provider-starteam-1.9.6-SNAPSHOT.jar under org\apache\maven\scm\maven-scm-provider-starteam\1.9.6-SNAPSHOT\maven-scm-provider-starteam-1.9.6-SNAPSHOT.jar
[windows-jdk7] [withMaven] artifactsPublisher - Archive artifact m\maven-scm-providers\maven-scm-providers-svn\pom.xml under org\apache\maven\scm\maven-scm-providers-svn\1.9.6-SNAPSHOT\maven-scm-providers-svn-1.9.6-SNAPSHOT.pom
[windows-jdk7] [withMaven] artifactsPublisher - Archive artifact m\maven-scm-providers\maven-scm-providers-svn\maven-scm-provider-svn-commons\pom.xml under org\apache\maven\scm\maven-scm-provider-svn-commons\1.9.6-SNAPSHOT\maven-scm-provider-svn-commons-1.9.6-SNAPSHOT.pom
[windows-jdk7] [withMaven] artifactsPublisher - Archive artifact m\maven-scm-providers\maven-scm-providers-svn\maven-scm-provider-svn-commons\target\maven-scm-provider-svn-commons-1.9.6-SNAPSHOT.jar under org\apache\maven\scm\maven-scm-provider-svn-commons\1.9.6-SNAPSHOT\maven-scm-provider-svn-commons-1.9.6-SNAPSHOT.jar
[windows-jdk7] [withMaven] artifactsPublisher - Archive artifact m\maven-scm-providers\maven-scm-providers-svn\maven-scm-provider-svntest\pom.xml under org\apache\maven\scm\maven-scm-provider-svntest\1.9.6-SNAPSHOT\maven-scm-provider-svntest-1.9.6-SNAPSHOT.pom
[windows-jdk7] [withMaven] artifactsPublisher - Archive artifact m\maven-scm-providers\maven-scm-providers-svn\maven-scm-provider-svntest\target\maven-scm-provider-svntest-1.9.6-SNAPSHOT.jar under org\apache\maven\scm\maven-scm-provider-svntest\1.9.6-SNAPSHOT\maven-scm-provider-svntest-1.9.6-SNAPSHOT.jar
[windows-jdk7] [withMaven] artifactsPublisher - Archive artifact m\maven-scm-providers\maven-scm-providers-svn\maven-scm-provider-svnexe\pom.xml under org\apache\maven\scm\maven-scm-provider-svnexe\1.9.6-SNAPSHOT\maven-scm-provider-svnexe-1.9.6-SNAPSHOT.pom
[windows-jdk7] [withMaven] artifactsPublisher - Archive artifact m\maven-scm-providers\maven-scm-providers-svn\maven-scm-provider-svnexe\target\maven-scm-provider-svnexe-1.9.6-SNAPSHOT.jar under org\apache\maven\scm\maven-scm-provider-svnexe\1.9.6-SNAPSHOT\maven-scm-provider-svnexe-1.9.6-SNAPSHOT.jar
[windows-jdk7] [withMaven] artifactsPublisher - Archive artifact m\maven-scm-providers\maven-scm-provider-synergy\pom.xml under org\apache\maven\scm\maven-scm-provider-synergy\1.9.6-SNAPSHOT\maven-scm-provider-synergy-1.9.6-SNAPSHOT.pom
[windows-jdk7] [withMaven] artifactsPublisher - Archive artifact m\maven-scm-providers\maven-scm-provider-synergy\target\maven-scm-provider-synergy-1.9.6-SNAPSHOT.jar under org\apache\maven\scm\maven-scm-provider-synergy\1.9.6-SNAPSHOT\maven-scm-provider-synergy-1.9.6-SNAPSHOT.jar
[windows-jdk7] [withMaven] artifactsPublisher - Archive artifact m\maven-scm-providers\maven-scm-provider-vss\pom.xml under org\apache\maven\scm\maven-scm-provider-vss\1.9.6-SNAPSHOT\maven-scm-provider-vss-1.9.6-SNAPSHOT.pom
[windows-jdk7] [withMaven] artifactsPublisher - Archive artifact m\maven-scm-providers\maven-scm-provider-vss\target\maven-scm-provider-vss-1.9.6-SNAPSHOT.jar under org\apache\maven\scm\maven-scm-provider-vss\1.9.6-SNAPSHOT\maven-scm-provider-vss-1.9.6-SNAPSHOT.jar
[windows-jdk7] [withMaven] artifactsPublisher - Archive artifact m\maven-scm-providers\maven-scm-provider-tfs\pom.xml under org\apache\maven\scm\maven-scm-provider-tfs\1.9.6-SNAPSHOT\maven-scm-provider-tfs-1.9.6-SNAPSHOT.pom
[windows-jdk7] [withMaven] artifactsPublisher - Archive artifact m\maven-scm-providers\maven-scm-provider-tfs\target\maven-scm-provider-tfs-1.9.6-SNAPSHOT.jar under org\apache\maven\scm\maven-scm-provider-tfs\1.9.6-SNAPSHOT\maven-scm-provider-tfs-1.9.6-SNAPSHOT.jar
[windows-jdk7] [withMaven] artifactsPublisher - Archive artifact m\maven-scm-providers\maven-scm-provider-integrity\pom.xml under org\apache\maven\scm\maven-scm-provider-integrity\1.9.6-SNAPSHOT\maven-scm-provider-integrity-1.9.6-SNAPSHOT.pom
[windows-jdk7] [withMaven] artifactsPublisher - Archive artifact m\maven-scm-providers\maven-scm-provider-integrity\target\maven-scm-provider-integrity-1.9.6-SNAPSHOT.jar under org\apache\maven\scm\maven-scm-provider-integrity\1.9.6-SNAPSHOT\maven-scm-provider-integrity-1.9.6-SNAPSHOT.jar
[windows-jdk7] [withMaven] artifactsPublisher - Archive artifact m\maven-scm-providers\maven-scm-provider-jazz\pom.xml under org\apache\maven\scm\maven-scm-provider-jazz\1.9.6-SNAPSHOT\maven-scm-provider-jazz-1.9.6-SNAPSHOT.pom
[windows-jdk7] [withMaven] artifactsPublisher - Archive artifact m\maven-scm-providers\maven-scm-provider-jazz\target\maven-scm-provider-jazz-1.9.6-SNAPSHOT.jar under org\apache\maven\scm\maven-scm-provider-jazz\1.9.6-SNAPSHOT\maven-scm-provider-jazz-1.9.6-SNAPSHOT.jar
[windows-jdk7] [withMaven] artifactsPublisher - Archive artifact m\maven-scm-providers\maven-scm-providers-standard\pom.xml under org\apache\maven\scm\maven-scm-providers-standard\1.9.6-SNAPSHOT\maven-scm-providers-standard-1.9.6-SNAPSHOT.pom
[windows-jdk7] [withMaven] artifactsPublisher - Archive artifact m\maven-scm-client\pom.xml under org\apache\maven\scm\maven-scm-client\1.9.6-SNAPSHOT\maven-scm-client-1.9.6-SNAPSHOT.pom
[windows-jdk7] [withMaven] artifactsPublisher - Archive artifact m\maven-scm-client\target\maven-scm-client-1.9.6-SNAPSHOT.jar under org\apache\maven\scm\maven-scm-client\1.9.6-SNAPSHOT\maven-scm-client-1.9.6-SNAPSHOT.jar
[windows-jdk7] [withMaven] artifactsPublisher - Archive artifact m\maven-scm-plugin\pom.xml under org\apache\maven\plugins\maven-scm-plugin\1.9.6-SNAPSHOT\maven-scm-plugin-1.9.6-SNAPSHOT.pom
[windows-jdk7] [withMaven] artifactsPublisher - Archive artifact m\maven-scm-plugin\target\maven-scm-plugin-1.9.6-SNAPSHOT.jar under org\apache\maven\plugins\maven-scm-plugin\1.9.6-SNAPSHOT\maven-scm-plugin-1.9.6-SNAPSHOT.jar
[windows-jdk7] [withMaven] artifactsPublisher - Archive artifact m\target\maven-scm-1.9.6-SNAPSHOT-site.xml under org\apache\maven\scm\maven-scm\1.9.6-SNAPSHOT\maven-scm-1.9.6-SNAPSHOT-site.xml
[windows-jdk7] [withMaven] artifactsPublisher - Archive artifact m\maven-scm-managers\target\maven-scm-managers-1.9.6-SNAPSHOT-site.xml under org\apache\maven\scm\maven-scm-managers\1.9.6-SNAPSHOT\maven-scm-managers-1.9.6-SNAPSHOT-site.xml
[windows-jdk7] [withMaven] artifactsPublisher - Archive artifact m\maven-scm-providers\target\maven-scm-providers-1.9.6-SNAPSHOT-site.xml under org\apache\maven\scm\maven-scm-providers\1.9.6-SNAPSHOT\maven-scm-providers-1.9.6-SNAPSHOT-site.xml
[windows-jdk7] [withMaven] artifactsPublisher - Archive artifact m\maven-scm-providers\maven-scm-providers-cvs\target\maven-scm-providers-cvs-1.9.6-SNAPSHOT-site.xml under org\apache\maven\scm\maven-scm-providers-cvs\1.9.6-SNAPSHOT\maven-scm-providers-cvs-1.9.6-SNAPSHOT-site.xml
[windows-jdk7] [withMaven] artifactsPublisher - Archive artifact m\maven-scm-providers\maven-scm-providers-git\target\maven-scm-providers-git-1.9.6-SNAPSHOT-site.xml under org\apache\maven\scm\maven-scm-providers-git\1.9.6-SNAPSHOT\maven-scm-providers-git-1.9.6-SNAPSHOT-site.xml
[windows-jdk7] [withMaven] artifactsPublisher - Archive artifact m\maven-scm-providers\maven-scm-providers-svn\target\maven-scm-providers-svn-1.9.6-SNAPSHOT-site.xml under org\apache\maven\scm\maven-scm-providers-svn\1.9.6-SNAPSHOT\maven-scm-providers-svn-1.9.6-SNAPSHOT-site.xml
[windows-jdk7] [withMaven] artifactsPublisher - Archive artifact m\maven-scm-client\target\maven-scm-client-1.9.6-SNAPSHOT-jar-with-dependencies.jar under org\apache\maven\scm\maven-scm-client\1.9.6-SNAPSHOT\maven-scm-client-1.9.6-SNAPSHOT-jar-with-dependencies.jar
[windows-jdk7] [withMaven] invokerPublisher - Archive invoker results for Maven artifact MavenArtifact{org.apache.maven.plugins:maven-scm-plugin::1.9.6-SNAPSHOT(version: 1.9.6-SNAPSHOT, snapshot:false) } generated by PluginInvocation{org.apache.maven.plugins:maven-invoker-plugin:2.0.0@run  integration-test}: m\maven-scm-plugin\target\invoker-reports\*.xml
[windows-jdk7] performing MavenInvokerRecorder, reportsFilenamePattern:'**/m\maven-scm-plugin\target\invoker-reports/BUILD*.xml', invokerBuildDir:'**/m\maven-scm-plugin\target\it'
[windows-jdk7] Found reports:[]
[windows-jdk7] Found logs:[]
[windows-jdk7] Finished parsing Maven Invoker results (found 0)
[windows-jdk7] [withMaven] junitPublisher - Archive test results for Maven artifact org.apache.maven.scm:maven-scm-api:1.9.6-SNAPSHOT generated by maven-surefire-plugin:test (default-test): m\maven-scm-api\target\surefire-reports\*.xml
[windows-jdk7] [withMaven] junitPublisher - Jenkins JUnit Attachments Plugin not found, can't publish test attachments.Recording test results
[windows-jdk7] [withMaven] junitPublisher - Archive test results for Maven artifact org.apache.maven.scm:maven-scm-manager-plexus:1.9.6-SNAPSHOT generated by maven-surefire-plugin:test (default-test): m\maven-scm-managers\maven-scm-manager-plexus\target\surefire-reports\*.xml
[windows-jdk7] [withMaven] junitPublisher - Jenkins JUnit Attachments Plugin not found, can't publish test attachments.Recording test results
[windows-jdk7] None of the test reports contained any result
[windows-jdk7] [withMaven] junitPublisher - Archive test results for Maven artifact org.apache.maven.scm:maven-scm-test:1.9.6-SNAPSHOT generated by maven-surefire-plugin:test (default-test): m\maven-scm-test\target\surefire-reports\*.xml
[windows-jdk7] [withMaven] junitPublisher - Jenkins JUnit Attachments Plugin not found, can't publish test attachments.Recording test results
[windows-jdk7] [withMaven] junitPublisher - Archive test results for Maven artifact org.apache.maven.scm:maven-scm-provider-accurev:1.9.6-SNAPSHOT generated by maven-surefire-plugin:test (default-test): m\maven-scm-providers\maven-scm-provider-accurev\target\surefire-reports\*.xml
[windows-jdk7] [withMaven] junitPublisher - Jenkins JUnit Attachments Plugin not found, can't publish test attachments.Recording test results
[windows-jdk7] [withMaven] junitPublisher - Archive test results for Maven artifact org.apache.maven.scm:maven-scm-provider-bazaar:1.9.6-SNAPSHOT generated by maven-surefire-plugin:test (default-test): m\maven-scm-providers\maven-scm-provider-bazaar\target\surefire-reports\*.xml
[windows-jdk7] [withMaven] junitPublisher - Jenkins JUnit Attachments Plugin not found, can't publish test attachments.Recording test results
[windows-jdk7] [withMaven] junitPublisher - Archive test results for Maven artifact org.apache.maven.scm:maven-scm-provider-clearcase:1.9.6-SNAPSHOT generated by maven-surefire-plugin:test (default-test): m\maven-scm-providers\maven-scm-provider-clearcase\target\surefire-reports\*.xml
[windows-jdk7] [withMaven] junitPublisher - Jenkins JUnit Attachments Plugin not found, can't publish test attachments.Recording test results
[windows-jdk7] [withMaven] junitPublisher - Archive test results for Maven artifact org.apache.maven.scm:maven-scm-provider-cvstest:1.9.6-SNAPSHOT generated by maven-surefire-plugin:test (default-test): m\maven-scm-providers\maven-scm-providers-cvs\maven-scm-provider-cvstest\target\surefire-reports\*.xml
[windows-jdk7] [withMaven] junitPublisher - Jenkins JUnit Attachments Plugin not found, can't publish test attachments.Recording test results
[windows-jdk7] None of the test reports contained any result
[windows-jdk7] [withMaven] junitPublisher - Archive test results for Maven artifact org.apache.maven.scm:maven-scm-provider-cvs-commons:1.9.6-SNAPSHOT generated by maven-surefire-plugin:test (default-test): m\maven-scm-providers\maven-scm-providers-cvs\maven-scm-provider-cvs-commons\target\surefire-reports\*.xml
[windows-jdk7] [withMaven] junitPublisher - Jenkins JUnit Attachments Plugin not found, can't publish test attachments.Recording test results
[windows-jdk7] [withMaven] junitPublisher - Archive test results for Maven artifact org.apache.maven.scm:maven-scm-provider-cvsexe:1.9.6-SNAPSHOT generated by maven-surefire-plugin:test (default-test): m\maven-scm-providers\maven-scm-providers-cvs\maven-scm-provider-cvsexe\target\surefire-reports\*.xml
[windows-jdk7] [withMaven] junitPublisher - Jenkins JUnit Attachments Plugin not found, can't publish test attachments.Recording test results
[windows-jdk7] [withMaven] junitPublisher - Archive test results for Maven artifact org.apache.maven.scm:maven-scm-provider-cvsjava:1.9.6-SNAPSHOT generated by maven-surefire-plugin:test (default-test): m\maven-scm-providers\maven-scm-providers-cvs\maven-scm-provider-cvsjava\target\surefire-reports\*.xml
[windows-jdk7] [withMaven] junitPublisher - Jenkins JUnit Attachments Plugin not found, can't publish test attachments.Recording test results
[windows-jdk7] [withMaven] junitPublisher - Archive test results for Maven artifact org.apache.maven.scm:maven-scm-provider-hg:1.9.6-SNAPSHOT generated by maven-surefire-plugin:test (default-test): m\maven-scm-providers\maven-scm-provider-hg\target\surefire-reports\*.xml
[windows-jdk7] [withMaven] junitPublisher - Jenkins JUnit Attachments Plugin not found, can't publish test attachments.Recording test results
[windows-jdk7] [withMaven] junitPublisher - Archive test results for Maven artifact org.apache.maven.scm:maven-scm-provider-git-commons:1.9.6-SNAPSHOT generated by maven-surefire-plugin:test (default-test): m\maven-scm-providers\maven-scm-providers-git\maven-scm-provider-git-commons\target\surefire-reports\*.xml
[windows-jdk7] [withMaven] junitPublisher - Jenkins JUnit Attachments Plugin not found, can't publish test attachments.Recording test results
[windows-jdk7] [withMaven] junitPublisher - Archive test results for Maven artifact org.apache.maven.scm:maven-scm-provider-gittest:1.9.6-SNAPSHOT generated by maven-surefire-plugin:test (default-test): m\maven-scm-providers\maven-scm-providers-git\maven-scm-provider-gittest\target\surefire-reports\*.xml
[windows-jdk7] [withMaven] junitPublisher - Jenkins JUnit Attachments Plugin not found, can't publish test attachments.Recording test results
[windows-jdk7] None of the test reports contained any result
[windows-jdk7] [withMaven] junitPublisher - Archive test results for Maven artifact org.apache.maven.scm:maven-scm-provider-gitexe:1.9.6-SNAPSHOT generated by maven-surefire-plugin:test (default-test): m\maven-scm-providers\maven-scm-providers-git\maven-scm-provider-gitexe\target\surefire-reports\*.xml
[windows-jdk7] [withMaven] junitPublisher - Jenkins JUnit Attachments Plugin not found, can't publish test attachments.Recording test results
[windows-jdk7] [withMaven] junitPublisher - Archive test results for Maven artifact org.apache.maven.scm:maven-scm-provider-jgit:1.9.6-SNAPSHOT generated by maven-surefire-plugin:test (default-test): m\maven-scm-providers\maven-scm-providers-git\maven-scm-provider-jgit\target\surefire-reports\*.xml
[windows-jdk7] [withMaven] junitPublisher - Jenkins JUnit Attachments Plugin not found, can't publish test attachments.Recording test results
[windows-jdk7] [withMaven] junitPublisher - Archive test results for Maven artifact org.apache.maven.scm:maven-scm-provider-local:1.9.6-SNAPSHOT generated by maven-surefire-plugin:test (default-test): m\maven-scm-providers\maven-scm-provider-local\target\surefire-reports\*.xml
[windows-jdk7] [withMaven] junitPublisher - Jenkins JUnit Attachments Plugin not found, can't publish test attachments.Recording test results
[windows-jdk7] [withMaven] junitPublisher - Archive test results for Maven artifact org.apache.maven.scm:maven-scm-provider-perforce:1.9.6-SNAPSHOT generated by maven-surefire-plugin:test (default-test): m\maven-scm-providers\maven-scm-provider-perforce\target\surefire-reports\*.xml
[windows-jdk7] [withMaven] junitPublisher - Jenkins JUnit Attachments Plugin not found, can't publish test attachments.Recording test results
[windows-jdk7] [withMaven] junitPublisher - Archive test results for Maven artifact org.apache.maven.scm:maven-scm-provider-starteam:1.9.6-SNAPSHOT generated by maven-surefire-plugin:test (default-test): m\maven-scm-providers\maven-scm-provider-starteam\target\surefire-reports\*.xml
[windows-jdk7] [withMaven] junitPublisher - Jenkins JUnit Attachments Plugin not found, can't publish test attachments.Recording test results
[windows-jdk7] [withMaven] junitPublisher - Archive test results for Maven artifact org.apache.maven.scm:maven-scm-provider-svn-commons:1.9.6-SNAPSHOT generated by maven-surefire-plugin:test (default-test): m\maven-scm-providers\maven-scm-providers-svn\maven-scm-provider-svn-commons\target\surefire-reports\*.xml
[windows-jdk7] [withMaven] junitPublisher - Jenkins JUnit Attachments Plugin not found, can't publish test attachments.Recording test results
[windows-jdk7] [withMaven] junitPublisher - Archive test results for Maven artifact org.apache.maven.scm:maven-scm-provider-svntest:1.9.6-SNAPSHOT generated by maven-surefire-plugin:test (default-test): m\maven-scm-providers\maven-scm-providers-svn\maven-scm-provider-svntest\target\surefire-reports\*.xml
[windows-jdk7] [withMaven] junitPublisher - Jenkins JUnit Attachments Plugin not found, can't publish test attachments.Recording test results
[windows-jdk7] None of the test reports contained any result
[windows-jdk7] [withMaven] junitPublisher - Archive test results for Maven artifact org.apache.maven.scm:maven-scm-provider-svnexe:1.9.6-SNAPSHOT generated by maven-surefire-plugin:test (default-test): m\maven-scm-providers\maven-scm-providers-svn\maven-scm-provider-svnexe\target\surefire-reports\*.xml
[windows-jdk7] [withMaven] junitPublisher - Jenkins JUnit Attachments Plugin not found, can't publish test attachments.Recording test results
[windows-jdk7] [withMaven] junitPublisher - Archive test results for Maven artifact org.apache.maven.scm:maven-scm-provider-synergy:1.9.6-SNAPSHOT generated by maven-surefire-plugin:test (default-test): m\maven-scm-providers\maven-scm-provider-synergy\target\surefire-reports\*.xml
[windows-jdk7] [withMaven] junitPublisher - Jenkins JUnit Attachments Plugin not found, can't publish test attachments.Recording test results
[windows-jdk7] [withMaven] junitPublisher - Archive test results for Maven artifact org.apache.maven.scm:maven-scm-provider-vss:1.9.6-SNAPSHOT generated by maven-surefire-plugin:test (default-test): m\maven-scm-providers\maven-scm-provider-vss\target\surefire-reports\*.xml
[windows-jdk7] [withMaven] junitPublisher - Jenkins JUnit Attachments Plugin not found, can't publish test attachments.Recording test results
[windows-jdk7] [withMaven] junitPublisher - Archive test results for Maven artifact org.apache.maven.scm:maven-scm-provider-tfs:1.9.6-SNAPSHOT generated by maven-surefire-plugin:test (default-test): m\maven-scm-providers\maven-scm-provider-tfs\target\surefire-reports\*.xml
[windows-jdk7] [withMaven] junitPublisher - Jenkins JUnit Attachments Plugin not found, can't publish test attachments.Recording test results
[windows-jdk7] [withMaven] junitPublisher - Archive test results for Maven artifact org.apache.maven.scm:maven-scm-provider-integrity:1.9.6-SNAPSHOT generated by maven-surefire-plugin:test (default-test): m\maven-scm-providers\maven-scm-provider-integrity\target\surefire-reports\*.xml
[windows-jdk7] [withMaven] junitPublisher - Jenkins JUnit Attachments Plugin not found, can't publish test attachments.Recording test results
[windows-jdk7] [withMaven] junitPublisher - Archive test results for Maven artifact org.apache.maven.scm:maven-scm-provider-jazz:1.9.6-SNAPSHOT generated by maven-surefire-plugin:test (default-test): m\maven-scm-providers\maven-scm-provider-jazz\target\surefire-reports\*.xml
[windows-jdk7] [withMaven] junitPublisher - Jenkins JUnit Attachments Plugin not found, can't publish test attachments.Recording test results
[windows-jdk7] [withMaven] junitPublisher - Archive test results for Maven artifact org.apache.maven.scm:maven-scm-client:1.9.6-SNAPSHOT generated by maven-surefire-plugin:test (default-test): m\maven-scm-client\target\surefire-reports\*.xml
[windows-jdk7] [withMaven] junitPublisher - Jenkins JUnit Attachments Plugin not found, can't publish test attachments.Recording test results
[windows-jdk7] None of the test reports contained any result
[windows-jdk7] [withMaven] junitPublisher - Archive test results for Maven artifact org.apache.maven.plugins:maven-scm-plugin:1.9.6-SNAPSHOT generated by maven-surefire-plugin:test (default-test): m\maven-scm-plugin\target\surefire-reports\*.xml
[windows-jdk7] [withMaven] junitPublisher - Jenkins JUnit Attachments Plugin not found, can't publish test attachments.Recording test results
[windows-jdk7] [withMaven] openTasksPublisher - Scan Tasks for Maven artifact org.apache.maven.scm:maven-scm-api:1.9.6-SNAPSHOT in source directory m\maven-scm-api\src\main\java
[windows-jdk7] [withMaven] openTasksPublisher - Scan Tasks for Maven artifact org.apache.maven.scm:maven-scm-manager-plexus:1.9.6-SNAPSHOT in source directory m\maven-scm-managers\maven-scm-manager-plexus\src\main\java
[windows-jdk7] [withMaven] openTasksPublisher - Scan Tasks for Maven artifact org.apache.maven.scm:maven-scm-test:1.9.6-SNAPSHOT in source directory m\maven-scm-test\src\main\java
[windows-jdk7] [withMaven] openTasksPublisher - Scan Tasks for Maven artifact org.apache.maven.scm:maven-scm-provider-accurev:1.9.6-SNAPSHOT in source directory m\maven-scm-providers\maven-scm-provider-accurev\src\main\java
[windows-jdk7] [withMaven] openTasksPublisher - Scan Tasks for Maven artifact org.apache.maven.scm:maven-scm-provider-bazaar:1.9.6-SNAPSHOT in source directory m\maven-scm-providers\maven-scm-provider-bazaar\src\main\java
[windows-jdk7] [withMaven] openTasksPublisher - Scan Tasks for Maven artifact org.apache.maven.scm:maven-scm-provider-clearcase:1.9.6-SNAPSHOT in source directory m\maven-scm-providers\maven-scm-provider-clearcase\src\main\java
[windows-jdk7] [withMaven] openTasksPublisher - Scan Tasks for Maven artifact org.apache.maven.scm:maven-scm-provider-cvstest:1.9.6-SNAPSHOT in source directory m\maven-scm-providers\maven-scm-providers-cvs\maven-scm-provider-cvstest\src\main\java
[windows-jdk7] [withMaven] openTasksPublisher - Scan Tasks for Maven artifact org.apache.maven.scm:maven-scm-provider-cvs-commons:1.9.6-SNAPSHOT in source directory m\maven-scm-providers\maven-scm-providers-cvs\maven-scm-provider-cvs-commons\src\main\java
[windows-jdk7] [withMaven] openTasksPublisher - Scan Tasks for Maven artifact org.apache.maven.scm:maven-scm-provider-cvsexe:1.9.6-SNAPSHOT in source directory m\maven-scm-providers\maven-scm-providers-cvs\maven-scm-provider-cvsexe\src\main\java
[windows-jdk7] [withMaven] openTasksPublisher - Scan Tasks for Maven artifact org.apache.maven.scm:maven-scm-provider-cvsjava:1.9.6-SNAPSHOT in source directory m\maven-scm-providers\maven-scm-providers-cvs\maven-scm-provider-cvsjava\src\main\java
[windows-jdk7] [withMaven] openTasksPublisher - Scan Tasks for Maven artifact org.apache.maven.scm:maven-scm-provider-hg:1.9.6-SNAPSHOT in source directory m\maven-scm-providers\maven-scm-provider-hg\src\main\java
[windows-jdk7] [withMaven] openTasksPublisher - Scan Tasks for Maven artifact org.apache.maven.scm:maven-scm-provider-git-commons:1.9.6-SNAPSHOT in source directory m\maven-scm-providers\maven-scm-providers-git\maven-scm-provider-git-commons\src\main\java
[windows-jdk7] [withMaven] openTasksPublisher - Scan Tasks for Maven artifact org.apache.maven.scm:maven-scm-provider-gittest:1.9.6-SNAPSHOT in source directory m\maven-scm-providers\maven-scm-providers-git\maven-scm-provider-gittest\src\main\java
[windows-jdk7] [withMaven] openTasksPublisher - Scan Tasks for Maven artifact org.apache.maven.scm:maven-scm-provider-gitexe:1.9.6-SNAPSHOT in source directory m\maven-scm-providers\maven-scm-providers-git\maven-scm-provider-gitexe\src\main\java
[windows-jdk7] [withMaven] openTasksPublisher - Scan Tasks for Maven artifact org.apache.maven.scm:maven-scm-provider-jgit:1.9.6-SNAPSHOT in source directory m\maven-scm-providers\maven-scm-providers-git\maven-scm-provider-jgit\src\main\java
[windows-jdk7] [withMaven] openTasksPublisher - Scan Tasks for Maven artifact org.apache.maven.scm:maven-scm-provider-local:1.9.6-SNAPSHOT in source directory m\maven-scm-providers\maven-scm-provider-local\src\main\java
[windows-jdk7] [withMaven] openTasksPublisher - Scan Tasks for Maven artifact org.apache.maven.scm:maven-scm-provider-perforce:1.9.6-SNAPSHOT in source directory m\maven-scm-providers\maven-scm-provider-perforce\src\main\java
[windows-jdk7] [withMaven] openTasksPublisher - Scan Tasks for Maven artifact org.apache.maven.scm:maven-scm-provider-starteam:1.9.6-SNAPSHOT in source directory m\maven-scm-providers\maven-scm-provider-starteam\src\main\java
[windows-jdk7] [withMaven] openTasksPublisher - Scan Tasks for Maven artifact org.apache.maven.scm:maven-scm-provider-svn-commons:1.9.6-SNAPSHOT in source directory m\maven-scm-providers\maven-scm-providers-svn\maven-scm-provider-svn-commons\src\main\java
[windows-jdk7] [withMaven] openTasksPublisher - Scan Tasks for Maven artifact org.apache.maven.scm:maven-scm-provider-svntest:1.9.6-SNAPSHOT in source directory m\maven-scm-providers\maven-scm-providers-svn\maven-scm-provider-svntest\src\main\java
[windows-jdk7] [withMaven] openTasksPublisher - Scan Tasks for Maven artifact org.apache.maven.scm:maven-scm-provider-svnexe:1.9.6-SNAPSHOT in source directory m\maven-scm-providers\maven-scm-providers-svn\maven-scm-provider-svnexe\src\main\java
[windows-jdk7] [withMaven] openTasksPublisher - Scan Tasks for Maven artifact org.apache.maven.scm:maven-scm-provider-synergy:1.9.6-SNAPSHOT in source directory m\maven-scm-providers\maven-scm-provider-synergy\src\main\java
[windows-jdk7] [withMaven] openTasksPublisher - Scan Tasks for Maven artifact org.apache.maven.scm:maven-scm-provider-vss:1.9.6-SNAPSHOT in source directory m\maven-scm-providers\maven-scm-provider-vss\src\main\java
[windows-jdk7] [withMaven] openTasksPublisher - Scan Tasks for Maven artifact org.apache.maven.scm:maven-scm-provider-tfs:1.9.6-SNAPSHOT in source directory m\maven-scm-providers\maven-scm-provider-tfs\src\main\java
[windows-jdk7] [withMaven] openTasksPublisher - Scan Tasks for Maven artifact org.apache.maven.scm:maven-scm-provider-integrity:1.9.6-SNAPSHOT in source directory m\maven-scm-providers\maven-scm-provider-integrity\src\main\java
[windows-jdk7] [withMaven] openTasksPublisher - Scan Tasks for Maven artifact org.apache.maven.scm:maven-scm-provider-jazz:1.9.6-SNAPSHOT in source directory m\maven-scm-providers\maven-scm-provider-jazz\src\main\java
[windows-jdk7] [withMaven] openTasksPublisher - Scan Tasks for Maven artifact org.apache.maven.scm:maven-scm-client:1.9.6-SNAPSHOT in source directory m\maven-scm-client\src\main\java
[windows-jdk7] [withMaven] openTasksPublisher - Scan Tasks for Maven artifact org.apache.maven.plugins:maven-scm-plugin:1.9.6-SNAPSHOT in source directory m\maven-scm-plugin\src\main\java
[windows-jdk7] [TASKS] Scanning folder 'f:\jenkins\jenkins-slave\workspace\maven-wip_maven-scm_master-ADXNUB4JTUUV5E57KMRFZSZVGMFJJBVMKSOJS62JASEIC2763EUQ' for files matching the pattern 'm\maven-scm-api\src\main\java\**\*,m\maven-scm-managers\maven-scm-manager-plexus\src\main\java\**\*,m\maven-scm-test\src\main\java\**\*,m\maven-scm-providers\maven-scm-provider-accurev\src\main\java\**\*,m\maven-scm-providers\maven-scm-provider-bazaar\src\main\java\**\*,m\maven-scm-providers\maven-scm-provider-clearcase\src\main\java\**\*,m\maven-scm-providers\maven-scm-providers-cvs\maven-scm-provider-cvstest\src\main\java\**\*,m\maven-scm-providers\maven-scm-providers-cvs\maven-scm-provider-cvs-commons\src\main\java\**\*,m\maven-scm-providers\maven-scm-providers-cvs\maven-scm-provider-cvsexe\src\main\java\**\*,m\maven-scm-providers\maven-scm-providers-cvs\maven-scm-provider-cvsjava\src\main\java\**\*,m\maven-scm-providers\maven-scm-provider-hg\src\main\java\**\*,m\maven-scm-providers\maven-scm-providers-git\maven-scm-provider-git-commons\src\main\java\**\*,m\maven-scm-providers\maven-scm-providers-git\maven-scm-provider-gittest\src\main\java\**\*,m\maven-scm-providers\maven-scm-providers-git\maven-scm-provider-gitexe\src\main\java\**\*,m\maven-scm-providers\maven-scm-providers-git\maven-scm-provider-jgit\src\main\java\**\*,m\maven-scm-providers\maven-scm-provider-local\src\main\java\**\*,m\maven-scm-providers\maven-scm-provider-perforce\src\main\java\**\*,m\maven-scm-providers\maven-scm-provider-starteam\src\main\java\**\*,m\maven-scm-providers\maven-scm-providers-svn\maven-scm-provider-svn-commons\src\main\java\**\*,m\maven-scm-providers\maven-scm-providers-svn\maven-scm-provider-svntest\src\main\java\**\*,m\maven-scm-providers\maven-scm-providers-svn\maven-scm-provider-svnexe\src\main\java\**\*,m\maven-scm-providers\maven-scm-provider-synergy\src\main\java\**\*,m\maven-scm-providers\maven-scm-provider-vss\src\main\java\**\*,m\maven-scm-providers\maven-scm-provider-tfs\src\main\java\**\*,m\maven-scm-providers\maven-scm-provider-integrity\src\main\java\**\*,m\maven-scm-providers\maven-scm-provider-jazz\src\main\java\**\*,m\maven-scm-client\src\main\java\**\*,m\maven-scm-plugin\src\main\java\**\*' - excludes: null
[windows-jdk7] [TASKS] Found 655 files to scan for tasks
[windows-jdk7] [TASKS] Found 95 open tasks.
[windows-jdk7] Skipping warnings blame since pipelines do not have an SCM link.%n
[windows-jdk7] [TASKS] Computing warning deltas based on reference build #1
[Pipeline] [linux-jdk8] // node
[Pipeline] [linux-jdk9] // node
[Pipeline] [windows-jdk8] // node
[Pipeline] [windows-jdk9] // withMaven
[Pipeline] [windows-jdk7] // withMaven
[Pipeline] [linux-jdk8] }
[Pipeline] [linux-jdk9] }
[Pipeline] [windows-jdk8] }
[Pipeline] [windows-jdk9] }
[Pipeline] [windows-jdk7] }
[Pipeline] [windows-jdk9] // stage
[Pipeline] [windows-jdk7] // stage
[Pipeline] [windows-jdk7] }
[Pipeline] [windows-jdk9] }
[Pipeline] [windows-jdk7] // node
[Pipeline] [windows-jdk9] // node
[Pipeline] [windows-jdk7] }
[Pipeline] [windows-jdk9] }
[Pipeline] // parallel
[Pipeline] stage
[Pipeline] { (Notifications)
[Pipeline] echo
Build result: UNSTABLE
[Pipeline] jiraIssueSelector
[Pipeline] emailext
Reply | Threaded
Open this post in threaded view
|

Build failed in Jenkins: Maven TLP (wip) » maven-scm » master #3

Apache Jenkins Server-2
See https://builds.apache.org/job/maven-wip/job/maven-scm/job/master/3/

Changes:

* No need to collect findbugs etc on anything other than the first

No tests ran.

Build log:
[...truncated 451 B...]
 > git ls-remote -h -t https://gitbox.apache.org/repos/asf/maven-jenkins-env.git # timeout=10
Found match: refs/heads/master revision 6c77351e3029741c6f350e8e419c0fb5f9feab2d
 > git rev-parse --is-inside-work-tree # timeout=10
Fetching changes from the remote Git repository
 > git config remote.origin.url https://gitbox.apache.org/repos/asf/maven-jenkins-env.git # timeout=10
Fetching without tags
Fetching upstream changes from https://gitbox.apache.org/repos/asf/maven-jenkins-env.git
 > git --version # timeout=10
 > git fetch --no-tags --progress https://gitbox.apache.org/repos/asf/maven-jenkins-env.git +refs/heads/*:refs/remotes/origin/*
Checking out Revision 6c77351e3029741c6f350e8e419c0fb5f9feab2d (master)
 > git config core.sparsecheckout # timeout=10
 > git checkout -f 6c77351e3029741c6f350e8e419c0fb5f9feab2d
Commit message: "Add license headers"
 > git rev-list 6c77351e3029741c6f350e8e419c0fb5f9feab2d # timeout=10
Loading library jenkins-lib@master
Attempting to resolve master from remote references...
 > git --version # timeout=10
 > git ls-remote -h -t https://gitbox.apache.org/repos/asf/maven-jenkins-lib.git # timeout=10
Found match: refs/heads/master revision 6cb1a21e8bda7ce124a49f99571f693f6ef9fa3b
 > git rev-parse --is-inside-work-tree # timeout=10
Fetching changes from the remote Git repository
 > git config remote.origin.url https://gitbox.apache.org/repos/asf/maven-jenkins-lib.git # timeout=10
Fetching without tags
Fetching upstream changes from https://gitbox.apache.org/repos/asf/maven-jenkins-lib.git
 > git --version # timeout=10
 > git fetch --no-tags --progress https://gitbox.apache.org/repos/asf/maven-jenkins-lib.git +refs/heads/*:refs/remotes/origin/*
Checking out Revision 6cb1a21e8bda7ce124a49f99571f693f6ef9fa3b (master)
 > git config core.sparsecheckout # timeout=10
 > git checkout -f 6cb1a21e8bda7ce124a49f99571f693f6ef9fa3b
Commit message: "No need to collect findbugs etc on anything other than the first parallel run"
 > git rev-list af25f0866ae2100d0297185e0fb181128f3da8fb # timeout=10
[Pipeline] properties
[Pipeline] echo
OS: linux JDK: 7 Maven: 3.x.x => Label: ubuntu JDK: JDK 1.7 (latest) Maven: Maven 3.5.2
[Pipeline] echo
OS: linux JDK: 8 Maven: 3.x.x => Label: ubuntu JDK: JDK 1.8 (latest) Maven: Maven 3.5.2
[Pipeline] echo
OS: linux JDK: 9 Maven: 3.x.x => Label: ubuntu JDK: JDK 1.9 (latest) Maven: Maven 3.5.2
[Pipeline] echo
OS: windows JDK: 7 Maven: 3.x.x => Label: Windows JDK: JDK 1.7 (latest) Maven: Maven 3.5.0 (Windows)
[Pipeline] echo
OS: windows JDK: 8 Maven: 3.x.x => Label: Windows JDK: JDK 1.8 (latest) Maven: Maven 3.5.0 (Windows)
[Pipeline] echo
OS: windows JDK: 9 Maven: 3.x.x => Label: Windows JDK: JDK 1.9 (latest) Maven: Maven 3.5.0 (Windows)
[Pipeline] parallel
[Pipeline] [linux-jdk7] { (Branch: linux-jdk7)
[Pipeline] [linux-jdk8] { (Branch: linux-jdk8)
[Pipeline] [linux-jdk9] { (Branch: linux-jdk9)
[Pipeline] [windows-jdk7] { (Branch: windows-jdk7)
[Pipeline] [windows-jdk8] { (Branch: windows-jdk8)
[Pipeline] [windows-jdk9] { (Branch: windows-jdk9)
[Pipeline] [linux-jdk7] node
[linux-jdk7] Running on H23 in /home/jenkins/jenkins-slave/workspace/maven-wip_maven-scm_master-ADXNUB4JTUUV5E57KMRFZSZVGMFJJBVMKSOJS62JASEIC2763EUQ
[Pipeline] [linux-jdk8] node
[linux-jdk8] Running on ubuntu-2 in /home/jenkins/jenkins-slave/workspace/maven-wip_maven-scm_master-ADXNUB4JTUUV5E57KMRFZSZVGMFJJBVMKSOJS62JASEIC2763EUQ
[Pipeline] [linux-jdk9] node
[linux-jdk9] Running on ubuntu-2 in /home/jenkins/jenkins-slave/workspace/maven-wip_maven-scm_master-ADXNUB4JTUUV5E57KMRFZSZVGMFJJBVMKSOJS62JASEIC2763EUQ@2
[Pipeline] [windows-jdk7] node
[windows-jdk7] Running on windows-2012-1 in f:\jenkins\jenkins-slave\workspace\maven-wip_maven-scm_master-ADXNUB4JTUUV5E57KMRFZSZVGMFJJBVMKSOJS62JASEIC2763EUQ
[Pipeline] [windows-jdk8] node
[Pipeline] [windows-jdk9] node
[windows-jdk8] Running on windows-2012-2 in f:\jenkins\jenkins-slave\workspace\maven-wip_maven-scm_master-ADXNUB4JTUUV5E57KMRFZSZVGMFJJBVMKSOJS62JASEIC2763EUQ
[windows-jdk9] Running on windows-2012-3 in f:\jenkins\jenkins-slave\workspace\maven-wip_maven-scm_master-ADXNUB4JTUUV5E57KMRFZSZVGMFJJBVMKSOJS62JASEIC2763EUQ
[Pipeline] [linux-jdk7] {
[Pipeline] [linux-jdk8] {
[Pipeline] [linux-jdk9] {
[Pipeline] [windows-jdk7] {
[Pipeline] [windows-jdk8] {
[Pipeline] [windows-jdk9] {
[Pipeline] [linux-jdk7] stage
[Pipeline] [linux-jdk7] { (Checkout linux-jdk7)
[Pipeline] [linux-jdk8] stage
[Pipeline] [linux-jdk8] { (Checkout linux-jdk8)
[Pipeline] [linux-jdk9] stage
[Pipeline] [linux-jdk9] { (Checkout linux-jdk9)
[Pipeline] [windows-jdk7] stage
[Pipeline] [windows-jdk7] { (Checkout windows-jdk7)
[Pipeline] [windows-jdk8] stage
[Pipeline] [windows-jdk8] { (Checkout windows-jdk8)
[Pipeline] [windows-jdk9] stage
[Pipeline] [windows-jdk9] { (Checkout windows-jdk9)
[Pipeline] [linux-jdk7] dir
[linux-jdk7] Running in /home/jenkins/jenkins-slave/workspace/maven-wip_maven-scm_master-ADXNUB4JTUUV5E57KMRFZSZVGMFJJBVMKSOJS62JASEIC2763EUQ/m
[Pipeline] [linux-jdk7] {
[Pipeline] [linux-jdk8] dir
[linux-jdk8] Running in /home/jenkins/jenkins-slave/workspace/maven-wip_maven-scm_master-ADXNUB4JTUUV5E57KMRFZSZVGMFJJBVMKSOJS62JASEIC2763EUQ/m
[Pipeline] [linux-jdk8] {
[Pipeline] [linux-jdk9] dir
[linux-jdk9] Running in /home/jenkins/jenkins-slave/workspace/maven-wip_maven-scm_master-ADXNUB4JTUUV5E57KMRFZSZVGMFJJBVMKSOJS62JASEIC2763EUQ@2/m
[Pipeline] [linux-jdk9] {
[Pipeline] [windows-jdk7] dir
[windows-jdk7] Running in f:\jenkins\jenkins-slave\workspace\maven-wip_maven-scm_master-ADXNUB4JTUUV5E57KMRFZSZVGMFJJBVMKSOJS62JASEIC2763EUQ\m
[Pipeline] [windows-jdk7] {
[Pipeline] [windows-jdk8] dir
[windows-jdk8] Running in f:\jenkins\jenkins-slave\workspace\maven-wip_maven-scm_master-ADXNUB4JTUUV5E57KMRFZSZVGMFJJBVMKSOJS62JASEIC2763EUQ\m
[Pipeline] [windows-jdk8] {
[Pipeline] [windows-jdk9] dir
[windows-jdk9] Running in f:\jenkins\jenkins-slave\workspace\maven-wip_maven-scm_master-ADXNUB4JTUUV5E57KMRFZSZVGMFJJBVMKSOJS62JASEIC2763EUQ\m
[Pipeline] [windows-jdk9] {
[Pipeline] [linux-jdk7] checkout
[Pipeline] [linux-jdk8] checkout
[Pipeline] [linux-jdk9] checkout
[Pipeline] [windows-jdk7] checkout
[Pipeline] [windows-jdk8] checkout
[Pipeline] [windows-jdk9] checkout
[windows-jdk8]  > git rev-parse --is-inside-work-tree # timeout=10
[windows-jdk8] Fetching changes from the remote Git repository
[windows-jdk8]  > git config remote.origin.url https://git-wip-us.apache.org/repos/asf/maven-scm.git # timeout=10
[windows-jdk8] Fetching without tags
[windows-jdk8] Fetching upstream changes from https://git-wip-us.apache.org/repos/asf/maven-scm.git
[windows-jdk8]  > git --version # timeout=10
[windows-jdk8]  > git fetch --no-tags --progress https://git-wip-us.apache.org/repos/asf/maven-scm.git +refs/heads/*:refs/remotes/origin/*
[windows-jdk9]  > git rev-parse --is-inside-work-tree # timeout=10
[windows-jdk9] Fetching changes from the remote Git repository
[windows-jdk9]  > git config remote.origin.url https://git-wip-us.apache.org/repos/asf/maven-scm.git # timeout=10
[windows-jdk9] Fetching without tags
[windows-jdk9] Fetching upstream changes from https://git-wip-us.apache.org/repos/asf/maven-scm.git
[windows-jdk9]  > git --version # timeout=10
[windows-jdk9]  > git fetch --no-tags --progress https://git-wip-us.apache.org/repos/asf/maven-scm.git +refs/heads/*:refs/remotes/origin/*
[linux-jdk7]  > git rev-parse --is-inside-work-tree # timeout=10
[linux-jdk7] Fetching changes from the remote Git repository
[linux-jdk7]  > git config remote.origin.url https://git-wip-us.apache.org/repos/asf/maven-scm.git # timeout=10
[linux-jdk7] Fetching without tags
[linux-jdk7] Fetching upstream changes from https://git-wip-us.apache.org/repos/asf/maven-scm.git
[linux-jdk7]  > git --version # timeout=10
[linux-jdk7]  > git fetch --no-tags --progress https://git-wip-us.apache.org/repos/asf/maven-scm.git +refs/heads/*:refs/remotes/origin/*
[linux-jdk8]  > git rev-parse --is-inside-work-tree # timeout=10
[linux-jdk8] Fetching changes from the remote Git repository
[linux-jdk8]  > git config remote.origin.url https://git-wip-us.apache.org/repos/asf/maven-scm.git # timeout=10
[linux-jdk9]  > git rev-parse --is-inside-work-tree # timeout=10
[linux-jdk9] Fetching changes from the remote Git repository
[windows-jdk7]  > git rev-parse --is-inside-work-tree # timeout=10
[windows-jdk7] Fetching changes from the remote Git repository
[windows-jdk7]  > git config remote.origin.url https://git-wip-us.apache.org/repos/asf/maven-scm.git # timeout=10
[windows-jdk7] Fetching without tags
[windows-jdk7] Fetching upstream changes from https://git-wip-us.apache.org/repos/asf/maven-scm.git
[windows-jdk7]  > git --version # timeout=10
[windows-jdk7]  > git fetch --no-tags --progress https://git-wip-us.apache.org/repos/asf/maven-scm.git +refs/heads/*:refs/remotes/origin/*
[windows-jdk8] Checking out Revision d34b4d0d3e21a5cad7a89f785662daaa259c9159 (master)
[windows-jdk8]  > git config core.sparsecheckout # timeout=10
[linux-jdk7] Checking out Revision d34b4d0d3e21a5cad7a89f785662daaa259c9159 (master)
[linux-jdk7]  > git config core.sparsecheckout # timeout=10
[linux-jdk7]  > git checkout -f d34b4d0d3e21a5cad7a89f785662daaa259c9159
[linux-jdk7] Commit message: "Add Jenkinsfile"
[linux-jdk7] Cleaning workspace
[linux-jdk7]  > git rev-parse --verify HEAD # timeout=10
[linux-jdk7] Resetting working tree
[linux-jdk7]  > git reset --hard # timeout=10
[linux-jdk7]  > git clean -fdx # timeout=10
[linux-jdk8] Fetching without tags
[linux-jdk8] Fetching upstream changes from https://git-wip-us.apache.org/repos/asf/maven-scm.git
[linux-jdk8]  > git --version # timeout=10
[linux-jdk8]  > git fetch --no-tags --progress https://git-wip-us.apache.org/repos/asf/maven-scm.git +refs/heads/*:refs/remotes/origin/*
[linux-jdk9]  > git config remote.origin.url https://git-wip-us.apache.org/repos/asf/maven-scm.git # timeout=10
[linux-jdk9] Fetching without tags
[linux-jdk9] Fetching upstream changes from https://git-wip-us.apache.org/repos/asf/maven-scm.git
[linux-jdk9]  > git --version # timeout=10
[linux-jdk9]  > git fetch --no-tags --progress https://git-wip-us.apache.org/repos/asf/maven-scm.git +refs/heads/*:refs/remotes/origin/*
[windows-jdk7] Checking out Revision d34b4d0d3e21a5cad7a89f785662daaa259c9159 (master)
[windows-jdk7]  > git config core.sparsecheckout # timeout=10
[windows-jdk7]  > git checkout -f d34b4d0d3e21a5cad7a89f785662daaa259c9159
[windows-jdk7] Commit message: "Add Jenkinsfile"
[windows-jdk7] Cleaning workspace
[windows-jdk7]  > git rev-parse --verify HEAD # timeout=10
[windows-jdk8]  > git checkout -f d34b4d0d3e21a5cad7a89f785662daaa259c9159
[windows-jdk8] Commit message: "Add Jenkinsfile"
[windows-jdk8]  > git rev-list d34b4d0d3e21a5cad7a89f785662daaa259c9159 # timeout=10
[windows-jdk8] Cleaning workspace
[windows-jdk8]  > git rev-parse --verify HEAD # timeout=10
[windows-jdk8] Resetting working tree
[windows-jdk8]  > git reset --hard # timeout=10
[windows-jdk8]  > git clean -fdx # timeout=10
[windows-jdk9] Checking out Revision d34b4d0d3e21a5cad7a89f785662daaa259c9159 (master)
[windows-jdk9]  > git config core.sparsecheckout # timeout=10
[windows-jdk9]  > git checkout -f d34b4d0d3e21a5cad7a89f785662daaa259c9159
[windows-jdk9] Commit message: "Add Jenkinsfile"
[windows-jdk9] Cleaning workspace
[windows-jdk9]  > git rev-parse --verify HEAD # timeout=10
[windows-jdk9] Resetting working tree
[windows-jdk9]  > git reset --hard # timeout=10
[windows-jdk9]  > git clean -fdx # timeout=10
[Pipeline] [linux-jdk7] }
[Pipeline] [linux-jdk7] // dir
[Pipeline] [linux-jdk7] }
[windows-jdk7] Resetting working tree
[windows-jdk7]  > git reset --hard # timeout=10
[Pipeline] [linux-jdk7] // stage
[Pipeline] [linux-jdk7] stage
[Pipeline] [linux-jdk7] { (Build linux-jdk7)
[linux-jdk8] Checking out Revision d34b4d0d3e21a5cad7a89f785662daaa259c9159 (master)
[linux-jdk8]  > git config core.sparsecheckout # timeout=10
[linux-jdk8]  > git checkout -f d34b4d0d3e21a5cad7a89f785662daaa259c9159
[linux-jdk8] Commit message: "Add Jenkinsfile"
[linux-jdk8] Cleaning workspace
[windows-jdk7]  > git clean -fdx # timeout=10
[Pipeline] [linux-jdk7] }
[Pipeline] [linux-jdk7] // stage
[linux-jdk9] Checking out Revision d34b4d0d3e21a5cad7a89f785662daaa259c9159 (master)
[Pipeline] [linux-jdk7] }
[Pipeline] [linux-jdk7] // node
[Pipeline] [linux-jdk7] }
[linux-jdk7] Failed in branch linux-jdk7
[Pipeline] [linux-jdk8] }
[Pipeline] [linux-jdk9] }
[Pipeline] [windows-jdk7] }
[Pipeline] [windows-jdk8] }
[Pipeline] [windows-jdk9] }
[Pipeline] [linux-jdk8] // dir
[Pipeline] [linux-jdk9] // dir
[Pipeline] [windows-jdk7] // dir
[Pipeline] [windows-jdk8] // dir
[Pipeline] [windows-jdk9] // dir
[Pipeline] [linux-jdk8] }
[Pipeline] [linux-jdk9] }
[Pipeline] [windows-jdk7] }
[Pipeline] [windows-jdk8] }
[Pipeline] [windows-jdk9] }
[Pipeline] [linux-jdk8] // stage
[Pipeline] [linux-jdk9] // stage
[Pipeline] [windows-jdk7] // stage
[Pipeline] [windows-jdk8] // stage
[Pipeline] [windows-jdk9] // stage
[Pipeline] [linux-jdk8] }
[Pipeline] [linux-jdk9] }
[Pipeline] [windows-jdk7] }
[Pipeline] [windows-jdk8] }
[Pipeline] [windows-jdk9] }
[Pipeline] [linux-jdk8] // node
[Pipeline] [linux-jdk9] // node
[Pipeline] [windows-jdk7] // node
[Pipeline] [windows-jdk8] // node
[Pipeline] [windows-jdk9] // node
[Pipeline] [linux-jdk8] }
[linux-jdk8] Failed in branch linux-jdk8
[Pipeline] [linux-jdk9] }
[linux-jdk9] Failed in branch linux-jdk9
[Pipeline] [windows-jdk7] }
[windows-jdk7] Failed in branch windows-jdk7
[Pipeline] [windows-jdk8] }
[windows-jdk8] Failed in branch windows-jdk8
[Pipeline] [windows-jdk9] }
[windows-jdk9] Failed in branch windows-jdk9
[Pipeline] // parallel
[Pipeline] stage
[Pipeline] { (Notifications)
[Pipeline] echo
Build result: FAILURE
[Pipeline] jiraIssueSelector
[Pipeline] emailext