Build unstable in Jenkins: Maven TLP (wip) » maven-plugin-testing » master #1

Previous Topic Next Topic
 
classic Classic list List threaded Threaded
1 message Options
Reply | Threaded
Open this post in threaded view
|

Build unstable in Jenkins: Maven TLP (wip) » maven-plugin-testing » master #1

Apache Jenkins Server-2
See https://builds.apache.org/job/maven-wip/job/maven-plugin-testing/job/master/1/

No changes.

2 tests failed.
FAILED:  org.apache.maven.shared.test.plugin.ProjectToolTest.testPackageProjectArtifact_ShouldPopulateWithCorrectArtifactAndMetadata

Error Message:
Missing target\unit\projects\basic\target\it-build-target\maven-it-plugin-test.jar

Stack Trace:
junit.framework.AssertionFailedError: Missing target\unit\projects\basic\target\it-build-target\maven-it-plugin-test.jar
        at junit.framework.Assert.fail(Assert.java:57)
        at junit.framework.Assert.assertTrue(Assert.java:22)
        at junit.framework.TestCase.assertTrue(TestCase.java:192)
        at org.apache.maven.shared.test.plugin.ProjectToolTest.testPackageProjectArtifact_ShouldPopulateWithCorrectArtifactAndMetadata(ProjectToolTest.java:99)


FAILED:  org.apache.maven.shared.test.plugin.ProjectToolTest.testPackageProjectArtifact_ShouldPopulateWithCorrectArtifactAndMetadata

Error Message:
Missing target/unit/projects/basic/target/it-build-target/maven-it-plugin-test.jar

Stack Trace:
junit.framework.AssertionFailedError: Missing target/unit/projects/basic/target/it-build-target/maven-it-plugin-test.jar
        at junit.framework.Assert.fail(Assert.java:57)
        at junit.framework.Assert.assertTrue(Assert.java:22)
        at junit.framework.TestCase.assertTrue(TestCase.java:192)
        at org.apache.maven.shared.test.plugin.ProjectToolTest.testPackageProjectArtifact_ShouldPopulateWithCorrectArtifactAndMetadata(ProjectToolTest.java:99)




Build log:
[...truncated 662.12 KB...]
[linux-jdk9] [INFO] --- maven-enforcer-plugin:1.3.1:enforce (ban-known-bad-maven-versions) @ maven-plugin-testing-harness ---
[linux-jdk9] [INFO]
[linux-jdk9] [INFO] --- maven-remote-resources-plugin:1.5:process (default) @ maven-plugin-testing-harness ---
[linux-jdk9] [INFO]
[linux-jdk9] [INFO] --- maven-resources-plugin:2.6:resources (default-resources) @ maven-plugin-testing-harness ---
[linux-jdk9] [INFO] Using 'UTF-8' encoding to copy filtered resources.
[linux-jdk9] [INFO] Copying 1 resource
[linux-jdk9] [INFO] Copying 3 resources
[linux-jdk9] [INFO]
[linux-jdk9] [INFO] --- maven-compiler-plugin:3.1:compile (default-compile) @ maven-plugin-testing-harness ---
[linux-jdk9] [INFO] Changes detected - recompiling the module!
[linux-jdk9] [INFO] Compiling 15 source files to /home/jenkins/jenkins-slave/workspace/maven-plugin-testing_master-NCBPBM2KWGRWS5DI42KPWKDSI7LTESQKZBNOJTJFN6BQQGHMA5ZQ/m/maven-plugin-testing-harness/target/classes
[linux-jdk9] [WARNING] /home/jenkins/jenkins-slave/workspace/maven-plugin-testing_master-NCBPBM2KWGRWS5DI42KPWKDSI7LTESQKZBNOJTJFN6BQQGHMA5ZQ/m/maven-plugin-testing-harness/src/main/java/org/apache/maven/plugin/testing/stubs/StubArtifactResolver.java: Some input files use or override a deprecated API.
[linux-jdk9] [WARNING] /home/jenkins/jenkins-slave/workspace/maven-plugin-testing_master-NCBPBM2KWGRWS5DI42KPWKDSI7LTESQKZBNOJTJFN6BQQGHMA5ZQ/m/maven-plugin-testing-harness/src/main/java/org/apache/maven/plugin/testing/stubs/StubArtifactResolver.java: Recompile with -Xlint:deprecation for details.
[linux-jdk9] [INFO]
[linux-jdk9] [INFO] --- maven-resources-plugin:2.6:testResources (default-testResources) @ maven-plugin-testing-harness ---
[linux-jdk9] [INFO] Using 'UTF-8' encoding to copy filtered resources.
[linux-jdk9] [INFO] Copying 1 resource
[linux-jdk9] [INFO] Copying 3 resources
[linux-jdk9] [INFO]
[linux-jdk9] [INFO] --- maven-compiler-plugin:3.1:testCompile (default-testCompile) @ maven-plugin-testing-harness ---
[linux-jdk9] [INFO] Changes detected - recompiling the module!
[linux-jdk9] [INFO] Compiling 11 source files to /home/jenkins/jenkins-slave/workspace/maven-plugin-testing_master-NCBPBM2KWGRWS5DI42KPWKDSI7LTESQKZBNOJTJFN6BQQGHMA5ZQ/m/maven-plugin-testing-harness/target/test-classes
[linux-jdk9] [INFO]
[linux-jdk9] [INFO] --- maven-surefire-plugin:2.16:test (default-test) @ maven-plugin-testing-harness ---
[linux-jdk9] [INFO] Surefire report directory: /home/jenkins/jenkins-slave/workspace/maven-plugin-testing_master-NCBPBM2KWGRWS5DI42KPWKDSI7LTESQKZBNOJTJFN6BQQGHMA5ZQ/m/maven-plugin-testing-harness/target/surefire-reports
[linux-jdk9]
[linux-jdk9] -------------------------------------------------------
[linux-jdk9]  T E S T S
[linux-jdk9] -------------------------------------------------------
[linux-jdk9] Picked up JAVA_TOOL_OPTIONS: -Dmaven.ext.class.path="/home/jenkins/jenkins-slave/workspace/maven-plugin-testing_master-NCBPBM2KWGRWS5DI42KPWKDSI7LTESQKZBNOJTJFN6BQQGHMA5ZQ@tmp/withMavene775e71c/pipeline-maven-spy.jar" -Dorg.jenkinsci.plugins.pipeline.maven.reportsFolder="/home/jenkins/jenkins-slave/workspace/maven-plugin-testing_master-NCBPBM2KWGRWS5DI42KPWKDSI7LTESQKZBNOJTJFN6BQQGHMA5ZQ@tmp/withMavene775e71c"
[linux-jdk9] Running org.apache.maven.plugin.testing.PluginArtifactFileTest
[linux-jdk9] Tests run: 1, Failures: 0, Errors: 0, Skipped: 0, Time elapsed: 1.048 sec - in org.apache.maven.plugin.testing.PluginArtifactFileTest
[linux-jdk9] Running org.apache.maven.plugin.testing.ExpressionEvaluatorTest
[linux-jdk9] Tests run: 1, Failures: 0, Errors: 0, Skipped: 0, Time elapsed: 0.125 sec - in org.apache.maven.plugin.testing.ExpressionEvaluatorTest
[linux-jdk9] Running org.apache.maven.plugin.testing.resources.TestResourcesTest
[linux-jdk9] Tests run: 1, Failures: 0, Errors: 0, Skipped: 0, Time elapsed: 0.015 sec - in org.apache.maven.plugin.testing.resources.TestResourcesTest
[linux-jdk9] Running org.apache.maven.plugin.testing.ParametersMojoTest
[linux-jdk9] Tests run: 4, Failures: 0, Errors: 0, Skipped: 0, Time elapsed: 0.619 sec - in org.apache.maven.plugin.testing.ParametersMojoTest
[linux-jdk9] Running org.apache.maven.plugin.testing.TestSilentLog
[linux-jdk9] Tests run: 2, Failures: 0, Errors: 0, Skipped: 0, Time elapsed: 0.002 sec - in org.apache.maven.plugin.testing.TestSilentLog
[linux-jdk9] Running org.apache.maven.plugin.testing.ArtifactStubFactoryTest
[linux-jdk9] Tests run: 2, Failures: 0, Errors: 0, Skipped: 0, Time elapsed: 0.003 sec - in org.apache.maven.plugin.testing.ArtifactStubFactoryTest
[linux-jdk9] Running org.apache.maven.plugin.testing.MojoRuleTest
[linux-jdk9] Tests run: 7, Failures: 0, Errors: 0, Skipped: 0, Time elapsed: 0.507 sec - in org.apache.maven.plugin.testing.MojoRuleTest
[linux-jdk9] Running org.apache.maven.plugin.testing.MojoTestCaseTest
[linux-jdk9] Tests run: 5, Failures: 0, Errors: 0, Skipped: 0, Time elapsed: 0.364 sec - in org.apache.maven.plugin.testing.MojoTestCaseTest
[linux-jdk9]
[linux-jdk9] Results :
[linux-jdk9]
[linux-jdk9] Tests run: 23, Failures: 0, Errors: 0, Skipped: 0
[linux-jdk9]
[linux-jdk9] [INFO]
[linux-jdk9] [INFO] --- maven-jar-plugin:2.4:jar (default-jar) @ maven-plugin-testing-harness ---
[linux-jdk9] [INFO] Building jar: /home/jenkins/jenkins-slave/workspace/maven-plugin-testing_master-NCBPBM2KWGRWS5DI42KPWKDSI7LTESQKZBNOJTJFN6BQQGHMA5ZQ/m/maven-plugin-testing-harness/target/maven-plugin-testing-harness-3.3.1-SNAPSHOT.jar
[linux-jdk9] [INFO]
[linux-jdk9] [INFO] >>> maven-source-plugin:2.2.1:jar (default) > generate-sources @ maven-plugin-testing-harness >>>
[linux-jdk9] [INFO]
[linux-jdk9] [INFO] --- maven-enforcer-plugin:1.3.1:enforce (enforce-bytecode-version) @ maven-plugin-testing-harness ---
[linux-jdk9] [INFO]
[linux-jdk9] [INFO] --- maven-enforcer-plugin:1.3.1:enforce (ban-known-bad-maven-versions) @ maven-plugin-testing-harness ---
[linux-jdk9] [INFO]
[linux-jdk9] [INFO] <<< maven-source-plugin:2.2.1:jar (default) < generate-sources @ maven-plugin-testing-harness <<<
[linux-jdk9] [INFO]
[linux-jdk9] [INFO]
[linux-jdk9] [INFO] --- maven-source-plugin:2.2.1:jar (default) @ maven-plugin-testing-harness ---
[linux-jdk9] [INFO] Building jar: /home/jenkins/jenkins-slave/workspace/maven-plugin-testing_master-NCBPBM2KWGRWS5DI42KPWKDSI7LTESQKZBNOJTJFN6BQQGHMA5ZQ/m/maven-plugin-testing-harness/target/maven-plugin-testing-harness-3.3.1-SNAPSHOT-sources.jar
[linux-jdk9] [INFO]
[linux-jdk9] [INFO] ------------------------------------------------------------------------
[linux-jdk9] [INFO] Building Maven Testing Tools 3.3.1-SNAPSHOT
[linux-jdk9] [INFO] ------------------------------------------------------------------------
[linux-jdk9] [INFO]
[linux-jdk9] [INFO] --- maven-clean-plugin:2.5:clean (default-clean) @ maven-test-tools ---
[linux-jdk9] [INFO]
[linux-jdk9] [INFO] --- maven-enforcer-plugin:1.3.1:enforce (enforce-bytecode-version) @ maven-test-tools ---
[linux-jdk9] [INFO]
[linux-jdk9] [INFO] --- maven-enforcer-plugin:1.3.1:enforce (ban-known-bad-maven-versions) @ maven-test-tools ---
[linux-jdk9] [INFO]
[linux-jdk9] [INFO] --- maven-remote-resources-plugin:1.5:process (default) @ maven-test-tools ---
[linux-jdk9] [INFO]
[linux-jdk9] [INFO] --- maven-resources-plugin:2.6:resources (default-resources) @ maven-test-tools ---
[linux-jdk9] [INFO] Using 'UTF-8' encoding to copy filtered resources.
[linux-jdk9] [INFO] skip non existing resourceDirectory /home/jenkins/jenkins-slave/workspace/maven-plugin-testing_master-NCBPBM2KWGRWS5DI42KPWKDSI7LTESQKZBNOJTJFN6BQQGHMA5ZQ/m/maven-test-tools/src/main/resources
[linux-jdk9] [INFO] Copying 3 resources
[linux-jdk9] [INFO]
[linux-jdk9] [INFO] --- maven-compiler-plugin:3.1:compile (default-compile) @ maven-test-tools ---
[linux-jdk9] [INFO] Changes detected - recompiling the module!
[linux-jdk9] [INFO] Compiling 4 source files to /home/jenkins/jenkins-slave/workspace/maven-plugin-testing_master-NCBPBM2KWGRWS5DI42KPWKDSI7LTESQKZBNOJTJFN6BQQGHMA5ZQ/m/maven-test-tools/target/classes
[linux-jdk9] [WARNING] /home/jenkins/jenkins-slave/workspace/maven-plugin-testing_master-NCBPBM2KWGRWS5DI42KPWKDSI7LTESQKZBNOJTJFN6BQQGHMA5ZQ/m/maven-test-tools/src/main/java/org/apache/maven/shared/tools/easymock/TestFileManager.java: Some input files use or override a deprecated API.
[linux-jdk9] [WARNING] /home/jenkins/jenkins-slave/workspace/maven-plugin-testing_master-NCBPBM2KWGRWS5DI42KPWKDSI7LTESQKZBNOJTJFN6BQQGHMA5ZQ/m/maven-test-tools/src/main/java/org/apache/maven/shared/tools/easymock/TestFileManager.java: Recompile with -Xlint:deprecation for details.
[linux-jdk9] [INFO]
[linux-jdk9] [INFO] --- maven-resources-plugin:2.6:testResources (default-testResources) @ maven-test-tools ---
[linux-jdk9] [INFO] Using 'UTF-8' encoding to copy filtered resources.
[linux-jdk9] [INFO] skip non existing resourceDirectory /home/jenkins/jenkins-slave/workspace/maven-plugin-testing_master-NCBPBM2KWGRWS5DI42KPWKDSI7LTESQKZBNOJTJFN6BQQGHMA5ZQ/m/maven-test-tools/src/test/resources
[linux-jdk9] [INFO] Copying 3 resources
[linux-jdk9] [INFO]
[linux-jdk9] [INFO] --- maven-compiler-plugin:3.1:testCompile (default-testCompile) @ maven-test-tools ---
[linux-jdk9] [INFO] No sources to compile
[linux-jdk9] [INFO]
[linux-jdk9] [INFO] --- maven-surefire-plugin:2.16:test (default-test) @ maven-test-tools ---
[linux-jdk9] [INFO]
[linux-jdk9] [INFO] --- maven-jar-plugin:2.4:jar (default-jar) @ maven-test-tools ---
[linux-jdk9] [INFO] Building jar: /home/jenkins/jenkins-slave/workspace/maven-plugin-testing_master-NCBPBM2KWGRWS5DI42KPWKDSI7LTESQKZBNOJTJFN6BQQGHMA5ZQ/m/maven-test-tools/target/maven-test-tools-3.3.1-SNAPSHOT.jar
[linux-jdk9] [INFO]
[linux-jdk9] [INFO] ------------------------------------------------------------------------
[linux-jdk9] [INFO] Building Maven Plugin Testing Tools 3.3.1-SNAPSHOT
[linux-jdk9] [INFO] ------------------------------------------------------------------------
[linux-jdk9] [INFO]
[linux-jdk9] [INFO] --- maven-clean-plugin:2.5:clean (default-clean) @ maven-plugin-testing-tools ---
[linux-jdk9] [INFO]
[linux-jdk9] [INFO] --- maven-enforcer-plugin:1.3.1:enforce (enforce-bytecode-version) @ maven-plugin-testing-tools ---
[linux-jdk9] [INFO]
[linux-jdk9] [INFO] --- maven-enforcer-plugin:1.3.1:enforce (ban-known-bad-maven-versions) @ maven-plugin-testing-tools ---
[linux-jdk9] [INFO]
[linux-jdk9] [INFO] --- maven-remote-resources-plugin:1.5:process (default) @ maven-plugin-testing-tools ---
[linux-jdk9] [INFO]
[linux-jdk9] [INFO] --- maven-resources-plugin:2.6:resources (default-resources) @ maven-plugin-testing-tools ---
[linux-jdk9] [INFO] Using 'UTF-8' encoding to copy filtered resources.
[linux-jdk9] [INFO] skip non existing resourceDirectory /home/jenkins/jenkins-slave/workspace/maven-plugin-testing_master-NCBPBM2KWGRWS5DI42KPWKDSI7LTESQKZBNOJTJFN6BQQGHMA5ZQ/m/maven-plugin-testing-tools/src/main/resources
[linux-jdk9] [INFO] Copying 3 resources
[linux-jdk9] [INFO]
[linux-jdk9] [INFO] --- maven-compiler-plugin:3.1:compile (default-compile) @ maven-plugin-testing-tools ---
[linux-jdk9] [INFO] Changes detected - recompiling the module!
[linux-jdk9] [INFO] Compiling 6 source files to /home/jenkins/jenkins-slave/workspace/maven-plugin-testing_master-NCBPBM2KWGRWS5DI42KPWKDSI7LTESQKZBNOJTJFN6BQQGHMA5ZQ/m/maven-plugin-testing-tools/target/classes
[linux-jdk9] [WARNING] /home/jenkins/jenkins-slave/workspace/maven-plugin-testing_master-NCBPBM2KWGRWS5DI42KPWKDSI7LTESQKZBNOJTJFN6BQQGHMA5ZQ/m/maven-plugin-testing-tools/src/main/java/org/apache/maven/shared/test/plugin/ProjectTool.java: Some input files use or override a deprecated API.
[linux-jdk9] [WARNING] /home/jenkins/jenkins-slave/workspace/maven-plugin-testing_master-NCBPBM2KWGRWS5DI42KPWKDSI7LTESQKZBNOJTJFN6BQQGHMA5ZQ/m/maven-plugin-testing-tools/src/main/java/org/apache/maven/shared/test/plugin/ProjectTool.java: Recompile with -Xlint:deprecation for details.
[linux-jdk9] [INFO]
[linux-jdk9] [INFO] --- plexus-component-metadata:1.5.5:generate-metadata (default) @ maven-plugin-testing-tools ---
[linux-jdk9] [INFO] Discovered 5 component descriptors(s)
[linux-jdk9] [INFO]
[linux-jdk9] [INFO] --- maven-resources-plugin:2.6:testResources (default-testResources) @ maven-plugin-testing-tools ---
[linux-jdk9] [INFO] Using 'UTF-8' encoding to copy filtered resources.
[linux-jdk9] [INFO] Copying 2 resources
[linux-jdk9] [INFO] Copying 3 resources
[linux-jdk9] [INFO]
[linux-jdk9] [INFO] --- maven-compiler-plugin:3.1:testCompile (default-testCompile) @ maven-plugin-testing-tools ---
[linux-jdk9] [INFO] Changes detected - recompiling the module!
[linux-jdk9] [INFO] Compiling 2 source files to /home/jenkins/jenkins-slave/workspace/maven-plugin-testing_master-NCBPBM2KWGRWS5DI42KPWKDSI7LTESQKZBNOJTJFN6BQQGHMA5ZQ/m/maven-plugin-testing-tools/target/test-classes
[linux-jdk9] [WARNING] /home/jenkins/jenkins-slave/workspace/maven-plugin-testing_master-NCBPBM2KWGRWS5DI42KPWKDSI7LTESQKZBNOJTJFN6BQQGHMA5ZQ/m/maven-plugin-testing-tools/src/test/java/org/apache/maven/shared/test/plugin/ProjectToolTest.java: Some input files use or override a deprecated API.
[linux-jdk9] [WARNING] /home/jenkins/jenkins-slave/workspace/maven-plugin-testing_master-NCBPBM2KWGRWS5DI42KPWKDSI7LTESQKZBNOJTJFN6BQQGHMA5ZQ/m/maven-plugin-testing-tools/src/test/java/org/apache/maven/shared/test/plugin/ProjectToolTest.java: Recompile with -Xlint:deprecation for details.
[linux-jdk9] [INFO]
[linux-jdk9] [INFO] --- maven-surefire-plugin:2.16:test (default-test) @ maven-plugin-testing-tools ---
[linux-jdk9] [INFO] Surefire report directory: /home/jenkins/jenkins-slave/workspace/maven-plugin-testing_master-NCBPBM2KWGRWS5DI42KPWKDSI7LTESQKZBNOJTJFN6BQQGHMA5ZQ/m/maven-plugin-testing-tools/target/surefire-reports
[linux-jdk9]
[linux-jdk9] -------------------------------------------------------
[linux-jdk9]  T E S T S
[linux-jdk9] -------------------------------------------------------
[linux-jdk9] Picked up JAVA_TOOL_OPTIONS: -Dmaven.ext.class.path="/home/jenkins/jenkins-slave/workspace/maven-plugin-testing_master-NCBPBM2KWGRWS5DI42KPWKDSI7LTESQKZBNOJTJFN6BQQGHMA5ZQ@tmp/withMavene775e71c/pipeline-maven-spy.jar" -Dorg.jenkinsci.plugins.pipeline.maven.reportsFolder="/home/jenkins/jenkins-slave/workspace/maven-plugin-testing_master-NCBPBM2KWGRWS5DI42KPWKDSI7LTESQKZBNOJTJFN6BQQGHMA5ZQ@tmp/withMavene775e71c"
[linux-jdk9] Running org.apache.maven.shared.test.plugin.ProjectToolTest
[linux-jdk9] Using target/it-build-target and target/it-build-target/classes to build IT version of plugin
[linux-jdk9] Now Building test version of the plugin...
[linux-jdk9] Using staged plugin-pom: /home/jenkins/jenkins-slave/workspace/maven-plugin-testing_master-NCBPBM2KWGRWS5DI42KPWKDSI7LTESQKZBNOJTJFN6BQQGHMA5ZQ/m/maven-plugin-testing-tools/target/unit/projects/basic/pom-test.xml
[linux-jdk9] Using IT Plugin Jar: /home/jenkins/jenkins-slave/workspace/maven-plugin-testing_master-NCBPBM2KWGRWS5DI42KPWKDSI7LTESQKZBNOJTJFN6BQQGHMA5ZQ/m/maven-plugin-testing-tools/target/unit/projects/basic/target/it-build-target/maven-it-plugin-test.jar
[linux-jdk9] Using target/it-build-target and target/it-build-target/classes to build IT version of plugin
[linux-jdk9] Now Building test version of the plugin...
[linux-jdk9] Using staged plugin-pom: /home/jenkins/jenkins-slave/workspace/maven-plugin-testing_master-NCBPBM2KWGRWS5DI42KPWKDSI7LTESQKZBNOJTJFN6BQQGHMA5ZQ/m/maven-plugin-testing-tools/target/unit/projects/basic/pom-test.xml
[linux-jdk9] Using IT Plugin Jar: /home/jenkins/jenkins-slave/workspace/maven-plugin-testing_master-NCBPBM2KWGRWS5DI42KPWKDSI7LTESQKZBNOJTJFN6BQQGHMA5ZQ/m/maven-plugin-testing-tools/target/unit/projects/basic/target/it-build-target/maven-it-plugin-test.jar
[linux-jdk9] Using target/it-build-target and target/it-build-target/classes to build IT version of plugin
[linux-jdk9] Tests run: 3, Failures: 1, Errors: 0, Skipped: 0, Time elapsed: 8.393 sec <<< FAILURE! - in org.apache.maven.shared.test.plugin.ProjectToolTest
[linux-jdk9] testPackageProjectArtifact_ShouldPopulateWithCorrectArtifactAndMetadata(org.apache.maven.shared.test.plugin.ProjectToolTest)  Time elapsed: 3.243 sec  <<< FAILURE!
[linux-jdk9] junit.framework.AssertionFailedError: Missing target/unit/projects/basic/target/it-build-target/maven-it-plugin-test.jar
[linux-jdk9] at junit.framework.Assert.fail(Assert.java:57)
[linux-jdk9] at junit.framework.Assert.assertTrue(Assert.java:22)
[linux-jdk9] at junit.framework.TestCase.assertTrue(TestCase.java:192)
[linux-jdk9] at org.apache.maven.shared.test.plugin.ProjectToolTest.testPackageProjectArtifact_ShouldPopulateWithCorrectArtifactAndMetadata(ProjectToolTest.java:99)
[linux-jdk9]
[linux-jdk9] Running org.apache.maven.shared.test.plugin.RepositoryToolTest
[linux-jdk9] Tests run: 1, Failures: 0, Errors: 0, Skipped: 0, Time elapsed: 0.199 sec - in org.apache.maven.shared.test.plugin.RepositoryToolTest
[linux-jdk9]
[linux-jdk9] Results :
[linux-jdk9]
[linux-jdk9] Failed tests:
[linux-jdk9]   ProjectToolTest.testPackageProjectArtifact_ShouldPopulateWithCorrectArtifactAndMetadata:99 Missing target/unit/projects/basic/target/it-build-target/maven-it-plugin-test.jar
[linux-jdk9]
[linux-jdk9] Tests run: 4, Failures: 1, Errors: 0, Skipped: 0
[linux-jdk9]
[linux-jdk9] [ERROR] There are test failures.
[linux-jdk9]
[linux-jdk9] Please refer to /home/jenkins/jenkins-slave/workspace/maven-plugin-testing_master-NCBPBM2KWGRWS5DI42KPWKDSI7LTESQKZBNOJTJFN6BQQGHMA5ZQ/m/maven-plugin-testing-tools/target/surefire-reports for the individual test results.
[linux-jdk9] [INFO]
[linux-jdk9] [INFO] --- maven-jar-plugin:2.4:jar (default-jar) @ maven-plugin-testing-tools ---
[linux-jdk9] [INFO] Building jar: /home/jenkins/jenkins-slave/workspace/maven-plugin-testing_master-NCBPBM2KWGRWS5DI42KPWKDSI7LTESQKZBNOJTJFN6BQQGHMA5ZQ/m/maven-plugin-testing-tools/target/maven-plugin-testing-tools-3.3.1-SNAPSHOT.jar
[linux-jdk9] [INFO] ------------------------------------------------------------------------
[linux-jdk9] [INFO] Reactor Summary:
[linux-jdk9] [INFO]
[linux-jdk9] [INFO] Maven Plugin Testing ............................... SUCCESS [  1.588 s]
[linux-jdk9] [INFO] Maven Plugin Testing Mechanism ..................... SUCCESS [  6.744 s]
[linux-jdk9] [INFO] Maven Testing Tools ................................ SUCCESS [  0.239 s]
[linux-jdk9] [INFO] Maven Plugin Testing Tools ......................... SUCCESS [ 10.054 s]
[linux-jdk9] [INFO] ------------------------------------------------------------------------
[linux-jdk9] [INFO] BUILD SUCCESS
[linux-jdk9] [INFO] ------------------------------------------------------------------------
[linux-jdk9] [INFO] Total time: 18.853 s
[linux-jdk9] [INFO] Finished at: 2017-11-29T22:58:01Z
[linux-jdk9] [INFO] Final Memory: 45M/152M
[linux-jdk9] [INFO] ------------------------------------------------------------------------
[linux-jdk9] [jenkins-maven-event-spy] INFO generated /home/jenkins/jenkins-slave/workspace/maven-plugin-testing_master-NCBPBM2KWGRWS5DI42KPWKDSI7LTESQKZBNOJTJFN6BQQGHMA5ZQ@tmp/withMavene775e71c/maven-spy-20171129-225742-8474276833399409470693.log
[Pipeline] [linux-jdk9] }
[Pipeline] [linux-jdk9] // dir
[Pipeline] [linux-jdk9] }
[linux-jdk9] [withMaven] artifactsPublisher - Archive artifact m/pom.xml under org/apache/maven/plugin-testing/maven-plugin-testing/3.3.1-SNAPSHOT/maven-plugin-testing-3.3.1-SNAPSHOT.pom
[linux-jdk9] [withMaven] artifactsPublisher - Archive artifact m/maven-plugin-testing-harness/pom.xml under org/apache/maven/plugin-testing/maven-plugin-testing-harness/3.3.1-SNAPSHOT/maven-plugin-testing-harness-3.3.1-SNAPSHOT.pom
[linux-jdk9] [withMaven] artifactsPublisher - Archive artifact m/maven-plugin-testing-harness/target/maven-plugin-testing-harness-3.3.1-SNAPSHOT.jar under org/apache/maven/plugin-testing/maven-plugin-testing-harness/3.3.1-SNAPSHOT/maven-plugin-testing-harness-3.3.1-SNAPSHOT.jar
[linux-jdk9] [withMaven] artifactsPublisher - Archive artifact m/maven-test-tools/pom.xml under org/apache/maven/plugin-testing/maven-test-tools/3.3.1-SNAPSHOT/maven-test-tools-3.3.1-SNAPSHOT.pom
[linux-jdk9] [withMaven] artifactsPublisher - Archive artifact m/maven-test-tools/target/maven-test-tools-3.3.1-SNAPSHOT.jar under org/apache/maven/plugin-testing/maven-test-tools/3.3.1-SNAPSHOT/maven-test-tools-3.3.1-SNAPSHOT.jar
[linux-jdk9] [withMaven] artifactsPublisher - Archive artifact m/maven-plugin-testing-tools/pom.xml under org/apache/maven/plugin-testing/maven-plugin-testing-tools/3.3.1-SNAPSHOT/maven-plugin-testing-tools-3.3.1-SNAPSHOT.pom
[linux-jdk9] [withMaven] artifactsPublisher - Archive artifact m/maven-plugin-testing-tools/target/maven-plugin-testing-tools-3.3.1-SNAPSHOT.jar under org/apache/maven/plugin-testing/maven-plugin-testing-tools/3.3.1-SNAPSHOT/maven-plugin-testing-tools-3.3.1-SNAPSHOT.jar
[linux-jdk9] [withMaven] artifactsPublisher - Archive artifact m/target/maven-plugin-testing-3.3.1-SNAPSHOT-site.xml under org/apache/maven/plugin-testing/maven-plugin-testing/3.3.1-SNAPSHOT/maven-plugin-testing-3.3.1-SNAPSHOT-site.xml
[linux-jdk9] [withMaven] artifactsPublisher - Archive artifact m/maven-plugin-testing-harness/target/maven-plugin-testing-harness-3.3.1-SNAPSHOT-sources.jar under org/apache/maven/plugin-testing/maven-plugin-testing-harness/3.3.1-SNAPSHOT/maven-plugin-testing-harness-3.3.1-SNAPSHOT-sources.jar
[linux-jdk9] [Fast Archiver] No prior successful build to compare, so performing full copy of artifacts
[linux-jdk9] [withMaven] junitPublisher - Archive test results for Maven artifact org.apache.maven.plugin-testing:maven-plugin-testing-harness:3.3.1-SNAPSHOT generated by maven-surefire-plugin:test (default-test): m/maven-plugin-testing-harness/target/surefire-reports/*.xml
[linux-jdk9] [withMaven] junitPublisher - Jenkins JUnit Attachments Plugin not found, can't publish test attachments.Recording test results
[linux-jdk9] [withMaven] junitPublisher - Archive test results for Maven artifact org.apache.maven.plugin-testing:maven-test-tools:3.3.1-SNAPSHOT generated by maven-surefire-plugin:test (default-test): m/maven-test-tools/target/surefire-reports/*.xml
[linux-jdk9] [withMaven] junitPublisher - Jenkins JUnit Attachments Plugin not found, can't publish test attachments.Recording test results
[linux-jdk9] None of the test reports contained any result
[linux-jdk9] [withMaven] junitPublisher - Archive test results for Maven artifact org.apache.maven.plugin-testing:maven-plugin-testing-tools:3.3.1-SNAPSHOT generated by maven-surefire-plugin:test (default-test): m/maven-plugin-testing-tools/target/surefire-reports/*.xml
[linux-jdk9] [withMaven] junitPublisher - Jenkins JUnit Attachments Plugin not found, can't publish test attachments.Recording test results
[linux-jdk9] [withMaven] openTasksPublisher - Scan Tasks for Maven artifact org.apache.maven.plugin-testing:maven-plugin-testing-harness:3.3.1-SNAPSHOT in source directory m/maven-plugin-testing-harness/src/main/java
[linux-jdk9] [withMaven] openTasksPublisher - Scan Tasks for Maven artifact org.apache.maven.plugin-testing:maven-test-tools:3.3.1-SNAPSHOT in source directory m/maven-test-tools/src/main/java
[linux-jdk9] [withMaven] openTasksPublisher - Scan Tasks for Maven artifact org.apache.maven.plugin-testing:maven-plugin-testing-tools:3.3.1-SNAPSHOT in source directory m/maven-plugin-testing-tools/src/main/java
[linux-jdk9] [TASKS] Scanning folder '/home/jenkins/jenkins-slave/workspace/maven-plugin-testing_master-NCBPBM2KWGRWS5DI42KPWKDSI7LTESQKZBNOJTJFN6BQQGHMA5ZQ' for files matching the pattern 'm/maven-plugin-testing-harness/src/main/java/**/*,m/maven-test-tools/src/main/java/**/*,m/maven-plugin-testing-tools/src/main/java/**/*' - excludes: null
[linux-jdk9] [TASKS] Found 25 files to scan for tasks
[linux-jdk9] [TASKS] Found 13 open tasks.
[linux-jdk9] Skipping warnings blame since pipelines do not have an SCM link.%n
[linux-jdk9] [Fast Archiver] No prior successful build to compare, so performing full copy of artifacts
[linux-jdk9] [withMaven] openTasksPublisher - Scan Tasks for Maven artifact org.apache.maven.its.plugins:maven-it-plugin:test in source directory m/maven-plugin-testing-tools/target/unit/projects/basic/src/main/java
[linux-jdk9] [TASKS] Scanning folder '/home/jenkins/jenkins-slave/workspace/maven-plugin-testing_master-NCBPBM2KWGRWS5DI42KPWKDSI7LTESQKZBNOJTJFN6BQQGHMA5ZQ' for files matching the pattern 'm/maven-plugin-testing-tools/target/unit/projects/basic/src/main/java/**/*' - excludes: null
[linux-jdk9] [TASKS] Found 1 files to scan for tasks
[linux-jdk9] [TASKS] Found 0 open tasks.
[linux-jdk9] Skipping warnings blame since pipelines do not have an SCM link.%n
[linux-jdk9] [Fast Archiver] No prior successful build to compare, so performing full copy of artifacts
[linux-jdk9] [withMaven] openTasksPublisher - Scan Tasks for Maven artifact org.apache.maven.its.plugins:maven-it-plugin:test in source directory m/maven-plugin-testing-tools/target/unit/projects/basic/src/main/java
[linux-jdk9] [TASKS] Scanning folder '/home/jenkins/jenkins-slave/workspace/maven-plugin-testing_master-NCBPBM2KWGRWS5DI42KPWKDSI7LTESQKZBNOJTJFN6BQQGHMA5ZQ' for files matching the pattern 'm/maven-plugin-testing-tools/target/unit/projects/basic/src/main/java/**/*' - excludes: null
[linux-jdk9] [TASKS] Found 1 files to scan for tasks
[linux-jdk9] [TASKS] Found 0 open tasks.
[linux-jdk9] Skipping warnings blame since pipelines do not have an SCM link.%n
[Pipeline] [linux-jdk9] // withMaven
[Pipeline] [linux-jdk9] }
[Pipeline] [linux-jdk9] // stage
[Pipeline] [linux-jdk9] }
[Pipeline] [linux-jdk9] // node
[Pipeline] [linux-jdk9] }
[Pipeline] // parallel
[Pipeline] stage
[Pipeline] { (Notifications)
[Pipeline] echo
Build result: UNSTABLE
[Pipeline] jiraIssueSelector
[Pipeline] emailext