Build unstable in Jenkins: Maven TLP » maven-resolver » MRESOLVER-12 #23

classic Classic list List threaded Threaded
3 messages Options
Reply | Threaded
Open this post in threaded view
|

Build unstable in Jenkins: Maven TLP » maven-resolver » MRESOLVER-12 #23

Apache Jenkins Server-2
See https://builds.apache.org/job/maven-box/job/maven-resolver/job/MRESOLVER-12/23/

Changes:

* Use Maven 3.6.3 for Linux builds, it should already be on all nodes
* Use Java 8 for Java 7 builds - due to the temporary removal of Java 7
* JDK 1.7.0_80 added back in

20 tests failed.
FAILED:  org.eclipse.aether.internal.impl.collect.DefaultDependencyCollectorTest.linux-jdk7 / Build linux-jdk7 / testSelectionWithScopeDependencySelector

Error Message:
path: [gid:root:ext:ver (root-scope)], expected: [gid:direct:ext:ver (direct-scope)], actual: [] expected:<1> but was:<0>

Stack Trace:
java.lang.AssertionError: path: [gid:root:ext:ver (root-scope)], expected: [gid:direct:ext:ver (direct-scope)], actual: [] expected:<1> but was:<0>
        at org.eclipse.aether.internal.impl.collect.DefaultDependencyCollectorTest.assertEqualSubtree(DefaultDependencyCollectorTest.java:145)
        at org.eclipse.aether.internal.impl.collect.DefaultDependencyCollectorTest.assertEqualSubtree(DefaultDependencyCollectorTest.java:123)
        at org.eclipse.aether.internal.impl.collect.DefaultDependencyCollectorTest.testSelectionWithScopeDependencySelector(DefaultDependencyCollectorTest.java:717)


FAILED:  org.eclipse.aether.internal.impl.collect.DefaultDependencyCollectorTest.linux-jdk7 / Build linux-jdk7 / testDependencyManagement_DependencySelectorProcessesManagedState

Error Message:
path: [gid:root:ext:ver (root-scope), gid:direct-of-root:ext:ver (direct-of-root-scope), gid:transitive-of-root:ext:ver (transitive-of-root-scope)], expected: [], actual: [gid:transitive-of-transitive-of-root:ext:ver (managed)] expected:<0> but was:<1>

Stack Trace:
java.lang.AssertionError: path: [gid:root:ext:ver (root-scope), gid:direct-of-root:ext:ver (direct-of-root-scope), gid:transitive-of-root:ext:ver (transitive-of-root-scope)], expected: [], actual: [gid:transitive-of-transitive-of-root:ext:ver (managed)] expected:<0> but was:<1>
        at org.eclipse.aether.internal.impl.collect.DefaultDependencyCollectorTest.assertEqualSubtree(DefaultDependencyCollectorTest.java:145)
        at org.eclipse.aether.internal.impl.collect.DefaultDependencyCollectorTest.assertEqualSubtree(DefaultDependencyCollectorTest.java:153)
        at org.eclipse.aether.internal.impl.collect.DefaultDependencyCollectorTest.assertEqualSubtree(DefaultDependencyCollectorTest.java:153)
        at org.eclipse.aether.internal.impl.collect.DefaultDependencyCollectorTest.assertEqualSubtree(DefaultDependencyCollectorTest.java:123)
        at org.eclipse.aether.internal.impl.collect.DefaultDependencyCollectorTest.testDependencyManagement_DependencySelectorProcessesManagedState(DefaultDependencyCollectorTest.java:591)


FAILED:  org.eclipse.aether.internal.impl.collect.DefaultDependencyCollectorTest.linux-jdk8 / Build linux-jdk8 / testSelectionWithScopeDependencySelector

Error Message:
path: [gid:root:ext:ver (root-scope)], expected: [gid:direct:ext:ver (direct-scope)], actual: [] expected:<1> but was:<0>

Stack Trace:
java.lang.AssertionError: path: [gid:root:ext:ver (root-scope)], expected: [gid:direct:ext:ver (direct-scope)], actual: [] expected:<1> but was:<0>
        at org.eclipse.aether.internal.impl.collect.DefaultDependencyCollectorTest.assertEqualSubtree(DefaultDependencyCollectorTest.java:145)
        at org.eclipse.aether.internal.impl.collect.DefaultDependencyCollectorTest.assertEqualSubtree(DefaultDependencyCollectorTest.java:123)
        at org.eclipse.aether.internal.impl.collect.DefaultDependencyCollectorTest.testSelectionWithScopeDependencySelector(DefaultDependencyCollectorTest.java:717)


FAILED:  org.eclipse.aether.internal.impl.collect.DefaultDependencyCollectorTest.linux-jdk8 / Build linux-jdk8 / testDependencyManagement_DependencySelectorProcessesManagedState

Error Message:
path: [gid:root:ext:ver (root-scope), gid:direct-of-root:ext:ver (direct-of-root-scope), gid:transitive-of-root:ext:ver (transitive-of-root-scope)], expected: [], actual: [gid:transitive-of-transitive-of-root:ext:ver (managed)] expected:<0> but was:<1>

Stack Trace:
java.lang.AssertionError: path: [gid:root:ext:ver (root-scope), gid:direct-of-root:ext:ver (direct-of-root-scope), gid:transitive-of-root:ext:ver (transitive-of-root-scope)], expected: [], actual: [gid:transitive-of-transitive-of-root:ext:ver (managed)] expected:<0> but was:<1>
        at org.eclipse.aether.internal.impl.collect.DefaultDependencyCollectorTest.assertEqualSubtree(DefaultDependencyCollectorTest.java:145)
        at org.eclipse.aether.internal.impl.collect.DefaultDependencyCollectorTest.assertEqualSubtree(DefaultDependencyCollectorTest.java:153)
        at org.eclipse.aether.internal.impl.collect.DefaultDependencyCollectorTest.assertEqualSubtree(DefaultDependencyCollectorTest.java:153)
        at org.eclipse.aether.internal.impl.collect.DefaultDependencyCollectorTest.assertEqualSubtree(DefaultDependencyCollectorTest.java:123)
        at org.eclipse.aether.internal.impl.collect.DefaultDependencyCollectorTest.testDependencyManagement_DependencySelectorProcessesManagedState(DefaultDependencyCollectorTest.java:591)


FAILED:  org.eclipse.aether.internal.impl.collect.DefaultDependencyCollectorTest.linux-jdk11 / Build linux-jdk11 / testSelectionWithScopeDependencySelector

Error Message:
path: [gid:root:ext:ver (root-scope)], expected: [gid:direct:ext:ver (direct-scope)], actual: [] expected:<1> but was:<0>

Stack Trace:
java.lang.AssertionError: path: [gid:root:ext:ver (root-scope)], expected: [gid:direct:ext:ver (direct-scope)], actual: [] expected:<1> but was:<0>
        at org.eclipse.aether.internal.impl.collect.DefaultDependencyCollectorTest.assertEqualSubtree(DefaultDependencyCollectorTest.java:145)
        at org.eclipse.aether.internal.impl.collect.DefaultDependencyCollectorTest.assertEqualSubtree(DefaultDependencyCollectorTest.java:123)
        at org.eclipse.aether.internal.impl.collect.DefaultDependencyCollectorTest.testSelectionWithScopeDependencySelector(DefaultDependencyCollectorTest.java:717)


FAILED:  org.eclipse.aether.internal.impl.collect.DefaultDependencyCollectorTest.linux-jdk11 / Build linux-jdk11 / testDependencyManagement_DependencySelectorProcessesManagedState

Error Message:
path: [gid:root:ext:ver (root-scope), gid:direct-of-root:ext:ver (direct-of-root-scope), gid:transitive-of-root:ext:ver (transitive-of-root-scope)], expected: [], actual: [gid:transitive-of-transitive-of-root:ext:ver (managed)] expected:<0> but was:<1>

Stack Trace:
java.lang.AssertionError: path: [gid:root:ext:ver (root-scope), gid:direct-of-root:ext:ver (direct-of-root-scope), gid:transitive-of-root:ext:ver (transitive-of-root-scope)], expected: [], actual: [gid:transitive-of-transitive-of-root:ext:ver (managed)] expected:<0> but was:<1>
        at org.eclipse.aether.internal.impl.collect.DefaultDependencyCollectorTest.assertEqualSubtree(DefaultDependencyCollectorTest.java:145)
        at org.eclipse.aether.internal.impl.collect.DefaultDependencyCollectorTest.assertEqualSubtree(DefaultDependencyCollectorTest.java:153)
        at org.eclipse.aether.internal.impl.collect.DefaultDependencyCollectorTest.assertEqualSubtree(DefaultDependencyCollectorTest.java:153)
        at org.eclipse.aether.internal.impl.collect.DefaultDependencyCollectorTest.assertEqualSubtree(DefaultDependencyCollectorTest.java:123)
        at org.eclipse.aether.internal.impl.collect.DefaultDependencyCollectorTest.testDependencyManagement_DependencySelectorProcessesManagedState(DefaultDependencyCollectorTest.java:591)


FAILED:  org.eclipse.aether.internal.impl.collect.DefaultDependencyCollectorTest.linux-jdk14 / Build linux-jdk14 / testSelectionWithScopeDependencySelector

Error Message:
path: [gid:root:ext:ver (root-scope)], expected: [gid:direct:ext:ver (direct-scope)], actual: [] expected:<1> but was:<0>

Stack Trace:
java.lang.AssertionError: path: [gid:root:ext:ver (root-scope)], expected: [gid:direct:ext:ver (direct-scope)], actual: [] expected:<1> but was:<0>
        at org.eclipse.aether.internal.impl.collect.DefaultDependencyCollectorTest.assertEqualSubtree(DefaultDependencyCollectorTest.java:145)
        at org.eclipse.aether.internal.impl.collect.DefaultDependencyCollectorTest.assertEqualSubtree(DefaultDependencyCollectorTest.java:123)
        at org.eclipse.aether.internal.impl.collect.DefaultDependencyCollectorTest.testSelectionWithScopeDependencySelector(DefaultDependencyCollectorTest.java:717)


FAILED:  org.eclipse.aether.internal.impl.collect.DefaultDependencyCollectorTest.linux-jdk14 / Build linux-jdk14 / testDependencyManagement_DependencySelectorProcessesManagedState

Error Message:
path: [gid:root:ext:ver (root-scope), gid:direct-of-root:ext:ver (direct-of-root-scope), gid:transitive-of-root:ext:ver (transitive-of-root-scope)], expected: [], actual: [gid:transitive-of-transitive-of-root:ext:ver (managed)] expected:<0> but was:<1>

Stack Trace:
java.lang.AssertionError: path: [gid:root:ext:ver (root-scope), gid:direct-of-root:ext:ver (direct-of-root-scope), gid:transitive-of-root:ext:ver (transitive-of-root-scope)], expected: [], actual: [gid:transitive-of-transitive-of-root:ext:ver (managed)] expected:<0> but was:<1>
        at org.eclipse.aether.internal.impl.collect.DefaultDependencyCollectorTest.assertEqualSubtree(DefaultDependencyCollectorTest.java:145)
        at org.eclipse.aether.internal.impl.collect.DefaultDependencyCollectorTest.assertEqualSubtree(DefaultDependencyCollectorTest.java:153)
        at org.eclipse.aether.internal.impl.collect.DefaultDependencyCollectorTest.assertEqualSubtree(DefaultDependencyCollectorTest.java:153)
        at org.eclipse.aether.internal.impl.collect.DefaultDependencyCollectorTest.assertEqualSubtree(DefaultDependencyCollectorTest.java:123)
        at org.eclipse.aether.internal.impl.collect.DefaultDependencyCollectorTest.testDependencyManagement_DependencySelectorProcessesManagedState(DefaultDependencyCollectorTest.java:591)


FAILED:  org.eclipse.aether.internal.impl.collect.DefaultDependencyCollectorTest.linux-jdk13 / Build linux-jdk13 / testSelectionWithScopeDependencySelector

Error Message:
path: [gid:root:ext:ver (root-scope)], expected: [gid:direct:ext:ver (direct-scope)], actual: [] expected:<1> but was:<0>

Stack Trace:
java.lang.AssertionError: path: [gid:root:ext:ver (root-scope)], expected: [gid:direct:ext:ver (direct-scope)], actual: [] expected:<1> but was:<0>
        at org.eclipse.aether.internal.impl.collect.DefaultDependencyCollectorTest.assertEqualSubtree(DefaultDependencyCollectorTest.java:145)
        at org.eclipse.aether.internal.impl.collect.DefaultDependencyCollectorTest.assertEqualSubtree(DefaultDependencyCollectorTest.java:123)
        at org.eclipse.aether.internal.impl.collect.DefaultDependencyCollectorTest.testSelectionWithScopeDependencySelector(DefaultDependencyCollectorTest.java:717)


FAILED:  org.eclipse.aether.internal.impl.collect.DefaultDependencyCollectorTest.linux-jdk13 / Build linux-jdk13 / testDependencyManagement_DependencySelectorProcessesManagedState

Error Message:
path: [gid:root:ext:ver (root-scope), gid:direct-of-root:ext:ver (direct-of-root-scope), gid:transitive-of-root:ext:ver (transitive-of-root-scope)], expected: [], actual: [gid:transitive-of-transitive-of-root:ext:ver (managed)] expected:<0> but was:<1>

Stack Trace:
java.lang.AssertionError: path: [gid:root:ext:ver (root-scope), gid:direct-of-root:ext:ver (direct-of-root-scope), gid:transitive-of-root:ext:ver (transitive-of-root-scope)], expected: [], actual: [gid:transitive-of-transitive-of-root:ext:ver (managed)] expected:<0> but was:<1>
        at org.eclipse.aether.internal.impl.collect.DefaultDependencyCollectorTest.assertEqualSubtree(DefaultDependencyCollectorTest.java:145)
        at org.eclipse.aether.internal.impl.collect.DefaultDependencyCollectorTest.assertEqualSubtree(DefaultDependencyCollectorTest.java:153)
        at org.eclipse.aether.internal.impl.collect.DefaultDependencyCollectorTest.assertEqualSubtree(DefaultDependencyCollectorTest.java:153)
        at org.eclipse.aether.internal.impl.collect.DefaultDependencyCollectorTest.assertEqualSubtree(DefaultDependencyCollectorTest.java:123)
        at org.eclipse.aether.internal.impl.collect.DefaultDependencyCollectorTest.testDependencyManagement_DependencySelectorProcessesManagedState(DefaultDependencyCollectorTest.java:591)


FAILED:  org.eclipse.aether.internal.impl.collect.DefaultDependencyCollectorTest.windows-jdk8 / Build windows-jdk8 / testSelectionWithScopeDependencySelector

Error Message:
path: [gid:root:ext:ver (root-scope)], expected: [gid:direct:ext:ver (direct-scope)], actual: [] expected:<1> but was:<0>

Stack Trace:
java.lang.AssertionError: path: [gid:root:ext:ver (root-scope)], expected: [gid:direct:ext:ver (direct-scope)], actual: [] expected:<1> but was:<0>
        at org.eclipse.aether.internal.impl.collect.DefaultDependencyCollectorTest.assertEqualSubtree(DefaultDependencyCollectorTest.java:145)
        at org.eclipse.aether.internal.impl.collect.DefaultDependencyCollectorTest.assertEqualSubtree(DefaultDependencyCollectorTest.java:123)
        at org.eclipse.aether.internal.impl.collect.DefaultDependencyCollectorTest.testSelectionWithScopeDependencySelector(DefaultDependencyCollectorTest.java:717)


FAILED:  org.eclipse.aether.internal.impl.collect.DefaultDependencyCollectorTest.windows-jdk8 / Build windows-jdk8 / testDependencyManagement_DependencySelectorProcessesManagedState

Error Message:
path: [gid:root:ext:ver (root-scope), gid:direct-of-root:ext:ver (direct-of-root-scope), gid:transitive-of-root:ext:ver (transitive-of-root-scope)], expected: [], actual: [gid:transitive-of-transitive-of-root:ext:ver (managed)] expected:<0> but was:<1>

Stack Trace:
java.lang.AssertionError: path: [gid:root:ext:ver (root-scope), gid:direct-of-root:ext:ver (direct-of-root-scope), gid:transitive-of-root:ext:ver (transitive-of-root-scope)], expected: [], actual: [gid:transitive-of-transitive-of-root:ext:ver (managed)] expected:<0> but was:<1>
        at org.eclipse.aether.internal.impl.collect.DefaultDependencyCollectorTest.assertEqualSubtree(DefaultDependencyCollectorTest.java:145)
        at org.eclipse.aether.internal.impl.collect.DefaultDependencyCollectorTest.assertEqualSubtree(DefaultDependencyCollectorTest.java:153)
        at org.eclipse.aether.internal.impl.collect.DefaultDependencyCollectorTest.assertEqualSubtree(DefaultDependencyCollectorTest.java:153)
        at org.eclipse.aether.internal.impl.collect.DefaultDependencyCollectorTest.assertEqualSubtree(DefaultDependencyCollectorTest.java:123)
        at org.eclipse.aether.internal.impl.collect.DefaultDependencyCollectorTest.testDependencyManagement_DependencySelectorProcessesManagedState(DefaultDependencyCollectorTest.java:591)


FAILED:  org.eclipse.aether.internal.impl.collect.DefaultDependencyCollectorTest.windows-jdk7 / Build windows-jdk7 / testSelectionWithScopeDependencySelector

Error Message:
path: [gid:root:ext:ver (root-scope)], expected: [gid:direct:ext:ver (direct-scope)], actual: [] expected:<1> but was:<0>

Stack Trace:
java.lang.AssertionError: path: [gid:root:ext:ver (root-scope)], expected: [gid:direct:ext:ver (direct-scope)], actual: [] expected:<1> but was:<0>
        at org.eclipse.aether.internal.impl.collect.DefaultDependencyCollectorTest.assertEqualSubtree(DefaultDependencyCollectorTest.java:145)
        at org.eclipse.aether.internal.impl.collect.DefaultDependencyCollectorTest.assertEqualSubtree(DefaultDependencyCollectorTest.java:123)
        at org.eclipse.aether.internal.impl.collect.DefaultDependencyCollectorTest.testSelectionWithScopeDependencySelector(DefaultDependencyCollectorTest.java:717)


FAILED:  org.eclipse.aether.internal.impl.collect.DefaultDependencyCollectorTest.windows-jdk7 / Build windows-jdk7 / testDependencyManagement_DependencySelectorProcessesManagedState

Error Message:
path: [gid:root:ext:ver (root-scope), gid:direct-of-root:ext:ver (direct-of-root-scope), gid:transitive-of-root:ext:ver (transitive-of-root-scope)], expected: [], actual: [gid:transitive-of-transitive-of-root:ext:ver (managed)] expected:<0> but was:<1>

Stack Trace:
java.lang.AssertionError: path: [gid:root:ext:ver (root-scope), gid:direct-of-root:ext:ver (direct-of-root-scope), gid:transitive-of-root:ext:ver (transitive-of-root-scope)], expected: [], actual: [gid:transitive-of-transitive-of-root:ext:ver (managed)] expected:<0> but was:<1>
        at org.eclipse.aether.internal.impl.collect.DefaultDependencyCollectorTest.assertEqualSubtree(DefaultDependencyCollectorTest.java:145)
        at org.eclipse.aether.internal.impl.collect.DefaultDependencyCollectorTest.assertEqualSubtree(DefaultDependencyCollectorTest.java:153)
        at org.eclipse.aether.internal.impl.collect.DefaultDependencyCollectorTest.assertEqualSubtree(DefaultDependencyCollectorTest.java:153)
        at org.eclipse.aether.internal.impl.collect.DefaultDependencyCollectorTest.assertEqualSubtree(DefaultDependencyCollectorTest.java:123)
        at org.eclipse.aether.internal.impl.collect.DefaultDependencyCollectorTest.testDependencyManagement_DependencySelectorProcessesManagedState(DefaultDependencyCollectorTest.java:591)


FAILED:  org.eclipse.aether.internal.impl.collect.DefaultDependencyCollectorTest.windows-jdk11 / Build windows-jdk11 / testSelectionWithScopeDependencySelector

Error Message:
path: [gid:root:ext:ver (root-scope)], expected: [gid:direct:ext:ver (direct-scope)], actual: [] expected:<1> but was:<0>

Stack Trace:
java.lang.AssertionError: path: [gid:root:ext:ver (root-scope)], expected: [gid:direct:ext:ver (direct-scope)], actual: [] expected:<1> but was:<0>
        at org.eclipse.aether.internal.impl.collect.DefaultDependencyCollectorTest.assertEqualSubtree(DefaultDependencyCollectorTest.java:145)
        at org.eclipse.aether.internal.impl.collect.DefaultDependencyCollectorTest.assertEqualSubtree(DefaultDependencyCollectorTest.java:123)
        at org.eclipse.aether.internal.impl.collect.DefaultDependencyCollectorTest.testSelectionWithScopeDependencySelector(DefaultDependencyCollectorTest.java:717)


FAILED:  org.eclipse.aether.internal.impl.collect.DefaultDependencyCollectorTest.windows-jdk11 / Build windows-jdk11 / testDependencyManagement_DependencySelectorProcessesManagedState

Error Message:
path: [gid:root:ext:ver (root-scope), gid:direct-of-root:ext:ver (direct-of-root-scope), gid:transitive-of-root:ext:ver (transitive-of-root-scope)], expected: [], actual: [gid:transitive-of-transitive-of-root:ext:ver (managed)] expected:<0> but was:<1>

Stack Trace:
java.lang.AssertionError: path: [gid:root:ext:ver (root-scope), gid:direct-of-root:ext:ver (direct-of-root-scope), gid:transitive-of-root:ext:ver (transitive-of-root-scope)], expected: [], actual: [gid:transitive-of-transitive-of-root:ext:ver (managed)] expected:<0> but was:<1>
        at org.eclipse.aether.internal.impl.collect.DefaultDependencyCollectorTest.assertEqualSubtree(DefaultDependencyCollectorTest.java:145)
        at org.eclipse.aether.internal.impl.collect.DefaultDependencyCollectorTest.assertEqualSubtree(DefaultDependencyCollectorTest.java:153)
        at org.eclipse.aether.internal.impl.collect.DefaultDependencyCollectorTest.assertEqualSubtree(DefaultDependencyCollectorTest.java:153)
        at org.eclipse.aether.internal.impl.collect.DefaultDependencyCollectorTest.assertEqualSubtree(DefaultDependencyCollectorTest.java:123)
        at org.eclipse.aether.internal.impl.collect.DefaultDependencyCollectorTest.testDependencyManagement_DependencySelectorProcessesManagedState(DefaultDependencyCollectorTest.java:591)


FAILED:  org.eclipse.aether.internal.impl.collect.DefaultDependencyCollectorTest.windows-jdk13 / Build windows-jdk13 / testSelectionWithScopeDependencySelector

Error Message:
path: [gid:root:ext:ver (root-scope)], expected: [gid:direct:ext:ver (direct-scope)], actual: [] expected:<1> but was:<0>

Stack Trace:
java.lang.AssertionError: path: [gid:root:ext:ver (root-scope)], expected: [gid:direct:ext:ver (direct-scope)], actual: [] expected:<1> but was:<0>
        at org.eclipse.aether.internal.impl.collect.DefaultDependencyCollectorTest.assertEqualSubtree(DefaultDependencyCollectorTest.java:145)
        at org.eclipse.aether.internal.impl.collect.DefaultDependencyCollectorTest.assertEqualSubtree(DefaultDependencyCollectorTest.java:123)
        at org.eclipse.aether.internal.impl.collect.DefaultDependencyCollectorTest.testSelectionWithScopeDependencySelector(DefaultDependencyCollectorTest.java:717)


FAILED:  org.eclipse.aether.internal.impl.collect.DefaultDependencyCollectorTest.windows-jdk13 / Build windows-jdk13 / testDependencyManagement_DependencySelectorProcessesManagedState

Error Message:
path: [gid:root:ext:ver (root-scope), gid:direct-of-root:ext:ver (direct-of-root-scope), gid:transitive-of-root:ext:ver (transitive-of-root-scope)], expected: [], actual: [gid:transitive-of-transitive-of-root:ext:ver (managed)] expected:<0> but was:<1>

Stack Trace:
java.lang.AssertionError: path: [gid:root:ext:ver (root-scope), gid:direct-of-root:ext:ver (direct-of-root-scope), gid:transitive-of-root:ext:ver (transitive-of-root-scope)], expected: [], actual: [gid:transitive-of-transitive-of-root:ext:ver (managed)] expected:<0> but was:<1>
        at org.eclipse.aether.internal.impl.collect.DefaultDependencyCollectorTest.assertEqualSubtree(DefaultDependencyCollectorTest.java:145)
        at org.eclipse.aether.internal.impl.collect.DefaultDependencyCollectorTest.assertEqualSubtree(DefaultDependencyCollectorTest.java:153)
        at org.eclipse.aether.internal.impl.collect.DefaultDependencyCollectorTest.assertEqualSubtree(DefaultDependencyCollectorTest.java:153)
        at org.eclipse.aether.internal.impl.collect.DefaultDependencyCollectorTest.assertEqualSubtree(DefaultDependencyCollectorTest.java:123)
        at org.eclipse.aether.internal.impl.collect.DefaultDependencyCollectorTest.testDependencyManagement_DependencySelectorProcessesManagedState(DefaultDependencyCollectorTest.java:591)


FAILED:  org.eclipse.aether.internal.impl.collect.DefaultDependencyCollectorTest.windows-jdk14 / Build windows-jdk14 / testSelectionWithScopeDependencySelector

Error Message:
path: [gid:root:ext:ver (root-scope)], expected: [gid:direct:ext:ver (direct-scope)], actual: [] expected:<1> but was:<0>

Stack Trace:
java.lang.AssertionError: path: [gid:root:ext:ver (root-scope)], expected: [gid:direct:ext:ver (direct-scope)], actual: [] expected:<1> but was:<0>
        at org.eclipse.aether.internal.impl.collect.DefaultDependencyCollectorTest.assertEqualSubtree(DefaultDependencyCollectorTest.java:145)
        at org.eclipse.aether.internal.impl.collect.DefaultDependencyCollectorTest.assertEqualSubtree(DefaultDependencyCollectorTest.java:123)
        at org.eclipse.aether.internal.impl.collect.DefaultDependencyCollectorTest.testSelectionWithScopeDependencySelector(DefaultDependencyCollectorTest.java:717)


FAILED:  org.eclipse.aether.internal.impl.collect.DefaultDependencyCollectorTest.windows-jdk14 / Build windows-jdk14 / testDependencyManagement_DependencySelectorProcessesManagedState

Error Message:
path: [gid:root:ext:ver (root-scope), gid:direct-of-root:ext:ver (direct-of-root-scope), gid:transitive-of-root:ext:ver (transitive-of-root-scope)], expected: [], actual: [gid:transitive-of-transitive-of-root:ext:ver (managed)] expected:<0> but was:<1>

Stack Trace:
java.lang.AssertionError: path: [gid:root:ext:ver (root-scope), gid:direct-of-root:ext:ver (direct-of-root-scope), gid:transitive-of-root:ext:ver (transitive-of-root-scope)], expected: [], actual: [gid:transitive-of-transitive-of-root:ext:ver (managed)] expected:<0> but was:<1>
        at org.eclipse.aether.internal.impl.collect.DefaultDependencyCollectorTest.assertEqualSubtree(DefaultDependencyCollectorTest.java:145)
        at org.eclipse.aether.internal.impl.collect.DefaultDependencyCollectorTest.assertEqualSubtree(DefaultDependencyCollectorTest.java:153)
        at org.eclipse.aether.internal.impl.collect.DefaultDependencyCollectorTest.assertEqualSubtree(DefaultDependencyCollectorTest.java:153)
        at org.eclipse.aether.internal.impl.collect.DefaultDependencyCollectorTest.assertEqualSubtree(DefaultDependencyCollectorTest.java:123)
        at org.eclipse.aether.internal.impl.collect.DefaultDependencyCollectorTest.testDependencyManagement_DependencySelectorProcessesManagedState(DefaultDependencyCollectorTest.java:591)




Build log:
[...truncated 33657 lines...]
[INFO] Downloading from central: https://repo.maven.apache.org/maven2/org/apache/ant/ant/1.8.1/ant-1.8.1.jar
[INFO] Downloaded from central: https://repo.maven.apache.org/maven2/commons-digester/commons-digester/1.8.1/commons-digester-1.8.1.jar (146 kB at 3.9 MB/s)
[INFO] Downloading from central: https://repo.maven.apache.org/maven2/org/apache/maven/shared/maven-artifact-transfer/0.9.1/maven-artifact-transfer-0.9.1.jar
[INFO] Downloaded from central: https://repo.maven.apache.org/maven2/commons-beanutils/commons-beanutils/1.8.3/commons-beanutils-1.8.3.jar (232 kB at 5.8 MB/s)
[INFO] Downloading from central: https://repo.maven.apache.org/maven2/org/apache/maven/shared/maven-script-interpreter/1.2/maven-script-interpreter-1.2.jar
[INFO] Downloading from central: https://repo.maven.apache.org/maven2/org/apache/maven/shared/maven-common-artifact-filters/3.0.1/maven-common-artifact-filters-3.0.1.jar
[INFO] Downloaded from central: https://repo.maven.apache.org/maven2/commons-logging/commons-logging/1.2/commons-logging-1.2.jar (62 kB at 1.1 MB/s)
[INFO] Downloading from central: https://repo.maven.apache.org/maven2/commons-codec/commons-codec/1.6/commons-codec-1.6.jar
[INFO] Downloaded from central: https://repo.maven.apache.org/maven2/org/apache/maven/shared/maven-script-interpreter/1.2/maven-script-interpreter-1.2.jar (22 kB at 311 kB/s)
[INFO] Downloading from central: https://repo.maven.apache.org/maven2/org/slf4j/slf4j-api/1.7.5/slf4j-api-1.7.5.jar
[INFO] Downloaded from central: https://repo.maven.apache.org/maven2/org/apache/maven/shared/maven-common-artifact-filters/3.0.1/maven-common-artifact-filters-3.0.1.jar (61 kB at 842 kB/s)
[INFO] Downloading from central: https://repo.maven.apache.org/maven2/org/apache/maven/doxia/doxia-sink-api/1.7/doxia-sink-api-1.7.jar
[INFO] Downloaded from central: https://repo.maven.apache.org/maven2/org/apache/maven/shared/maven-artifact-transfer/0.9.1/maven-artifact-transfer-0.9.1.jar (123 kB at 1.5 MB/s)
[INFO] Downloading from central: https://repo.maven.apache.org/maven2/org/apache/maven/doxia/doxia-logging-api/1.7/doxia-logging-api-1.7.jar
[INFO] Downloaded from central: https://repo.maven.apache.org/maven2/commons-codec/commons-codec/1.6/commons-codec-1.6.jar (233 kB at 2.5 MB/s)
[INFO] Downloading from central: https://repo.maven.apache.org/maven2/org/apache/maven/doxia/doxia-site-renderer/1.7.4/doxia-site-renderer-1.7.4.jar
[INFO] Downloaded from central: https://repo.maven.apache.org/maven2/org/slf4j/slf4j-api/1.7.5/slf4j-api-1.7.5.jar (26 kB at 269 kB/s)
[INFO] Downloading from central: https://repo.maven.apache.org/maven2/org/apache/maven/doxia/doxia-decoration-model/1.7.4/doxia-decoration-model-1.7.4.jar
[INFO] Downloaded from central: https://repo.maven.apache.org/maven2/org/apache/maven/doxia/doxia-sink-api/1.7/doxia-sink-api-1.7.jar (11 kB at 115 kB/s)
[INFO] Downloading from central: https://repo.maven.apache.org/maven2/org/apache/maven/doxia/doxia-skin-model/1.7.4/doxia-skin-model-1.7.4.jar
[INFO] Downloaded from central: https://repo.maven.apache.org/maven2/org/apache/ant/ant/1.8.1/ant-1.8.1.jar (1.5 MB at 15 MB/s)
[INFO] Downloading from central: https://repo.maven.apache.org/maven2/org/apache/maven/doxia/doxia-module-xhtml/1.7/doxia-module-xhtml-1.7.jar
[INFO] Downloaded from central: https://repo.maven.apache.org/maven2/org/apache/maven/doxia/doxia-logging-api/1.7/doxia-logging-api-1.7.jar (12 kB at 107 kB/s)
[INFO] Downloading from central: https://repo.maven.apache.org/maven2/org/codehaus/groovy/groovy-all/2.4.8/groovy-all-2.4.8.jar
[INFO] Downloaded from central: https://repo.maven.apache.org/maven2/org/apache/maven/doxia/doxia-decoration-model/1.7.4/doxia-decoration-model-1.7.4.jar (61 kB at 489 kB/s)
[INFO] Downloaded from central: https://repo.maven.apache.org/maven2/org/apache/maven/doxia/doxia-site-renderer/1.7.4/doxia-site-renderer-1.7.4.jar (64 kB at 516 kB/s)
[INFO] Downloaded from central: https://repo.maven.apache.org/maven2/org/apache/maven/doxia/doxia-skin-model/1.7.4/doxia-skin-model-1.7.4.jar (16 kB at 128 kB/s)
[INFO] Downloaded from central: https://repo.maven.apache.org/maven2/org/apache/maven/doxia/doxia-module-xhtml/1.7/doxia-module-xhtml-1.7.jar (17 kB at 134 kB/s)
[INFO] Downloaded from central: https://repo.maven.apache.org/maven2/org/codehaus/groovy/groovy-all/2.4.8/groovy-all-2.4.8.jar (7.0 MB at 25 MB/s)
[INFO] Installing f:\jenkins\jenkins-slave\workspace\-box_maven-resolver_MRESOLVER-12\m\pom.xml to F:\jenkins\jenkins-slave\workspace\-box_maven-resolver_MRESOLVER-12\m\maven-resolver-demos\maven-resolver-demo-maven-plugin\target\local-repo\org\apache\maven\resolver\maven-resolver\1.4.0-SNAPSHOT\maven-resolver-1.4.0-SNAPSHOT.pom
[INFO] Installing f:\jenkins\jenkins-slave\workspace\-box_maven-resolver_MRESOLVER-12\m\target\maven-resolver-1.4.0-SNAPSHOT-site.xml to F:\jenkins\jenkins-slave\workspace\-box_maven-resolver_MRESOLVER-12\m\maven-resolver-demos\maven-resolver-demo-maven-plugin\target\local-repo\org\apache\maven\resolver\maven-resolver\1.4.0-SNAPSHOT\maven-resolver-1.4.0-SNAPSHOT-site.xml
[INFO] Installing F:\jenkins\jenkins-slave\workspace\-box_maven-resolver_MRESOLVER-12\m\maven-resolver-api\pom.xml to F:\jenkins\jenkins-slave\workspace\-box_maven-resolver_MRESOLVER-12\m\maven-resolver-demos\maven-resolver-demo-maven-plugin\target\local-repo\org\apache\maven\resolver\maven-resolver-api\1.4.0-SNAPSHOT\maven-resolver-api-1.4.0-SNAPSHOT.pom
[INFO] Installing F:\jenkins\jenkins-slave\workspace\-box_maven-resolver_MRESOLVER-12\m\maven-resolver-api\target\maven-resolver-api-1.4.0-SNAPSHOT.jar to F:\jenkins\jenkins-slave\workspace\-box_maven-resolver_MRESOLVER-12\m\maven-resolver-demos\maven-resolver-demo-maven-plugin\target\local-repo\org\apache\maven\resolver\maven-resolver-api\1.4.0-SNAPSHOT\maven-resolver-api-1.4.0-SNAPSHOT.jar
[INFO] Installing F:\jenkins\jenkins-slave\workspace\-box_maven-resolver_MRESOLVER-12\m\maven-resolver-spi\pom.xml to F:\jenkins\jenkins-slave\workspace\-box_maven-resolver_MRESOLVER-12\m\maven-resolver-demos\maven-resolver-demo-maven-plugin\target\local-repo\org\apache\maven\resolver\maven-resolver-spi\1.4.0-SNAPSHOT\maven-resolver-spi-1.4.0-SNAPSHOT.pom
[INFO] Installing F:\jenkins\jenkins-slave\workspace\-box_maven-resolver_MRESOLVER-12\m\maven-resolver-spi\target\maven-resolver-spi-1.4.0-SNAPSHOT.jar to F:\jenkins\jenkins-slave\workspace\-box_maven-resolver_MRESOLVER-12\m\maven-resolver-demos\maven-resolver-demo-maven-plugin\target\local-repo\org\apache\maven\resolver\maven-resolver-spi\1.4.0-SNAPSHOT\maven-resolver-spi-1.4.0-SNAPSHOT.jar
[INFO] Installing F:\jenkins\jenkins-slave\workspace\-box_maven-resolver_MRESOLVER-12\m\maven-resolver-test-util\pom.xml to F:\jenkins\jenkins-slave\workspace\-box_maven-resolver_MRESOLVER-12\m\maven-resolver-demos\maven-resolver-demo-maven-plugin\target\local-repo\org\apache\maven\resolver\maven-resolver-test-util\1.4.0-SNAPSHOT\maven-resolver-test-util-1.4.0-SNAPSHOT.pom
[INFO] Installing F:\jenkins\jenkins-slave\workspace\-box_maven-resolver_MRESOLVER-12\m\maven-resolver-test-util\target\maven-resolver-test-util-1.4.0-SNAPSHOT.jar to F:\jenkins\jenkins-slave\workspace\-box_maven-resolver_MRESOLVER-12\m\maven-resolver-demos\maven-resolver-demo-maven-plugin\target\local-repo\org\apache\maven\resolver\maven-resolver-test-util\1.4.0-SNAPSHOT\maven-resolver-test-util-1.4.0-SNAPSHOT.jar
[INFO] Installing F:\jenkins\jenkins-slave\workspace\-box_maven-resolver_MRESOLVER-12\m\maven-resolver-util\pom.xml to F:\jenkins\jenkins-slave\workspace\-box_maven-resolver_MRESOLVER-12\m\maven-resolver-demos\maven-resolver-demo-maven-plugin\target\local-repo\org\apache\maven\resolver\maven-resolver-util\1.4.0-SNAPSHOT\maven-resolver-util-1.4.0-SNAPSHOT.pom
[INFO] Installing F:\jenkins\jenkins-slave\workspace\-box_maven-resolver_MRESOLVER-12\m\maven-resolver-util\target\maven-resolver-util-1.4.0-SNAPSHOT.jar to F:\jenkins\jenkins-slave\workspace\-box_maven-resolver_MRESOLVER-12\m\maven-resolver-demos\maven-resolver-demo-maven-plugin\target\local-repo\org\apache\maven\resolver\maven-resolver-util\1.4.0-SNAPSHOT\maven-resolver-util-1.4.0-SNAPSHOT.jar
[INFO] Installing F:\jenkins\jenkins-slave\workspace\-box_maven-resolver_MRESOLVER-12\m\maven-resolver-impl\pom.xml to F:\jenkins\jenkins-slave\workspace\-box_maven-resolver_MRESOLVER-12\m\maven-resolver-demos\maven-resolver-demo-maven-plugin\target\local-repo\org\apache\maven\resolver\maven-resolver-impl\1.4.0-SNAPSHOT\maven-resolver-impl-1.4.0-SNAPSHOT.pom
[INFO] Installing F:\jenkins\jenkins-slave\workspace\-box_maven-resolver_MRESOLVER-12\m\maven-resolver-impl\target\maven-resolver-impl-1.4.0-SNAPSHOT.jar to F:\jenkins\jenkins-slave\workspace\-box_maven-resolver_MRESOLVER-12\m\maven-resolver-demos\maven-resolver-demo-maven-plugin\target\local-repo\org\apache\maven\resolver\maven-resolver-impl\1.4.0-SNAPSHOT\maven-resolver-impl-1.4.0-SNAPSHOT.jar
[INFO] Installing F:\jenkins\jenkins-slave\workspace\-box_maven-resolver_MRESOLVER-12\m\maven-resolver-connector-basic\pom.xml to F:\jenkins\jenkins-slave\workspace\-box_maven-resolver_MRESOLVER-12\m\maven-resolver-demos\maven-resolver-demo-maven-plugin\target\local-repo\org\apache\maven\resolver\maven-resolver-connector-basic\1.4.0-SNAPSHOT\maven-resolver-connector-basic-1.4.0-SNAPSHOT.pom
[INFO] Installing F:\jenkins\jenkins-slave\workspace\-box_maven-resolver_MRESOLVER-12\m\maven-resolver-connector-basic\target\maven-resolver-connector-basic-1.4.0-SNAPSHOT.jar to F:\jenkins\jenkins-slave\workspace\-box_maven-resolver_MRESOLVER-12\m\maven-resolver-demos\maven-resolver-demo-maven-plugin\target\local-repo\org\apache\maven\resolver\maven-resolver-connector-basic\1.4.0-SNAPSHOT\maven-resolver-connector-basic-1.4.0-SNAPSHOT.jar
[INFO] Installing F:\jenkins\jenkins-slave\workspace\-box_maven-resolver_MRESOLVER-12\m\maven-resolver-transport-classpath\pom.xml to F:\jenkins\jenkins-slave\workspace\-box_maven-resolver_MRESOLVER-12\m\maven-resolver-demos\maven-resolver-demo-maven-plugin\target\local-repo\org\apache\maven\resolver\maven-resolver-transport-classpath\1.4.0-SNAPSHOT\maven-resolver-transport-classpath-1.4.0-SNAPSHOT.pom
[INFO] Installing F:\jenkins\jenkins-slave\workspace\-box_maven-resolver_MRESOLVER-12\m\maven-resolver-transport-classpath\target\maven-resolver-transport-classpath-1.4.0-SNAPSHOT.jar to F:\jenkins\jenkins-slave\workspace\-box_maven-resolver_MRESOLVER-12\m\maven-resolver-demos\maven-resolver-demo-maven-plugin\target\local-repo\org\apache\maven\resolver\maven-resolver-transport-classpath\1.4.0-SNAPSHOT\maven-resolver-transport-classpath-1.4.0-SNAPSHOT.jar
[INFO] Installing F:\jenkins\jenkins-slave\workspace\-box_maven-resolver_MRESOLVER-12\m\maven-resolver-transport-file\pom.xml to F:\jenkins\jenkins-slave\workspace\-box_maven-resolver_MRESOLVER-12\m\maven-resolver-demos\maven-resolver-demo-maven-plugin\target\local-repo\org\apache\maven\resolver\maven-resolver-transport-file\1.4.0-SNAPSHOT\maven-resolver-transport-file-1.4.0-SNAPSHOT.pom
[INFO] Installing F:\jenkins\jenkins-slave\workspace\-box_maven-resolver_MRESOLVER-12\m\maven-resolver-transport-file\target\maven-resolver-transport-file-1.4.0-SNAPSHOT.jar to F:\jenkins\jenkins-slave\workspace\-box_maven-resolver_MRESOLVER-12\m\maven-resolver-demos\maven-resolver-demo-maven-plugin\target\local-repo\org\apache\maven\resolver\maven-resolver-transport-file\1.4.0-SNAPSHOT\maven-resolver-transport-file-1.4.0-SNAPSHOT.jar
[INFO] Installing F:\jenkins\jenkins-slave\workspace\-box_maven-resolver_MRESOLVER-12\m\maven-resolver-transport-http\pom.xml to F:\jenkins\jenkins-slave\workspace\-box_maven-resolver_MRESOLVER-12\m\maven-resolver-demos\maven-resolver-demo-maven-plugin\target\local-repo\org\apache\maven\resolver\maven-resolver-transport-http\1.4.0-SNAPSHOT\maven-resolver-transport-http-1.4.0-SNAPSHOT.pom
[INFO] Installing F:\jenkins\jenkins-slave\workspace\-box_maven-resolver_MRESOLVER-12\m\maven-resolver-transport-http\target\maven-resolver-transport-http-1.4.0-SNAPSHOT.jar to F:\jenkins\jenkins-slave\workspace\-box_maven-resolver_MRESOLVER-12\m\maven-resolver-demos\maven-resolver-demo-maven-plugin\target\local-repo\org\apache\maven\resolver\maven-resolver-transport-http\1.4.0-SNAPSHOT\maven-resolver-transport-http-1.4.0-SNAPSHOT.jar
[INFO] Installing F:\jenkins\jenkins-slave\workspace\-box_maven-resolver_MRESOLVER-12\m\maven-resolver-transport-wagon\pom.xml to F:\jenkins\jenkins-slave\workspace\-box_maven-resolver_MRESOLVER-12\m\maven-resolver-demos\maven-resolver-demo-maven-plugin\target\local-repo\org\apache\maven\resolver\maven-resolver-transport-wagon\1.4.0-SNAPSHOT\maven-resolver-transport-wagon-1.4.0-SNAPSHOT.pom
[INFO] Installing F:\jenkins\jenkins-slave\workspace\-box_maven-resolver_MRESOLVER-12\m\maven-resolver-transport-wagon\target\maven-resolver-transport-wagon-1.4.0-SNAPSHOT.jar to F:\jenkins\jenkins-slave\workspace\-box_maven-resolver_MRESOLVER-12\m\maven-resolver-demos\maven-resolver-demo-maven-plugin\target\local-repo\org\apache\maven\resolver\maven-resolver-transport-wagon\1.4.0-SNAPSHOT\maven-resolver-transport-wagon-1.4.0-SNAPSHOT.jar
[INFO] Installing F:\jenkins\jenkins-slave\workspace\-box_maven-resolver_MRESOLVER-12\m\maven-resolver-demos\pom.xml to F:\jenkins\jenkins-slave\workspace\-box_maven-resolver_MRESOLVER-12\m\maven-resolver-demos\maven-resolver-demo-maven-plugin\target\local-repo\org\apache\maven\resolver\maven-resolver-demos\1.4.0-SNAPSHOT\maven-resolver-demos-1.4.0-SNAPSHOT.pom
[INFO] Installing F:\jenkins\jenkins-slave\workspace\-box_maven-resolver_MRESOLVER-12\m\maven-resolver-demos\target\maven-resolver-demos-1.4.0-SNAPSHOT-site.xml to F:\jenkins\jenkins-slave\workspace\-box_maven-resolver_MRESOLVER-12\m\maven-resolver-demos\maven-resolver-demo-maven-plugin\target\local-repo\org\apache\maven\resolver\maven-resolver-demos\1.4.0-SNAPSHOT\maven-resolver-demos-1.4.0-SNAPSHOT-site.xml
[INFO] Installing F:\jenkins\jenkins-slave\workspace\-box_maven-resolver_MRESOLVER-12\m\maven-resolver-demos\maven-resolver-demo-snippets\pom.xml to F:\jenkins\jenkins-slave\workspace\-box_maven-resolver_MRESOLVER-12\m\maven-resolver-demos\maven-resolver-demo-maven-plugin\target\local-repo\org\apache\maven\resolver\maven-resolver-demo-snippets\1.4.0-SNAPSHOT\maven-resolver-demo-snippets-1.4.0-SNAPSHOT.pom
[INFO] Installing F:\jenkins\jenkins-slave\workspace\-box_maven-resolver_MRESOLVER-12\m\maven-resolver-demos\maven-resolver-demo-snippets\target\maven-resolver-demo-snippets-1.4.0-SNAPSHOT.jar to F:\jenkins\jenkins-slave\workspace\-box_maven-resolver_MRESOLVER-12\m\maven-resolver-demos\maven-resolver-demo-maven-plugin\target\local-repo\org\apache\maven\resolver\maven-resolver-demo-snippets\1.4.0-SNAPSHOT\maven-resolver-demo-snippets-1.4.0-SNAPSHOT.jar
[INFO] Installing F:\jenkins\jenkins-slave\workspace\-box_maven-resolver_MRESOLVER-12\m\maven-resolver-demos\maven-resolver-demo-maven-plugin\pom.xml to F:\jenkins\jenkins-slave\workspace\-box_maven-resolver_MRESOLVER-12\m\maven-resolver-demos\maven-resolver-demo-maven-plugin\target\local-repo\org\apache\maven\resolver\maven-resolver-demo-maven-plugin\1.4.0-SNAPSHOT\maven-resolver-demo-maven-plugin-1.4.0-SNAPSHOT.pom
[INFO] Installing F:\jenkins\jenkins-slave\workspace\-box_maven-resolver_MRESOLVER-12\m\maven-resolver-demos\maven-resolver-demo-maven-plugin\target\maven-resolver-demo-maven-plugin-1.4.0-SNAPSHOT.jar to F:\jenkins\jenkins-slave\workspace\-box_maven-resolver_MRESOLVER-12\m\maven-resolver-demos\maven-resolver-demo-maven-plugin\target\local-repo\org\apache\maven\resolver\maven-resolver-demo-maven-plugin\1.4.0-SNAPSHOT\maven-resolver-demo-maven-plugin-1.4.0-SNAPSHOT.jar
[INFO]
[INFO] --- maven-invoker-plugin:3.0.1:run (integration-test) @ maven-resolver-demo-maven-plugin ---
[INFO] Running Setup Jobs
[INFO] Building: resolve-artifact\pom.xml
[INFO]           resolve-artifact\pom.xml ......................... SUCCESS (4.4 s)
[INFO] -------------------------------------------------
[INFO] Build Summary:
[INFO]   Passed: 1, Failed: 0, Errors: 0, Skipped: 0
[INFO] -------------------------------------------------
[INFO]
[INFO] --- maven-checkstyle-plugin:3.0.0:check (checkstyle-check) @ maven-resolver-demo-maven-plugin ---
[INFO] ------------------------------------------------------------------------
[INFO] Reactor Summary for Maven Artifact Resolver 1.4.0-SNAPSHOT:
[INFO]
[INFO] Maven Artifact Resolver ............................ SUCCESS [ 39.874 s]
[INFO] Maven Artifact Resolver API ........................ SUCCESS [ 21.129 s]
[INFO] Maven Artifact Resolver SPI ........................ SUCCESS [  2.973 s]
[INFO] Maven Artifact Resolver Test Utilities ............. SUCCESS [  3.289 s]
[INFO] Maven Artifact Resolver Utilities .................. SUCCESS [  8.747 s]
[INFO] Maven Artifact Resolver Implementation ............. SUCCESS [ 26.293 s]
[INFO] Maven Artifact Resolver Connector Basic ............ SUCCESS [  8.131 s]
[INFO] Maven Artifact Resolver Transport Classpath ........ SUCCESS [  2.348 s]
[INFO] Maven Artifact Resolver Transport File ............. SUCCESS [  2.814 s]
[INFO] Maven Artifact Resolver Transport HTTP ............. SUCCESS [  9.632 s]
[INFO] Maven Artifact Resolver Transport Wagon ............ SUCCESS [  5.469 s]
[INFO] Maven Artifact Resolver Demos ...................... SUCCESS [  0.340 s]
[INFO] Maven Artifact Resolver Demo Snippets .............. SUCCESS [  2.988 s]
[INFO] Maven Artifact Resolver Demo Maven Plugin .......... SUCCESS [ 12.280 s]
[INFO] ------------------------------------------------------------------------
[INFO] BUILD SUCCESS
[INFO] ------------------------------------------------------------------------
[INFO] Total time:  02:27 min
[INFO] Finished at: 2020-03-04T10:47:15-08:00
[INFO] ------------------------------------------------------------------------
[INFO] [jenkins-event-spy] Generated F:\jenkins\jenkins-slave\workspace\-box_maven-resolver_MRESOLVER-12@tmp\withMavenc680a879\maven-spy-20200304-104447-51112415739800928309432.log
[Pipeline] }
[Pipeline] // dir
[Pipeline] }
[withMaven] invokerPublisher - Archive invoker results for Maven artifact MavenArtifact{org.apache.maven.resolver:maven-resolver-demo-maven-plugin:maven-plugin:1.4.0-SNAPSHOT(version: 1.4.0-SNAPSHOT, snapshot:false) } generated by PluginInvocation{org.apache.maven.plugins:maven-invoker-plugin:3.0.1@run  integration-test}: m\maven-resolver-demos\maven-resolver-demo-maven-plugin\target\invoker-reports\*.xml
[withMaven] junitPublisher - Archive test results for Maven artifact org.apache.maven.resolver:maven-resolver-api:jar:1.4.0-SNAPSHOT generated by maven-surefire-plugin:test (default-test): m\maven-resolver-api\target\surefire-reports\*.xml
[withMaven] junitPublisher - Archive test results for Maven artifact org.apache.maven.resolver:maven-resolver-spi:jar:1.4.0-SNAPSHOT generated by maven-surefire-plugin:test (default-test): m\maven-resolver-spi\target\surefire-reports\*.xml
[withMaven] junitPublisher - Archive test results for Maven artifact org.apache.maven.resolver:maven-resolver-test-util:jar:1.4.0-SNAPSHOT generated by maven-surefire-plugin:test (default-test): m\maven-resolver-test-util\target\surefire-reports\*.xml
[withMaven] junitPublisher - Archive test results for Maven artifact org.apache.maven.resolver:maven-resolver-util:jar:1.4.0-SNAPSHOT generated by maven-surefire-plugin:test (default-test): m\maven-resolver-util\target\surefire-reports\*.xml
[withMaven] junitPublisher - Archive test results for Maven artifact org.apache.maven.resolver:maven-resolver-impl:jar:1.4.0-SNAPSHOT generated by maven-surefire-plugin:test (default-test): m\maven-resolver-impl\target\surefire-reports\*.xml
[withMaven] junitPublisher - Archive test results for Maven artifact org.apache.maven.resolver:maven-resolver-connector-basic:jar:1.4.0-SNAPSHOT generated by maven-surefire-plugin:test (default-test): m\maven-resolver-connector-basic\target\surefire-reports\*.xml
[withMaven] junitPublisher - Archive test results for Maven artifact org.apache.maven.resolver:maven-resolver-transport-classpath:jar:1.4.0-SNAPSHOT generated by maven-surefire-plugin:test (default-test): m\maven-resolver-transport-classpath\target\surefire-reports\*.xml
[withMaven] junitPublisher - Archive test results for Maven artifact org.apache.maven.resolver:maven-resolver-transport-file:jar:1.4.0-SNAPSHOT generated by maven-surefire-plugin:test (default-test): m\maven-resolver-transport-file\target\surefire-reports\*.xml
[withMaven] junitPublisher - Archive test results for Maven artifact org.apache.maven.resolver:maven-resolver-transport-http:jar:1.4.0-SNAPSHOT generated by maven-surefire-plugin:test (default-test): m\maven-resolver-transport-http\target\surefire-reports\*.xml
[withMaven] junitPublisher - Archive test results for Maven artifact org.apache.maven.resolver:maven-resolver-transport-wagon:jar:1.4.0-SNAPSHOT generated by maven-surefire-plugin:test (default-test): m\maven-resolver-transport-wagon\target\surefire-reports\*.xml
[withMaven] junitPublisher - Archive test results for Maven artifact org.apache.maven.resolver:maven-resolver-demo-snippets:jar:1.4.0-SNAPSHOT generated by maven-surefire-plugin:test (default-test): m\maven-resolver-demos\maven-resolver-demo-snippets\target\surefire-reports\*.xml
[withMaven] junitPublisher - Archive test results for Maven artifact org.apache.maven.resolver:maven-resolver-demo-maven-plugin:maven-plugin:1.4.0-SNAPSHOT generated by maven-surefire-plugin:test (default-test): m\maven-resolver-demos\maven-resolver-demo-maven-plugin\target\surefire-reports\*.xml
Recording test results
[INFO]           resolve-artifact\pom.xml ......................... SUCCESS (4.6 s)
[INFO] -------------------------------------------------
[INFO] Build Summary:
[INFO]   Passed: 1, Failed: 0, Errors: 0, Skipped: 0
[INFO] -------------------------------------------------
[INFO]
[INFO] --- maven-checkstyle-plugin:3.0.0:check (checkstyle-check) @ maven-resolver-demo-maven-plugin ---
[INFO] ------------------------------------------------------------------------
[INFO] Reactor Summary for Maven Artifact Resolver 1.4.0-SNAPSHOT:
[INFO]
[INFO] Maven Artifact Resolver ............................ SUCCESS [ 38.950 s]
[INFO] Maven Artifact Resolver API ........................ SUCCESS [ 22.557 s]
[INFO] Maven Artifact Resolver SPI ........................ SUCCESS [  3.088 s]
[INFO] Maven Artifact Resolver Test Utilities ............. SUCCESS [  3.738 s]
[INFO] Maven Artifact Resolver Utilities .................. SUCCESS [  8.511 s]
[INFO] Maven Artifact Resolver Implementation ............. SUCCESS [ 23.775 s]
[INFO] Maven Artifact Resolver Connector Basic ............ SUCCESS [  8.241 s]
[INFO] Maven Artifact Resolver Transport Classpath ........ SUCCESS [  2.543 s]
[INFO] Maven Artifact Resolver Transport File ............. SUCCESS [  2.926 s]
[INFO] Maven Artifact Resolver Transport HTTP ............. SUCCESS [  9.904 s]
[INFO] Maven Artifact Resolver Transport Wagon ............ SUCCESS [  5.536 s]
[INFO] Maven Artifact Resolver Demos ...................... SUCCESS [  0.327 s]
[INFO] Maven Artifact Resolver Demo Snippets .............. SUCCESS [  3.184 s]
[INFO] Maven Artifact Resolver Demo Maven Plugin .......... SUCCESS [ 12.264 s]
[INFO] ------------------------------------------------------------------------
[INFO] BUILD SUCCESS
[INFO] ------------------------------------------------------------------------
[INFO] Total time:  02:27 min
[INFO] Finished at: 2020-03-04T10:47:16-08:00
[INFO] ------------------------------------------------------------------------
[INFO] [jenkins-event-spy] Generated F:\jenkins\jenkins-slave\workspace\-box_maven-resolver_MRESOLVER-12@tmp\withMavenfa217f0b\maven-spy-20200304-104448-90814276514221322926085.log
[Pipeline] }
[Pipeline] // dir
[Pipeline] }
[withMaven] invokerPublisher - Archive invoker results for Maven artifact MavenArtifact{org.apache.maven.resolver:maven-resolver-demo-maven-plugin:maven-plugin:1.4.0-SNAPSHOT(version: 1.4.0-SNAPSHOT, snapshot:false) } generated by PluginInvocation{org.apache.maven.plugins:maven-invoker-plugin:3.0.1@run  integration-test}: m\maven-resolver-demos\maven-resolver-demo-maven-plugin\target\invoker-reports\*.xml
[withMaven] junitPublisher - Archive test results for Maven artifact org.apache.maven.resolver:maven-resolver-api:jar:1.4.0-SNAPSHOT generated by maven-surefire-plugin:test (default-test): m\maven-resolver-api\target\surefire-reports\*.xml
[withMaven] junitPublisher - Archive test results for Maven artifact org.apache.maven.resolver:maven-resolver-spi:jar:1.4.0-SNAPSHOT generated by maven-surefire-plugin:test (default-test): m\maven-resolver-spi\target\surefire-reports\*.xml
[withMaven] junitPublisher - Archive test results for Maven artifact org.apache.maven.resolver:maven-resolver-test-util:jar:1.4.0-SNAPSHOT generated by maven-surefire-plugin:test (default-test): m\maven-resolver-test-util\target\surefire-reports\*.xml
[withMaven] junitPublisher - Archive test results for Maven artifact org.apache.maven.resolver:maven-resolver-util:jar:1.4.0-SNAPSHOT generated by maven-surefire-plugin:test (default-test): m\maven-resolver-util\target\surefire-reports\*.xml
[withMaven] junitPublisher - Archive test results for Maven artifact org.apache.maven.resolver:maven-resolver-impl:jar:1.4.0-SNAPSHOT generated by maven-surefire-plugin:test (default-test): m\maven-resolver-impl\target\surefire-reports\*.xml
[withMaven] junitPublisher - Archive test results for Maven artifact org.apache.maven.resolver:maven-resolver-connector-basic:jar:1.4.0-SNAPSHOT generated by maven-surefire-plugin:test (default-test): m\maven-resolver-connector-basic\target\surefire-reports\*.xml
[withMaven] junitPublisher - Archive test results for Maven artifact org.apache.maven.resolver:maven-resolver-transport-classpath:jar:1.4.0-SNAPSHOT generated by maven-surefire-plugin:test (default-test): m\maven-resolver-transport-classpath\target\surefire-reports\*.xml
[withMaven] junitPublisher - Archive test results for Maven artifact org.apache.maven.resolver:maven-resolver-transport-file:jar:1.4.0-SNAPSHOT generated by maven-surefire-plugin:test (default-test): m\maven-resolver-transport-file\target\surefire-reports\*.xml
[withMaven] junitPublisher - Archive test results for Maven artifact org.apache.maven.resolver:maven-resolver-transport-http:jar:1.4.0-SNAPSHOT generated by maven-surefire-plugin:test (default-test): m\maven-resolver-transport-http\target\surefire-reports\*.xml
[withMaven] junitPublisher - Archive test results for Maven artifact org.apache.maven.resolver:maven-resolver-transport-wagon:jar:1.4.0-SNAPSHOT generated by maven-surefire-plugin:test (default-test): m\maven-resolver-transport-wagon\target\surefire-reports\*.xml
[withMaven] junitPublisher - Archive test results for Maven artifact org.apache.maven.resolver:maven-resolver-demo-snippets:jar:1.4.0-SNAPSHOT generated by maven-surefire-plugin:test (default-test): m\maven-resolver-demos\maven-resolver-demo-snippets\target\surefire-reports\*.xml
[withMaven] junitPublisher - Archive test results for Maven artifact org.apache.maven.resolver:maven-resolver-demo-maven-plugin:maven-plugin:1.4.0-SNAPSHOT generated by maven-surefire-plugin:test (default-test): m\maven-resolver-demos\maven-resolver-demo-maven-plugin\target\surefire-reports\*.xml
Recording test results
[INFO]           resolve-artifact\pom.xml ......................... SUCCESS (5.1 s)
[INFO] -------------------------------------------------
[INFO] Build Summary:
[INFO]   Passed: 1, Failed: 0, Errors: 0, Skipped: 0
[INFO] -------------------------------------------------
[INFO]
[INFO] --- maven-checkstyle-plugin:3.0.0:check (checkstyle-check) @ maven-resolver-demo-maven-plugin ---
[INFO] ------------------------------------------------------------------------
[INFO] Reactor Summary for Maven Artifact Resolver 1.4.0-SNAPSHOT:
[INFO]
[INFO] Maven Artifact Resolver ............................ SUCCESS [ 38.616 s]
[INFO] Maven Artifact Resolver API ........................ SUCCESS [ 21.028 s]
[INFO] Maven Artifact Resolver SPI ........................ SUCCESS [  3.059 s]
[INFO] Maven Artifact Resolver Test Utilities ............. SUCCESS [  3.319 s]
[INFO] Maven Artifact Resolver Utilities .................. SUCCESS [  8.995 s]
[INFO] Maven Artifact Resolver Implementation ............. SUCCESS [ 25.414 s]
[INFO] Maven Artifact Resolver Connector Basic ............ SUCCESS [  8.289 s]
[INFO] Maven Artifact Resolver Transport Classpath ........ SUCCESS [  2.416 s]
[INFO] Maven Artifact Resolver Transport File ............. SUCCESS [  2.785 s]
[INFO] Maven Artifact Resolver Transport HTTP ............. SUCCESS [  9.868 s]
[INFO] Maven Artifact Resolver Transport Wagon ............ SUCCESS [  5.660 s]
[INFO] Maven Artifact Resolver Demos ...................... SUCCESS [  0.376 s]
[INFO] Maven Artifact Resolver Demo Snippets .............. SUCCESS [  3.087 s]
[INFO] Maven Artifact Resolver Demo Maven Plugin .......... SUCCESS [ 12.722 s]
[INFO] ------------------------------------------------------------------------
[INFO] BUILD SUCCESS
[INFO] ------------------------------------------------------------------------
[INFO] Total time:  02:27 min
[INFO] Finished at: 2020-03-04T10:47:19-08:00
[INFO] ------------------------------------------------------------------------
[INFO] [jenkins-event-spy] Generated F:\jenkins\jenkins-slave\workspace\-box_maven-resolver_MRESOLVER-12@tmp\withMaven008c3468\maven-spy-20200304-104452-12610325955889696266264.log
[withMaven] Publishers: Pipeline Graph Publisher: 6 ms, Invoker Publisher: 669 ms, Junit Publisher: 2782 ms, Dependencies Fingerprint Publisher: 369 ms
[Pipeline] // withMaven
[Pipeline] cleanWs
[WS-CLEANUP] Deleting project workspace...
[WS-CLEANUP] Deferred wipeout is used...
[WS-CLEANUP] done
[Pipeline] }
[Pipeline] // stage
[Pipeline] }
[Pipeline] // node
[Pipeline] }
[Pipeline] }
[Pipeline] // dir
[Pipeline] }
[withMaven] invokerPublisher - Archive invoker results for Maven artifact MavenArtifact{org.apache.maven.resolver:maven-resolver-demo-maven-plugin:maven-plugin:1.4.0-SNAPSHOT(version: 1.4.0-SNAPSHOT, snapshot:false) } generated by PluginInvocation{org.apache.maven.plugins:maven-invoker-plugin:3.0.1@run  integration-test}: m\maven-resolver-demos\maven-resolver-demo-maven-plugin\target\invoker-reports\*.xml
[withMaven] junitPublisher - Archive test results for Maven artifact org.apache.maven.resolver:maven-resolver-api:jar:1.4.0-SNAPSHOT generated by maven-surefire-plugin:test (default-test): m\maven-resolver-api\target\surefire-reports\*.xml
[withMaven] junitPublisher - Archive test results for Maven artifact org.apache.maven.resolver:maven-resolver-spi:jar:1.4.0-SNAPSHOT generated by maven-surefire-plugin:test (default-test): m\maven-resolver-spi\target\surefire-reports\*.xml
[withMaven] junitPublisher - Archive test results for Maven artifact org.apache.maven.resolver:maven-resolver-test-util:jar:1.4.0-SNAPSHOT generated by maven-surefire-plugin:test (default-test): m\maven-resolver-test-util\target\surefire-reports\*.xml
[withMaven] junitPublisher - Archive test results for Maven artifact org.apache.maven.resolver:maven-resolver-util:jar:1.4.0-SNAPSHOT generated by maven-surefire-plugin:test (default-test): m\maven-resolver-util\target\surefire-reports\*.xml
[withMaven] junitPublisher - Archive test results for Maven artifact org.apache.maven.resolver:maven-resolver-impl:jar:1.4.0-SNAPSHOT generated by maven-surefire-plugin:test (default-test): m\maven-resolver-impl\target\surefire-reports\*.xml
[withMaven] junitPublisher - Archive test results for Maven artifact org.apache.maven.resolver:maven-resolver-connector-basic:jar:1.4.0-SNAPSHOT generated by maven-surefire-plugin:test (default-test): m\maven-resolver-connector-basic\target\surefire-reports\*.xml
[withMaven] junitPublisher - Archive test results for Maven artifact org.apache.maven.resolver:maven-resolver-transport-classpath:jar:1.4.0-SNAPSHOT generated by maven-surefire-plugin:test (default-test): m\maven-resolver-transport-classpath\target\surefire-reports\*.xml
[withMaven] junitPublisher - Archive test results for Maven artifact org.apache.maven.resolver:maven-resolver-transport-file:jar:1.4.0-SNAPSHOT generated by maven-surefire-plugin:test (default-test): m\maven-resolver-transport-file\target\surefire-reports\*.xml
[withMaven] junitPublisher - Archive test results for Maven artifact org.apache.maven.resolver:maven-resolver-transport-http:jar:1.4.0-SNAPSHOT generated by maven-surefire-plugin:test (default-test): m\maven-resolver-transport-http\target\surefire-reports\*.xml
[withMaven] junitPublisher - Archive test results for Maven artifact org.apache.maven.resolver:maven-resolver-transport-wagon:jar:1.4.0-SNAPSHOT generated by maven-surefire-plugin:test (default-test): m\maven-resolver-transport-wagon\target\surefire-reports\*.xml
[withMaven] junitPublisher - Archive test results for Maven artifact org.apache.maven.resolver:maven-resolver-demo-snippets:jar:1.4.0-SNAPSHOT generated by maven-surefire-plugin:test (default-test): m\maven-resolver-demos\maven-resolver-demo-snippets\target\surefire-reports\*.xml
[withMaven] junitPublisher - Archive test results for Maven artifact org.apache.maven.resolver:maven-resolver-demo-maven-plugin:maven-plugin:1.4.0-SNAPSHOT generated by maven-surefire-plugin:test (default-test): m\maven-resolver-demos\maven-resolver-demo-maven-plugin\target\surefire-reports\*.xml
Recording test results
[withMaven] Publishers: Pipeline Graph Publisher: 5 ms, Invoker Publisher: 2579 ms, Junit Publisher: 2997 ms, Concordion Publisher: 1 ms, Dependencies Fingerprint Publisher: 377 ms
[Pipeline] // withMaven
[Pipeline] cleanWs
[WS-CLEANUP] Deleting project workspace...
[WS-CLEANUP] Deferred wipeout is used...
[WS-CLEANUP] done
[Pipeline] }
[Pipeline] // stage
[Pipeline] }
[Pipeline] // node
[Pipeline] }
[withMaven] Publishers: Pipeline Graph Publisher: 9 ms, Invoker Publisher: 2246 ms, Junit Publisher: 3398 ms, Dependencies Fingerprint Publisher: 392 ms
[Pipeline] // withMaven
[Pipeline] cleanWs
[WS-CLEANUP] Deleting project workspace...
[WS-CLEANUP] Deferred wipeout is used...
[WS-CLEANUP] done
[Pipeline] }
[Pipeline] // stage
[Pipeline] }
[Pipeline] // node
[Pipeline] }
[Pipeline] // parallel
[Pipeline] stage
[Pipeline] { (Notifications)
[Pipeline] echo
Build result: UNSTABLE
[Pipeline] jiraIssueSelector
[Pipeline] echo
The authors of changes [slachiewicz].
[Pipeline] echo
Sending email ...
[Pipeline] emailext
Reply | Threaded
Open this post in threaded view
|

Build unstable in Jenkins: Maven TLP » maven-resolver » MRESOLVER-12 #24

Apache Jenkins Server-2
See https://builds.apache.org/job/maven-box/job/maven-resolver/job/MRESOLVER-12/24/

Changes:

* Java 14 released, so Java 13 EOL. Include Java 15-ea

20 tests failed.
FAILED:  org.eclipse.aether.internal.impl.collect.DefaultDependencyCollectorTest.linux-jdk8 / Build linux-jdk8 / testSelectionWithScopeDependencySelector

Error Message:
path: [gid:root:ext:ver (root-scope)], expected: [gid:direct:ext:ver (direct-scope)], actual: [] expected:<1> but was:<0>

Stack Trace:
java.lang.AssertionError: path: [gid:root:ext:ver (root-scope)], expected: [gid:direct:ext:ver (direct-scope)], actual: [] expected:<1> but was:<0>
        at org.eclipse.aether.internal.impl.collect.DefaultDependencyCollectorTest.assertEqualSubtree(DefaultDependencyCollectorTest.java:145)
        at org.eclipse.aether.internal.impl.collect.DefaultDependencyCollectorTest.assertEqualSubtree(DefaultDependencyCollectorTest.java:123)
        at org.eclipse.aether.internal.impl.collect.DefaultDependencyCollectorTest.testSelectionWithScopeDependencySelector(DefaultDependencyCollectorTest.java:717)


FAILED:  org.eclipse.aether.internal.impl.collect.DefaultDependencyCollectorTest.linux-jdk8 / Build linux-jdk8 / testDependencyManagement_DependencySelectorProcessesManagedState

Error Message:
path: [gid:root:ext:ver (root-scope), gid:direct-of-root:ext:ver (direct-of-root-scope), gid:transitive-of-root:ext:ver (transitive-of-root-scope)], expected: [], actual: [gid:transitive-of-transitive-of-root:ext:ver (managed)] expected:<0> but was:<1>

Stack Trace:
java.lang.AssertionError: path: [gid:root:ext:ver (root-scope), gid:direct-of-root:ext:ver (direct-of-root-scope), gid:transitive-of-root:ext:ver (transitive-of-root-scope)], expected: [], actual: [gid:transitive-of-transitive-of-root:ext:ver (managed)] expected:<0> but was:<1>
        at org.eclipse.aether.internal.impl.collect.DefaultDependencyCollectorTest.assertEqualSubtree(DefaultDependencyCollectorTest.java:145)
        at org.eclipse.aether.internal.impl.collect.DefaultDependencyCollectorTest.assertEqualSubtree(DefaultDependencyCollectorTest.java:153)
        at org.eclipse.aether.internal.impl.collect.DefaultDependencyCollectorTest.assertEqualSubtree(DefaultDependencyCollectorTest.java:153)
        at org.eclipse.aether.internal.impl.collect.DefaultDependencyCollectorTest.assertEqualSubtree(DefaultDependencyCollectorTest.java:123)
        at org.eclipse.aether.internal.impl.collect.DefaultDependencyCollectorTest.testDependencyManagement_DependencySelectorProcessesManagedState(DefaultDependencyCollectorTest.java:591)


FAILED:  org.eclipse.aether.internal.impl.collect.DefaultDependencyCollectorTest.linux-jdk11 / Build linux-jdk11 / testSelectionWithScopeDependencySelector

Error Message:
path: [gid:root:ext:ver (root-scope)], expected: [gid:direct:ext:ver (direct-scope)], actual: [] expected:<1> but was:<0>

Stack Trace:
java.lang.AssertionError: path: [gid:root:ext:ver (root-scope)], expected: [gid:direct:ext:ver (direct-scope)], actual: [] expected:<1> but was:<0>
        at org.eclipse.aether.internal.impl.collect.DefaultDependencyCollectorTest.assertEqualSubtree(DefaultDependencyCollectorTest.java:145)
        at org.eclipse.aether.internal.impl.collect.DefaultDependencyCollectorTest.assertEqualSubtree(DefaultDependencyCollectorTest.java:123)
        at org.eclipse.aether.internal.impl.collect.DefaultDependencyCollectorTest.testSelectionWithScopeDependencySelector(DefaultDependencyCollectorTest.java:717)


FAILED:  org.eclipse.aether.internal.impl.collect.DefaultDependencyCollectorTest.linux-jdk11 / Build linux-jdk11 / testDependencyManagement_DependencySelectorProcessesManagedState

Error Message:
path: [gid:root:ext:ver (root-scope), gid:direct-of-root:ext:ver (direct-of-root-scope), gid:transitive-of-root:ext:ver (transitive-of-root-scope)], expected: [], actual: [gid:transitive-of-transitive-of-root:ext:ver (managed)] expected:<0> but was:<1>

Stack Trace:
java.lang.AssertionError: path: [gid:root:ext:ver (root-scope), gid:direct-of-root:ext:ver (direct-of-root-scope), gid:transitive-of-root:ext:ver (transitive-of-root-scope)], expected: [], actual: [gid:transitive-of-transitive-of-root:ext:ver (managed)] expected:<0> but was:<1>
        at org.eclipse.aether.internal.impl.collect.DefaultDependencyCollectorTest.assertEqualSubtree(DefaultDependencyCollectorTest.java:145)
        at org.eclipse.aether.internal.impl.collect.DefaultDependencyCollectorTest.assertEqualSubtree(DefaultDependencyCollectorTest.java:153)
        at org.eclipse.aether.internal.impl.collect.DefaultDependencyCollectorTest.assertEqualSubtree(DefaultDependencyCollectorTest.java:153)
        at org.eclipse.aether.internal.impl.collect.DefaultDependencyCollectorTest.assertEqualSubtree(DefaultDependencyCollectorTest.java:123)
        at org.eclipse.aether.internal.impl.collect.DefaultDependencyCollectorTest.testDependencyManagement_DependencySelectorProcessesManagedState(DefaultDependencyCollectorTest.java:591)


FAILED:  org.eclipse.aether.internal.impl.collect.DefaultDependencyCollectorTest.linux-jdk13 / Build linux-jdk13 / testSelectionWithScopeDependencySelector

Error Message:
path: [gid:root:ext:ver (root-scope)], expected: [gid:direct:ext:ver (direct-scope)], actual: [] expected:<1> but was:<0>

Stack Trace:
java.lang.AssertionError: path: [gid:root:ext:ver (root-scope)], expected: [gid:direct:ext:ver (direct-scope)], actual: [] expected:<1> but was:<0>
        at org.eclipse.aether.internal.impl.collect.DefaultDependencyCollectorTest.assertEqualSubtree(DefaultDependencyCollectorTest.java:145)
        at org.eclipse.aether.internal.impl.collect.DefaultDependencyCollectorTest.assertEqualSubtree(DefaultDependencyCollectorTest.java:123)
        at org.eclipse.aether.internal.impl.collect.DefaultDependencyCollectorTest.testSelectionWithScopeDependencySelector(DefaultDependencyCollectorTest.java:717)


FAILED:  org.eclipse.aether.internal.impl.collect.DefaultDependencyCollectorTest.linux-jdk13 / Build linux-jdk13 / testDependencyManagement_DependencySelectorProcessesManagedState

Error Message:
path: [gid:root:ext:ver (root-scope), gid:direct-of-root:ext:ver (direct-of-root-scope), gid:transitive-of-root:ext:ver (transitive-of-root-scope)], expected: [], actual: [gid:transitive-of-transitive-of-root:ext:ver (managed)] expected:<0> but was:<1>

Stack Trace:
java.lang.AssertionError: path: [gid:root:ext:ver (root-scope), gid:direct-of-root:ext:ver (direct-of-root-scope), gid:transitive-of-root:ext:ver (transitive-of-root-scope)], expected: [], actual: [gid:transitive-of-transitive-of-root:ext:ver (managed)] expected:<0> but was:<1>
        at org.eclipse.aether.internal.impl.collect.DefaultDependencyCollectorTest.assertEqualSubtree(DefaultDependencyCollectorTest.java:145)
        at org.eclipse.aether.internal.impl.collect.DefaultDependencyCollectorTest.assertEqualSubtree(DefaultDependencyCollectorTest.java:153)
        at org.eclipse.aether.internal.impl.collect.DefaultDependencyCollectorTest.assertEqualSubtree(DefaultDependencyCollectorTest.java:153)
        at org.eclipse.aether.internal.impl.collect.DefaultDependencyCollectorTest.assertEqualSubtree(DefaultDependencyCollectorTest.java:123)
        at org.eclipse.aether.internal.impl.collect.DefaultDependencyCollectorTest.testDependencyManagement_DependencySelectorProcessesManagedState(DefaultDependencyCollectorTest.java:591)


FAILED:  org.eclipse.aether.internal.impl.collect.DefaultDependencyCollectorTest.linux-jdk7 / Build linux-jdk7 / testSelectionWithScopeDependencySelector

Error Message:
path: [gid:root:ext:ver (root-scope)], expected: [gid:direct:ext:ver (direct-scope)], actual: [] expected:<1> but was:<0>

Stack Trace:
java.lang.AssertionError: path: [gid:root:ext:ver (root-scope)], expected: [gid:direct:ext:ver (direct-scope)], actual: [] expected:<1> but was:<0>
        at org.eclipse.aether.internal.impl.collect.DefaultDependencyCollectorTest.assertEqualSubtree(DefaultDependencyCollectorTest.java:145)
        at org.eclipse.aether.internal.impl.collect.DefaultDependencyCollectorTest.assertEqualSubtree(DefaultDependencyCollectorTest.java:123)
        at org.eclipse.aether.internal.impl.collect.DefaultDependencyCollectorTest.testSelectionWithScopeDependencySelector(DefaultDependencyCollectorTest.java:717)


FAILED:  org.eclipse.aether.internal.impl.collect.DefaultDependencyCollectorTest.linux-jdk7 / Build linux-jdk7 / testDependencyManagement_DependencySelectorProcessesManagedState

Error Message:
path: [gid:root:ext:ver (root-scope), gid:direct-of-root:ext:ver (direct-of-root-scope), gid:transitive-of-root:ext:ver (transitive-of-root-scope)], expected: [], actual: [gid:transitive-of-transitive-of-root:ext:ver (managed)] expected:<0> but was:<1>

Stack Trace:
java.lang.AssertionError: path: [gid:root:ext:ver (root-scope), gid:direct-of-root:ext:ver (direct-of-root-scope), gid:transitive-of-root:ext:ver (transitive-of-root-scope)], expected: [], actual: [gid:transitive-of-transitive-of-root:ext:ver (managed)] expected:<0> but was:<1>
        at org.eclipse.aether.internal.impl.collect.DefaultDependencyCollectorTest.assertEqualSubtree(DefaultDependencyCollectorTest.java:145)
        at org.eclipse.aether.internal.impl.collect.DefaultDependencyCollectorTest.assertEqualSubtree(DefaultDependencyCollectorTest.java:153)
        at org.eclipse.aether.internal.impl.collect.DefaultDependencyCollectorTest.assertEqualSubtree(DefaultDependencyCollectorTest.java:153)
        at org.eclipse.aether.internal.impl.collect.DefaultDependencyCollectorTest.assertEqualSubtree(DefaultDependencyCollectorTest.java:123)
        at org.eclipse.aether.internal.impl.collect.DefaultDependencyCollectorTest.testDependencyManagement_DependencySelectorProcessesManagedState(DefaultDependencyCollectorTest.java:591)


FAILED:  org.eclipse.aether.internal.impl.collect.DefaultDependencyCollectorTest.linux-jdk14 / Build linux-jdk14 / testSelectionWithScopeDependencySelector

Error Message:
path: [gid:root:ext:ver (root-scope)], expected: [gid:direct:ext:ver (direct-scope)], actual: [] expected:<1> but was:<0>

Stack Trace:
java.lang.AssertionError: path: [gid:root:ext:ver (root-scope)], expected: [gid:direct:ext:ver (direct-scope)], actual: [] expected:<1> but was:<0>
        at org.eclipse.aether.internal.impl.collect.DefaultDependencyCollectorTest.assertEqualSubtree(DefaultDependencyCollectorTest.java:145)
        at org.eclipse.aether.internal.impl.collect.DefaultDependencyCollectorTest.assertEqualSubtree(DefaultDependencyCollectorTest.java:123)
        at org.eclipse.aether.internal.impl.collect.DefaultDependencyCollectorTest.testSelectionWithScopeDependencySelector(DefaultDependencyCollectorTest.java:717)


FAILED:  org.eclipse.aether.internal.impl.collect.DefaultDependencyCollectorTest.linux-jdk14 / Build linux-jdk14 / testDependencyManagement_DependencySelectorProcessesManagedState

Error Message:
path: [gid:root:ext:ver (root-scope), gid:direct-of-root:ext:ver (direct-of-root-scope), gid:transitive-of-root:ext:ver (transitive-of-root-scope)], expected: [], actual: [gid:transitive-of-transitive-of-root:ext:ver (managed)] expected:<0> but was:<1>

Stack Trace:
java.lang.AssertionError: path: [gid:root:ext:ver (root-scope), gid:direct-of-root:ext:ver (direct-of-root-scope), gid:transitive-of-root:ext:ver (transitive-of-root-scope)], expected: [], actual: [gid:transitive-of-transitive-of-root:ext:ver (managed)] expected:<0> but was:<1>
        at org.eclipse.aether.internal.impl.collect.DefaultDependencyCollectorTest.assertEqualSubtree(DefaultDependencyCollectorTest.java:145)
        at org.eclipse.aether.internal.impl.collect.DefaultDependencyCollectorTest.assertEqualSubtree(DefaultDependencyCollectorTest.java:153)
        at org.eclipse.aether.internal.impl.collect.DefaultDependencyCollectorTest.assertEqualSubtree(DefaultDependencyCollectorTest.java:153)
        at org.eclipse.aether.internal.impl.collect.DefaultDependencyCollectorTest.assertEqualSubtree(DefaultDependencyCollectorTest.java:123)
        at org.eclipse.aether.internal.impl.collect.DefaultDependencyCollectorTest.testDependencyManagement_DependencySelectorProcessesManagedState(DefaultDependencyCollectorTest.java:591)


FAILED:  org.eclipse.aether.internal.impl.collect.DefaultDependencyCollectorTest.windows-jdk7 / Build windows-jdk7 / testSelectionWithScopeDependencySelector

Error Message:
path: [gid:root:ext:ver (root-scope)], expected: [gid:direct:ext:ver (direct-scope)], actual: [] expected:<1> but was:<0>

Stack Trace:
java.lang.AssertionError: path: [gid:root:ext:ver (root-scope)], expected: [gid:direct:ext:ver (direct-scope)], actual: [] expected:<1> but was:<0>
        at org.eclipse.aether.internal.impl.collect.DefaultDependencyCollectorTest.assertEqualSubtree(DefaultDependencyCollectorTest.java:145)
        at org.eclipse.aether.internal.impl.collect.DefaultDependencyCollectorTest.assertEqualSubtree(DefaultDependencyCollectorTest.java:123)
        at org.eclipse.aether.internal.impl.collect.DefaultDependencyCollectorTest.testSelectionWithScopeDependencySelector(DefaultDependencyCollectorTest.java:717)


FAILED:  org.eclipse.aether.internal.impl.collect.DefaultDependencyCollectorTest.windows-jdk7 / Build windows-jdk7 / testDependencyManagement_DependencySelectorProcessesManagedState

Error Message:
path: [gid:root:ext:ver (root-scope), gid:direct-of-root:ext:ver (direct-of-root-scope), gid:transitive-of-root:ext:ver (transitive-of-root-scope)], expected: [], actual: [gid:transitive-of-transitive-of-root:ext:ver (managed)] expected:<0> but was:<1>

Stack Trace:
java.lang.AssertionError: path: [gid:root:ext:ver (root-scope), gid:direct-of-root:ext:ver (direct-of-root-scope), gid:transitive-of-root:ext:ver (transitive-of-root-scope)], expected: [], actual: [gid:transitive-of-transitive-of-root:ext:ver (managed)] expected:<0> but was:<1>
        at org.eclipse.aether.internal.impl.collect.DefaultDependencyCollectorTest.assertEqualSubtree(DefaultDependencyCollectorTest.java:145)
        at org.eclipse.aether.internal.impl.collect.DefaultDependencyCollectorTest.assertEqualSubtree(DefaultDependencyCollectorTest.java:153)
        at org.eclipse.aether.internal.impl.collect.DefaultDependencyCollectorTest.assertEqualSubtree(DefaultDependencyCollectorTest.java:153)
        at org.eclipse.aether.internal.impl.collect.DefaultDependencyCollectorTest.assertEqualSubtree(DefaultDependencyCollectorTest.java:123)
        at org.eclipse.aether.internal.impl.collect.DefaultDependencyCollectorTest.testDependencyManagement_DependencySelectorProcessesManagedState(DefaultDependencyCollectorTest.java:591)


FAILED:  org.eclipse.aether.internal.impl.collect.DefaultDependencyCollectorTest.windows-jdk8 / Build windows-jdk8 / testSelectionWithScopeDependencySelector

Error Message:
path: [gid:root:ext:ver (root-scope)], expected: [gid:direct:ext:ver (direct-scope)], actual: [] expected:<1> but was:<0>

Stack Trace:
java.lang.AssertionError: path: [gid:root:ext:ver (root-scope)], expected: [gid:direct:ext:ver (direct-scope)], actual: [] expected:<1> but was:<0>
        at org.eclipse.aether.internal.impl.collect.DefaultDependencyCollectorTest.assertEqualSubtree(DefaultDependencyCollectorTest.java:145)
        at org.eclipse.aether.internal.impl.collect.DefaultDependencyCollectorTest.assertEqualSubtree(DefaultDependencyCollectorTest.java:123)
        at org.eclipse.aether.internal.impl.collect.DefaultDependencyCollectorTest.testSelectionWithScopeDependencySelector(DefaultDependencyCollectorTest.java:717)


FAILED:  org.eclipse.aether.internal.impl.collect.DefaultDependencyCollectorTest.windows-jdk8 / Build windows-jdk8 / testDependencyManagement_DependencySelectorProcessesManagedState

Error Message:
path: [gid:root:ext:ver (root-scope), gid:direct-of-root:ext:ver (direct-of-root-scope), gid:transitive-of-root:ext:ver (transitive-of-root-scope)], expected: [], actual: [gid:transitive-of-transitive-of-root:ext:ver (managed)] expected:<0> but was:<1>

Stack Trace:
java.lang.AssertionError: path: [gid:root:ext:ver (root-scope), gid:direct-of-root:ext:ver (direct-of-root-scope), gid:transitive-of-root:ext:ver (transitive-of-root-scope)], expected: [], actual: [gid:transitive-of-transitive-of-root:ext:ver (managed)] expected:<0> but was:<1>
        at org.eclipse.aether.internal.impl.collect.DefaultDependencyCollectorTest.assertEqualSubtree(DefaultDependencyCollectorTest.java:145)
        at org.eclipse.aether.internal.impl.collect.DefaultDependencyCollectorTest.assertEqualSubtree(DefaultDependencyCollectorTest.java:153)
        at org.eclipse.aether.internal.impl.collect.DefaultDependencyCollectorTest.assertEqualSubtree(DefaultDependencyCollectorTest.java:153)
        at org.eclipse.aether.internal.impl.collect.DefaultDependencyCollectorTest.assertEqualSubtree(DefaultDependencyCollectorTest.java:123)
        at org.eclipse.aether.internal.impl.collect.DefaultDependencyCollectorTest.testDependencyManagement_DependencySelectorProcessesManagedState(DefaultDependencyCollectorTest.java:591)


FAILED:  org.eclipse.aether.internal.impl.collect.DefaultDependencyCollectorTest.windows-jdk11 / Build windows-jdk11 / testSelectionWithScopeDependencySelector

Error Message:
path: [gid:root:ext:ver (root-scope)], expected: [gid:direct:ext:ver (direct-scope)], actual: [] expected:<1> but was:<0>

Stack Trace:
java.lang.AssertionError: path: [gid:root:ext:ver (root-scope)], expected: [gid:direct:ext:ver (direct-scope)], actual: [] expected:<1> but was:<0>
        at org.eclipse.aether.internal.impl.collect.DefaultDependencyCollectorTest.assertEqualSubtree(DefaultDependencyCollectorTest.java:145)
        at org.eclipse.aether.internal.impl.collect.DefaultDependencyCollectorTest.assertEqualSubtree(DefaultDependencyCollectorTest.java:123)
        at org.eclipse.aether.internal.impl.collect.DefaultDependencyCollectorTest.testSelectionWithScopeDependencySelector(DefaultDependencyCollectorTest.java:717)


FAILED:  org.eclipse.aether.internal.impl.collect.DefaultDependencyCollectorTest.windows-jdk11 / Build windows-jdk11 / testDependencyManagement_DependencySelectorProcessesManagedState

Error Message:
path: [gid:root:ext:ver (root-scope), gid:direct-of-root:ext:ver (direct-of-root-scope), gid:transitive-of-root:ext:ver (transitive-of-root-scope)], expected: [], actual: [gid:transitive-of-transitive-of-root:ext:ver (managed)] expected:<0> but was:<1>

Stack Trace:
java.lang.AssertionError: path: [gid:root:ext:ver (root-scope), gid:direct-of-root:ext:ver (direct-of-root-scope), gid:transitive-of-root:ext:ver (transitive-of-root-scope)], expected: [], actual: [gid:transitive-of-transitive-of-root:ext:ver (managed)] expected:<0> but was:<1>
        at org.eclipse.aether.internal.impl.collect.DefaultDependencyCollectorTest.assertEqualSubtree(DefaultDependencyCollectorTest.java:145)
        at org.eclipse.aether.internal.impl.collect.DefaultDependencyCollectorTest.assertEqualSubtree(DefaultDependencyCollectorTest.java:153)
        at org.eclipse.aether.internal.impl.collect.DefaultDependencyCollectorTest.assertEqualSubtree(DefaultDependencyCollectorTest.java:153)
        at org.eclipse.aether.internal.impl.collect.DefaultDependencyCollectorTest.assertEqualSubtree(DefaultDependencyCollectorTest.java:123)
        at org.eclipse.aether.internal.impl.collect.DefaultDependencyCollectorTest.testDependencyManagement_DependencySelectorProcessesManagedState(DefaultDependencyCollectorTest.java:591)


FAILED:  org.eclipse.aether.internal.impl.collect.DefaultDependencyCollectorTest.windows-jdk13 / Build windows-jdk13 / testSelectionWithScopeDependencySelector

Error Message:
path: [gid:root:ext:ver (root-scope)], expected: [gid:direct:ext:ver (direct-scope)], actual: [] expected:<1> but was:<0>

Stack Trace:
java.lang.AssertionError: path: [gid:root:ext:ver (root-scope)], expected: [gid:direct:ext:ver (direct-scope)], actual: [] expected:<1> but was:<0>
        at org.eclipse.aether.internal.impl.collect.DefaultDependencyCollectorTest.assertEqualSubtree(DefaultDependencyCollectorTest.java:145)
        at org.eclipse.aether.internal.impl.collect.DefaultDependencyCollectorTest.assertEqualSubtree(DefaultDependencyCollectorTest.java:123)
        at org.eclipse.aether.internal.impl.collect.DefaultDependencyCollectorTest.testSelectionWithScopeDependencySelector(DefaultDependencyCollectorTest.java:717)


FAILED:  org.eclipse.aether.internal.impl.collect.DefaultDependencyCollectorTest.windows-jdk13 / Build windows-jdk13 / testDependencyManagement_DependencySelectorProcessesManagedState

Error Message:
path: [gid:root:ext:ver (root-scope), gid:direct-of-root:ext:ver (direct-of-root-scope), gid:transitive-of-root:ext:ver (transitive-of-root-scope)], expected: [], actual: [gid:transitive-of-transitive-of-root:ext:ver (managed)] expected:<0> but was:<1>

Stack Trace:
java.lang.AssertionError: path: [gid:root:ext:ver (root-scope), gid:direct-of-root:ext:ver (direct-of-root-scope), gid:transitive-of-root:ext:ver (transitive-of-root-scope)], expected: [], actual: [gid:transitive-of-transitive-of-root:ext:ver (managed)] expected:<0> but was:<1>
        at org.eclipse.aether.internal.impl.collect.DefaultDependencyCollectorTest.assertEqualSubtree(DefaultDependencyCollectorTest.java:145)
        at org.eclipse.aether.internal.impl.collect.DefaultDependencyCollectorTest.assertEqualSubtree(DefaultDependencyCollectorTest.java:153)
        at org.eclipse.aether.internal.impl.collect.DefaultDependencyCollectorTest.assertEqualSubtree(DefaultDependencyCollectorTest.java:153)
        at org.eclipse.aether.internal.impl.collect.DefaultDependencyCollectorTest.assertEqualSubtree(DefaultDependencyCollectorTest.java:123)
        at org.eclipse.aether.internal.impl.collect.DefaultDependencyCollectorTest.testDependencyManagement_DependencySelectorProcessesManagedState(DefaultDependencyCollectorTest.java:591)


FAILED:  org.eclipse.aether.internal.impl.collect.DefaultDependencyCollectorTest.windows-jdk14 / Build windows-jdk14 / testSelectionWithScopeDependencySelector

Error Message:
path: [gid:root:ext:ver (root-scope)], expected: [gid:direct:ext:ver (direct-scope)], actual: [] expected:<1> but was:<0>

Stack Trace:
java.lang.AssertionError: path: [gid:root:ext:ver (root-scope)], expected: [gid:direct:ext:ver (direct-scope)], actual: [] expected:<1> but was:<0>
        at org.eclipse.aether.internal.impl.collect.DefaultDependencyCollectorTest.assertEqualSubtree(DefaultDependencyCollectorTest.java:145)
        at org.eclipse.aether.internal.impl.collect.DefaultDependencyCollectorTest.assertEqualSubtree(DefaultDependencyCollectorTest.java:123)
        at org.eclipse.aether.internal.impl.collect.DefaultDependencyCollectorTest.testSelectionWithScopeDependencySelector(DefaultDependencyCollectorTest.java:717)


FAILED:  org.eclipse.aether.internal.impl.collect.DefaultDependencyCollectorTest.windows-jdk14 / Build windows-jdk14 / testDependencyManagement_DependencySelectorProcessesManagedState

Error Message:
path: [gid:root:ext:ver (root-scope), gid:direct-of-root:ext:ver (direct-of-root-scope), gid:transitive-of-root:ext:ver (transitive-of-root-scope)], expected: [], actual: [gid:transitive-of-transitive-of-root:ext:ver (managed)] expected:<0> but was:<1>

Stack Trace:
java.lang.AssertionError: path: [gid:root:ext:ver (root-scope), gid:direct-of-root:ext:ver (direct-of-root-scope), gid:transitive-of-root:ext:ver (transitive-of-root-scope)], expected: [], actual: [gid:transitive-of-transitive-of-root:ext:ver (managed)] expected:<0> but was:<1>
        at org.eclipse.aether.internal.impl.collect.DefaultDependencyCollectorTest.assertEqualSubtree(DefaultDependencyCollectorTest.java:145)
        at org.eclipse.aether.internal.impl.collect.DefaultDependencyCollectorTest.assertEqualSubtree(DefaultDependencyCollectorTest.java:153)
        at org.eclipse.aether.internal.impl.collect.DefaultDependencyCollectorTest.assertEqualSubtree(DefaultDependencyCollectorTest.java:153)
        at org.eclipse.aether.internal.impl.collect.DefaultDependencyCollectorTest.assertEqualSubtree(DefaultDependencyCollectorTest.java:123)
        at org.eclipse.aether.internal.impl.collect.DefaultDependencyCollectorTest.testDependencyManagement_DependencySelectorProcessesManagedState(DefaultDependencyCollectorTest.java:591)




Build log:
[...truncated 33651 lines...]
[INFO] Downloading from central: https://repo.maven.apache.org/maven2/org/apache/maven/plugin-tools/maven-plugin-tools-java/3.5.2/maven-plugin-tools-java-3.5.2.jar
[INFO] Downloaded from central: https://repo.maven.apache.org/maven2/org/ow2/asm/asm-tree/6.1.1/asm-tree-6.1.1.jar (50 kB at 2.0 MB/s)
[INFO] Downloaded from central: https://repo.maven.apache.org/maven2/org/ow2/asm/asm-analysis/6.1.1/asm-analysis-6.1.1.jar (32 kB at 1.3 MB/s)
[INFO] Downloading from central: https://repo.maven.apache.org/maven2/com/thoughtworks/qdox/qdox/2.0-M5/qdox-2.0-M5.jar
[INFO] Downloading from central: https://repo.maven.apache.org/maven2/org/apache/maven/plugin-tools/maven-plugin-tools-annotations/3.5.2/maven-plugin-tools-annotations-3.5.2.jar
[INFO] Downloaded from central: https://repo.maven.apache.org/maven2/org/ow2/asm/asm-commons/6.1.1/asm-commons-6.1.1.jar (78 kB at 2.8 MB/s)
[INFO] Downloading from central: https://repo.maven.apache.org/maven2/org/codehaus/plexus/plexus-archiver/3.4.1/plexus-archiver-3.4.1.jar
[INFO] Downloaded from central: https://repo.maven.apache.org/maven2/org/apache/maven/plugin-tools/maven-plugin-tools-java/3.5.2/maven-plugin-tools-java-3.5.2.jar (18 kB at 442 kB/s)
[INFO] Downloading from central: https://repo.maven.apache.org/maven2/org/apache/maven/doxia/doxia-core/1.4/doxia-core-1.4.jar
[INFO] Downloaded from central: https://repo.maven.apache.org/maven2/org/apache/maven/plugin-tools/maven-plugin-tools-annotations/3.5.2/maven-plugin-tools-annotations-3.5.2.jar (43 kB at 935 kB/s)
[INFO] Downloading from central: https://repo.maven.apache.org/maven2/javax/servlet/servlet-api/2.3/servlet-api-2.3.jar
[INFO] Downloaded from central: https://repo.maven.apache.org/maven2/net/sf/jtidy/jtidy/r938/jtidy-r938.jar (250 kB at 5.1 MB/s)
[INFO] Downloading from central: https://repo.maven.apache.org/maven2/org/codehaus/plexus/plexus-utils/3.0.20/plexus-utils-3.0.20.jar
[INFO] Downloaded from central: https://repo.maven.apache.org/maven2/org/codehaus/plexus/plexus-archiver/3.4.1/plexus-archiver-3.4.1.jar (187 kB at 3.2 MB/s)
[INFO] Downloaded from central: https://repo.maven.apache.org/maven2/com/thoughtworks/qdox/qdox/2.0-M5/qdox-2.0-M5.jar (313 kB at 5.3 MB/s)
[INFO] Downloading from central: https://repo.maven.apache.org/maven2/org/apache/maven/surefire/maven-surefire-common/2.19.1/maven-surefire-common-2.19.1.jar
[INFO] Downloading from central: https://repo.maven.apache.org/maven2/org/apache/maven/surefire/surefire-api/2.19.1/surefire-api-2.19.1.jar
[INFO] Downloaded from central: https://repo.maven.apache.org/maven2/org/apache/maven/doxia/doxia-core/1.4/doxia-core-1.4.jar (165 kB at 2.3 MB/s)
[INFO] Downloading from central: https://repo.maven.apache.org/maven2/org/apache/maven/surefire/surefire-booter/2.19.1/surefire-booter-2.19.1.jar
[INFO] Downloaded from central: https://repo.maven.apache.org/maven2/org/codehaus/plexus/plexus-utils/3.0.20/plexus-utils-3.0.20.jar (243 kB at 3.2 MB/s)
[INFO] Downloading from central: https://repo.maven.apache.org/maven2/org/apache/commons/commons-lang3/3.1/commons-lang3-3.1.jar
[INFO] Downloaded from central: https://repo.maven.apache.org/maven2/javax/servlet/servlet-api/2.3/servlet-api-2.3.jar (78 kB at 1.0 MB/s)
[INFO] Downloaded from central: https://repo.maven.apache.org/maven2/org/apache/maven/surefire/surefire-api/2.19.1/surefire-api-2.19.1.jar (196 kB at 2.3 MB/s)
[INFO] Downloaded from central: https://repo.maven.apache.org/maven2/org/apache/maven/surefire/maven-surefire-common/2.19.1/maven-surefire-common-2.19.1.jar (293 kB at 3.0 MB/s)
[INFO] Downloaded from central: https://repo.maven.apache.org/maven2/org/apache/maven/surefire/surefire-booter/2.19.1/surefire-booter-2.19.1.jar (46 kB at 450 kB/s)
[INFO] Downloaded from central: https://repo.maven.apache.org/maven2/org/apache/commons/commons-lang3/3.1/commons-lang3-3.1.jar (316 kB at 2.8 MB/s)
[ERROR]

Artifact Ids of the format maven-___-plugin are reserved for
plugins in the Group Id org.apache.maven.plugins
Please change your artifactId to the format ___-maven-plugin
In the future this error will break the build.


[INFO] Using 'UTF-8' encoding to read mojo source files.
[INFO] java-javadoc mojo extractor found 0 mojo descriptor.
[INFO] java-annotations mojo extractor found 1 mojo descriptor.
[INFO]
[INFO] --- maven-resources-plugin:3.1.0:testResources (default-testResources) @ maven-resolver-demo-maven-plugin ---
[INFO] Using 'UTF-8' encoding to copy filtered resources.
[INFO] skip non existing resourceDirectory F:\jenkins\jenkins-slave\workspace\-box_maven-resolver_MRESOLVER-12\m\maven-resolver-demos\maven-resolver-demo-maven-plugin\src\test\resources
[INFO] Copying 3 resources
[INFO]
[INFO] --- maven-compiler-plugin:3.7.0:testCompile (default-testCompile) @ maven-resolver-demo-maven-plugin ---
[INFO] No sources to compile
[INFO]
[INFO] --- maven-surefire-plugin:2.22.0:test (default-test) @ maven-resolver-demo-maven-plugin ---
[INFO]
[INFO] --- maven-jar-plugin:3.1.0:jar (default-jar) @ maven-resolver-demo-maven-plugin ---
[INFO] Building jar: F:\jenkins\jenkins-slave\workspace\-box_maven-resolver_MRESOLVER-12\m\maven-resolver-demos\maven-resolver-demo-maven-plugin\target\maven-resolver-demo-maven-plugin-1.4.0-SNAPSHOT.jar
[INFO]
[INFO] --- maven-plugin-plugin:3.5.2:addPluginArtifactMetadata (default-addPluginArtifactMetadata) @ maven-resolver-demo-maven-plugin ---
[INFO]
[INFO] --- maven-site-plugin:3.7.1:attach-descriptor (attach-descriptor) @ maven-resolver-demo-maven-plugin ---
[INFO] Skipping because packaging 'maven-plugin' is not pom.
[INFO]
[INFO] --- maven-invoker-plugin:3.0.1:install (integration-test) @ maven-resolver-demo-maven-plugin ---
[INFO] Downloading from central: https://repo.maven.apache.org/maven2/org/apache/maven/shared/maven-invoker/3.0.0/maven-invoker-3.0.0.pom
[INFO] Downloaded from central: https://repo.maven.apache.org/maven2/org/apache/maven/shared/maven-invoker/3.0.0/maven-invoker-3.0.0.pom (5.0 kB at 193 kB/s)
[INFO] Downloading from central: https://repo.maven.apache.org/maven2/org/apache/maven/reporting/maven-reporting-impl/2.4/maven-reporting-impl-2.4.pom
[INFO] Downloaded from central: https://repo.maven.apache.org/maven2/org/apache/maven/reporting/maven-reporting-impl/2.4/maven-reporting-impl-2.4.pom (6.1 kB at 233 kB/s)
[INFO] Downloading from central: https://repo.maven.apache.org/maven2/commons-validator/commons-validator/1.4.1/commons-validator-1.4.1.pom
[INFO] Downloaded from central: https://repo.maven.apache.org/maven2/commons-validator/commons-validator/1.4.1/commons-validator-1.4.1.pom (13 kB at 704 kB/s)
[INFO] Downloading from central: https://repo.maven.apache.org/maven2/org/apache/commons/commons-parent/36/commons-parent-36.pom
[INFO] Downloaded from central: https://repo.maven.apache.org/maven2/org/apache/commons/commons-parent/36/commons-parent-36.pom (58 kB at 2.2 MB/s)
[INFO] Downloading from central: https://repo.maven.apache.org/maven2/commons-beanutils/commons-beanutils/1.8.3/commons-beanutils-1.8.3.pom
[INFO] Downloaded from central: https://repo.maven.apache.org/maven2/commons-beanutils/commons-beanutils/1.8.3/commons-beanutils-1.8.3.pom (11 kB at 400 kB/s)
[INFO] Downloading from central: https://repo.maven.apache.org/maven2/org/apache/commons/commons-parent/14/commons-parent-14.pom
[INFO] Downloaded from central: https://repo.maven.apache.org/maven2/org/apache/commons/commons-parent/14/commons-parent-14.pom (31 kB at 1.1 MB/s)
[INFO] Downloading from central: https://repo.maven.apache.org/maven2/commons-digester/commons-digester/1.8.1/commons-digester-1.8.1.pom
[INFO] Downloaded from central: https://repo.maven.apache.org/maven2/commons-digester/commons-digester/1.8.1/commons-digester-1.8.1.pom (10 kB at 528 kB/s)
[INFO] Downloading from central: https://repo.maven.apache.org/maven2/org/apache/maven/shared/maven-script-interpreter/1.2/maven-script-interpreter-1.2.pom
[INFO] Downloaded from central: https://repo.maven.apache.org/maven2/org/apache/maven/shared/maven-script-interpreter/1.2/maven-script-interpreter-1.2.pom (4.0 kB at 143 kB/s)
[INFO] Downloading from central: https://repo.maven.apache.org/maven2/org/apache/ant/ant/1.8.1/ant-1.8.1.pom
[INFO] Downloaded from central: https://repo.maven.apache.org/maven2/org/apache/ant/ant/1.8.1/ant-1.8.1.pom (8.8 kB at 338 kB/s)
[INFO] Downloading from central: https://repo.maven.apache.org/maven2/org/apache/ant/ant-parent/1.8.1/ant-parent-1.8.1.pom
[INFO] Downloaded from central: https://repo.maven.apache.org/maven2/org/apache/ant/ant-parent/1.8.1/ant-parent-1.8.1.pom (4.3 kB at 214 kB/s)
[INFO] Downloading from central: https://repo.maven.apache.org/maven2/org/apache/maven/shared/maven-artifact-transfer/0.9.1/maven-artifact-transfer-0.9.1.pom
[INFO] Downloaded from central: https://repo.maven.apache.org/maven2/org/apache/maven/shared/maven-artifact-transfer/0.9.1/maven-artifact-transfer-0.9.1.pom (7.6 kB at 282 kB/s)
[INFO] Downloading from central: https://repo.maven.apache.org/maven2/org/apache/maven/shared/maven-common-artifact-filters/3.0.1/maven-common-artifact-filters-3.0.1.pom
[INFO] Downloaded from central: https://repo.maven.apache.org/maven2/org/apache/maven/shared/maven-common-artifact-filters/3.0.1/maven-common-artifact-filters-3.0.1.pom (4.8 kB at 193 kB/s)
[INFO] Downloading from central: https://repo.maven.apache.org/maven2/commons-codec/commons-codec/1.6/commons-codec-1.6.pom
[INFO] Downloaded from central: https://repo.maven.apache.org/maven2/commons-codec/commons-codec/1.6/commons-codec-1.6.pom (11 kB at 413 kB/s)
[INFO] Downloading from central: https://repo.maven.apache.org/maven2/org/slf4j/slf4j-api/1.7.5/slf4j-api-1.7.5.pom
[INFO] Downloaded from central: https://repo.maven.apache.org/maven2/org/slf4j/slf4j-api/1.7.5/slf4j-api-1.7.5.pom (2.7 kB at 103 kB/s)
[INFO] Downloading from central: https://repo.maven.apache.org/maven2/org/slf4j/slf4j-parent/1.7.5/slf4j-parent-1.7.5.pom
[INFO] Downloaded from central: https://repo.maven.apache.org/maven2/org/slf4j/slf4j-parent/1.7.5/slf4j-parent-1.7.5.pom (12 kB at 472 kB/s)
[INFO] Downloading from central: https://repo.maven.apache.org/maven2/org/apache/maven/doxia/doxia-sink-api/1.7/doxia-sink-api-1.7.pom
[INFO] Downloaded from central: https://repo.maven.apache.org/maven2/org/apache/maven/doxia/doxia-sink-api/1.7/doxia-sink-api-1.7.pom (1.5 kB at 59 kB/s)
[INFO] Downloading from central: https://repo.maven.apache.org/maven2/org/apache/maven/doxia/doxia/1.7/doxia-1.7.pom
[INFO] Downloaded from central: https://repo.maven.apache.org/maven2/org/apache/maven/doxia/doxia/1.7/doxia-1.7.pom (15 kB at 565 kB/s)
[INFO] Downloading from central: https://repo.maven.apache.org/maven2/org/apache/maven/doxia/doxia-logging-api/1.7/doxia-logging-api-1.7.pom
[INFO] Downloaded from central: https://repo.maven.apache.org/maven2/org/apache/maven/doxia/doxia-logging-api/1.7/doxia-logging-api-1.7.pom (1.5 kB at 73 kB/s)
[INFO] Downloading from central: https://repo.maven.apache.org/maven2/org/apache/maven/doxia/doxia-site-renderer/1.7.4/doxia-site-renderer-1.7.4.pom
[INFO] Downloaded from central: https://repo.maven.apache.org/maven2/org/apache/maven/doxia/doxia-site-renderer/1.7.4/doxia-site-renderer-1.7.4.pom (6.7 kB at 267 kB/s)
[INFO] Downloading from central: https://repo.maven.apache.org/maven2/org/apache/maven/doxia/doxia-sitetools/1.7.4/doxia-sitetools-1.7.4.pom
[INFO] Downloaded from central: https://repo.maven.apache.org/maven2/org/apache/maven/doxia/doxia-sitetools/1.7.4/doxia-sitetools-1.7.4.pom (14 kB at 690 kB/s)
[INFO] Downloading from central: https://repo.maven.apache.org/maven2/org/apache/maven/doxia/doxia-core/1.7/doxia-core-1.7.pom
[INFO] Downloaded from central: https://repo.maven.apache.org/maven2/org/apache/maven/doxia/doxia-core/1.7/doxia-core-1.7.pom (4.1 kB at 150 kB/s)
[INFO] Downloading from central: https://repo.maven.apache.org/maven2/org/apache/maven/doxia/doxia-decoration-model/1.7.4/doxia-decoration-model-1.7.4.pom
[INFO] Downloaded from central: https://repo.maven.apache.org/maven2/org/apache/maven/doxia/doxia-decoration-model/1.7.4/doxia-decoration-model-1.7.4.pom (3.4 kB at 117 kB/s)
[INFO] Downloading from central: https://repo.maven.apache.org/maven2/org/apache/maven/doxia/doxia-skin-model/1.7.4/doxia-skin-model-1.7.4.pom
[INFO] Downloaded from central: https://repo.maven.apache.org/maven2/org/apache/maven/doxia/doxia-skin-model/1.7.4/doxia-skin-model-1.7.4.pom (3.0 kB at 116 kB/s)
[INFO] Downloading from central: https://repo.maven.apache.org/maven2/org/apache/maven/doxia/doxia-module-xhtml/1.7/doxia-module-xhtml-1.7.pom
[INFO] Downloaded from central: https://repo.maven.apache.org/maven2/org/apache/maven/doxia/doxia-module-xhtml/1.7/doxia-module-xhtml-1.7.pom (1.6 kB at 56 kB/s)
[INFO] Downloading from central: https://repo.maven.apache.org/maven2/org/apache/maven/doxia/doxia-modules/1.7/doxia-modules-1.7.pom
[INFO] Downloaded from central: https://repo.maven.apache.org/maven2/org/apache/maven/doxia/doxia-modules/1.7/doxia-modules-1.7.pom (2.6 kB at 90 kB/s)
[INFO] Downloading from central: https://repo.maven.apache.org/maven2/org/codehaus/groovy/groovy-all/2.4.8/groovy-all-2.4.8.pom
[INFO] Downloaded from central: https://repo.maven.apache.org/maven2/org/codehaus/groovy/groovy-all/2.4.8/groovy-all-2.4.8.pom (21 kB at 792 kB/s)
[INFO] Downloading from central: https://repo.maven.apache.org/maven2/org/apache/maven/shared/maven-invoker/3.0.0/maven-invoker-3.0.0.jar
[INFO] Downloading from central: https://repo.maven.apache.org/maven2/commons-digester/commons-digester/1.8.1/commons-digester-1.8.1.jar
[INFO] Downloading from central: https://repo.maven.apache.org/maven2/commons-beanutils/commons-beanutils/1.8.3/commons-beanutils-1.8.3.jar
[INFO] Downloading from central: https://repo.maven.apache.org/maven2/commons-validator/commons-validator/1.4.1/commons-validator-1.4.1.jar
[INFO] Downloading from central: https://repo.maven.apache.org/maven2/org/apache/maven/reporting/maven-reporting-impl/2.4/maven-reporting-impl-2.4.jar
[INFO] Downloaded from central: https://repo.maven.apache.org/maven2/commons-digester/commons-digester/1.8.1/commons-digester-1.8.1.jar (146 kB at 5.2 MB/s)
[INFO] Downloading from central: https://repo.maven.apache.org/maven2/commons-logging/commons-logging/1.2/commons-logging-1.2.jar
[INFO] Downloaded from central: https://repo.maven.apache.org/maven2/commons-beanutils/commons-beanutils/1.8.3/commons-beanutils-1.8.3.jar (232 kB at 6.8 MB/s)
[INFO] Downloaded from central: https://repo.maven.apache.org/maven2/org/apache/maven/shared/maven-invoker/3.0.0/maven-invoker-3.0.0.jar (33 kB at 966 kB/s)
[INFO] Downloaded from central: https://repo.maven.apache.org/maven2/org/apache/maven/reporting/maven-reporting-impl/2.4/maven-reporting-impl-2.4.jar (20 kB at 569 kB/s)
[INFO] Downloading from central: https://repo.maven.apache.org/maven2/org/apache/maven/shared/maven-artifact-transfer/0.9.1/maven-artifact-transfer-0.9.1.jar
[INFO] Downloading from central: https://repo.maven.apache.org/maven2/org/apache/maven/shared/maven-script-interpreter/1.2/maven-script-interpreter-1.2.jar
[INFO] Downloading from central: https://repo.maven.apache.org/maven2/org/apache/ant/ant/1.8.1/ant-1.8.1.jar
[INFO] Downloaded from central: https://repo.maven.apache.org/maven2/commons-validator/commons-validator/1.4.1/commons-validator-1.4.1.jar (190 kB at 4.8 MB/s)
[INFO] Downloading from central: https://repo.maven.apache.org/maven2/org/apache/maven/shared/maven-common-artifact-filters/3.0.1/maven-common-artifact-filters-3.0.1.jar
[INFO] Downloaded from central: https://repo.maven.apache.org/maven2/commons-logging/commons-logging/1.2/commons-logging-1.2.jar (62 kB at 1.1 MB/s)
[INFO] Downloading from central: https://repo.maven.apache.org/maven2/commons-codec/commons-codec/1.6/commons-codec-1.6.jar
[INFO] Downloaded from central: https://repo.maven.apache.org/maven2/org/apache/maven/shared/maven-artifact-transfer/0.9.1/maven-artifact-transfer-0.9.1.jar (123 kB at 2.0 MB/s)
[INFO] Downloaded from central: https://repo.maven.apache.org/maven2/org/apache/maven/shared/maven-common-artifact-filters/3.0.1/maven-common-artifact-filters-3.0.1.jar (61 kB at 975 kB/s)
[INFO] Downloading from central: https://repo.maven.apache.org/maven2/org/slf4j/slf4j-api/1.7.5/slf4j-api-1.7.5.jar
[INFO] Downloading from central: https://repo.maven.apache.org/maven2/org/apache/maven/doxia/doxia-sink-api/1.7/doxia-sink-api-1.7.jar
[INFO] Downloaded from central: https://repo.maven.apache.org/maven2/org/apache/maven/shared/maven-script-interpreter/1.2/maven-script-interpreter-1.2.jar (22 kB at 334 kB/s)
[INFO] Downloading from central: https://repo.maven.apache.org/maven2/org/apache/maven/doxia/doxia-logging-api/1.7/doxia-logging-api-1.7.jar
[INFO] Downloaded from central: https://repo.maven.apache.org/maven2/org/apache/maven/doxia/doxia-logging-api/1.7/doxia-logging-api-1.7.jar (12 kB at 130 kB/s)
[INFO] Downloading from central: https://repo.maven.apache.org/maven2/org/apache/maven/doxia/doxia-site-renderer/1.7.4/doxia-site-renderer-1.7.4.jar
[INFO] Downloaded from central: https://repo.maven.apache.org/maven2/org/apache/maven/doxia/doxia-sink-api/1.7/doxia-sink-api-1.7.jar (11 kB at 120 kB/s)
[INFO] Downloaded from central: https://repo.maven.apache.org/maven2/org/slf4j/slf4j-api/1.7.5/slf4j-api-1.7.5.jar (26 kB at 275 kB/s)
[INFO] Downloaded from central: https://repo.maven.apache.org/maven2/commons-codec/commons-codec/1.6/commons-codec-1.6.jar (233 kB at 2.5 MB/s)
[INFO] Downloading from central: https://repo.maven.apache.org/maven2/org/apache/maven/doxia/doxia-skin-model/1.7.4/doxia-skin-model-1.7.4.jar
[INFO] Downloading from central: https://repo.maven.apache.org/maven2/org/apache/maven/doxia/doxia-decoration-model/1.7.4/doxia-decoration-model-1.7.4.jar
[INFO] Downloading from central: https://repo.maven.apache.org/maven2/org/apache/maven/doxia/doxia-module-xhtml/1.7/doxia-module-xhtml-1.7.jar
[INFO] Downloaded from central: https://repo.maven.apache.org/maven2/org/apache/ant/ant/1.8.1/ant-1.8.1.jar (1.5 MB at 14 MB/s)
[INFO] Downloading from central: https://repo.maven.apache.org/maven2/org/codehaus/groovy/groovy-all/2.4.8/groovy-all-2.4.8.jar
[INFO] Downloaded from central: https://repo.maven.apache.org/maven2/org/apache/maven/doxia/doxia-site-renderer/1.7.4/doxia-site-renderer-1.7.4.jar (64 kB at 528 kB/s)
[INFO] Downloaded from central: https://repo.maven.apache.org/maven2/org/apache/maven/doxia/doxia-module-xhtml/1.7/doxia-module-xhtml-1.7.jar (17 kB at 143 kB/s)
[INFO] Downloaded from central: https://repo.maven.apache.org/maven2/org/apache/maven/doxia/doxia-skin-model/1.7.4/doxia-skin-model-1.7.4.jar (16 kB at 126 kB/s)
[INFO] Downloaded from central: https://repo.maven.apache.org/maven2/org/apache/maven/doxia/doxia-decoration-model/1.7.4/doxia-decoration-model-1.7.4.jar (61 kB at 463 kB/s)
[INFO] Downloaded from central: https://repo.maven.apache.org/maven2/org/codehaus/groovy/groovy-all/2.4.8/groovy-all-2.4.8.jar (7.0 MB at 21 MB/s)
[INFO] Installing f:\jenkins\jenkins-slave\workspace\-box_maven-resolver_MRESOLVER-12\m\pom.xml to F:\jenkins\jenkins-slave\workspace\-box_maven-resolver_MRESOLVER-12\m\maven-resolver-demos\maven-resolver-demo-maven-plugin\target\local-repo\org\apache\maven\resolver\maven-resolver\1.4.0-SNAPSHOT\maven-resolver-1.4.0-SNAPSHOT.pom
[INFO] Installing f:\jenkins\jenkins-slave\workspace\-box_maven-resolver_MRESOLVER-12\m\target\maven-resolver-1.4.0-SNAPSHOT-site.xml to F:\jenkins\jenkins-slave\workspace\-box_maven-resolver_MRESOLVER-12\m\maven-resolver-demos\maven-resolver-demo-maven-plugin\target\local-repo\org\apache\maven\resolver\maven-resolver\1.4.0-SNAPSHOT\maven-resolver-1.4.0-SNAPSHOT-site.xml
[INFO] Installing F:\jenkins\jenkins-slave\workspace\-box_maven-resolver_MRESOLVER-12\m\maven-resolver-api\pom.xml to F:\jenkins\jenkins-slave\workspace\-box_maven-resolver_MRESOLVER-12\m\maven-resolver-demos\maven-resolver-demo-maven-plugin\target\local-repo\org\apache\maven\resolver\maven-resolver-api\1.4.0-SNAPSHOT\maven-resolver-api-1.4.0-SNAPSHOT.pom
[INFO] Installing F:\jenkins\jenkins-slave\workspace\-box_maven-resolver_MRESOLVER-12\m\maven-resolver-api\target\maven-resolver-api-1.4.0-SNAPSHOT.jar to F:\jenkins\jenkins-slave\workspace\-box_maven-resolver_MRESOLVER-12\m\maven-resolver-demos\maven-resolver-demo-maven-plugin\target\local-repo\org\apache\maven\resolver\maven-resolver-api\1.4.0-SNAPSHOT\maven-resolver-api-1.4.0-SNAPSHOT.jar
[INFO] Installing F:\jenkins\jenkins-slave\workspace\-box_maven-resolver_MRESOLVER-12\m\maven-resolver-spi\pom.xml to F:\jenkins\jenkins-slave\workspace\-box_maven-resolver_MRESOLVER-12\m\maven-resolver-demos\maven-resolver-demo-maven-plugin\target\local-repo\org\apache\maven\resolver\maven-resolver-spi\1.4.0-SNAPSHOT\maven-resolver-spi-1.4.0-SNAPSHOT.pom
[INFO] Installing F:\jenkins\jenkins-slave\workspace\-box_maven-resolver_MRESOLVER-12\m\maven-resolver-spi\target\maven-resolver-spi-1.4.0-SNAPSHOT.jar to F:\jenkins\jenkins-slave\workspace\-box_maven-resolver_MRESOLVER-12\m\maven-resolver-demos\maven-resolver-demo-maven-plugin\target\local-repo\org\apache\maven\resolver\maven-resolver-spi\1.4.0-SNAPSHOT\maven-resolver-spi-1.4.0-SNAPSHOT.jar
[INFO] Installing F:\jenkins\jenkins-slave\workspace\-box_maven-resolver_MRESOLVER-12\m\maven-resolver-test-util\pom.xml to F:\jenkins\jenkins-slave\workspace\-box_maven-resolver_MRESOLVER-12\m\maven-resolver-demos\maven-resolver-demo-maven-plugin\target\local-repo\org\apache\maven\resolver\maven-resolver-test-util\1.4.0-SNAPSHOT\maven-resolver-test-util-1.4.0-SNAPSHOT.pom
[INFO] Installing F:\jenkins\jenkins-slave\workspace\-box_maven-resolver_MRESOLVER-12\m\maven-resolver-test-util\target\maven-resolver-test-util-1.4.0-SNAPSHOT.jar to F:\jenkins\jenkins-slave\workspace\-box_maven-resolver_MRESOLVER-12\m\maven-resolver-demos\maven-resolver-demo-maven-plugin\target\local-repo\org\apache\maven\resolver\maven-resolver-test-util\1.4.0-SNAPSHOT\maven-resolver-test-util-1.4.0-SNAPSHOT.jar
[INFO] Installing F:\jenkins\jenkins-slave\workspace\-box_maven-resolver_MRESOLVER-12\m\maven-resolver-util\pom.xml to F:\jenkins\jenkins-slave\workspace\-box_maven-resolver_MRESOLVER-12\m\maven-resolver-demos\maven-resolver-demo-maven-plugin\target\local-repo\org\apache\maven\resolver\maven-resolver-util\1.4.0-SNAPSHOT\maven-resolver-util-1.4.0-SNAPSHOT.pom
[INFO] Installing F:\jenkins\jenkins-slave\workspace\-box_maven-resolver_MRESOLVER-12\m\maven-resolver-util\target\maven-resolver-util-1.4.0-SNAPSHOT.jar to F:\jenkins\jenkins-slave\workspace\-box_maven-resolver_MRESOLVER-12\m\maven-resolver-demos\maven-resolver-demo-maven-plugin\target\local-repo\org\apache\maven\resolver\maven-resolver-util\1.4.0-SNAPSHOT\maven-resolver-util-1.4.0-SNAPSHOT.jar
[INFO] Installing F:\jenkins\jenkins-slave\workspace\-box_maven-resolver_MRESOLVER-12\m\maven-resolver-impl\pom.xml to F:\jenkins\jenkins-slave\workspace\-box_maven-resolver_MRESOLVER-12\m\maven-resolver-demos\maven-resolver-demo-maven-plugin\target\local-repo\org\apache\maven\resolver\maven-resolver-impl\1.4.0-SNAPSHOT\maven-resolver-impl-1.4.0-SNAPSHOT.pom
[INFO] Installing F:\jenkins\jenkins-slave\workspace\-box_maven-resolver_MRESOLVER-12\m\maven-resolver-impl\target\maven-resolver-impl-1.4.0-SNAPSHOT.jar to F:\jenkins\jenkins-slave\workspace\-box_maven-resolver_MRESOLVER-12\m\maven-resolver-demos\maven-resolver-demo-maven-plugin\target\local-repo\org\apache\maven\resolver\maven-resolver-impl\1.4.0-SNAPSHOT\maven-resolver-impl-1.4.0-SNAPSHOT.jar
[INFO] Installing F:\jenkins\jenkins-slave\workspace\-box_maven-resolver_MRESOLVER-12\m\maven-resolver-connector-basic\pom.xml to F:\jenkins\jenkins-slave\workspace\-box_maven-resolver_MRESOLVER-12\m\maven-resolver-demos\maven-resolver-demo-maven-plugin\target\local-repo\org\apache\maven\resolver\maven-resolver-connector-basic\1.4.0-SNAPSHOT\maven-resolver-connector-basic-1.4.0-SNAPSHOT.pom
[INFO] Installing F:\jenkins\jenkins-slave\workspace\-box_maven-resolver_MRESOLVER-12\m\maven-resolver-connector-basic\target\maven-resolver-connector-basic-1.4.0-SNAPSHOT.jar to F:\jenkins\jenkins-slave\workspace\-box_maven-resolver_MRESOLVER-12\m\maven-resolver-demos\maven-resolver-demo-maven-plugin\target\local-repo\org\apache\maven\resolver\maven-resolver-connector-basic\1.4.0-SNAPSHOT\maven-resolver-connector-basic-1.4.0-SNAPSHOT.jar
[INFO] Installing F:\jenkins\jenkins-slave\workspace\-box_maven-resolver_MRESOLVER-12\m\maven-resolver-transport-classpath\pom.xml to F:\jenkins\jenkins-slave\workspace\-box_maven-resolver_MRESOLVER-12\m\maven-resolver-demos\maven-resolver-demo-maven-plugin\target\local-repo\org\apache\maven\resolver\maven-resolver-transport-classpath\1.4.0-SNAPSHOT\maven-resolver-transport-classpath-1.4.0-SNAPSHOT.pom
[INFO] Installing F:\jenkins\jenkins-slave\workspace\-box_maven-resolver_MRESOLVER-12\m\maven-resolver-transport-classpath\target\maven-resolver-transport-classpath-1.4.0-SNAPSHOT.jar to F:\jenkins\jenkins-slave\workspace\-box_maven-resolver_MRESOLVER-12\m\maven-resolver-demos\maven-resolver-demo-maven-plugin\target\local-repo\org\apache\maven\resolver\maven-resolver-transport-classpath\1.4.0-SNAPSHOT\maven-resolver-transport-classpath-1.4.0-SNAPSHOT.jar
[INFO] Installing F:\jenkins\jenkins-slave\workspace\-box_maven-resolver_MRESOLVER-12\m\maven-resolver-transport-file\pom.xml to F:\jenkins\jenkins-slave\workspace\-box_maven-resolver_MRESOLVER-12\m\maven-resolver-demos\maven-resolver-demo-maven-plugin\target\local-repo\org\apache\maven\resolver\maven-resolver-transport-file\1.4.0-SNAPSHOT\maven-resolver-transport-file-1.4.0-SNAPSHOT.pom
[INFO] Installing F:\jenkins\jenkins-slave\workspace\-box_maven-resolver_MRESOLVER-12\m\maven-resolver-transport-file\target\maven-resolver-transport-file-1.4.0-SNAPSHOT.jar to F:\jenkins\jenkins-slave\workspace\-box_maven-resolver_MRESOLVER-12\m\maven-resolver-demos\maven-resolver-demo-maven-plugin\target\local-repo\org\apache\maven\resolver\maven-resolver-transport-file\1.4.0-SNAPSHOT\maven-resolver-transport-file-1.4.0-SNAPSHOT.jar
[INFO] Installing F:\jenkins\jenkins-slave\workspace\-box_maven-resolver_MRESOLVER-12\m\maven-resolver-transport-http\pom.xml to F:\jenkins\jenkins-slave\workspace\-box_maven-resolver_MRESOLVER-12\m\maven-resolver-demos\maven-resolver-demo-maven-plugin\target\local-repo\org\apache\maven\resolver\maven-resolver-transport-http\1.4.0-SNAPSHOT\maven-resolver-transport-http-1.4.0-SNAPSHOT.pom
[INFO] Installing F:\jenkins\jenkins-slave\workspace\-box_maven-resolver_MRESOLVER-12\m\maven-resolver-transport-http\target\maven-resolver-transport-http-1.4.0-SNAPSHOT.jar to F:\jenkins\jenkins-slave\workspace\-box_maven-resolver_MRESOLVER-12\m\maven-resolver-demos\maven-resolver-demo-maven-plugin\target\local-repo\org\apache\maven\resolver\maven-resolver-transport-http\1.4.0-SNAPSHOT\maven-resolver-transport-http-1.4.0-SNAPSHOT.jar
[INFO] Installing F:\jenkins\jenkins-slave\workspace\-box_maven-resolver_MRESOLVER-12\m\maven-resolver-transport-wagon\pom.xml to F:\jenkins\jenkins-slave\workspace\-box_maven-resolver_MRESOLVER-12\m\maven-resolver-demos\maven-resolver-demo-maven-plugin\target\local-repo\org\apache\maven\resolver\maven-resolver-transport-wagon\1.4.0-SNAPSHOT\maven-resolver-transport-wagon-1.4.0-SNAPSHOT.pom
[INFO] Installing F:\jenkins\jenkins-slave\workspace\-box_maven-resolver_MRESOLVER-12\m\maven-resolver-transport-wagon\target\maven-resolver-transport-wagon-1.4.0-SNAPSHOT.jar to F:\jenkins\jenkins-slave\workspace\-box_maven-resolver_MRESOLVER-12\m\maven-resolver-demos\maven-resolver-demo-maven-plugin\target\local-repo\org\apache\maven\resolver\maven-resolver-transport-wagon\1.4.0-SNAPSHOT\maven-resolver-transport-wagon-1.4.0-SNAPSHOT.jar
[INFO] Installing F:\jenkins\jenkins-slave\workspace\-box_maven-resolver_MRESOLVER-12\m\maven-resolver-demos\pom.xml to F:\jenkins\jenkins-slave\workspace\-box_maven-resolver_MRESOLVER-12\m\maven-resolver-demos\maven-resolver-demo-maven-plugin\target\local-repo\org\apache\maven\resolver\maven-resolver-demos\1.4.0-SNAPSHOT\maven-resolver-demos-1.4.0-SNAPSHOT.pom
[INFO] Installing F:\jenkins\jenkins-slave\workspace\-box_maven-resolver_MRESOLVER-12\m\maven-resolver-demos\target\maven-resolver-demos-1.4.0-SNAPSHOT-site.xml to F:\jenkins\jenkins-slave\workspace\-box_maven-resolver_MRESOLVER-12\m\maven-resolver-demos\maven-resolver-demo-maven-plugin\target\local-repo\org\apache\maven\resolver\maven-resolver-demos\1.4.0-SNAPSHOT\maven-resolver-demos-1.4.0-SNAPSHOT-site.xml
[INFO] Installing F:\jenkins\jenkins-slave\workspace\-box_maven-resolver_MRESOLVER-12\m\maven-resolver-demos\maven-resolver-demo-snippets\pom.xml to F:\jenkins\jenkins-slave\workspace\-box_maven-resolver_MRESOLVER-12\m\maven-resolver-demos\maven-resolver-demo-maven-plugin\target\local-repo\org\apache\maven\resolver\maven-resolver-demo-snippets\1.4.0-SNAPSHOT\maven-resolver-demo-snippets-1.4.0-SNAPSHOT.pom
[INFO] Installing F:\jenkins\jenkins-slave\workspace\-box_maven-resolver_MRESOLVER-12\m\maven-resolver-demos\maven-resolver-demo-snippets\target\maven-resolver-demo-snippets-1.4.0-SNAPSHOT.jar to F:\jenkins\jenkins-slave\workspace\-box_maven-resolver_MRESOLVER-12\m\maven-resolver-demos\maven-resolver-demo-maven-plugin\target\local-repo\org\apache\maven\resolver\maven-resolver-demo-snippets\1.4.0-SNAPSHOT\maven-resolver-demo-snippets-1.4.0-SNAPSHOT.jar
[INFO] Installing F:\jenkins\jenkins-slave\workspace\-box_maven-resolver_MRESOLVER-12\m\maven-resolver-demos\maven-resolver-demo-maven-plugin\pom.xml to F:\jenkins\jenkins-slave\workspace\-box_maven-resolver_MRESOLVER-12\m\maven-resolver-demos\maven-resolver-demo-maven-plugin\target\local-repo\org\apache\maven\resolver\maven-resolver-demo-maven-plugin\1.4.0-SNAPSHOT\maven-resolver-demo-maven-plugin-1.4.0-SNAPSHOT.pom
[INFO] Installing F:\jenkins\jenkins-slave\workspace\-box_maven-resolver_MRESOLVER-12\m\maven-resolver-demos\maven-resolver-demo-maven-plugin\target\maven-resolver-demo-maven-plugin-1.4.0-SNAPSHOT.jar to F:\jenkins\jenkins-slave\workspace\-box_maven-resolver_MRESOLVER-12\m\maven-resolver-demos\maven-resolver-demo-maven-plugin\target\local-repo\org\apache\maven\resolver\maven-resolver-demo-maven-plugin\1.4.0-SNAPSHOT\maven-resolver-demo-maven-plugin-1.4.0-SNAPSHOT.jar
[INFO]
[INFO] --- maven-invoker-plugin:3.0.1:run (integration-test) @ maven-resolver-demo-maven-plugin ---
[INFO] Running Setup Jobs
[INFO] Building: resolve-artifact\pom.xml
[INFO]           resolve-artifact\pom.xml ......................... SUCCESS (4.6 s)
[INFO] -------------------------------------------------
[INFO] Build Summary:
[INFO]   Passed: 1, Failed: 0, Errors: 0, Skipped: 0
[INFO] -------------------------------------------------
[INFO]
[INFO] --- maven-checkstyle-plugin:3.0.0:check (checkstyle-check) @ maven-resolver-demo-maven-plugin ---
[INFO] ------------------------------------------------------------------------
[INFO] Reactor Summary for Maven Artifact Resolver 1.4.0-SNAPSHOT:
[INFO]
[INFO] Maven Artifact Resolver ............................ SUCCESS [ 37.825 s]
[INFO] Maven Artifact Resolver API ........................ SUCCESS [ 20.535 s]
[INFO] Maven Artifact Resolver SPI ........................ SUCCESS [  2.938 s]
[INFO] Maven Artifact Resolver Test Utilities ............. SUCCESS [  3.753 s]
[INFO] Maven Artifact Resolver Utilities .................. SUCCESS [  8.621 s]
[INFO] Maven Artifact Resolver Implementation ............. SUCCESS [ 22.282 s]
[INFO] Maven Artifact Resolver Connector Basic ............ SUCCESS [  8.144 s]
[INFO] Maven Artifact Resolver Transport Classpath ........ SUCCESS [  2.790 s]
[INFO] Maven Artifact Resolver Transport File ............. SUCCESS [  3.138 s]
[INFO] Maven Artifact Resolver Transport HTTP ............. SUCCESS [ 12.747 s]
[INFO] Maven Artifact Resolver Transport Wagon ............ SUCCESS [  6.038 s]
[INFO] Maven Artifact Resolver Demos ...................... SUCCESS [  0.348 s]
[INFO] Maven Artifact Resolver Demo Snippets .............. SUCCESS [  2.995 s]
[INFO] Maven Artifact Resolver Demo Maven Plugin .......... SUCCESS [ 12.674 s]
[INFO] ------------------------------------------------------------------------
[INFO] BUILD SUCCESS
[INFO] ------------------------------------------------------------------------
[INFO] Total time:  02:26 min
[INFO] Finished at: 2020-03-18T16:32:10-07:00
[INFO] ------------------------------------------------------------------------
[INFO] [jenkins-event-spy] Generated F:\jenkins\jenkins-slave\workspace\-box_maven-resolver_MRESOLVER-12@tmp\withMaven0cc6949c\maven-spy-20200318-162943-7799761285462807872903.log
[Pipeline] }
[Pipeline] // dir
[Pipeline] }
[withMaven] invokerPublisher - Archive invoker results for Maven artifact MavenArtifact{org.apache.maven.resolver:maven-resolver-demo-maven-plugin:maven-plugin:1.4.0-SNAPSHOT(version: 1.4.0-SNAPSHOT, snapshot:false) } generated by PluginInvocation{org.apache.maven.plugins:maven-invoker-plugin:3.0.1@run  integration-test}: m\maven-resolver-demos\maven-resolver-demo-maven-plugin\target\invoker-reports\*.xml
[withMaven] junitPublisher - Archive test results for Maven artifact org.apache.maven.resolver:maven-resolver-api:jar:1.4.0-SNAPSHOT generated by maven-surefire-plugin:test (default-test): m\maven-resolver-api\target\surefire-reports\*.xml
[withMaven] junitPublisher - Archive test results for Maven artifact org.apache.maven.resolver:maven-resolver-spi:jar:1.4.0-SNAPSHOT generated by maven-surefire-plugin:test (default-test): m\maven-resolver-spi\target\surefire-reports\*.xml
[withMaven] junitPublisher - Archive test results for Maven artifact org.apache.maven.resolver:maven-resolver-test-util:jar:1.4.0-SNAPSHOT generated by maven-surefire-plugin:test (default-test): m\maven-resolver-test-util\target\surefire-reports\*.xml
[withMaven] junitPublisher - Archive test results for Maven artifact org.apache.maven.resolver:maven-resolver-util:jar:1.4.0-SNAPSHOT generated by maven-surefire-plugin:test (default-test): m\maven-resolver-util\target\surefire-reports\*.xml
[withMaven] junitPublisher - Archive test results for Maven artifact org.apache.maven.resolver:maven-resolver-impl:jar:1.4.0-SNAPSHOT generated by maven-surefire-plugin:test (default-test): m\maven-resolver-impl\target\surefire-reports\*.xml
[withMaven] junitPublisher - Archive test results for Maven artifact org.apache.maven.resolver:maven-resolver-connector-basic:jar:1.4.0-SNAPSHOT generated by maven-surefire-plugin:test (default-test): m\maven-resolver-connector-basic\target\surefire-reports\*.xml
[withMaven] junitPublisher - Archive test results for Maven artifact org.apache.maven.resolver:maven-resolver-transport-classpath:jar:1.4.0-SNAPSHOT generated by maven-surefire-plugin:test (default-test): m\maven-resolver-transport-classpath\target\surefire-reports\*.xml
[withMaven] junitPublisher - Archive test results for Maven artifact org.apache.maven.resolver:maven-resolver-transport-file:jar:1.4.0-SNAPSHOT generated by maven-surefire-plugin:test (default-test): m\maven-resolver-transport-file\target\surefire-reports\*.xml
[withMaven] junitPublisher - Archive test results for Maven artifact org.apache.maven.resolver:maven-resolver-transport-http:jar:1.4.0-SNAPSHOT generated by maven-surefire-plugin:test (default-test): m\maven-resolver-transport-http\target\surefire-reports\*.xml
[withMaven] junitPublisher - Archive test results for Maven artifact org.apache.maven.resolver:maven-resolver-transport-wagon:jar:1.4.0-SNAPSHOT generated by maven-surefire-plugin:test (default-test): m\maven-resolver-transport-wagon\target\surefire-reports\*.xml
[withMaven] junitPublisher - Archive test results for Maven artifact org.apache.maven.resolver:maven-resolver-demo-snippets:jar:1.4.0-SNAPSHOT generated by maven-surefire-plugin:test (default-test): m\maven-resolver-demos\maven-resolver-demo-snippets\target\surefire-reports\*.xml
[withMaven] junitPublisher - Archive test results for Maven artifact org.apache.maven.resolver:maven-resolver-demo-maven-plugin:maven-plugin:1.4.0-SNAPSHOT generated by maven-surefire-plugin:test (default-test): m\maven-resolver-demos\maven-resolver-demo-maven-plugin\target\surefire-reports\*.xml
Recording test results
[withMaven] Publishers: Pipeline Graph Publisher: 5 ms, Invoker Publisher: 957 ms, Junit Publisher: 2856 ms, Concordion Publisher: 1 ms, Dependencies Fingerprint Publisher: 427 ms
[Pipeline] // withMaven
[Pipeline] cleanWs
[WS-CLEANUP] Deleting project workspace...
[WS-CLEANUP] Deferred wipeout is used...
[WS-CLEANUP] done
[Pipeline] }
[Pipeline] // stage
[Pipeline] }
[Pipeline] // node
[Pipeline] }
[Pipeline] // parallel
[Pipeline] stage
[Pipeline] { (Notifications)
[Pipeline] echo
Build result: UNSTABLE
[Pipeline] jiraIssueSelector
[Pipeline] echo
The authors of changes [rfscholte].
[Pipeline] echo
Sending email ...
[Pipeline] emailext
Reply | Threaded
Open this post in threaded view
|

Build unstable in Jenkins: Maven TLP » maven-resolver » MRESOLVER-12 #25

Apache Jenkins Server-2
See https://builds.apache.org/job/maven-box/job/maven-resolver/job/MRESOLVER-12/25/

Changes:

* Java 14 released, so Java 13 EOL. Include Java 15-ea

20 tests failed.
FAILED:  org.eclipse.aether.internal.impl.collect.DefaultDependencyCollectorTest.linux-jdk7 / Build linux-jdk7 / testSelectionWithScopeDependencySelector

Error Message:
path: [gid:root:ext:ver (root-scope)], expected: [gid:direct:ext:ver (direct-scope)], actual: [] expected:<1> but was:<0>

Stack Trace:
java.lang.AssertionError: path: [gid:root:ext:ver (root-scope)], expected: [gid:direct:ext:ver (direct-scope)], actual: [] expected:<1> but was:<0>
        at org.eclipse.aether.internal.impl.collect.DefaultDependencyCollectorTest.assertEqualSubtree(DefaultDependencyCollectorTest.java:145)
        at org.eclipse.aether.internal.impl.collect.DefaultDependencyCollectorTest.assertEqualSubtree(DefaultDependencyCollectorTest.java:123)
        at org.eclipse.aether.internal.impl.collect.DefaultDependencyCollectorTest.testSelectionWithScopeDependencySelector(DefaultDependencyCollectorTest.java:717)


FAILED:  org.eclipse.aether.internal.impl.collect.DefaultDependencyCollectorTest.linux-jdk7 / Build linux-jdk7 / testDependencyManagement_DependencySelectorProcessesManagedState

Error Message:
path: [gid:root:ext:ver (root-scope), gid:direct-of-root:ext:ver (direct-of-root-scope), gid:transitive-of-root:ext:ver (transitive-of-root-scope)], expected: [], actual: [gid:transitive-of-transitive-of-root:ext:ver (managed)] expected:<0> but was:<1>

Stack Trace:
java.lang.AssertionError: path: [gid:root:ext:ver (root-scope), gid:direct-of-root:ext:ver (direct-of-root-scope), gid:transitive-of-root:ext:ver (transitive-of-root-scope)], expected: [], actual: [gid:transitive-of-transitive-of-root:ext:ver (managed)] expected:<0> but was:<1>
        at org.eclipse.aether.internal.impl.collect.DefaultDependencyCollectorTest.assertEqualSubtree(DefaultDependencyCollectorTest.java:145)
        at org.eclipse.aether.internal.impl.collect.DefaultDependencyCollectorTest.assertEqualSubtree(DefaultDependencyCollectorTest.java:153)
        at org.eclipse.aether.internal.impl.collect.DefaultDependencyCollectorTest.assertEqualSubtree(DefaultDependencyCollectorTest.java:153)
        at org.eclipse.aether.internal.impl.collect.DefaultDependencyCollectorTest.assertEqualSubtree(DefaultDependencyCollectorTest.java:123)
        at org.eclipse.aether.internal.impl.collect.DefaultDependencyCollectorTest.testDependencyManagement_DependencySelectorProcessesManagedState(DefaultDependencyCollectorTest.java:591)


FAILED:  org.eclipse.aether.internal.impl.collect.DefaultDependencyCollectorTest.linux-jdk8 / Build linux-jdk8 / testSelectionWithScopeDependencySelector

Error Message:
path: [gid:root:ext:ver (root-scope)], expected: [gid:direct:ext:ver (direct-scope)], actual: [] expected:<1> but was:<0>

Stack Trace:
java.lang.AssertionError: path: [gid:root:ext:ver (root-scope)], expected: [gid:direct:ext:ver (direct-scope)], actual: [] expected:<1> but was:<0>
        at org.eclipse.aether.internal.impl.collect.DefaultDependencyCollectorTest.assertEqualSubtree(DefaultDependencyCollectorTest.java:145)
        at org.eclipse.aether.internal.impl.collect.DefaultDependencyCollectorTest.assertEqualSubtree(DefaultDependencyCollectorTest.java:123)
        at org.eclipse.aether.internal.impl.collect.DefaultDependencyCollectorTest.testSelectionWithScopeDependencySelector(DefaultDependencyCollectorTest.java:717)


FAILED:  org.eclipse.aether.internal.impl.collect.DefaultDependencyCollectorTest.linux-jdk8 / Build linux-jdk8 / testDependencyManagement_DependencySelectorProcessesManagedState

Error Message:
path: [gid:root:ext:ver (root-scope), gid:direct-of-root:ext:ver (direct-of-root-scope), gid:transitive-of-root:ext:ver (transitive-of-root-scope)], expected: [], actual: [gid:transitive-of-transitive-of-root:ext:ver (managed)] expected:<0> but was:<1>

Stack Trace:
java.lang.AssertionError: path: [gid:root:ext:ver (root-scope), gid:direct-of-root:ext:ver (direct-of-root-scope), gid:transitive-of-root:ext:ver (transitive-of-root-scope)], expected: [], actual: [gid:transitive-of-transitive-of-root:ext:ver (managed)] expected:<0> but was:<1>
        at org.eclipse.aether.internal.impl.collect.DefaultDependencyCollectorTest.assertEqualSubtree(DefaultDependencyCollectorTest.java:145)
        at org.eclipse.aether.internal.impl.collect.DefaultDependencyCollectorTest.assertEqualSubtree(DefaultDependencyCollectorTest.java:153)
        at org.eclipse.aether.internal.impl.collect.DefaultDependencyCollectorTest.assertEqualSubtree(DefaultDependencyCollectorTest.java:153)
        at org.eclipse.aether.internal.impl.collect.DefaultDependencyCollectorTest.assertEqualSubtree(DefaultDependencyCollectorTest.java:123)
        at org.eclipse.aether.internal.impl.collect.DefaultDependencyCollectorTest.testDependencyManagement_DependencySelectorProcessesManagedState(DefaultDependencyCollectorTest.java:591)


FAILED:  org.eclipse.aether.internal.impl.collect.DefaultDependencyCollectorTest.linux-jdk11 / Build linux-jdk11 / testSelectionWithScopeDependencySelector

Error Message:
path: [gid:root:ext:ver (root-scope)], expected: [gid:direct:ext:ver (direct-scope)], actual: [] expected:<1> but was:<0>

Stack Trace:
java.lang.AssertionError: path: [gid:root:ext:ver (root-scope)], expected: [gid:direct:ext:ver (direct-scope)], actual: [] expected:<1> but was:<0>
        at org.eclipse.aether.internal.impl.collect.DefaultDependencyCollectorTest.assertEqualSubtree(DefaultDependencyCollectorTest.java:145)
        at org.eclipse.aether.internal.impl.collect.DefaultDependencyCollectorTest.assertEqualSubtree(DefaultDependencyCollectorTest.java:123)
        at org.eclipse.aether.internal.impl.collect.DefaultDependencyCollectorTest.testSelectionWithScopeDependencySelector(DefaultDependencyCollectorTest.java:717)


FAILED:  org.eclipse.aether.internal.impl.collect.DefaultDependencyCollectorTest.linux-jdk11 / Build linux-jdk11 / testDependencyManagement_DependencySelectorProcessesManagedState

Error Message:
path: [gid:root:ext:ver (root-scope), gid:direct-of-root:ext:ver (direct-of-root-scope), gid:transitive-of-root:ext:ver (transitive-of-root-scope)], expected: [], actual: [gid:transitive-of-transitive-of-root:ext:ver (managed)] expected:<0> but was:<1>

Stack Trace:
java.lang.AssertionError: path: [gid:root:ext:ver (root-scope), gid:direct-of-root:ext:ver (direct-of-root-scope), gid:transitive-of-root:ext:ver (transitive-of-root-scope)], expected: [], actual: [gid:transitive-of-transitive-of-root:ext:ver (managed)] expected:<0> but was:<1>
        at org.eclipse.aether.internal.impl.collect.DefaultDependencyCollectorTest.assertEqualSubtree(DefaultDependencyCollectorTest.java:145)
        at org.eclipse.aether.internal.impl.collect.DefaultDependencyCollectorTest.assertEqualSubtree(DefaultDependencyCollectorTest.java:153)
        at org.eclipse.aether.internal.impl.collect.DefaultDependencyCollectorTest.assertEqualSubtree(DefaultDependencyCollectorTest.java:153)
        at org.eclipse.aether.internal.impl.collect.DefaultDependencyCollectorTest.assertEqualSubtree(DefaultDependencyCollectorTest.java:123)
        at org.eclipse.aether.internal.impl.collect.DefaultDependencyCollectorTest.testDependencyManagement_DependencySelectorProcessesManagedState(DefaultDependencyCollectorTest.java:591)


FAILED:  org.eclipse.aether.internal.impl.collect.DefaultDependencyCollectorTest.linux-jdk14 / Build linux-jdk14 / testSelectionWithScopeDependencySelector

Error Message:
path: [gid:root:ext:ver (root-scope)], expected: [gid:direct:ext:ver (direct-scope)], actual: [] expected:<1> but was:<0>

Stack Trace:
java.lang.AssertionError: path: [gid:root:ext:ver (root-scope)], expected: [gid:direct:ext:ver (direct-scope)], actual: [] expected:<1> but was:<0>
        at org.eclipse.aether.internal.impl.collect.DefaultDependencyCollectorTest.assertEqualSubtree(DefaultDependencyCollectorTest.java:145)
        at org.eclipse.aether.internal.impl.collect.DefaultDependencyCollectorTest.assertEqualSubtree(DefaultDependencyCollectorTest.java:123)
        at org.eclipse.aether.internal.impl.collect.DefaultDependencyCollectorTest.testSelectionWithScopeDependencySelector(DefaultDependencyCollectorTest.java:717)


FAILED:  org.eclipse.aether.internal.impl.collect.DefaultDependencyCollectorTest.linux-jdk14 / Build linux-jdk14 / testDependencyManagement_DependencySelectorProcessesManagedState

Error Message:
path: [gid:root:ext:ver (root-scope), gid:direct-of-root:ext:ver (direct-of-root-scope), gid:transitive-of-root:ext:ver (transitive-of-root-scope)], expected: [], actual: [gid:transitive-of-transitive-of-root:ext:ver (managed)] expected:<0> but was:<1>

Stack Trace:
java.lang.AssertionError: path: [gid:root:ext:ver (root-scope), gid:direct-of-root:ext:ver (direct-of-root-scope), gid:transitive-of-root:ext:ver (transitive-of-root-scope)], expected: [], actual: [gid:transitive-of-transitive-of-root:ext:ver (managed)] expected:<0> but was:<1>
        at org.eclipse.aether.internal.impl.collect.DefaultDependencyCollectorTest.assertEqualSubtree(DefaultDependencyCollectorTest.java:145)
        at org.eclipse.aether.internal.impl.collect.DefaultDependencyCollectorTest.assertEqualSubtree(DefaultDependencyCollectorTest.java:153)
        at org.eclipse.aether.internal.impl.collect.DefaultDependencyCollectorTest.assertEqualSubtree(DefaultDependencyCollectorTest.java:153)
        at org.eclipse.aether.internal.impl.collect.DefaultDependencyCollectorTest.assertEqualSubtree(DefaultDependencyCollectorTest.java:123)
        at org.eclipse.aether.internal.impl.collect.DefaultDependencyCollectorTest.testDependencyManagement_DependencySelectorProcessesManagedState(DefaultDependencyCollectorTest.java:591)


FAILED:  org.eclipse.aether.internal.impl.collect.DefaultDependencyCollectorTest.linux-jdk15 / Build linux-jdk15 / testSelectionWithScopeDependencySelector

Error Message:
path: [gid:root:ext:ver (root-scope)], expected: [gid:direct:ext:ver (direct-scope)], actual: [] expected:<1> but was:<0>

Stack Trace:
java.lang.AssertionError: path: [gid:root:ext:ver (root-scope)], expected: [gid:direct:ext:ver (direct-scope)], actual: [] expected:<1> but was:<0>
        at org.eclipse.aether.internal.impl.collect.DefaultDependencyCollectorTest.assertEqualSubtree(DefaultDependencyCollectorTest.java:145)
        at org.eclipse.aether.internal.impl.collect.DefaultDependencyCollectorTest.assertEqualSubtree(DefaultDependencyCollectorTest.java:123)
        at org.eclipse.aether.internal.impl.collect.DefaultDependencyCollectorTest.testSelectionWithScopeDependencySelector(DefaultDependencyCollectorTest.java:717)


FAILED:  org.eclipse.aether.internal.impl.collect.DefaultDependencyCollectorTest.linux-jdk15 / Build linux-jdk15 / testDependencyManagement_DependencySelectorProcessesManagedState

Error Message:
path: [gid:root:ext:ver (root-scope), gid:direct-of-root:ext:ver (direct-of-root-scope), gid:transitive-of-root:ext:ver (transitive-of-root-scope)], expected: [], actual: [gid:transitive-of-transitive-of-root:ext:ver (managed)] expected:<0> but was:<1>

Stack Trace:
java.lang.AssertionError: path: [gid:root:ext:ver (root-scope), gid:direct-of-root:ext:ver (direct-of-root-scope), gid:transitive-of-root:ext:ver (transitive-of-root-scope)], expected: [], actual: [gid:transitive-of-transitive-of-root:ext:ver (managed)] expected:<0> but was:<1>
        at org.eclipse.aether.internal.impl.collect.DefaultDependencyCollectorTest.assertEqualSubtree(DefaultDependencyCollectorTest.java:145)
        at org.eclipse.aether.internal.impl.collect.DefaultDependencyCollectorTest.assertEqualSubtree(DefaultDependencyCollectorTest.java:153)
        at org.eclipse.aether.internal.impl.collect.DefaultDependencyCollectorTest.assertEqualSubtree(DefaultDependencyCollectorTest.java:153)
        at org.eclipse.aether.internal.impl.collect.DefaultDependencyCollectorTest.assertEqualSubtree(DefaultDependencyCollectorTest.java:123)
        at org.eclipse.aether.internal.impl.collect.DefaultDependencyCollectorTest.testDependencyManagement_DependencySelectorProcessesManagedState(DefaultDependencyCollectorTest.java:591)


FAILED:  org.eclipse.aether.internal.impl.collect.DefaultDependencyCollectorTest.windows-jdk7 / Build windows-jdk7 / testSelectionWithScopeDependencySelector

Error Message:
path: [gid:root:ext:ver (root-scope)], expected: [gid:direct:ext:ver (direct-scope)], actual: [] expected:<1> but was:<0>

Stack Trace:
java.lang.AssertionError: path: [gid:root:ext:ver (root-scope)], expected: [gid:direct:ext:ver (direct-scope)], actual: [] expected:<1> but was:<0>
        at org.eclipse.aether.internal.impl.collect.DefaultDependencyCollectorTest.assertEqualSubtree(DefaultDependencyCollectorTest.java:145)
        at org.eclipse.aether.internal.impl.collect.DefaultDependencyCollectorTest.assertEqualSubtree(DefaultDependencyCollectorTest.java:123)
        at org.eclipse.aether.internal.impl.collect.DefaultDependencyCollectorTest.testSelectionWithScopeDependencySelector(DefaultDependencyCollectorTest.java:717)


FAILED:  org.eclipse.aether.internal.impl.collect.DefaultDependencyCollectorTest.windows-jdk7 / Build windows-jdk7 / testDependencyManagement_DependencySelectorProcessesManagedState

Error Message:
path: [gid:root:ext:ver (root-scope), gid:direct-of-root:ext:ver (direct-of-root-scope), gid:transitive-of-root:ext:ver (transitive-of-root-scope)], expected: [], actual: [gid:transitive-of-transitive-of-root:ext:ver (managed)] expected:<0> but was:<1>

Stack Trace:
java.lang.AssertionError: path: [gid:root:ext:ver (root-scope), gid:direct-of-root:ext:ver (direct-of-root-scope), gid:transitive-of-root:ext:ver (transitive-of-root-scope)], expected: [], actual: [gid:transitive-of-transitive-of-root:ext:ver (managed)] expected:<0> but was:<1>
        at org.eclipse.aether.internal.impl.collect.DefaultDependencyCollectorTest.assertEqualSubtree(DefaultDependencyCollectorTest.java:145)
        at org.eclipse.aether.internal.impl.collect.DefaultDependencyCollectorTest.assertEqualSubtree(DefaultDependencyCollectorTest.java:153)
        at org.eclipse.aether.internal.impl.collect.DefaultDependencyCollectorTest.assertEqualSubtree(DefaultDependencyCollectorTest.java:153)
        at org.eclipse.aether.internal.impl.collect.DefaultDependencyCollectorTest.assertEqualSubtree(DefaultDependencyCollectorTest.java:123)
        at org.eclipse.aether.internal.impl.collect.DefaultDependencyCollectorTest.testDependencyManagement_DependencySelectorProcessesManagedState(DefaultDependencyCollectorTest.java:591)


FAILED:  org.eclipse.aether.internal.impl.collect.DefaultDependencyCollectorTest.windows-jdk8 / Build windows-jdk8 / testSelectionWithScopeDependencySelector

Error Message:
path: [gid:root:ext:ver (root-scope)], expected: [gid:direct:ext:ver (direct-scope)], actual: [] expected:<1> but was:<0>

Stack Trace:
java.lang.AssertionError: path: [gid:root:ext:ver (root-scope)], expected: [gid:direct:ext:ver (direct-scope)], actual: [] expected:<1> but was:<0>
        at org.eclipse.aether.internal.impl.collect.DefaultDependencyCollectorTest.assertEqualSubtree(DefaultDependencyCollectorTest.java:145)
        at org.eclipse.aether.internal.impl.collect.DefaultDependencyCollectorTest.assertEqualSubtree(DefaultDependencyCollectorTest.java:123)
        at org.eclipse.aether.internal.impl.collect.DefaultDependencyCollectorTest.testSelectionWithScopeDependencySelector(DefaultDependencyCollectorTest.java:717)


FAILED:  org.eclipse.aether.internal.impl.collect.DefaultDependencyCollectorTest.windows-jdk8 / Build windows-jdk8 / testDependencyManagement_DependencySelectorProcessesManagedState

Error Message:
path: [gid:root:ext:ver (root-scope), gid:direct-of-root:ext:ver (direct-of-root-scope), gid:transitive-of-root:ext:ver (transitive-of-root-scope)], expected: [], actual: [gid:transitive-of-transitive-of-root:ext:ver (managed)] expected:<0> but was:<1>

Stack Trace:
java.lang.AssertionError: path: [gid:root:ext:ver (root-scope), gid:direct-of-root:ext:ver (direct-of-root-scope), gid:transitive-of-root:ext:ver (transitive-of-root-scope)], expected: [], actual: [gid:transitive-of-transitive-of-root:ext:ver (managed)] expected:<0> but was:<1>
        at org.eclipse.aether.internal.impl.collect.DefaultDependencyCollectorTest.assertEqualSubtree(DefaultDependencyCollectorTest.java:145)
        at org.eclipse.aether.internal.impl.collect.DefaultDependencyCollectorTest.assertEqualSubtree(DefaultDependencyCollectorTest.java:153)
        at org.eclipse.aether.internal.impl.collect.DefaultDependencyCollectorTest.assertEqualSubtree(DefaultDependencyCollectorTest.java:153)
        at org.eclipse.aether.internal.impl.collect.DefaultDependencyCollectorTest.assertEqualSubtree(DefaultDependencyCollectorTest.java:123)
        at org.eclipse.aether.internal.impl.collect.DefaultDependencyCollectorTest.testDependencyManagement_DependencySelectorProcessesManagedState(DefaultDependencyCollectorTest.java:591)


FAILED:  org.eclipse.aether.internal.impl.collect.DefaultDependencyCollectorTest.windows-jdk11 / Build windows-jdk11 / testSelectionWithScopeDependencySelector

Error Message:
path: [gid:root:ext:ver (root-scope)], expected: [gid:direct:ext:ver (direct-scope)], actual: [] expected:<1> but was:<0>

Stack Trace:
java.lang.AssertionError: path: [gid:root:ext:ver (root-scope)], expected: [gid:direct:ext:ver (direct-scope)], actual: [] expected:<1> but was:<0>
        at org.eclipse.aether.internal.impl.collect.DefaultDependencyCollectorTest.assertEqualSubtree(DefaultDependencyCollectorTest.java:145)
        at org.eclipse.aether.internal.impl.collect.DefaultDependencyCollectorTest.assertEqualSubtree(DefaultDependencyCollectorTest.java:123)
        at org.eclipse.aether.internal.impl.collect.DefaultDependencyCollectorTest.testSelectionWithScopeDependencySelector(DefaultDependencyCollectorTest.java:717)


FAILED:  org.eclipse.aether.internal.impl.collect.DefaultDependencyCollectorTest.windows-jdk11 / Build windows-jdk11 / testDependencyManagement_DependencySelectorProcessesManagedState

Error Message:
path: [gid:root:ext:ver (root-scope), gid:direct-of-root:ext:ver (direct-of-root-scope), gid:transitive-of-root:ext:ver (transitive-of-root-scope)], expected: [], actual: [gid:transitive-of-transitive-of-root:ext:ver (managed)] expected:<0> but was:<1>

Stack Trace:
java.lang.AssertionError: path: [gid:root:ext:ver (root-scope), gid:direct-of-root:ext:ver (direct-of-root-scope), gid:transitive-of-root:ext:ver (transitive-of-root-scope)], expected: [], actual: [gid:transitive-of-transitive-of-root:ext:ver (managed)] expected:<0> but was:<1>
        at org.eclipse.aether.internal.impl.collect.DefaultDependencyCollectorTest.assertEqualSubtree(DefaultDependencyCollectorTest.java:145)
        at org.eclipse.aether.internal.impl.collect.DefaultDependencyCollectorTest.assertEqualSubtree(DefaultDependencyCollectorTest.java:153)
        at org.eclipse.aether.internal.impl.collect.DefaultDependencyCollectorTest.assertEqualSubtree(DefaultDependencyCollectorTest.java:153)
        at org.eclipse.aether.internal.impl.collect.DefaultDependencyCollectorTest.assertEqualSubtree(DefaultDependencyCollectorTest.java:123)
        at org.eclipse.aether.internal.impl.collect.DefaultDependencyCollectorTest.testDependencyManagement_DependencySelectorProcessesManagedState(DefaultDependencyCollectorTest.java:591)


FAILED:  org.eclipse.aether.internal.impl.collect.DefaultDependencyCollectorTest.windows-jdk14 / Build windows-jdk14 / testSelectionWithScopeDependencySelector

Error Message:
path: [gid:root:ext:ver (root-scope)], expected: [gid:direct:ext:ver (direct-scope)], actual: [] expected:<1> but was:<0>

Stack Trace:
java.lang.AssertionError: path: [gid:root:ext:ver (root-scope)], expected: [gid:direct:ext:ver (direct-scope)], actual: [] expected:<1> but was:<0>
        at org.eclipse.aether.internal.impl.collect.DefaultDependencyCollectorTest.assertEqualSubtree(DefaultDependencyCollectorTest.java:145)
        at org.eclipse.aether.internal.impl.collect.DefaultDependencyCollectorTest.assertEqualSubtree(DefaultDependencyCollectorTest.java:123)
        at org.eclipse.aether.internal.impl.collect.DefaultDependencyCollectorTest.testSelectionWithScopeDependencySelector(DefaultDependencyCollectorTest.java:717)


FAILED:  org.eclipse.aether.internal.impl.collect.DefaultDependencyCollectorTest.windows-jdk14 / Build windows-jdk14 / testDependencyManagement_DependencySelectorProcessesManagedState

Error Message:
path: [gid:root:ext:ver (root-scope), gid:direct-of-root:ext:ver (direct-of-root-scope), gid:transitive-of-root:ext:ver (transitive-of-root-scope)], expected: [], actual: [gid:transitive-of-transitive-of-root:ext:ver (managed)] expected:<0> but was:<1>

Stack Trace:
java.lang.AssertionError: path: [gid:root:ext:ver (root-scope), gid:direct-of-root:ext:ver (direct-of-root-scope), gid:transitive-of-root:ext:ver (transitive-of-root-scope)], expected: [], actual: [gid:transitive-of-transitive-of-root:ext:ver (managed)] expected:<0> but was:<1>
        at org.eclipse.aether.internal.impl.collect.DefaultDependencyCollectorTest.assertEqualSubtree(DefaultDependencyCollectorTest.java:145)
        at org.eclipse.aether.internal.impl.collect.DefaultDependencyCollectorTest.assertEqualSubtree(DefaultDependencyCollectorTest.java:153)
        at org.eclipse.aether.internal.impl.collect.DefaultDependencyCollectorTest.assertEqualSubtree(DefaultDependencyCollectorTest.java:153)
        at org.eclipse.aether.internal.impl.collect.DefaultDependencyCollectorTest.assertEqualSubtree(DefaultDependencyCollectorTest.java:123)
        at org.eclipse.aether.internal.impl.collect.DefaultDependencyCollectorTest.testDependencyManagement_DependencySelectorProcessesManagedState(DefaultDependencyCollectorTest.java:591)


FAILED:  org.eclipse.aether.internal.impl.collect.DefaultDependencyCollectorTest.windows-jdk15 / Build windows-jdk15 / testSelectionWithScopeDependencySelector

Error Message:
path: [gid:root:ext:ver (root-scope)], expected: [gid:direct:ext:ver (direct-scope)], actual: [] expected:<1> but was:<0>

Stack Trace:
java.lang.AssertionError: path: [gid:root:ext:ver (root-scope)], expected: [gid:direct:ext:ver (direct-scope)], actual: [] expected:<1> but was:<0>
        at org.eclipse.aether.internal.impl.collect.DefaultDependencyCollectorTest.assertEqualSubtree(DefaultDependencyCollectorTest.java:145)
        at org.eclipse.aether.internal.impl.collect.DefaultDependencyCollectorTest.assertEqualSubtree(DefaultDependencyCollectorTest.java:123)
        at org.eclipse.aether.internal.impl.collect.DefaultDependencyCollectorTest.testSelectionWithScopeDependencySelector(DefaultDependencyCollectorTest.java:717)


FAILED:  org.eclipse.aether.internal.impl.collect.DefaultDependencyCollectorTest.windows-jdk15 / Build windows-jdk15 / testDependencyManagement_DependencySelectorProcessesManagedState

Error Message:
path: [gid:root:ext:ver (root-scope), gid:direct-of-root:ext:ver (direct-of-root-scope), gid:transitive-of-root:ext:ver (transitive-of-root-scope)], expected: [], actual: [gid:transitive-of-transitive-of-root:ext:ver (managed)] expected:<0> but was:<1>

Stack Trace:
java.lang.AssertionError: path: [gid:root:ext:ver (root-scope), gid:direct-of-root:ext:ver (direct-of-root-scope), gid:transitive-of-root:ext:ver (transitive-of-root-scope)], expected: [], actual: [gid:transitive-of-transitive-of-root:ext:ver (managed)] expected:<0> but was:<1>
        at org.eclipse.aether.internal.impl.collect.DefaultDependencyCollectorTest.assertEqualSubtree(DefaultDependencyCollectorTest.java:145)
        at org.eclipse.aether.internal.impl.collect.DefaultDependencyCollectorTest.assertEqualSubtree(DefaultDependencyCollectorTest.java:153)
        at org.eclipse.aether.internal.impl.collect.DefaultDependencyCollectorTest.assertEqualSubtree(DefaultDependencyCollectorTest.java:153)
        at org.eclipse.aether.internal.impl.collect.DefaultDependencyCollectorTest.assertEqualSubtree(DefaultDependencyCollectorTest.java:123)
        at org.eclipse.aether.internal.impl.collect.DefaultDependencyCollectorTest.testDependencyManagement_DependencySelectorProcessesManagedState(DefaultDependencyCollectorTest.java:591)




Build log:
[...truncated 33657 lines...]
[INFO] Downloading from central: https://repo.maven.apache.org/maven2/org/apache/maven/plugin-tools/maven-plugin-tools-java/3.5.2/maven-plugin-tools-java-3.5.2.jar
[INFO] Downloaded from central: https://repo.maven.apache.org/maven2/org/apache/maven/plugin-tools/maven-plugin-tools-generators/3.5.2/maven-plugin-tools-generators-3.5.2.jar (48 kB at 1.5 MB/s)
[INFO] Downloading from central: https://repo.maven.apache.org/maven2/com/thoughtworks/qdox/qdox/2.0-M5/qdox-2.0-M5.jar
[INFO] Downloaded from central: https://repo.maven.apache.org/maven2/org/ow2/asm/asm-analysis/6.1.1/asm-analysis-6.1.1.jar (32 kB at 293 kB/s)
[INFO] Downloaded from central: https://repo.maven.apache.org/maven2/com/thoughtworks/qdox/qdox/2.0-M5/qdox-2.0-M5.jar (313 kB at 2.9 MB/s)
[INFO] Downloaded from central: https://repo.maven.apache.org/maven2/net/sf/jtidy/jtidy/r938/jtidy-r938.jar (250 kB at 2.3 MB/s)
[INFO] Downloading from central: https://repo.maven.apache.org/maven2/org/codehaus/plexus/plexus-archiver/3.4.1/plexus-archiver-3.4.1.jar
[INFO] Downloaded from central: https://repo.maven.apache.org/maven2/org/ow2/asm/asm-commons/6.1.1/asm-commons-6.1.1.jar (78 kB at 707 kB/s)
[INFO] Downloading from central: https://repo.maven.apache.org/maven2/org/apache/maven/plugin-tools/maven-plugin-tools-annotations/3.5.2/maven-plugin-tools-annotations-3.5.2.jar
[INFO] Downloading from central: https://repo.maven.apache.org/maven2/javax/servlet/servlet-api/2.3/servlet-api-2.3.jar
[INFO] Downloading from central: https://repo.maven.apache.org/maven2/org/apache/maven/doxia/doxia-core/1.4/doxia-core-1.4.jar
[INFO] Downloaded from central: https://repo.maven.apache.org/maven2/org/apache/maven/plugin-tools/maven-plugin-tools-java/3.5.2/maven-plugin-tools-java-3.5.2.jar (18 kB at 144 kB/s)
[INFO] Downloading from central: https://repo.maven.apache.org/maven2/org/codehaus/plexus/plexus-utils/3.0.20/plexus-utils-3.0.20.jar
[INFO] Downloaded from central: https://repo.maven.apache.org/maven2/org/codehaus/plexus/plexus-archiver/3.4.1/plexus-archiver-3.4.1.jar (187 kB at 1.3 MB/s)
[INFO] Downloaded from central: https://repo.maven.apache.org/maven2/org/apache/maven/plugin-tools/maven-plugin-tools-annotations/3.5.2/maven-plugin-tools-annotations-3.5.2.jar (43 kB at 291 kB/s)
[INFO] Downloaded from central: https://repo.maven.apache.org/maven2/org/apache/maven/doxia/doxia-core/1.4/doxia-core-1.4.jar (165 kB at 1.1 MB/s)
[INFO] Downloading from central: https://repo.maven.apache.org/maven2/org/apache/maven/surefire/surefire-booter/2.19.1/surefire-booter-2.19.1.jar
[INFO] Downloading from central: https://repo.maven.apache.org/maven2/org/apache/maven/surefire/maven-surefire-common/2.19.1/maven-surefire-common-2.19.1.jar
[INFO] Downloading from central: https://repo.maven.apache.org/maven2/org/apache/maven/surefire/surefire-api/2.19.1/surefire-api-2.19.1.jar
[INFO] Downloaded from central: https://repo.maven.apache.org/maven2/javax/servlet/servlet-api/2.3/servlet-api-2.3.jar (78 kB at 484 kB/s)
[INFO] Downloading from central: https://repo.maven.apache.org/maven2/org/apache/commons/commons-lang3/3.1/commons-lang3-3.1.jar
[INFO] Downloaded from central: https://repo.maven.apache.org/maven2/org/codehaus/plexus/plexus-utils/3.0.20/plexus-utils-3.0.20.jar (243 kB at 1.4 MB/s)
[INFO] Downloaded from central: https://repo.maven.apache.org/maven2/org/apache/maven/surefire/surefire-booter/2.19.1/surefire-booter-2.19.1.jar (46 kB at 249 kB/s)
[INFO] Downloaded from central: https://repo.maven.apache.org/maven2/org/apache/maven/surefire/surefire-api/2.19.1/surefire-api-2.19.1.jar (196 kB at 1.0 MB/s)
[INFO] Downloaded from central: https://repo.maven.apache.org/maven2/org/apache/maven/surefire/maven-surefire-common/2.19.1/maven-surefire-common-2.19.1.jar (293 kB at 1.5 MB/s)
[INFO] Downloaded from central: https://repo.maven.apache.org/maven2/org/apache/commons/commons-lang3/3.1/commons-lang3-3.1.jar (316 kB at 1.5 MB/s)
[ERROR]

Artifact Ids of the format maven-___-plugin are reserved for
plugins in the Group Id org.apache.maven.plugins
Please change your artifactId to the format ___-maven-plugin
In the future this error will break the build.


[INFO] Using 'UTF-8' encoding to read mojo source files.
[INFO] java-javadoc mojo extractor found 0 mojo descriptor.
[INFO] java-annotations mojo extractor found 1 mojo descriptor.
[INFO]
[INFO] --- maven-resources-plugin:3.1.0:testResources (default-testResources) @ maven-resolver-demo-maven-plugin ---
[INFO] Using 'UTF-8' encoding to copy filtered resources.
[INFO] skip non existing resourceDirectory F:\jenkins\jenkins-slave\workspace\-box_maven-resolver_MRESOLVER-12\m\maven-resolver-demos\maven-resolver-demo-maven-plugin\src\test\resources
[INFO] Copying 3 resources
[INFO]
[INFO] --- maven-compiler-plugin:3.7.0:testCompile (default-testCompile) @ maven-resolver-demo-maven-plugin ---
[INFO] No sources to compile
[INFO]
[INFO] --- maven-surefire-plugin:2.22.0:test (default-test) @ maven-resolver-demo-maven-plugin ---
[INFO]
[INFO] --- maven-jar-plugin:3.1.0:jar (default-jar) @ maven-resolver-demo-maven-plugin ---
[INFO] Building jar: F:\jenkins\jenkins-slave\workspace\-box_maven-resolver_MRESOLVER-12\m\maven-resolver-demos\maven-resolver-demo-maven-plugin\target\maven-resolver-demo-maven-plugin-1.4.0-SNAPSHOT.jar
[INFO]
[INFO] --- maven-plugin-plugin:3.5.2:addPluginArtifactMetadata (default-addPluginArtifactMetadata) @ maven-resolver-demo-maven-plugin ---
[INFO]
[INFO] --- maven-site-plugin:3.7.1:attach-descriptor (attach-descriptor) @ maven-resolver-demo-maven-plugin ---
[INFO] Skipping because packaging 'maven-plugin' is not pom.
[INFO]
[INFO] --- maven-invoker-plugin:3.0.1:install (integration-test) @ maven-resolver-demo-maven-plugin ---
[INFO] Downloading from central: https://repo.maven.apache.org/maven2/org/apache/maven/shared/maven-invoker/3.0.0/maven-invoker-3.0.0.pom
[INFO] Downloaded from central: https://repo.maven.apache.org/maven2/org/apache/maven/shared/maven-invoker/3.0.0/maven-invoker-3.0.0.pom (5.0 kB at 126 kB/s)
[INFO] Downloading from central: https://repo.maven.apache.org/maven2/org/apache/maven/reporting/maven-reporting-impl/2.4/maven-reporting-impl-2.4.pom
[INFO] Downloaded from central: https://repo.maven.apache.org/maven2/org/apache/maven/reporting/maven-reporting-impl/2.4/maven-reporting-impl-2.4.pom (6.1 kB at 195 kB/s)
[INFO] Downloading from central: https://repo.maven.apache.org/maven2/commons-validator/commons-validator/1.4.1/commons-validator-1.4.1.pom
[INFO] Downloaded from central: https://repo.maven.apache.org/maven2/commons-validator/commons-validator/1.4.1/commons-validator-1.4.1.pom (13 kB at 469 kB/s)
[INFO] Downloading from central: https://repo.maven.apache.org/maven2/org/apache/commons/commons-parent/36/commons-parent-36.pom
[INFO] Downloaded from central: https://repo.maven.apache.org/maven2/org/apache/commons/commons-parent/36/commons-parent-36.pom (58 kB at 2.0 MB/s)
[INFO] Downloading from central: https://repo.maven.apache.org/maven2/commons-beanutils/commons-beanutils/1.8.3/commons-beanutils-1.8.3.pom
[INFO] Downloaded from central: https://repo.maven.apache.org/maven2/commons-beanutils/commons-beanutils/1.8.3/commons-beanutils-1.8.3.pom (11 kB at 431 kB/s)
[INFO] Downloading from central: https://repo.maven.apache.org/maven2/org/apache/commons/commons-parent/14/commons-parent-14.pom
[INFO] Downloaded from central: https://repo.maven.apache.org/maven2/org/apache/commons/commons-parent/14/commons-parent-14.pom (31 kB at 1.3 MB/s)
[INFO] Downloading from central: https://repo.maven.apache.org/maven2/commons-digester/commons-digester/1.8.1/commons-digester-1.8.1.pom
[INFO] Downloaded from central: https://repo.maven.apache.org/maven2/commons-digester/commons-digester/1.8.1/commons-digester-1.8.1.pom (10 kB at 418 kB/s)
[INFO] Downloading from central: https://repo.maven.apache.org/maven2/org/apache/maven/shared/maven-script-interpreter/1.2/maven-script-interpreter-1.2.pom
[INFO] Downloaded from central: https://repo.maven.apache.org/maven2/org/apache/maven/shared/maven-script-interpreter/1.2/maven-script-interpreter-1.2.pom (4.0 kB at 133 kB/s)
[INFO] Downloading from central: https://repo.maven.apache.org/maven2/org/apache/ant/ant/1.8.1/ant-1.8.1.pom
[INFO] Downloaded from central: https://repo.maven.apache.org/maven2/org/apache/ant/ant/1.8.1/ant-1.8.1.pom (8.8 kB at 352 kB/s)
[INFO] Downloading from central: https://repo.maven.apache.org/maven2/org/apache/ant/ant-parent/1.8.1/ant-parent-1.8.1.pom
[INFO] Downloaded from central: https://repo.maven.apache.org/maven2/org/apache/ant/ant-parent/1.8.1/ant-parent-1.8.1.pom (4.3 kB at 171 kB/s)
[INFO] Downloading from central: https://repo.maven.apache.org/maven2/org/apache/maven/shared/maven-artifact-transfer/0.9.1/maven-artifact-transfer-0.9.1.pom
[INFO] Downloaded from central: https://repo.maven.apache.org/maven2/org/apache/maven/shared/maven-artifact-transfer/0.9.1/maven-artifact-transfer-0.9.1.pom (7.6 kB at 317 kB/s)
[INFO] Downloading from central: https://repo.maven.apache.org/maven2/org/apache/maven/shared/maven-common-artifact-filters/3.0.1/maven-common-artifact-filters-3.0.1.pom
[INFO] Downloaded from central: https://repo.maven.apache.org/maven2/org/apache/maven/shared/maven-common-artifact-filters/3.0.1/maven-common-artifact-filters-3.0.1.pom (4.8 kB at 230 kB/s)
[INFO] Downloading from central: https://repo.maven.apache.org/maven2/commons-codec/commons-codec/1.6/commons-codec-1.6.pom
[INFO] Downloaded from central: https://repo.maven.apache.org/maven2/commons-codec/commons-codec/1.6/commons-codec-1.6.pom (11 kB at 531 kB/s)
[INFO] Downloading from central: https://repo.maven.apache.org/maven2/org/slf4j/slf4j-api/1.7.5/slf4j-api-1.7.5.pom
[INFO] Downloaded from central: https://repo.maven.apache.org/maven2/org/slf4j/slf4j-api/1.7.5/slf4j-api-1.7.5.pom (2.7 kB at 134 kB/s)
[INFO] Downloading from central: https://repo.maven.apache.org/maven2/org/slf4j/slf4j-parent/1.7.5/slf4j-parent-1.7.5.pom
[INFO] Downloaded from central: https://repo.maven.apache.org/maven2/org/slf4j/slf4j-parent/1.7.5/slf4j-parent-1.7.5.pom (12 kB at 472 kB/s)
[INFO] Downloading from central: https://repo.maven.apache.org/maven2/org/apache/maven/doxia/doxia-sink-api/1.7/doxia-sink-api-1.7.pom
[INFO] Downloaded from central: https://repo.maven.apache.org/maven2/org/apache/maven/doxia/doxia-sink-api/1.7/doxia-sink-api-1.7.pom (1.5 kB at 70 kB/s)
[INFO] Downloading from central: https://repo.maven.apache.org/maven2/org/apache/maven/doxia/doxia/1.7/doxia-1.7.pom
[INFO] Downloaded from central: https://repo.maven.apache.org/maven2/org/apache/maven/doxia/doxia/1.7/doxia-1.7.pom (15 kB at 635 kB/s)
[INFO] Downloading from central: https://repo.maven.apache.org/maven2/org/apache/maven/doxia/doxia-logging-api/1.7/doxia-logging-api-1.7.pom
[INFO] Downloaded from central: https://repo.maven.apache.org/maven2/org/apache/maven/doxia/doxia-logging-api/1.7/doxia-logging-api-1.7.pom (1.5 kB at 67 kB/s)
[INFO] Downloading from central: https://repo.maven.apache.org/maven2/org/apache/maven/doxia/doxia-site-renderer/1.7.4/doxia-site-renderer-1.7.4.pom
[INFO] Downloaded from central: https://repo.maven.apache.org/maven2/org/apache/maven/doxia/doxia-site-renderer/1.7.4/doxia-site-renderer-1.7.4.pom (6.7 kB at 230 kB/s)
[INFO] Downloading from central: https://repo.maven.apache.org/maven2/org/apache/maven/doxia/doxia-sitetools/1.7.4/doxia-sitetools-1.7.4.pom
[INFO] Downloaded from central: https://repo.maven.apache.org/maven2/org/apache/maven/doxia/doxia-sitetools/1.7.4/doxia-sitetools-1.7.4.pom (14 kB at 439 kB/s)
[INFO] Downloading from central: https://repo.maven.apache.org/maven2/org/apache/maven/doxia/doxia-core/1.7/doxia-core-1.7.pom
[INFO] Downloaded from central: https://repo.maven.apache.org/maven2/org/apache/maven/doxia/doxia-core/1.7/doxia-core-1.7.pom (4.1 kB at 145 kB/s)
[INFO] Downloading from central: https://repo.maven.apache.org/maven2/org/apache/maven/doxia/doxia-decoration-model/1.7.4/doxia-decoration-model-1.7.4.pom
[INFO] Downloaded from central: https://repo.maven.apache.org/maven2/org/apache/maven/doxia/doxia-decoration-model/1.7.4/doxia-decoration-model-1.7.4.pom (3.4 kB at 136 kB/s)
[INFO] Downloading from central: https://repo.maven.apache.org/maven2/org/apache/maven/doxia/doxia-skin-model/1.7.4/doxia-skin-model-1.7.4.pom
[INFO] Downloaded from central: https://repo.maven.apache.org/maven2/org/apache/maven/doxia/doxia-skin-model/1.7.4/doxia-skin-model-1.7.4.pom (3.0 kB at 108 kB/s)
[INFO] Downloading from central: https://repo.maven.apache.org/maven2/org/apache/maven/doxia/doxia-module-xhtml/1.7/doxia-module-xhtml-1.7.pom
[INFO] Downloaded from central: https://repo.maven.apache.org/maven2/org/apache/maven/doxia/doxia-module-xhtml/1.7/doxia-module-xhtml-1.7.pom (1.6 kB at 63 kB/s)
[INFO] Downloading from central: https://repo.maven.apache.org/maven2/org/apache/maven/doxia/doxia-modules/1.7/doxia-modules-1.7.pom
[INFO] Downloaded from central: https://repo.maven.apache.org/maven2/org/apache/maven/doxia/doxia-modules/1.7/doxia-modules-1.7.pom (2.6 kB at 101 kB/s)
[INFO] Downloading from central: https://repo.maven.apache.org/maven2/org/codehaus/groovy/groovy-all/2.4.8/groovy-all-2.4.8.pom
[INFO] Downloaded from central: https://repo.maven.apache.org/maven2/org/codehaus/groovy/groovy-all/2.4.8/groovy-all-2.4.8.pom (21 kB at 648 kB/s)
[INFO] Downloading from central: https://repo.maven.apache.org/maven2/org/apache/maven/shared/maven-invoker/3.0.0/maven-invoker-3.0.0.jar
[INFO] Downloading from central: https://repo.maven.apache.org/maven2/commons-digester/commons-digester/1.8.1/commons-digester-1.8.1.jar
[INFO] Downloading from central: https://repo.maven.apache.org/maven2/commons-beanutils/commons-beanutils/1.8.3/commons-beanutils-1.8.3.jar
[INFO] Downloading from central: https://repo.maven.apache.org/maven2/commons-validator/commons-validator/1.4.1/commons-validator-1.4.1.jar
[INFO] Downloading from central: https://repo.maven.apache.org/maven2/org/apache/maven/reporting/maven-reporting-impl/2.4/maven-reporting-impl-2.4.jar
[INFO] Downloaded from central: https://repo.maven.apache.org/maven2/org/apache/maven/shared/maven-invoker/3.0.0/maven-invoker-3.0.0.jar (33 kB at 995 kB/s)
[INFO] Downloading from central: https://repo.maven.apache.org/maven2/commons-logging/commons-logging/1.2/commons-logging-1.2.jar
[INFO] Downloaded from central: https://repo.maven.apache.org/maven2/org/apache/maven/reporting/maven-reporting-impl/2.4/maven-reporting-impl-2.4.jar (20 kB at 486 kB/s)
[INFO] Downloaded from central: https://repo.maven.apache.org/maven2/commons-validator/commons-validator/1.4.1/commons-validator-1.4.1.jar (190 kB at 4.8 MB/s)
[INFO] Downloaded from central: https://repo.maven.apache.org/maven2/commons-digester/commons-digester/1.8.1/commons-digester-1.8.1.jar (146 kB at 3.7 MB/s)
[INFO] Downloading from central: https://repo.maven.apache.org/maven2/org/apache/maven/shared/maven-artifact-transfer/0.9.1/maven-artifact-transfer-0.9.1.jar
[INFO] Downloaded from central: https://repo.maven.apache.org/maven2/commons-beanutils/commons-beanutils/1.8.3/commons-beanutils-1.8.3.jar (232 kB at 5.5 MB/s)
[INFO] Downloading from central: https://repo.maven.apache.org/maven2/org/apache/ant/ant/1.8.1/ant-1.8.1.jar
[INFO] Downloading from central: https://repo.maven.apache.org/maven2/org/apache/maven/shared/maven-script-interpreter/1.2/maven-script-interpreter-1.2.jar
[INFO] Downloading from central: https://repo.maven.apache.org/maven2/org/apache/maven/shared/maven-common-artifact-filters/3.0.1/maven-common-artifact-filters-3.0.1.jar
[INFO] Downloaded from central: https://repo.maven.apache.org/maven2/commons-logging/commons-logging/1.2/commons-logging-1.2.jar (62 kB at 981 kB/s)
[INFO] Downloading from central: https://repo.maven.apache.org/maven2/commons-codec/commons-codec/1.6/commons-codec-1.6.jar
[INFO] Downloaded from central: https://repo.maven.apache.org/maven2/org/apache/maven/shared/maven-script-interpreter/1.2/maven-script-interpreter-1.2.jar (22 kB at 294 kB/s)
[INFO] Downloading from central: https://repo.maven.apache.org/maven2/org/slf4j/slf4j-api/1.7.5/slf4j-api-1.7.5.jar
[INFO] Downloaded from central: https://repo.maven.apache.org/maven2/org/apache/maven/shared/maven-artifact-transfer/0.9.1/maven-artifact-transfer-0.9.1.jar (123 kB at 1.6 MB/s)
[INFO] Downloaded from central: https://repo.maven.apache.org/maven2/org/apache/maven/shared/maven-common-artifact-filters/3.0.1/maven-common-artifact-filters-3.0.1.jar (61 kB at 788 kB/s)
[INFO] Downloading from central: https://repo.maven.apache.org/maven2/org/apache/maven/doxia/doxia-logging-api/1.7/doxia-logging-api-1.7.jar
[INFO] Downloading from central: https://repo.maven.apache.org/maven2/org/apache/maven/doxia/doxia-sink-api/1.7/doxia-sink-api-1.7.jar
[INFO] Downloaded from central: https://repo.maven.apache.org/maven2/org/slf4j/slf4j-api/1.7.5/slf4j-api-1.7.5.jar (26 kB at 256 kB/s)
[INFO] Downloaded from central: https://repo.maven.apache.org/maven2/commons-codec/commons-codec/1.6/commons-codec-1.6.jar (233 kB at 2.3 MB/s)
[INFO] Downloading from central: https://repo.maven.apache.org/maven2/org/apache/maven/doxia/doxia-site-renderer/1.7.4/doxia-site-renderer-1.7.4.jar
[INFO] Downloading from central: https://repo.maven.apache.org/maven2/org/apache/maven/doxia/doxia-decoration-model/1.7.4/doxia-decoration-model-1.7.4.jar
[INFO] Downloaded from central: https://repo.maven.apache.org/maven2/org/apache/maven/doxia/doxia-logging-api/1.7/doxia-logging-api-1.7.jar (12 kB at 108 kB/s)
[INFO] Downloading from central: https://repo.maven.apache.org/maven2/org/apache/maven/doxia/doxia-skin-model/1.7.4/doxia-skin-model-1.7.4.jar
[INFO] Downloaded from central: https://repo.maven.apache.org/maven2/org/apache/maven/doxia/doxia-sink-api/1.7/doxia-sink-api-1.7.jar (11 kB at 107 kB/s)
[INFO] Downloading from central: https://repo.maven.apache.org/maven2/org/apache/maven/doxia/doxia-module-xhtml/1.7/doxia-module-xhtml-1.7.jar
[INFO] Downloaded from central: https://repo.maven.apache.org/maven2/org/apache/ant/ant/1.8.1/ant-1.8.1.jar (1.5 MB at 14 MB/s)
[INFO] Downloading from central: https://repo.maven.apache.org/maven2/org/codehaus/groovy/groovy-all/2.4.8/groovy-all-2.4.8.jar
[INFO] Downloaded from central: https://repo.maven.apache.org/maven2/org/apache/maven/doxia/doxia-site-renderer/1.7.4/doxia-site-renderer-1.7.4.jar (64 kB at 492 kB/s)
[INFO] Downloaded from central: https://repo.maven.apache.org/maven2/org/apache/maven/doxia/doxia-skin-model/1.7.4/doxia-skin-model-1.7.4.jar (16 kB at 117 kB/s)
[INFO] Downloaded from central: https://repo.maven.apache.org/maven2/org/apache/maven/doxia/doxia-decoration-model/1.7.4/doxia-decoration-model-1.7.4.jar (61 kB at 442 kB/s)
[INFO] Downloaded from central: https://repo.maven.apache.org/maven2/org/apache/maven/doxia/doxia-module-xhtml/1.7/doxia-module-xhtml-1.7.jar (17 kB at 124 kB/s)
[INFO] Downloaded from central: https://repo.maven.apache.org/maven2/org/codehaus/groovy/groovy-all/2.4.8/groovy-all-2.4.8.jar (7.0 MB at 25 MB/s)
[INFO] Installing f:\jenkins\jenkins-slave\workspace\-box_maven-resolver_MRESOLVER-12\m\pom.xml to F:\jenkins\jenkins-slave\workspace\-box_maven-resolver_MRESOLVER-12\m\maven-resolver-demos\maven-resolver-demo-maven-plugin\target\local-repo\org\apache\maven\resolver\maven-resolver\1.4.0-SNAPSHOT\maven-resolver-1.4.0-SNAPSHOT.pom
[INFO] Installing f:\jenkins\jenkins-slave\workspace\-box_maven-resolver_MRESOLVER-12\m\target\maven-resolver-1.4.0-SNAPSHOT-site.xml to F:\jenkins\jenkins-slave\workspace\-box_maven-resolver_MRESOLVER-12\m\maven-resolver-demos\maven-resolver-demo-maven-plugin\target\local-repo\org\apache\maven\resolver\maven-resolver\1.4.0-SNAPSHOT\maven-resolver-1.4.0-SNAPSHOT-site.xml
[INFO] Installing F:\jenkins\jenkins-slave\workspace\-box_maven-resolver_MRESOLVER-12\m\maven-resolver-api\pom.xml to F:\jenkins\jenkins-slave\workspace\-box_maven-resolver_MRESOLVER-12\m\maven-resolver-demos\maven-resolver-demo-maven-plugin\target\local-repo\org\apache\maven\resolver\maven-resolver-api\1.4.0-SNAPSHOT\maven-resolver-api-1.4.0-SNAPSHOT.pom
[INFO] Installing F:\jenkins\jenkins-slave\workspace\-box_maven-resolver_MRESOLVER-12\m\maven-resolver-api\target\maven-resolver-api-1.4.0-SNAPSHOT.jar to F:\jenkins\jenkins-slave\workspace\-box_maven-resolver_MRESOLVER-12\m\maven-resolver-demos\maven-resolver-demo-maven-plugin\target\local-repo\org\apache\maven\resolver\maven-resolver-api\1.4.0-SNAPSHOT\maven-resolver-api-1.4.0-SNAPSHOT.jar
[INFO] Installing F:\jenkins\jenkins-slave\workspace\-box_maven-resolver_MRESOLVER-12\m\maven-resolver-spi\pom.xml to F:\jenkins\jenkins-slave\workspace\-box_maven-resolver_MRESOLVER-12\m\maven-resolver-demos\maven-resolver-demo-maven-plugin\target\local-repo\org\apache\maven\resolver\maven-resolver-spi\1.4.0-SNAPSHOT\maven-resolver-spi-1.4.0-SNAPSHOT.pom
[INFO] Installing F:\jenkins\jenkins-slave\workspace\-box_maven-resolver_MRESOLVER-12\m\maven-resolver-spi\target\maven-resolver-spi-1.4.0-SNAPSHOT.jar to F:\jenkins\jenkins-slave\workspace\-box_maven-resolver_MRESOLVER-12\m\maven-resolver-demos\maven-resolver-demo-maven-plugin\target\local-repo\org\apache\maven\resolver\maven-resolver-spi\1.4.0-SNAPSHOT\maven-resolver-spi-1.4.0-SNAPSHOT.jar
[INFO] Installing F:\jenkins\jenkins-slave\workspace\-box_maven-resolver_MRESOLVER-12\m\maven-resolver-test-util\pom.xml to F:\jenkins\jenkins-slave\workspace\-box_maven-resolver_MRESOLVER-12\m\maven-resolver-demos\maven-resolver-demo-maven-plugin\target\local-repo\org\apache\maven\resolver\maven-resolver-test-util\1.4.0-SNAPSHOT\maven-resolver-test-util-1.4.0-SNAPSHOT.pom
[INFO] Installing F:\jenkins\jenkins-slave\workspace\-box_maven-resolver_MRESOLVER-12\m\maven-resolver-test-util\target\maven-resolver-test-util-1.4.0-SNAPSHOT.jar to F:\jenkins\jenkins-slave\workspace\-box_maven-resolver_MRESOLVER-12\m\maven-resolver-demos\maven-resolver-demo-maven-plugin\target\local-repo\org\apache\maven\resolver\maven-resolver-test-util\1.4.0-SNAPSHOT\maven-resolver-test-util-1.4.0-SNAPSHOT.jar
[INFO] Installing F:\jenkins\jenkins-slave\workspace\-box_maven-resolver_MRESOLVER-12\m\maven-resolver-util\pom.xml to F:\jenkins\jenkins-slave\workspace\-box_maven-resolver_MRESOLVER-12\m\maven-resolver-demos\maven-resolver-demo-maven-plugin\target\local-repo\org\apache\maven\resolver\maven-resolver-util\1.4.0-SNAPSHOT\maven-resolver-util-1.4.0-SNAPSHOT.pom
[INFO] Installing F:\jenkins\jenkins-slave\workspace\-box_maven-resolver_MRESOLVER-12\m\maven-resolver-util\target\maven-resolver-util-1.4.0-SNAPSHOT.jar to F:\jenkins\jenkins-slave\workspace\-box_maven-resolver_MRESOLVER-12\m\maven-resolver-demos\maven-resolver-demo-maven-plugin\target\local-repo\org\apache\maven\resolver\maven-resolver-util\1.4.0-SNAPSHOT\maven-resolver-util-1.4.0-SNAPSHOT.jar
[INFO] Installing F:\jenkins\jenkins-slave\workspace\-box_maven-resolver_MRESOLVER-12\m\maven-resolver-impl\pom.xml to F:\jenkins\jenkins-slave\workspace\-box_maven-resolver_MRESOLVER-12\m\maven-resolver-demos\maven-resolver-demo-maven-plugin\target\local-repo\org\apache\maven\resolver\maven-resolver-impl\1.4.0-SNAPSHOT\maven-resolver-impl-1.4.0-SNAPSHOT.pom
[INFO] Installing F:\jenkins\jenkins-slave\workspace\-box_maven-resolver_MRESOLVER-12\m\maven-resolver-impl\target\maven-resolver-impl-1.4.0-SNAPSHOT.jar to F:\jenkins\jenkins-slave\workspace\-box_maven-resolver_MRESOLVER-12\m\maven-resolver-demos\maven-resolver-demo-maven-plugin\target\local-repo\org\apache\maven\resolver\maven-resolver-impl\1.4.0-SNAPSHOT\maven-resolver-impl-1.4.0-SNAPSHOT.jar
[INFO] Installing F:\jenkins\jenkins-slave\workspace\-box_maven-resolver_MRESOLVER-12\m\maven-resolver-connector-basic\pom.xml to F:\jenkins\jenkins-slave\workspace\-box_maven-resolver_MRESOLVER-12\m\maven-resolver-demos\maven-resolver-demo-maven-plugin\target\local-repo\org\apache\maven\resolver\maven-resolver-connector-basic\1.4.0-SNAPSHOT\maven-resolver-connector-basic-1.4.0-SNAPSHOT.pom
[INFO] Installing F:\jenkins\jenkins-slave\workspace\-box_maven-resolver_MRESOLVER-12\m\maven-resolver-connector-basic\target\maven-resolver-connector-basic-1.4.0-SNAPSHOT.jar to F:\jenkins\jenkins-slave\workspace\-box_maven-resolver_MRESOLVER-12\m\maven-resolver-demos\maven-resolver-demo-maven-plugin\target\local-repo\org\apache\maven\resolver\maven-resolver-connector-basic\1.4.0-SNAPSHOT\maven-resolver-connector-basic-1.4.0-SNAPSHOT.jar
[INFO] Installing F:\jenkins\jenkins-slave\workspace\-box_maven-resolver_MRESOLVER-12\m\maven-resolver-transport-classpath\pom.xml to F:\jenkins\jenkins-slave\workspace\-box_maven-resolver_MRESOLVER-12\m\maven-resolver-demos\maven-resolver-demo-maven-plugin\target\local-repo\org\apache\maven\resolver\maven-resolver-transport-classpath\1.4.0-SNAPSHOT\maven-resolver-transport-classpath-1.4.0-SNAPSHOT.pom
[INFO] Installing F:\jenkins\jenkins-slave\workspace\-box_maven-resolver_MRESOLVER-12\m\maven-resolver-transport-classpath\target\maven-resolver-transport-classpath-1.4.0-SNAPSHOT.jar to F:\jenkins\jenkins-slave\workspace\-box_maven-resolver_MRESOLVER-12\m\maven-resolver-demos\maven-resolver-demo-maven-plugin\target\local-repo\org\apache\maven\resolver\maven-resolver-transport-classpath\1.4.0-SNAPSHOT\maven-resolver-transport-classpath-1.4.0-SNAPSHOT.jar
[INFO] Installing F:\jenkins\jenkins-slave\workspace\-box_maven-resolver_MRESOLVER-12\m\maven-resolver-transport-file\pom.xml to F:\jenkins\jenkins-slave\workspace\-box_maven-resolver_MRESOLVER-12\m\maven-resolver-demos\maven-resolver-demo-maven-plugin\target\local-repo\org\apache\maven\resolver\maven-resolver-transport-file\1.4.0-SNAPSHOT\maven-resolver-transport-file-1.4.0-SNAPSHOT.pom
[INFO] Installing F:\jenkins\jenkins-slave\workspace\-box_maven-resolver_MRESOLVER-12\m\maven-resolver-transport-file\target\maven-resolver-transport-file-1.4.0-SNAPSHOT.jar to F:\jenkins\jenkins-slave\workspace\-box_maven-resolver_MRESOLVER-12\m\maven-resolver-demos\maven-resolver-demo-maven-plugin\target\local-repo\org\apache\maven\resolver\maven-resolver-transport-file\1.4.0-SNAPSHOT\maven-resolver-transport-file-1.4.0-SNAPSHOT.jar
[INFO] Installing F:\jenkins\jenkins-slave\workspace\-box_maven-resolver_MRESOLVER-12\m\maven-resolver-transport-http\pom.xml to F:\jenkins\jenkins-slave\workspace\-box_maven-resolver_MRESOLVER-12\m\maven-resolver-demos\maven-resolver-demo-maven-plugin\target\local-repo\org\apache\maven\resolver\maven-resolver-transport-http\1.4.0-SNAPSHOT\maven-resolver-transport-http-1.4.0-SNAPSHOT.pom
[INFO] Installing F:\jenkins\jenkins-slave\workspace\-box_maven-resolver_MRESOLVER-12\m\maven-resolver-transport-http\target\maven-resolver-transport-http-1.4.0-SNAPSHOT.jar to F:\jenkins\jenkins-slave\workspace\-box_maven-resolver_MRESOLVER-12\m\maven-resolver-demos\maven-resolver-demo-maven-plugin\target\local-repo\org\apache\maven\resolver\maven-resolver-transport-http\1.4.0-SNAPSHOT\maven-resolver-transport-http-1.4.0-SNAPSHOT.jar
[INFO] Installing F:\jenkins\jenkins-slave\workspace\-box_maven-resolver_MRESOLVER-12\m\maven-resolver-transport-wagon\pom.xml to F:\jenkins\jenkins-slave\workspace\-box_maven-resolver_MRESOLVER-12\m\maven-resolver-demos\maven-resolver-demo-maven-plugin\target\local-repo\org\apache\maven\resolver\maven-resolver-transport-wagon\1.4.0-SNAPSHOT\maven-resolver-transport-wagon-1.4.0-SNAPSHOT.pom
[INFO] Installing F:\jenkins\jenkins-slave\workspace\-box_maven-resolver_MRESOLVER-12\m\maven-resolver-transport-wagon\target\maven-resolver-transport-wagon-1.4.0-SNAPSHOT.jar to F:\jenkins\jenkins-slave\workspace\-box_maven-resolver_MRESOLVER-12\m\maven-resolver-demos\maven-resolver-demo-maven-plugin\target\local-repo\org\apache\maven\resolver\maven-resolver-transport-wagon\1.4.0-SNAPSHOT\maven-resolver-transport-wagon-1.4.0-SNAPSHOT.jar
[INFO] Installing F:\jenkins\jenkins-slave\workspace\-box_maven-resolver_MRESOLVER-12\m\maven-resolver-demos\pom.xml to F:\jenkins\jenkins-slave\workspace\-box_maven-resolver_MRESOLVER-12\m\maven-resolver-demos\maven-resolver-demo-maven-plugin\target\local-repo\org\apache\maven\resolver\maven-resolver-demos\1.4.0-SNAPSHOT\maven-resolver-demos-1.4.0-SNAPSHOT.pom
[INFO] Installing F:\jenkins\jenkins-slave\workspace\-box_maven-resolver_MRESOLVER-12\m\maven-resolver-demos\target\maven-resolver-demos-1.4.0-SNAPSHOT-site.xml to F:\jenkins\jenkins-slave\workspace\-box_maven-resolver_MRESOLVER-12\m\maven-resolver-demos\maven-resolver-demo-maven-plugin\target\local-repo\org\apache\maven\resolver\maven-resolver-demos\1.4.0-SNAPSHOT\maven-resolver-demos-1.4.0-SNAPSHOT-site.xml
[INFO] Installing F:\jenkins\jenkins-slave\workspace\-box_maven-resolver_MRESOLVER-12\m\maven-resolver-demos\maven-resolver-demo-snippets\pom.xml to F:\jenkins\jenkins-slave\workspace\-box_maven-resolver_MRESOLVER-12\m\maven-resolver-demos\maven-resolver-demo-maven-plugin\target\local-repo\org\apache\maven\resolver\maven-resolver-demo-snippets\1.4.0-SNAPSHOT\maven-resolver-demo-snippets-1.4.0-SNAPSHOT.pom
[INFO] Installing F:\jenkins\jenkins-slave\workspace\-box_maven-resolver_MRESOLVER-12\m\maven-resolver-demos\maven-resolver-demo-snippets\target\maven-resolver-demo-snippets-1.4.0-SNAPSHOT.jar to F:\jenkins\jenkins-slave\workspace\-box_maven-resolver_MRESOLVER-12\m\maven-resolver-demos\maven-resolver-demo-maven-plugin\target\local-repo\org\apache\maven\resolver\maven-resolver-demo-snippets\1.4.0-SNAPSHOT\maven-resolver-demo-snippets-1.4.0-SNAPSHOT.jar
[INFO] Installing F:\jenkins\jenkins-slave\workspace\-box_maven-resolver_MRESOLVER-12\m\maven-resolver-demos\maven-resolver-demo-maven-plugin\pom.xml to F:\jenkins\jenkins-slave\workspace\-box_maven-resolver_MRESOLVER-12\m\maven-resolver-demos\maven-resolver-demo-maven-plugin\target\local-repo\org\apache\maven\resolver\maven-resolver-demo-maven-plugin\1.4.0-SNAPSHOT\maven-resolver-demo-maven-plugin-1.4.0-SNAPSHOT.pom
[INFO] Installing F:\jenkins\jenkins-slave\workspace\-box_maven-resolver_MRESOLVER-12\m\maven-resolver-demos\maven-resolver-demo-maven-plugin\target\maven-resolver-demo-maven-plugin-1.4.0-SNAPSHOT.jar to F:\jenkins\jenkins-slave\workspace\-box_maven-resolver_MRESOLVER-12\m\maven-resolver-demos\maven-resolver-demo-maven-plugin\target\local-repo\org\apache\maven\resolver\maven-resolver-demo-maven-plugin\1.4.0-SNAPSHOT\maven-resolver-demo-maven-plugin-1.4.0-SNAPSHOT.jar
[INFO]
[INFO] --- maven-invoker-plugin:3.0.1:run (integration-test) @ maven-resolver-demo-maven-plugin ---
[INFO] Running Setup Jobs
[INFO] Building: resolve-artifact\pom.xml
[INFO]           resolve-artifact\pom.xml ......................... SUCCESS (5.3 s)
[INFO] -------------------------------------------------
[INFO] Build Summary:
[INFO]   Passed: 1, Failed: 0, Errors: 0, Skipped: 0
[INFO] -------------------------------------------------
[INFO]
[INFO] --- maven-checkstyle-plugin:3.0.0:check (checkstyle-check) @ maven-resolver-demo-maven-plugin ---
[INFO] ------------------------------------------------------------------------
[INFO] Reactor Summary for Maven Artifact Resolver 1.4.0-SNAPSHOT:
[INFO]
[INFO] Maven Artifact Resolver ............................ SUCCESS [ 41.824 s]
[INFO] Maven Artifact Resolver API ........................ SUCCESS [ 23.002 s]
[INFO] Maven Artifact Resolver SPI ........................ SUCCESS [  4.150 s]
[INFO] Maven Artifact Resolver Test Utilities ............. SUCCESS [  3.389 s]
[INFO] Maven Artifact Resolver Utilities .................. SUCCESS [  9.813 s]
[INFO] Maven Artifact Resolver Implementation ............. SUCCESS [ 22.177 s]
[INFO] Maven Artifact Resolver Connector Basic ............ SUCCESS [  8.154 s]
[INFO] Maven Artifact Resolver Transport Classpath ........ SUCCESS [  2.640 s]
[INFO] Maven Artifact Resolver Transport File ............. SUCCESS [  2.449 s]
[INFO] Maven Artifact Resolver Transport HTTP ............. SUCCESS [ 10.547 s]
[INFO] Maven Artifact Resolver Transport Wagon ............ SUCCESS [  6.193 s]
[INFO] Maven Artifact Resolver Demos ...................... SUCCESS [  0.349 s]
[INFO] Maven Artifact Resolver Demo Snippets .............. SUCCESS [  3.327 s]
[INFO] Maven Artifact Resolver Demo Maven Plugin .......... SUCCESS [ 13.131 s]
[INFO] ------------------------------------------------------------------------
[INFO] BUILD SUCCESS
[INFO] ------------------------------------------------------------------------
[INFO] Total time:  02:32 min
[INFO] Finished at: 2020-03-26T10:57:49-07:00
[INFO] ------------------------------------------------------------------------
[INFO] [jenkins-event-spy] Generated F:\jenkins\jenkins-slave\workspace\-box_maven-resolver_MRESOLVER-12@tmp\withMavena69b965c\maven-spy-20200326-105516-8059333261847119025975.log
[Pipeline] }
[Pipeline] // dir
[Pipeline] }
[withMaven] invokerPublisher - Archive invoker results for Maven artifact MavenArtifact{org.apache.maven.resolver:maven-resolver-demo-maven-plugin:maven-plugin:1.4.0-SNAPSHOT(version: 1.4.0-SNAPSHOT, snapshot:false) } generated by PluginInvocation{org.apache.maven.plugins:maven-invoker-plugin:3.0.1@run  integration-test}: m\maven-resolver-demos\maven-resolver-demo-maven-plugin\target\invoker-reports\*.xml
[withMaven] junitPublisher - Archive test results for Maven artifact org.apache.maven.resolver:maven-resolver-api:jar:1.4.0-SNAPSHOT generated by maven-surefire-plugin:test (default-test): m\maven-resolver-api\target\surefire-reports\*.xml
[withMaven] junitPublisher - Archive test results for Maven artifact org.apache.maven.resolver:maven-resolver-spi:jar:1.4.0-SNAPSHOT generated by maven-surefire-plugin:test (default-test): m\maven-resolver-spi\target\surefire-reports\*.xml
[withMaven] junitPublisher - Archive test results for Maven artifact org.apache.maven.resolver:maven-resolver-test-util:jar:1.4.0-SNAPSHOT generated by maven-surefire-plugin:test (default-test): m\maven-resolver-test-util\target\surefire-reports\*.xml
[withMaven] junitPublisher - Archive test results for Maven artifact org.apache.maven.resolver:maven-resolver-util:jar:1.4.0-SNAPSHOT generated by maven-surefire-plugin:test (default-test): m\maven-resolver-util\target\surefire-reports\*.xml
[withMaven] junitPublisher - Archive test results for Maven artifact org.apache.maven.resolver:maven-resolver-impl:jar:1.4.0-SNAPSHOT generated by maven-surefire-plugin:test (default-test): m\maven-resolver-impl\target\surefire-reports\*.xml
[withMaven] junitPublisher - Archive test results for Maven artifact org.apache.maven.resolver:maven-resolver-connector-basic:jar:1.4.0-SNAPSHOT generated by maven-surefire-plugin:test (default-test): m\maven-resolver-connector-basic\target\surefire-reports\*.xml
[withMaven] junitPublisher - Archive test results for Maven artifact org.apache.maven.resolver:maven-resolver-transport-classpath:jar:1.4.0-SNAPSHOT generated by maven-surefire-plugin:test (default-test): m\maven-resolver-transport-classpath\target\surefire-reports\*.xml
[withMaven] junitPublisher - Archive test results for Maven artifact org.apache.maven.resolver:maven-resolver-transport-file:jar:1.4.0-SNAPSHOT generated by maven-surefire-plugin:test (default-test): m\maven-resolver-transport-file\target\surefire-reports\*.xml
[withMaven] junitPublisher - Archive test results for Maven artifact org.apache.maven.resolver:maven-resolver-transport-http:jar:1.4.0-SNAPSHOT generated by maven-surefire-plugin:test (default-test): m\maven-resolver-transport-http\target\surefire-reports\*.xml
[withMaven] junitPublisher - Archive test results for Maven artifact org.apache.maven.resolver:maven-resolver-transport-wagon:jar:1.4.0-SNAPSHOT generated by maven-surefire-plugin:test (default-test): m\maven-resolver-transport-wagon\target\surefire-reports\*.xml
[withMaven] junitPublisher - Archive test results for Maven artifact org.apache.maven.resolver:maven-resolver-demo-snippets:jar:1.4.0-SNAPSHOT generated by maven-surefire-plugin:test (default-test): m\maven-resolver-demos\maven-resolver-demo-snippets\target\surefire-reports\*.xml
[withMaven] junitPublisher - Archive test results for Maven artifact org.apache.maven.resolver:maven-resolver-demo-maven-plugin:maven-plugin:1.4.0-SNAPSHOT generated by maven-surefire-plugin:test (default-test): m\maven-resolver-demos\maven-resolver-demo-maven-plugin\target\surefire-reports\*.xml
Recording test results
[withMaven] Publishers: Pipeline Graph Publisher: 4 ms, Invoker Publisher: 612 ms, Junit Publisher: 3438 ms, Concordion Publisher: 1 ms, Dependencies Fingerprint Publisher: 452 ms
[Pipeline] // withMaven
[Pipeline] cleanWs
[WS-CLEANUP] Deleting project workspace...
[WS-CLEANUP] Deferred wipeout is used...
[WS-CLEANUP] done
[Pipeline] }
[Pipeline] // stage
[Pipeline] }
[Pipeline] // node
[Pipeline] }
[Pipeline] // parallel
[Pipeline] stage
[Pipeline] { (Notifications)
[Pipeline] echo
Build result: UNSTABLE
[Pipeline] jiraIssueSelector
[Pipeline] echo
The authors of changes [rfscholte].
[Pipeline] echo
Sending email ...
[Pipeline] emailext