Build unstable in Jenkins: Maven TLP » maven-remote-resources-plugin » MRRESOURCES-103 #1

Previous Topic Next Topic
 
classic Classic list List threaded Threaded
1 message Options
Reply | Threaded
Open this post in threaded view
|

Build unstable in Jenkins: Maven TLP » maven-remote-resources-plugin » MRRESOURCES-103 #1

Apache Jenkins Server-2
See https://builds.apache.org/job/maven-box/job/maven-remote-resources-plugin/job/MRRESOURCES-103/1/

No changes.

5 tests failed.
FAILED:  org.apache.maven.plugin.resources.remote.it.IT_RunOnlyAtExecutionRoot.test

Error Message:
Exit code was non-zero: 1; command line and log =
F:\jenkins\tools\maven\apache-maven-3.5.0\bin\mvn -e --batch-mode -Dmaven.repo.local=f:\jenkins\jenkins-slave\workspace\rces-plugin_MRRESOURCES-103-OWZ3HFZ43MS4CUVJZUVLTQDPH6VF24RFDOZDFCITEPHO3WVUHWJQ\m\target/it-repo org.apache.maven.plugins:maven-clean-plugin:clean generate-resources
Picked up JAVA_TOOL_OPTIONS: -Dmaven.ext.class.path="f:\jenkins\jenkins-slave\workspace\rces-plugin_MRRESOURCES-103-OWZ3HFZ43MS4CUVJZUVLTQDPH6VF24RFDOZDFCITEPHO3WVUHWJQ@tmp\withMavene513d22a\pipeline-maven-spy.jar" -Dorg.jenkinsci.plugins.pipeline.maven.reportsFolder="f:\jenkins\jenkins-slave\workspace\rces-plugin_MRRESOURCES-103-OWZ3HFZ43MS4CUVJZUVLTQDPH6VF24RFDOZDFCITEPHO3WVUHWJQ@tmp\withMavene513d22a"
[INFO] [jenkins-event-spy] Jenkins Maven Event Spy is disabled
[INFO] Error stacktraces are turned on.
[INFO] Scanning for projects...
[INFO] Downloading: http://repository.apache.org/snapshots/org/apache/maven/plugin/rresource/it/it-parent/1.6-SNAPSHOT/maven-metadata.xml
[INFO] Downloading: http://repository.apache.org/snapshots/org/apache/maven/plugin/rresource/it/it-parent/1.6-SNAPSHOT/it-parent-1.6-SNAPSHOT.pom
[ERROR] [ERROR] Some problems were encountered while processing the POMs:
[FATAL] Non-resolvable parent POM for org.apache.maven.plugin.rresource.it.mrr41:parent:[unknown-version]: Could not find artifact org.apache.maven.plugin.rresource.it:it-parent:pom:1.6-SNAPSHOT in apache-snapshots (http://repository.apache.org/snapshots/) and 'parent.relativePath' points at wrong local POM @ org.apache.maven.plugin.rresource.it.mrr41:parent:[unknown-version], F:\jenkins\jenkins-slave\workspace\rces-plugin_MRRESOURCES-103-OWZ3HFZ43MS4CUVJZUVLTQDPH6VF24RFDOZDFCITEPHO3WVUHWJQ\m\target\test-classes\run-only-at-execution-root\pom.xml, line 24, column 11
[FATAL] Non-resolvable parent POM for org.apache.maven.plugin.rresource.it.mrr41:parent:[unknown-version]: Failure to find org.apache.maven.plugin.rresource.it:it-parent:pom:1.6-SNAPSHOT in http://repository.apache.org/snapshots/ was cached in the local repository, resolution will not be reattempted until the update interval of apache-snapshots has elapsed or updates are forced and 'parent.relativePath' points at wrong local POM @ org.apache.maven.plugin.rresource.it.mrr41:parent:[unknown-version], F:\jenkins\jenkins-slave\workspace\rces-plugin_MRRESOURCES-103-OWZ3HFZ43MS4CUVJZUVLTQDPH6VF24RFDOZDFCITEPHO3WVUHWJQ\m\target\test-classes\run-only-at-execution-root\pom.xml, line 24, column 11
 @
[ERROR] The build could not read 2 projects -> [Help 1]
org.apache.maven.project.ProjectBuildingException: Some problems were encountered while processing the POMs:
[FATAL] Non-resolvable parent POM for org.apache.maven.plugin.rresource.it.mrr41:parent:[unknown-version]: Could not find artifact org.apache.maven.plugin.rresource.it:it-parent:pom:1.6-SNAPSHOT in apache-snapshots (http://repository.apache.org/snapshots/) and 'parent.relativePath' points at wrong local POM @ org.apache.maven.plugin.rresource.it.mrr41:parent:[unknown-version], F:\jenkins\jenkins-slave\workspace\rces-plugin_MRRESOURCES-103-OWZ3HFZ43MS4CUVJZUVLTQDPH6VF24RFDOZDFCITEPHO3WVUHWJQ\m\target\test-classes\run-only-at-execution-root\pom.xml, line 24, column 11
[FATAL] Non-resolvable parent POM for org.apache.maven.plugin.rresource.it.mrr41:parent:[unknown-version]: Failure to find org.apache.maven.plugin.rresource.it:it-parent:pom:1.6-SNAPSHOT in http://repository.apache.org/snapshots/ was cached in the local repository, resolution will not be reattempted until the update interval of apache-snapshots has elapsed or updates are forced and 'parent.relativePath' points at wrong local POM @ org.apache.maven.plugin.rresource.it.mrr41:parent:[unknown-version], F:\jenkins\jenkins-slave\workspace\rces-plugin_MRRESOURCES-103-OWZ3HFZ43MS4CUVJZUVLTQDPH6VF24RFDOZDFCITEPHO3WVUHWJQ\m\target\test-classes\run-only-at-execution-root\pom.xml, line 24, column 11

 at org.apache.maven.project.DefaultProjectBuilder.build(DefaultProjectBuilder.java:382)
 at org.apache.maven.graph.DefaultGraphBuilder.collectProjects(DefaultGraphBuilder.java:400)
 at org.apache.maven.graph.DefaultGraphBuilder.getProjectsForMavenReactor(DefaultGraphBuilder.java:391)
 at org.apache.maven.graph.DefaultGraphBuilder.build(DefaultGraphBuilder.java:78)
 at org.apache.maven.DefaultMaven.buildGraph(DefaultMaven.java:511)
 at org.apache.maven.DefaultMaven.doExecute(DefaultMaven.java:221)
 at org.apache.maven.DefaultMaven.doExecute(DefaultMaven.java:194)
 at org.apache.maven.DefaultMaven.execute(DefaultMaven.java:107)
 at org.apache.maven.cli.MavenCli.execute(MavenCli.java:993)
 at org.apache.maven.cli.MavenCli.doMain(MavenCli.java:345)
 at org.apache.maven.cli.MavenCli.main(MavenCli.java:191)
 at java.base/jdk.internal.reflect.NativeMethodAccessorImpl.invoke0(Native Method)
 at java.base/jdk.internal.reflect.NativeMethodAccessorImpl.invoke(NativeMethodAccessorImpl.java:62)
 at java.base/jdk.internal.reflect.DelegatingMethodAccessorImpl.invoke(DelegatingMethodAccessorImpl.java:43)
 at java.base/java.lang.reflect.Method.invoke(Method.java:564)
 at org.codehaus.plexus.classworlds.launcher.Launcher.launchEnhanced(Launcher.java:289)
 at org.codehaus.plexus.classworlds.launcher.Launcher.launch(Launcher.java:229)
 at org.codehaus.plexus.classworlds.launcher.Launcher.mainWithExitCode(Launcher.java:415)
 at org.codehaus.plexus.classworlds.launcher.Launcher.main(Launcher.java:356)
[ERROR]  
[ERROR]   The project org.apache.maven.plugin.rresource.it.mrr41:child-1:[unknown-version] (F:\jenkins\jenkins-slave\workspace\rces-plugin_MRRESOURCES-103-OWZ3HFZ43MS4CUVJZUVLTQDPH6VF24RFDOZDFCITEPHO3WVUHWJQ\m\target\test-classes\run-only-at-execution-root\child1\pom.xml) has 1 error
[ERROR]     Non-resolvable parent POM for org.apache.maven.plugin.rresource.it.mrr41:parent:[unknown-version]: Could not find artifact org.apache.maven.plugin.rresource.it:it-parent:pom:1.6-SNAPSHOT in apache-snapshots (http://repository.apache.org/snapshots/) and 'parent.relativePath' points at wrong local POM @ org.apache.maven.plugin.rresource.it.mrr41:parent:[unknown-version], F:\jenkins\jenkins-slave\workspace\rces-plugin_MRRESOURCES-103-OWZ3HFZ43MS4CUVJZUVLTQDPH6VF24RFDOZDFCITEPHO3WVUHWJQ\m\target\test-classes\run-only-at-execution-root\pom.xml, line 24, column 11 -> [Help 2]
org.apache.maven.model.resolution.UnresolvableModelException: Could not find artifact org.apache.maven.plugin.rresource.it:it-parent:pom:1.6-SNAPSHOT in apache-snapshots (http://repository.apache.org/snapshots/)
 at org.apache.maven.project.ProjectModelResolver.resolveModel(ProjectModelResolver.java:197)
 at org.apache.maven.project.ProjectModelResolver.resolveModel(ProjectModelResolver.java:243)
 at org.apache.maven.model.building.DefaultModelBuilder.readParentExternally(DefaultModelBuilder.java:1051)
 at org.apache.maven.model.building.DefaultModelBuilder.readParent(DefaultModelBuilder.java:851)
 at org.apache.maven.model.building.DefaultModelBuilder.build(DefaultModelBuilder.java:331)
 at org.apache.maven.project.DefaultProjectBuilder.build(DefaultProjectBuilder.java:429)
 at org.apache.maven.project.DefaultProjectBuilder.build(DefaultProjectBuilder.java:398)
 at org.apache.maven.project.DefaultProjectBuilder.build(DefaultProjectBuilder.java:515)
 at org.apache.maven.project.DefaultProjectBuilder.build(DefaultProjectBuilder.java:398)
 at org.apache.maven.project.DefaultProjectBuilder.build(DefaultProjectBuilder.java:361)
 at org.apache.maven.graph.DefaultGraphBuilder.collectProjects(DefaultGraphBuilder.java:400)
 at org.apache.maven.graph.DefaultGraphBuilder.getProjectsForMavenReactor(DefaultGraphBuilder.java:391)
 at org.apache.maven.graph.DefaultGraphBuilder.build(DefaultGraphBuilder.java:78)
 at org.apache.maven.DefaultMaven.buildGraph(DefaultMaven.java:511)
 at org.apache.maven.DefaultMaven.doExecute(DefaultMaven.java:221)
 at org.apache.maven.DefaultMaven.doExecute(DefaultMaven.java:194)
 at org.apache.maven.DefaultMaven.execute(DefaultMaven.java:107)
 at org.apache.maven.cli.MavenCli.execute(MavenCli.java:993)
 at org.apache.maven.cli.MavenCli.doMain(MavenCli.java:345)
 at org.apache.maven.cli.MavenCli.main(MavenCli.java:191)
 at java.base/jdk.internal.reflect.NativeMethodAccessorImpl.invoke0(Native Method)
 at java.base/jdk.internal.reflect.NativeMethodAccessorImpl.invoke(NativeMethodAccessorImpl.java:62)
 at java.base/jdk.internal.reflect.DelegatingMethodAccessorImpl.invoke(DelegatingMethodAccessorImpl.java:43)
 at java.base/java.lang.reflect.Method.invoke(Method.java:564)
 at org.codehaus.plexus.classworlds.launcher.Launcher.launchEnhanced(Launcher.java:289)
 at org.codehaus.plexus.classworlds.launcher.Launcher.launch(Launcher.java:229)
 at org.codehaus.plexus.classworlds.launcher.Launcher.mainWithExitCode(Launcher.java:415)
 at org.codehaus.plexus.classworlds.launcher.Launcher.main(Launcher.java:356)
Caused by: org.eclipse.aether.resolution.ArtifactResolutionException: Could not find artifact org.apache.maven.plugin.rresource.it:it-parent:pom:1.6-SNAPSHOT in apache-snapshots (http://repository.apache.org/snapshots/)
 at org.eclipse.aether.internal.impl.DefaultArtifactResolver.resolve(DefaultArtifactResolver.java:453)
 at org.eclipse.aether.internal.impl.DefaultArtifactResolver.resolveArtifacts(DefaultArtifactResolver.java:255)
 at org.eclipse.aether.internal.impl.DefaultArtifactResolver.resolveArtifact(DefaultArtifactResolver.java:232)
 at org.eclipse.aether.internal.impl.DefaultRepositorySystem.resolveArtifact(DefaultRepositorySystem.java:303)
 at org.apache.maven.project.ProjectModelResolver.resolveModel(ProjectModelResolver.java:193)
 ... 27 more
Caused by: org.eclipse.aether.transfer.ArtifactNotFoundException: Could not find artifact org.apache.maven.plugin.rresource.it:it-parent:pom:1.6-SNAPSHOT in apache-snapshots (http://repository.apache.org/snapshots/)
 at org.eclipse.aether.connector.basic.ArtifactTransportListener.transferFailed(ArtifactTransportListener.java:48)
 at org.eclipse.aether.connector.basic.BasicRepositoryConnector$TaskRunner.run(BasicRepositoryConnector.java:364)
 at org.eclipse.aether.util.concurrency.RunnableErrorForwarder$1.run(RunnableErrorForwarder.java:76)
 at org.eclipse.aether.connector.basic.BasicRepositoryConnector$DirectExecutor.execute(BasicRepositoryConnector.java:590)
 at org.eclipse.aether.connector.basic.BasicRepositoryConnector.get(BasicRepositoryConnector.java:258)
 at org.eclipse.aether.internal.impl.DefaultArtifactResolver.performDownloads(DefaultArtifactResolver.java:529)
 at org.eclipse.aether.internal.impl.DefaultArtifactResolver.resolve(DefaultArtifactResolver.java:430)
 ... 31 more
[ERROR]  
[ERROR]   The project org.apache.maven.plugin.rresource.it.mrr41:child-2:[unknown-version] (F:\jenkins\jenkins-slave\workspace\rces-plugin_MRRESOURCES-103-OWZ3HFZ43MS4CUVJZUVLTQDPH6VF24RFDOZDFCITEPHO3WVUHWJQ\m\target\test-classes\run-only-at-execution-root\child2\pom.xml) has 1 error
[ERROR]     Non-resolvable parent POM for org.apache.maven.plugin.rresource.it.mrr41:parent:[unknown-version]: Failure to find org.apache.maven.plugin.rresource.it:it-parent:pom:1.6-SNAPSHOT in http://repository.apache.org/snapshots/ was cached in the local repository, resolution will not be reattempted until the update interval of apache-snapshots has elapsed or updates are forced and 'parent.relativePath' points at wrong local POM @ org.apache.maven.plugin.rresource.it.mrr41:parent:[unknown-version], F:\jenkins\jenkins-slave\workspace\rces-plugin_MRRESOURCES-103-OWZ3HFZ43MS4CUVJZUVLTQDPH6VF24RFDOZDFCITEPHO3WVUHWJQ\m\target\test-classes\run-only-at-execution-root\pom.xml, line 24, column 11 -> [Help 2]
org.apache.maven.model.resolution.UnresolvableModelException: Failure to find org.apache.maven.plugin.rresource.it:it-parent:pom:1.6-SNAPSHOT in http://repository.apache.org/snapshots/ was cached in the local repository, resolution will not be reattempted until the update interval of apache-snapshots has elapsed or updates are forced
 at org.apache.maven.project.ProjectModelResolver.resolveModel(ProjectModelResolver.java:197)
 at org.apache.maven.project.ProjectModelResolver.resolveModel(ProjectModelResolver.java:243)
 at org.apache.maven.model.building.DefaultModelBuilder.readParentExternally(DefaultModelBuilder.java:1051)
 at org.apache.maven.model.building.DefaultModelBuilder.readParent(DefaultModelBuilder.java:851)
 at org.apache.maven.model.building.DefaultModelBuilder.build(DefaultModelBuilder.java:331)
 at org.apache.maven.project.DefaultProjectBuilder.build(DefaultProjectBuilder.java:429)
 at org.apache.maven.project.DefaultProjectBuilder.build(DefaultProjectBuilder.java:398)
 at org.apache.maven.project.DefaultProjectBuilder.build(DefaultProjectBuilder.java:515)
 at org.apache.maven.project.DefaultProjectBuilder.build(DefaultProjectBuilder.java:398)
 at org.apache.maven.project.DefaultProjectBuilder.build(DefaultProjectBuilder.java:361)
 at org.apache.maven.graph.DefaultGraphBuilder.collectProjects(DefaultGraphBuilder.java:400)
 at org.apache.maven.graph.DefaultGraphBuilder.getProjectsForMavenReactor(DefaultGraphBuilder.java:391)
 at org.apache.maven.graph.DefaultGraphBuilder.build(DefaultGraphBuilder.java:78)
 at org.apache.maven.DefaultMaven.buildGraph(DefaultMaven.java:511)
 at org.apache.maven.DefaultMaven.doExecute(DefaultMaven.java:221)
 at org.apache.maven.DefaultMaven.doExecute(DefaultMaven.java:194)
 at org.apache.maven.DefaultMaven.execute(DefaultMaven.java:107)
 at org.apache.maven.cli.MavenCli.execute(MavenCli.java:993)
 at org.apache.maven.cli.MavenCli.doMain(MavenCli.java:345)
 at org.apache.maven.cli.MavenCli.main(MavenCli.java:191)
 at java.base/jdk.internal.reflect.NativeMethodAccessorImpl.invoke0(Native Method)
 at java.base/jdk.internal.reflect.NativeMethodAccessorImpl.invoke(NativeMethodAccessorImpl.java:62)
 at java.base/jdk.internal.reflect.DelegatingMethodAccessorImpl.invoke(DelegatingMethodAccessorImpl.java:43)
 at java.base/java.lang.reflect.Method.invoke(Method.java:564)
 at org.codehaus.plexus.classworlds.launcher.Launcher.launchEnhanced(Launcher.java:289)
 at org.codehaus.plexus.classworlds.launcher.Launcher.launch(Launcher.java:229)
 at org.codehaus.plexus.classworlds.launcher.Launcher.mainWithExitCode(Launcher.java:415)
 at org.codehaus.plexus.classworlds.launcher.Launcher.main(Launcher.java:356)
Caused by: org.eclipse.aether.resolution.ArtifactResolutionException: Failure to find org.apache.maven.plugin.rresource.it:it-parent:pom:1.6-SNAPSHOT in http://repository.apache.org/snapshots/ was cached in the local repository, resolution will not be reattempted until the update interval of apache-snapshots has elapsed or updates are forced
 at org.eclipse.aether.internal.impl.DefaultArtifactResolver.resolve(DefaultArtifactResolver.java:453)
 at org.eclipse.aether.internal.impl.DefaultArtifactResolver.resolveArtifacts(DefaultArtifactResolver.java:255)
 at org.eclipse.aether.internal.impl.DefaultArtifactResolver.resolveArtifact(DefaultArtifactResolver.java:232)
 at org.eclipse.aether.internal.impl.DefaultRepositorySystem.resolveArtifact(DefaultRepositorySystem.java:303)
 at org.apache.maven.project.ProjectModelResolver.resolveModel(ProjectModelResolver.java:193)
 ... 27 more
Caused by: org.eclipse.aether.transfer.ArtifactNotFoundException: Failure to find org.apache.maven.plugin.rresource.it:it-parent:pom:1.6-SNAPSHOT in http://repository.apache.org/snapshots/ was cached in the local repository, resolution will not be reattempted until the update interval of apache-snapshots has elapsed or updates are forced
 at org.eclipse.aether.internal.impl.DefaultUpdateCheckManager.newException(DefaultUpdateCheckManager.java:240)
 at org.eclipse.aether.internal.impl.DefaultUpdateCheckManager.checkArtifact(DefaultUpdateCheckManager.java:192)
 at org.eclipse.aether.internal.impl.DefaultArtifactResolver.gatherDownloads(DefaultArtifactResolver.java:594)
 at org.eclipse.aether.internal.impl.DefaultArtifactResolver.performDownloads(DefaultArtifactResolver.java:512)
 at org.eclipse.aether.internal.impl.DefaultArtifactResolver.resolve(DefaultArtifactResolver.java:430)
 ... 31 more
[ERROR]
[ERROR] Re-run Maven using the -X switch to enable full debug logging.
[ERROR]
[ERROR] For more information about the errors and possible solutions, please read the following articles:
[ERROR] [Help 1] http://cwiki.apache.org/confluence/display/MAVEN/ProjectBuildingException
[ERROR] [Help 2] http://cwiki.apache.org/confluence/display/MAVEN/UnresolvableModelException


Stack Trace:
org.apache.maven.it.VerificationException:
Exit code was non-zero: 1; command line and log =
F:\jenkins\tools\maven\apache-maven-3.5.0\bin\mvn -e --batch-mode -Dmaven.repo.local=f:\jenkins\jenkins-slave\workspace\rces-plugin_MRRESOURCES-103-OWZ3HFZ43MS4CUVJZUVLTQDPH6VF24RFDOZDFCITEPHO3WVUHWJQ\m\target/it-repo org.apache.maven.plugins:maven-clean-plugin:clean generate-resources
Picked up JAVA_TOOL_OPTIONS: -Dmaven.ext.class.path="f:\jenkins\jenkins-slave\workspace\rces-plugin_MRRESOURCES-103-OWZ3HFZ43MS4CUVJZUVLTQDPH6VF24RFDOZDFCITEPHO3WVUHWJQ@tmp\withMavene513d22a\pipeline-maven-spy.jar" -Dorg.jenkinsci.plugins.pipeline.maven.reportsFolder="f:\jenkins\jenkins-slave\workspace\rces-plugin_MRRESOURCES-103-OWZ3HFZ43MS4CUVJZUVLTQDPH6VF24RFDOZDFCITEPHO3WVUHWJQ@tmp\withMavene513d22a"
[INFO] [jenkins-event-spy] Jenkins Maven Event Spy is disabled
[INFO] Error stacktraces are turned on.
[INFO] Scanning for projects...
[INFO] Downloading: http://repository.apache.org/snapshots/org/apache/maven/plugin/rresource/it/it-parent/1.6-SNAPSHOT/maven-metadata.xml
[INFO] Downloading: http://repository.apache.org/snapshots/org/apache/maven/plugin/rresource/it/it-parent/1.6-SNAPSHOT/it-parent-1.6-SNAPSHOT.pom
[ERROR] [ERROR] Some problems were encountered while processing the POMs:
[FATAL] Non-resolvable parent POM for org.apache.maven.plugin.rresource.it.mrr41:parent:[unknown-version]: Could not find artifact org.apache.maven.plugin.rresource.it:it-parent:pom:1.6-SNAPSHOT in apache-snapshots (http://repository.apache.org/snapshots/) and 'parent.relativePath' points at wrong local POM @ org.apache.maven.plugin.rresource.it.mrr41:parent:[unknown-version], F:\jenkins\jenkins-slave\workspace\rces-plugin_MRRESOURCES-103-OWZ3HFZ43MS4CUVJZUVLTQDPH6VF24RFDOZDFCITEPHO3WVUHWJQ\m\target\test-classes\run-only-at-execution-root\pom.xml, line 24, column 11
[FATAL] Non-resolvable parent POM for org.apache.maven.plugin.rresource.it.mrr41:parent:[unknown-version]: Failure to find org.apache.maven.plugin.rresource.it:it-parent:pom:1.6-SNAPSHOT in http://repository.apache.org/snapshots/ was cached in the local repository, resolution will not be reattempted until the update interval of apache-snapshots has elapsed or updates are forced and 'parent.relativePath' points at wrong local POM @ org.apache.maven.plugin.rresource.it.mrr41:parent:[unknown-version], F:\jenkins\jenkins-slave\workspace\rces-plugin_MRRESOURCES-103-OWZ3HFZ43MS4CUVJZUVLTQDPH6VF24RFDOZDFCITEPHO3WVUHWJQ\m\target\test-classes\run-only-at-execution-root\pom.xml, line 24, column 11
 @
[ERROR] The build could not read 2 projects -> [Help 1]
org.apache.maven.project.ProjectBuildingException: Some problems were encountered while processing the POMs:
[FATAL] Non-resolvable parent POM for org.apache.maven.plugin.rresource.it.mrr41:parent:[unknown-version]: Could not find artifact org.apache.maven.plugin.rresource.it:it-parent:pom:1.6-SNAPSHOT in apache-snapshots (http://repository.apache.org/snapshots/) and 'parent.relativePath' points at wrong local POM @ org.apache.maven.plugin.rresource.it.mrr41:parent:[unknown-version], F:\jenkins\jenkins-slave\workspace\rces-plugin_MRRESOURCES-103-OWZ3HFZ43MS4CUVJZUVLTQDPH6VF24RFDOZDFCITEPHO3WVUHWJQ\m\target\test-classes\run-only-at-execution-root\pom.xml, line 24, column 11
[FATAL] Non-resolvable parent POM for org.apache.maven.plugin.rresource.it.mrr41:parent:[unknown-version]: Failure to find org.apache.maven.plugin.rresource.it:it-parent:pom:1.6-SNAPSHOT in http://repository.apache.org/snapshots/ was cached in the local repository, resolution will not be reattempted until the update interval of apache-snapshots has elapsed or updates are forced and 'parent.relativePath' points at wrong local POM @ org.apache.maven.plugin.rresource.it.mrr41:parent:[unknown-version], F:\jenkins\jenkins-slave\workspace\rces-plugin_MRRESOURCES-103-OWZ3HFZ43MS4CUVJZUVLTQDPH6VF24RFDOZDFCITEPHO3WVUHWJQ\m\target\test-classes\run-only-at-execution-root\pom.xml, line 24, column 11

        at org.apache.maven.project.DefaultProjectBuilder.build(DefaultProjectBuilder.java:382)
        at org.apache.maven.graph.DefaultGraphBuilder.collectProjects(DefaultGraphBuilder.java:400)
        at org.apache.maven.graph.DefaultGraphBuilder.getProjectsForMavenReactor(DefaultGraphBuilder.java:391)
        at org.apache.maven.graph.DefaultGraphBuilder.build(DefaultGraphBuilder.java:78)
        at org.apache.maven.DefaultMaven.buildGraph(DefaultMaven.java:511)
        at org.apache.maven.DefaultMaven.doExecute(DefaultMaven.java:221)
        at org.apache.maven.DefaultMaven.doExecute(DefaultMaven.java:194)
        at org.apache.maven.DefaultMaven.execute(DefaultMaven.java:107)
        at org.apache.maven.cli.MavenCli.execute(MavenCli.java:993)
        at org.apache.maven.cli.MavenCli.doMain(MavenCli.java:345)
        at org.apache.maven.cli.MavenCli.main(MavenCli.java:191)
        at java.base/jdk.internal.reflect.NativeMethodAccessorImpl.invoke0(Native Method)
        at java.base/jdk.internal.reflect.NativeMethodAccessorImpl.invoke(NativeMethodAccessorImpl.java:62)
        at java.base/jdk.internal.reflect.DelegatingMethodAccessorImpl.invoke(DelegatingMethodAccessorImpl.java:43)
        at java.base/java.lang.reflect.Method.invoke(Method.java:564)
        at org.codehaus.plexus.classworlds.launcher.Launcher.launchEnhanced(Launcher.java:289)
        at org.codehaus.plexus.classworlds.launcher.Launcher.launch(Launcher.java:229)
        at org.codehaus.plexus.classworlds.launcher.Launcher.mainWithExitCode(Launcher.java:415)
        at org.codehaus.plexus.classworlds.launcher.Launcher.main(Launcher.java:356)
[ERROR]  
[ERROR]   The project org.apache.maven.plugin.rresource.it.mrr41:child-1:[unknown-version] (F:\jenkins\jenkins-slave\workspace\rces-plugin_MRRESOURCES-103-OWZ3HFZ43MS4CUVJZUVLTQDPH6VF24RFDOZDFCITEPHO3WVUHWJQ\m\target\test-classes\run-only-at-execution-root\child1\pom.xml) has 1 error
[ERROR]     Non-resolvable parent POM for org.apache.maven.plugin.rresource.it.mrr41:parent:[unknown-version]: Could not find artifact org.apache.maven.plugin.rresource.it:it-parent:pom:1.6-SNAPSHOT in apache-snapshots (http://repository.apache.org/snapshots/) and 'parent.relativePath' points at wrong local POM @ org.apache.maven.plugin.rresource.it.mrr41:parent:[unknown-version], F:\jenkins\jenkins-slave\workspace\rces-plugin_MRRESOURCES-103-OWZ3HFZ43MS4CUVJZUVLTQDPH6VF24RFDOZDFCITEPHO3WVUHWJQ\m\target\test-classes\run-only-at-execution-root\pom.xml, line 24, column 11 -> [Help 2]
org.apache.maven.model.resolution.UnresolvableModelException: Could not find artifact org.apache.maven.plugin.rresource.it:it-parent:pom:1.6-SNAPSHOT in apache-snapshots (http://repository.apache.org/snapshots/)
        at org.apache.maven.project.ProjectModelResolver.resolveModel(ProjectModelResolver.java:197)
        at org.apache.maven.project.ProjectModelResolver.resolveModel(ProjectModelResolver.java:243)
        at org.apache.maven.model.building.DefaultModelBuilder.readParentExternally(DefaultModelBuilder.java:1051)
        at org.apache.maven.model.building.DefaultModelBuilder.readParent(DefaultModelBuilder.java:851)
        at org.apache.maven.model.building.DefaultModelBuilder.build(DefaultModelBuilder.java:331)
        at org.apache.maven.project.DefaultProjectBuilder.build(DefaultProjectBuilder.java:429)
        at org.apache.maven.project.DefaultProjectBuilder.build(DefaultProjectBuilder.java:398)
        at org.apache.maven.project.DefaultProjectBuilder.build(DefaultProjectBuilder.java:515)
        at org.apache.maven.project.DefaultProjectBuilder.build(DefaultProjectBuilder.java:398)
        at org.apache.maven.project.DefaultProjectBuilder.build(DefaultProjectBuilder.java:361)
        at org.apache.maven.graph.DefaultGraphBuilder.collectProjects(DefaultGraphBuilder.java:400)
        at org.apache.maven.graph.DefaultGraphBuilder.getProjectsForMavenReactor(DefaultGraphBuilder.java:391)
        at org.apache.maven.graph.DefaultGraphBuilder.build(DefaultGraphBuilder.java:78)
        at org.apache.maven.DefaultMaven.buildGraph(DefaultMaven.java:511)
        at org.apache.maven.DefaultMaven.doExecute(DefaultMaven.java:221)
        at org.apache.maven.DefaultMaven.doExecute(DefaultMaven.java:194)
        at org.apache.maven.DefaultMaven.execute(DefaultMaven.java:107)
        at org.apache.maven.cli.MavenCli.execute(MavenCli.java:993)
        at org.apache.maven.cli.MavenCli.doMain(MavenCli.java:345)
        at org.apache.maven.cli.MavenCli.main(MavenCli.java:191)
        at java.base/jdk.internal.reflect.NativeMethodAccessorImpl.invoke0(Native Method)
        at java.base/jdk.internal.reflect.NativeMethodAccessorImpl.invoke(NativeMethodAccessorImpl.java:62)
        at java.base/jdk.internal.reflect.DelegatingMethodAccessorImpl.invoke(DelegatingMethodAccessorImpl.java:43)
        at java.base/java.lang.reflect.Method.invoke(Method.java:564)
        at org.codehaus.plexus.classworlds.launcher.Launcher.launchEnhanced(Launcher.java:289)
        at org.codehaus.plexus.classworlds.launcher.Launcher.launch(Launcher.java:229)
        at org.codehaus.plexus.classworlds.launcher.Launcher.mainWithExitCode(Launcher.java:415)
        at org.codehaus.plexus.classworlds.launcher.Launcher.main(Launcher.java:356)
Caused by: org.eclipse.aether.resolution.ArtifactResolutionException: Could not find artifact org.apache.maven.plugin.rresource.it:it-parent:pom:1.6-SNAPSHOT in apache-snapshots (http://repository.apache.org/snapshots/)
        at org.eclipse.aether.internal.impl.DefaultArtifactResolver.resolve(DefaultArtifactResolver.java:453)
        at org.eclipse.aether.internal.impl.DefaultArtifactResolver.resolveArtifacts(DefaultArtifactResolver.java:255)
        at org.eclipse.aether.internal.impl.DefaultArtifactResolver.resolveArtifact(DefaultArtifactResolver.java:232)
        at org.eclipse.aether.internal.impl.DefaultRepositorySystem.resolveArtifact(DefaultRepositorySystem.java:303)
        at org.apache.maven.project.ProjectModelResolver.resolveModel(ProjectModelResolver.java:193)
        ... 27 more
Caused by: org.eclipse.aether.transfer.ArtifactNotFoundException: Could not find artifact org.apache.maven.plugin.rresource.it:it-parent:pom:1.6-SNAPSHOT in apache-snapshots (http://repository.apache.org/snapshots/)
        at org.eclipse.aether.connector.basic.ArtifactTransportListener.transferFailed(ArtifactTransportListener.java:48)
        at org.eclipse.aether.connector.basic.BasicRepositoryConnector$TaskRunner.run(BasicRepositoryConnector.java:364)
        at org.eclipse.aether.util.concurrency.RunnableErrorForwarder$1.run(RunnableErrorForwarder.java:76)
        at org.eclipse.aether.connector.basic.BasicRepositoryConnector$DirectExecutor.execute(BasicRepositoryConnector.java:590)
        at org.eclipse.aether.connector.basic.BasicRepositoryConnector.get(BasicRepositoryConnector.java:258)
        at org.eclipse.aether.internal.impl.DefaultArtifactResolver.performDownloads(DefaultArtifactResolver.java:529)
        at org.eclipse.aether.internal.impl.DefaultArtifactResolver.resolve(DefaultArtifactResolver.java:430)
        ... 31 more
[ERROR]  
[ERROR]   The project org.apache.maven.plugin.rresource.it.mrr41:child-2:[unknown-version] (F:\jenkins\jenkins-slave\workspace\rces-plugin_MRRESOURCES-103-OWZ3HFZ43MS4CUVJZUVLTQDPH6VF24RFDOZDFCITEPHO3WVUHWJQ\m\target\test-classes\run-only-at-execution-root\child2\pom.xml) has 1 error
[ERROR]     Non-resolvable parent POM for org.apache.maven.plugin.rresource.it.mrr41:parent:[unknown-version]: Failure to find org.apache.maven.plugin.rresource.it:it-parent:pom:1.6-SNAPSHOT in http://repository.apache.org/snapshots/ was cached in the local repository, resolution will not be reattempted until the update interval of apache-snapshots has elapsed or updates are forced and 'parent.relativePath' points at wrong local POM @ org.apache.maven.plugin.rresource.it.mrr41:parent:[unknown-version], F:\jenkins\jenkins-slave\workspace\rces-plugin_MRRESOURCES-103-OWZ3HFZ43MS4CUVJZUVLTQDPH6VF24RFDOZDFCITEPHO3WVUHWJQ\m\target\test-classes\run-only-at-execution-root\pom.xml, line 24, column 11 -> [Help 2]
org.apache.maven.model.resolution.UnresolvableModelException: Failure to find org.apache.maven.plugin.rresource.it:it-parent:pom:1.6-SNAPSHOT in http://repository.apache.org/snapshots/ was cached in the local repository, resolution will not be reattempted until the update interval of apache-snapshots has elapsed or updates are forced
        at org.apache.maven.project.ProjectModelResolver.resolveModel(ProjectModelResolver.java:197)
        at org.apache.maven.project.ProjectModelResolver.resolveModel(ProjectModelResolver.java:243)
        at org.apache.maven.model.building.DefaultModelBuilder.readParentExternally(DefaultModelBuilder.java:1051)
        at org.apache.maven.model.building.DefaultModelBuilder.readParent(DefaultModelBuilder.java:851)
        at org.apache.maven.model.building.DefaultModelBuilder.build(DefaultModelBuilder.java:331)
        at org.apache.maven.project.DefaultProjectBuilder.build(DefaultProjectBuilder.java:429)
        at org.apache.maven.project.DefaultProjectBuilder.build(DefaultProjectBuilder.java:398)
        at org.apache.maven.project.DefaultProjectBuilder.build(DefaultProjectBuilder.java:515)
        at org.apache.maven.project.DefaultProjectBuilder.build(DefaultProjectBuilder.java:398)
        at org.apache.maven.project.DefaultProjectBuilder.build(DefaultProjectBuilder.java:361)
        at org.apache.maven.graph.DefaultGraphBuilder.collectProjects(DefaultGraphBuilder.java:400)
        at org.apache.maven.graph.DefaultGraphBuilder.getProjectsForMavenReactor(DefaultGraphBuilder.java:391)
        at org.apache.maven.graph.DefaultGraphBuilder.build(DefaultGraphBuilder.java:78)
        at org.apache.maven.DefaultMaven.buildGraph(DefaultMaven.java:511)
        at org.apache.maven.DefaultMaven.doExecute(DefaultMaven.java:221)
        at org.apache.maven.DefaultMaven.doExecute(DefaultMaven.java:194)
        at org.apache.maven.DefaultMaven.execute(DefaultMaven.java:107)
        at org.apache.maven.cli.MavenCli.execute(MavenCli.java:993)
        at org.apache.maven.cli.MavenCli.doMain(MavenCli.java:345)
        at org.apache.maven.cli.MavenCli.main(MavenCli.java:191)
        at java.base/jdk.internal.reflect.NativeMethodAccessorImpl.invoke0(Native Method)
        at java.base/jdk.internal.reflect.NativeMethodAccessorImpl.invoke(NativeMethodAccessorImpl.java:62)
        at java.base/jdk.internal.reflect.DelegatingMethodAccessorImpl.invoke(DelegatingMethodAccessorImpl.java:43)
        at java.base/java.lang.reflect.Method.invoke(Method.java:564)
        at org.codehaus.plexus.classworlds.launcher.Launcher.launchEnhanced(Launcher.java:289)
        at org.codehaus.plexus.classworlds.launcher.Launcher.launch(Launcher.java:229)
        at org.codehaus.plexus.classworlds.launcher.Launcher.mainWithExitCode(Launcher.java:415)
        at org.codehaus.plexus.classworlds.launcher.Launcher.main(Launcher.java:356)
Caused by: org.eclipse.aether.resolution.ArtifactResolutionException: Failure to find org.apache.maven.plugin.rresource.it:it-parent:pom:1.6-SNAPSHOT in http://repository.apache.org/snapshots/ was cached in the local repository, resolution will not be reattempted until the update interval of apache-snapshots has elapsed or updates are forced
        at org.eclipse.aether.internal.impl.DefaultArtifactResolver.resolve(DefaultArtifactResolver.java:453)
        at org.eclipse.aether.internal.impl.DefaultArtifactResolver.resolveArtifacts(DefaultArtifactResolver.java:255)
        at org.eclipse.aether.internal.impl.DefaultArtifactResolver.resolveArtifact(DefaultArtifactResolver.java:232)
        at org.eclipse.aether.internal.impl.DefaultRepositorySystem.resolveArtifact(DefaultRepositorySystem.java:303)
        at org.apache.maven.project.ProjectModelResolver.resolveModel(ProjectModelResolver.java:193)
        ... 27 more
Caused by: org.eclipse.aether.transfer.ArtifactNotFoundException: Failure to find org.apache.maven.plugin.rresource.it:it-parent:pom:1.6-SNAPSHOT in http://repository.apache.org/snapshots/ was cached in the local repository, resolution will not be reattempted until the update interval of apache-snapshots has elapsed or updates are forced
        at org.eclipse.aether.internal.impl.DefaultUpdateCheckManager.newException(DefaultUpdateCheckManager.java:240)
        at org.eclipse.aether.internal.impl.DefaultUpdateCheckManager.checkArtifact(DefaultUpdateCheckManager.java:192)
        at org.eclipse.aether.internal.impl.DefaultArtifactResolver.gatherDownloads(DefaultArtifactResolver.java:594)
        at org.eclipse.aether.internal.impl.DefaultArtifactResolver.performDownloads(DefaultArtifactResolver.java:512)
        at org.eclipse.aether.internal.impl.DefaultArtifactResolver.resolve(DefaultArtifactResolver.java:430)
        ... 31 more
[ERROR]
[ERROR] Re-run Maven using the -X switch to enable full debug logging.
[ERROR]
[ERROR] For more information about the errors and possible solutions, please read the following articles:
[ERROR] [Help 1] http://cwiki.apache.org/confluence/display/MAVEN/ProjectBuildingException
[ERROR] [Help 2] http://cwiki.apache.org/confluence/display/MAVEN/UnresolvableModelException

        at org.apache.maven.plugin.resources.remote.it.IT_RunOnlyAtExecutionRoot.test(IT_RunOnlyAtExecutionRoot.java:60)


FAILED:  org.apache.maven.plugin.resources.remote.it.IT_RunOnlyAtExecutionRoot.test

Error Message:
Exit code was non-zero: 1; command line and log =
F:\jenkins\tools\maven\apache-maven-3.5.0\bin\mvn -e --batch-mode -Dmaven.repo.local=f:\jenkins\jenkins-slave\workspace\rces-plugin_MRRESOURCES-103-OWZ3HFZ43MS4CUVJZUVLTQDPH6VF24RFDOZDFCITEPHO3WVUHWJQ\m\target/it-repo org.apache.maven.plugins:maven-clean-plugin:clean generate-resources
[INFO] [jenkins-event-spy] Jenkins Maven Event Spy is disabled
[INFO] Error stacktraces are turned on.
[INFO] Scanning for projects...
[INFO] Downloading: http://repository.apache.org/snapshots/org/apache/maven/plugin/rresource/it/it-parent/1.6-SNAPSHOT/maven-metadata.xml
[INFO] Downloading: http://repository.apache.org/snapshots/org/apache/maven/plugin/rresource/it/it-parent/1.6-SNAPSHOT/it-parent-1.6-SNAPSHOT.pom
[ERROR] [ERROR] Some problems were encountered while processing the POMs:
[FATAL] Non-resolvable parent POM for org.apache.maven.plugin.rresource.it.mrr41:parent:[unknown-version]: Could not find artifact org.apache.maven.plugin.rresource.it:it-parent:pom:1.6-SNAPSHOT in apache-snapshots (http://repository.apache.org/snapshots/) and 'parent.relativePath' points at wrong local POM @ org.apache.maven.plugin.rresource.it.mrr41:parent:[unknown-version], F:\jenkins\jenkins-slave\workspace\rces-plugin_MRRESOURCES-103-OWZ3HFZ43MS4CUVJZUVLTQDPH6VF24RFDOZDFCITEPHO3WVUHWJQ\m\target\test-classes\run-only-at-execution-root\pom.xml, line 24, column 11
[FATAL] Non-resolvable parent POM for org.apache.maven.plugin.rresource.it.mrr41:parent:[unknown-version]: Failure to find org.apache.maven.plugin.rresource.it:it-parent:pom:1.6-SNAPSHOT in http://repository.apache.org/snapshots/ was cached in the local repository, resolution will not be reattempted until the update interval of apache-snapshots has elapsed or updates are forced and 'parent.relativePath' points at wrong local POM @ org.apache.maven.plugin.rresource.it.mrr41:parent:[unknown-version], F:\jenkins\jenkins-slave\workspace\rces-plugin_MRRESOURCES-103-OWZ3HFZ43MS4CUVJZUVLTQDPH6VF24RFDOZDFCITEPHO3WVUHWJQ\m\target\test-classes\run-only-at-execution-root\pom.xml, line 24, column 11
 @
[ERROR] The build could not read 2 projects -> [Help 1]
org.apache.maven.project.ProjectBuildingException: Some problems were encountered while processing the POMs:
[FATAL] Non-resolvable parent POM for org.apache.maven.plugin.rresource.it.mrr41:parent:[unknown-version]: Could not find artifact org.apache.maven.plugin.rresource.it:it-parent:pom:1.6-SNAPSHOT in apache-snapshots (http://repository.apache.org/snapshots/) and 'parent.relativePath' points at wrong local POM @ org.apache.maven.plugin.rresource.it.mrr41:parent:[unknown-version], F:\jenkins\jenkins-slave\workspace\rces-plugin_MRRESOURCES-103-OWZ3HFZ43MS4CUVJZUVLTQDPH6VF24RFDOZDFCITEPHO3WVUHWJQ\m\target\test-classes\run-only-at-execution-root\pom.xml, line 24, column 11
[FATAL] Non-resolvable parent POM for org.apache.maven.plugin.rresource.it.mrr41:parent:[unknown-version]: Failure to find org.apache.maven.plugin.rresource.it:it-parent:pom:1.6-SNAPSHOT in http://repository.apache.org/snapshots/ was cached in the local repository, resolution will not be reattempted until the update interval of apache-snapshots has elapsed or updates are forced and 'parent.relativePath' points at wrong local POM @ org.apache.maven.plugin.rresource.it.mrr41:parent:[unknown-version], F:\jenkins\jenkins-slave\workspace\rces-plugin_MRRESOURCES-103-OWZ3HFZ43MS4CUVJZUVLTQDPH6VF24RFDOZDFCITEPHO3WVUHWJQ\m\target\test-classes\run-only-at-execution-root\pom.xml, line 24, column 11

 at org.apache.maven.project.DefaultProjectBuilder.build(DefaultProjectBuilder.java:382)
 at org.apache.maven.graph.DefaultGraphBuilder.collectProjects(DefaultGraphBuilder.java:400)
 at org.apache.maven.graph.DefaultGraphBuilder.getProjectsForMavenReactor(DefaultGraphBuilder.java:391)
 at org.apache.maven.graph.DefaultGraphBuilder.build(DefaultGraphBuilder.java:78)
 at org.apache.maven.DefaultMaven.buildGraph(DefaultMaven.java:511)
 at org.apache.maven.DefaultMaven.doExecute(DefaultMaven.java:221)
 at org.apache.maven.DefaultMaven.doExecute(DefaultMaven.java:194)
 at org.apache.maven.DefaultMaven.execute(DefaultMaven.java:107)
 at org.apache.maven.cli.MavenCli.execute(MavenCli.java:993)
 at org.apache.maven.cli.MavenCli.doMain(MavenCli.java:345)
 at org.apache.maven.cli.MavenCli.main(MavenCli.java:191)
 at sun.reflect.NativeMethodAccessorImpl.invoke0(Native Method)
 at sun.reflect.NativeMethodAccessorImpl.invoke(NativeMethodAccessorImpl.java:57)
 at sun.reflect.DelegatingMethodAccessorImpl.invoke(DelegatingMethodAccessorImpl.java:43)
 at java.lang.reflect.Method.invoke(Method.java:606)
 at org.codehaus.plexus.classworlds.launcher.Launcher.launchEnhanced(Launcher.java:289)
 at org.codehaus.plexus.classworlds.launcher.Launcher.launch(Launcher.java:229)
 at org.codehaus.plexus.classworlds.launcher.Launcher.mainWithExitCode(Launcher.java:415)
 at org.codehaus.plexus.classworlds.launcher.Launcher.main(Launcher.java:356)
[ERROR]  
[ERROR]   The project org.apache.maven.plugin.rresource.it.mrr41:child-1:[unknown-version] (F:\jenkins\jenkins-slave\workspace\rces-plugin_MRRESOURCES-103-OWZ3HFZ43MS4CUVJZUVLTQDPH6VF24RFDOZDFCITEPHO3WVUHWJQ\m\target\test-classes\run-only-at-execution-root\child1\pom.xml) has 1 error
[ERROR]     Non-resolvable parent POM for org.apache.maven.plugin.rresource.it.mrr41:parent:[unknown-version]: Could not find artifact org.apache.maven.plugin.rresource.it:it-parent:pom:1.6-SNAPSHOT in apache-snapshots (http://repository.apache.org/snapshots/) and 'parent.relativePath' points at wrong local POM @ org.apache.maven.plugin.rresource.it.mrr41:parent:[unknown-version], F:\jenkins\jenkins-slave\workspace\rces-plugin_MRRESOURCES-103-OWZ3HFZ43MS4CUVJZUVLTQDPH6VF24RFDOZDFCITEPHO3WVUHWJQ\m\target\test-classes\run-only-at-execution-root\pom.xml, line 24, column 11 -> [Help 2]
org.apache.maven.model.resolution.UnresolvableModelException: Could not find artifact org.apache.maven.plugin.rresource.it:it-parent:pom:1.6-SNAPSHOT in apache-snapshots (http://repository.apache.org/snapshots/)
 at org.apache.maven.project.ProjectModelResolver.resolveModel(ProjectModelResolver.java:197)
 at org.apache.maven.project.ProjectModelResolver.resolveModel(ProjectModelResolver.java:243)
 at org.apache.maven.model.building.DefaultModelBuilder.readParentExternally(DefaultModelBuilder.java:1051)
 at org.apache.maven.model.building.DefaultModelBuilder.readParent(DefaultModelBuilder.java:851)
 at org.apache.maven.model.building.DefaultModelBuilder.build(DefaultModelBuilder.java:331)
 at org.apache.maven.project.DefaultProjectBuilder.build(DefaultProjectBuilder.java:429)
 at org.apache.maven.project.DefaultProjectBuilder.build(DefaultProjectBuilder.java:398)
 at org.apache.maven.project.DefaultProjectBuilder.build(DefaultProjectBuilder.java:515)
 at org.apache.maven.project.DefaultProjectBuilder.build(DefaultProjectBuilder.java:398)
 at org.apache.maven.project.DefaultProjectBuilder.build(DefaultProjectBuilder.java:361)
 at org.apache.maven.graph.DefaultGraphBuilder.collectProjects(DefaultGraphBuilder.java:400)
 at org.apache.maven.graph.DefaultGraphBuilder.getProjectsForMavenReactor(DefaultGraphBuilder.java:391)
 at org.apache.maven.graph.DefaultGraphBuilder.build(DefaultGraphBuilder.java:78)
 at org.apache.maven.DefaultMaven.buildGraph(DefaultMaven.java:511)
 at org.apache.maven.DefaultMaven.doExecute(DefaultMaven.java:221)
 at org.apache.maven.DefaultMaven.doExecute(DefaultMaven.java:194)
 at org.apache.maven.DefaultMaven.execute(DefaultMaven.java:107)
 at org.apache.maven.cli.MavenCli.execute(MavenCli.java:993)
 at org.apache.maven.cli.MavenCli.doMain(MavenCli.java:345)
 at org.apache.maven.cli.MavenCli.main(MavenCli.java:191)
 at sun.reflect.NativeMethodAccessorImpl.invoke0(Native Method)
 at sun.reflect.NativeMethodAccessorImpl.invoke(NativeMethodAccessorImpl.java:57)
 at sun.reflect.DelegatingMethodAccessorImpl.invoke(DelegatingMethodAccessorImpl.java:43)
 at java.lang.reflect.Method.invoke(Method.java:606)
 at org.codehaus.plexus.classworlds.launcher.Launcher.launchEnhanced(Launcher.java:289)
 at org.codehaus.plexus.classworlds.launcher.Launcher.launch(Launcher.java:229)
 at org.codehaus.plexus.classworlds.launcher.Launcher.mainWithExitCode(Launcher.java:415)
 at org.codehaus.plexus.classworlds.launcher.Launcher.main(Launcher.java:356)
Caused by: org.eclipse.aether.resolution.ArtifactResolutionException: Could not find artifact org.apache.maven.plugin.rresource.it:it-parent:pom:1.6-SNAPSHOT in apache-snapshots (http://repository.apache.org/snapshots/)
 at org.eclipse.aether.internal.impl.DefaultArtifactResolver.resolve(DefaultArtifactResolver.java:453)
 at org.eclipse.aether.internal.impl.DefaultArtifactResolver.resolveArtifacts(DefaultArtifactResolver.java:255)
 at org.eclipse.aether.internal.impl.DefaultArtifactResolver.resolveArtifact(DefaultArtifactResolver.java:232)
 at org.eclipse.aether.internal.impl.DefaultRepositorySystem.resolveArtifact(DefaultRepositorySystem.java:303)
 at org.apache.maven.project.ProjectModelResolver.resolveModel(ProjectModelResolver.java:193)
 ... 27 more
Caused by: org.eclipse.aether.transfer.ArtifactNotFoundException: Could not find artifact org.apache.maven.plugin.rresource.it:it-parent:pom:1.6-SNAPSHOT in apache-snapshots (http://repository.apache.org/snapshots/)
 at org.eclipse.aether.connector.basic.ArtifactTransportListener.transferFailed(ArtifactTransportListener.java:48)
 at org.eclipse.aether.connector.basic.BasicRepositoryConnector$TaskRunner.run(BasicRepositoryConnector.java:364)
 at org.eclipse.aether.util.concurrency.RunnableErrorForwarder$1.run(RunnableErrorForwarder.java:76)
 at org.eclipse.aether.connector.basic.BasicRepositoryConnector$DirectExecutor.execute(BasicRepositoryConnector.java:590)
 at org.eclipse.aether.connector.basic.BasicRepositoryConnector.get(BasicRepositoryConnector.java:258)
 at org.eclipse.aether.internal.impl.DefaultArtifactResolver.performDownloads(DefaultArtifactResolver.java:529)
 at org.eclipse.aether.internal.impl.DefaultArtifactResolver.resolve(DefaultArtifactResolver.java:430)
 ... 31 more
[ERROR]  
[ERROR]   The project org.apache.maven.plugin.rresource.it.mrr41:child-2:[unknown-version] (F:\jenkins\jenkins-slave\workspace\rces-plugin_MRRESOURCES-103-OWZ3HFZ43MS4CUVJZUVLTQDPH6VF24RFDOZDFCITEPHO3WVUHWJQ\m\target\test-classes\run-only-at-execution-root\child2\pom.xml) has 1 error
[ERROR]     Non-resolvable parent POM for org.apache.maven.plugin.rresource.it.mrr41:parent:[unknown-version]: Failure to find org.apache.maven.plugin.rresource.it:it-parent:pom:1.6-SNAPSHOT in http://repository.apache.org/snapshots/ was cached in the local repository, resolution will not be reattempted until the update interval of apache-snapshots has elapsed or updates are forced and 'parent.relativePath' points at wrong local POM @ org.apache.maven.plugin.rresource.it.mrr41:parent:[unknown-version], F:\jenkins\jenkins-slave\workspace\rces-plugin_MRRESOURCES-103-OWZ3HFZ43MS4CUVJZUVLTQDPH6VF24RFDOZDFCITEPHO3WVUHWJQ\m\target\test-classes\run-only-at-execution-root\pom.xml, line 24, column 11 -> [Help 2]
org.apache.maven.model.resolution.UnresolvableModelException: Failure to find org.apache.maven.plugin.rresource.it:it-parent:pom:1.6-SNAPSHOT in http://repository.apache.org/snapshots/ was cached in the local repository, resolution will not be reattempted until the update interval of apache-snapshots has elapsed or updates are forced
 at org.apache.maven.project.ProjectModelResolver.resolveModel(ProjectModelResolver.java:197)
 at org.apache.maven.project.ProjectModelResolver.resolveModel(ProjectModelResolver.java:243)
 at org.apache.maven.model.building.DefaultModelBuilder.readParentExternally(DefaultModelBuilder.java:1051)
 at org.apache.maven.model.building.DefaultModelBuilder.readParent(DefaultModelBuilder.java:851)
 at org.apache.maven.model.building.DefaultModelBuilder.build(DefaultModelBuilder.java:331)
 at org.apache.maven.project.DefaultProjectBuilder.build(DefaultProjectBuilder.java:429)
 at org.apache.maven.project.DefaultProjectBuilder.build(DefaultProjectBuilder.java:398)
 at org.apache.maven.project.DefaultProjectBuilder.build(DefaultProjectBuilder.java:515)
 at org.apache.maven.project.DefaultProjectBuilder.build(DefaultProjectBuilder.java:398)
 at org.apache.maven.project.DefaultProjectBuilder.build(DefaultProjectBuilder.java:361)
 at org.apache.maven.graph.DefaultGraphBuilder.collectProjects(DefaultGraphBuilder.java:400)
 at org.apache.maven.graph.DefaultGraphBuilder.getProjectsForMavenReactor(DefaultGraphBuilder.java:391)
 at org.apache.maven.graph.DefaultGraphBuilder.build(DefaultGraphBuilder.java:78)
 at org.apache.maven.DefaultMaven.buildGraph(DefaultMaven.java:511)
 at org.apache.maven.DefaultMaven.doExecute(DefaultMaven.java:221)
 at org.apache.maven.DefaultMaven.doExecute(DefaultMaven.java:194)
 at org.apache.maven.DefaultMaven.execute(DefaultMaven.java:107)
 at org.apache.maven.cli.MavenCli.execute(MavenCli.java:993)
 at org.apache.maven.cli.MavenCli.doMain(MavenCli.java:345)
 at org.apache.maven.cli.MavenCli.main(MavenCli.java:191)
 at sun.reflect.NativeMethodAccessorImpl.invoke0(Native Method)
 at sun.reflect.NativeMethodAccessorImpl.invoke(NativeMethodAccessorImpl.java:57)
 at sun.reflect.DelegatingMethodAccessorImpl.invoke(DelegatingMethodAccessorImpl.java:43)
 at java.lang.reflect.Method.invoke(Method.java:606)
 at org.codehaus.plexus.classworlds.launcher.Launcher.launchEnhanced(Launcher.java:289)
 at org.codehaus.plexus.classworlds.launcher.Launcher.launch(Launcher.java:229)
 at org.codehaus.plexus.classworlds.launcher.Launcher.mainWithExitCode(Launcher.java:415)
 at org.codehaus.plexus.classworlds.launcher.Launcher.main(Launcher.java:356)
Caused by: org.eclipse.aether.resolution.ArtifactResolutionException: Failure to find org.apache.maven.plugin.rresource.it:it-parent:pom:1.6-SNAPSHOT in http://repository.apache.org/snapshots/ was cached in the local repository, resolution will not be reattempted until the update interval of apache-snapshots has elapsed or updates are forced
 at org.eclipse.aether.internal.impl.DefaultArtifactResolver.resolve(DefaultArtifactResolver.java:453)
 at org.eclipse.aether.internal.impl.DefaultArtifactResolver.resolveArtifacts(DefaultArtifactResolver.java:255)
 at org.eclipse.aether.internal.impl.DefaultArtifactResolver.resolveArtifact(DefaultArtifactResolver.java:232)
 at org.eclipse.aether.internal.impl.DefaultRepositorySystem.resolveArtifact(DefaultRepositorySystem.java:303)
 at org.apache.maven.project.ProjectModelResolver.resolveModel(ProjectModelResolver.java:193)
 ... 27 more
Caused by: org.eclipse.aether.transfer.ArtifactNotFoundException: Failure to find org.apache.maven.plugin.rresource.it:it-parent:pom:1.6-SNAPSHOT in http://repository.apache.org/snapshots/ was cached in the local repository, resolution will not be reattempted until the update interval of apache-snapshots has elapsed or updates are forced
 at org.eclipse.aether.internal.impl.DefaultUpdateCheckManager.newException(DefaultUpdateCheckManager.java:240)
 at org.eclipse.aether.internal.impl.DefaultUpdateCheckManager.checkArtifact(DefaultUpdateCheckManager.java:192)
 at org.eclipse.aether.internal.impl.DefaultArtifactResolver.gatherDownloads(DefaultArtifactResolver.java:594)
 at org.eclipse.aether.internal.impl.DefaultArtifactResolver.performDownloads(DefaultArtifactResolver.java:512)
 at org.eclipse.aether.internal.impl.DefaultArtifactResolver.resolve(DefaultArtifactResolver.java:430)
 ... 31 more
[ERROR]
[ERROR] Re-run Maven using the -X switch to enable full debug logging.
[ERROR]
[ERROR] For more information about the errors and possible solutions, please read the following articles:
[ERROR] [Help 1] http://cwiki.apache.org/confluence/display/MAVEN/ProjectBuildingException
[ERROR] [Help 2] http://cwiki.apache.org/confluence/display/MAVEN/UnresolvableModelException
Picked up JAVA_TOOL_OPTIONS: -Dmaven.ext.class.path="f:\jenkins\jenkins-slave\workspace\rces-plugin_MRRESOURCES-103-OWZ3HFZ43MS4CUVJZUVLTQDPH6VF24RFDOZDFCITEPHO3WVUHWJQ@tmp\withMavend4a3493b\pipeline-maven-spy.jar" -Dorg.jenkinsci.plugins.pipeline.maven.reportsFolder="f:\jenkins\jenkins-slave\workspace\rces-plugin_MRRESOURCES-103-OWZ3HFZ43MS4CUVJZUVLTQDPH6VF24RFDOZDFCITEPHO3WVUHWJQ@tmp\withMavend4a3493b"


Stack Trace:
org.apache.maven.it.VerificationException:
Exit code was non-zero: 1; command line and log =
F:\jenkins\tools\maven\apache-maven-3.5.0\bin\mvn -e --batch-mode -Dmaven.repo.local=f:\jenkins\jenkins-slave\workspace\rces-plugin_MRRESOURCES-103-OWZ3HFZ43MS4CUVJZUVLTQDPH6VF24RFDOZDFCITEPHO3WVUHWJQ\m\target/it-repo org.apache.maven.plugins:maven-clean-plugin:clean generate-resources
[INFO] [jenkins-event-spy] Jenkins Maven Event Spy is disabled
[INFO] Error stacktraces are turned on.
[INFO] Scanning for projects...
[INFO] Downloading: http://repository.apache.org/snapshots/org/apache/maven/plugin/rresource/it/it-parent/1.6-SNAPSHOT/maven-metadata.xml
[INFO] Downloading: http://repository.apache.org/snapshots/org/apache/maven/plugin/rresource/it/it-parent/1.6-SNAPSHOT/it-parent-1.6-SNAPSHOT.pom
[ERROR] [ERROR] Some problems were encountered while processing the POMs:
[FATAL] Non-resolvable parent POM for org.apache.maven.plugin.rresource.it.mrr41:parent:[unknown-version]: Could not find artifact org.apache.maven.plugin.rresource.it:it-parent:pom:1.6-SNAPSHOT in apache-snapshots (http://repository.apache.org/snapshots/) and 'parent.relativePath' points at wrong local POM @ org.apache.maven.plugin.rresource.it.mrr41:parent:[unknown-version], F:\jenkins\jenkins-slave\workspace\rces-plugin_MRRESOURCES-103-OWZ3HFZ43MS4CUVJZUVLTQDPH6VF24RFDOZDFCITEPHO3WVUHWJQ\m\target\test-classes\run-only-at-execution-root\pom.xml, line 24, column 11
[FATAL] Non-resolvable parent POM for org.apache.maven.plugin.rresource.it.mrr41:parent:[unknown-version]: Failure to find org.apache.maven.plugin.rresource.it:it-parent:pom:1.6-SNAPSHOT in http://repository.apache.org/snapshots/ was cached in the local repository, resolution will not be reattempted until the update interval of apache-snapshots has elapsed or updates are forced and 'parent.relativePath' points at wrong local POM @ org.apache.maven.plugin.rresource.it.mrr41:parent:[unknown-version], F:\jenkins\jenkins-slave\workspace\rces-plugin_MRRESOURCES-103-OWZ3HFZ43MS4CUVJZUVLTQDPH6VF24RFDOZDFCITEPHO3WVUHWJQ\m\target\test-classes\run-only-at-execution-root\pom.xml, line 24, column 11
 @
[ERROR] The build could not read 2 projects -> [Help 1]
org.apache.maven.project.ProjectBuildingException: Some problems were encountered while processing the POMs:
[FATAL] Non-resolvable parent POM for org.apache.maven.plugin.rresource.it.mrr41:parent:[unknown-version]: Could not find artifact org.apache.maven.plugin.rresource.it:it-parent:pom:1.6-SNAPSHOT in apache-snapshots (http://repository.apache.org/snapshots/) and 'parent.relativePath' points at wrong local POM @ org.apache.maven.plugin.rresource.it.mrr41:parent:[unknown-version], F:\jenkins\jenkins-slave\workspace\rces-plugin_MRRESOURCES-103-OWZ3HFZ43MS4CUVJZUVLTQDPH6VF24RFDOZDFCITEPHO3WVUHWJQ\m\target\test-classes\run-only-at-execution-root\pom.xml, line 24, column 11
[FATAL] Non-resolvable parent POM for org.apache.maven.plugin.rresource.it.mrr41:parent:[unknown-version]: Failure to find org.apache.maven.plugin.rresource.it:it-parent:pom:1.6-SNAPSHOT in http://repository.apache.org/snapshots/ was cached in the local repository, resolution will not be reattempted until the update interval of apache-snapshots has elapsed or updates are forced and 'parent.relativePath' points at wrong local POM @ org.apache.maven.plugin.rresource.it.mrr41:parent:[unknown-version], F:\jenkins\jenkins-slave\workspace\rces-plugin_MRRESOURCES-103-OWZ3HFZ43MS4CUVJZUVLTQDPH6VF24RFDOZDFCITEPHO3WVUHWJQ\m\target\test-classes\run-only-at-execution-root\pom.xml, line 24, column 11

        at org.apache.maven.project.DefaultProjectBuilder.build(DefaultProjectBuilder.java:382)
        at org.apache.maven.graph.DefaultGraphBuilder.collectProjects(DefaultGraphBuilder.java:400)
        at org.apache.maven.graph.DefaultGraphBuilder.getProjectsForMavenReactor(DefaultGraphBuilder.java:391)
        at org.apache.maven.graph.DefaultGraphBuilder.build(DefaultGraphBuilder.java:78)
        at org.apache.maven.DefaultMaven.buildGraph(DefaultMaven.java:511)
        at org.apache.maven.DefaultMaven.doExecute(DefaultMaven.java:221)
        at org.apache.maven.DefaultMaven.doExecute(DefaultMaven.java:194)
        at org.apache.maven.DefaultMaven.execute(DefaultMaven.java:107)
        at org.apache.maven.cli.MavenCli.execute(MavenCli.java:993)
        at org.apache.maven.cli.MavenCli.doMain(MavenCli.java:345)
        at org.apache.maven.cli.MavenCli.main(MavenCli.java:191)
        at sun.reflect.NativeMethodAccessorImpl.invoke0(Native Method)
        at sun.reflect.NativeMethodAccessorImpl.invoke(NativeMethodAccessorImpl.java:57)
        at sun.reflect.DelegatingMethodAccessorImpl.invoke(DelegatingMethodAccessorImpl.java:43)
        at java.lang.reflect.Method.invoke(Method.java:606)
        at org.codehaus.plexus.classworlds.launcher.Launcher.launchEnhanced(Launcher.java:289)
        at org.codehaus.plexus.classworlds.launcher.Launcher.launch(Launcher.java:229)
        at org.codehaus.plexus.classworlds.launcher.Launcher.mainWithExitCode(Launcher.java:415)
        at org.codehaus.plexus.classworlds.launcher.Launcher.main(Launcher.java:356)
[ERROR]  
[ERROR]   The project org.apache.maven.plugin.rresource.it.mrr41:child-1:[unknown-version] (F:\jenkins\jenkins-slave\workspace\rces-plugin_MRRESOURCES-103-OWZ3HFZ43MS4CUVJZUVLTQDPH6VF24RFDOZDFCITEPHO3WVUHWJQ\m\target\test-classes\run-only-at-execution-root\child1\pom.xml) has 1 error
[ERROR]     Non-resolvable parent POM for org.apache.maven.plugin.rresource.it.mrr41:parent:[unknown-version]: Could not find artifact org.apache.maven.plugin.rresource.it:it-parent:pom:1.6-SNAPSHOT in apache-snapshots (http://repository.apache.org/snapshots/) and 'parent.relativePath' points at wrong local POM @ org.apache.maven.plugin.rresource.it.mrr41:parent:[unknown-version], F:\jenkins\jenkins-slave\workspace\rces-plugin_MRRESOURCES-103-OWZ3HFZ43MS4CUVJZUVLTQDPH6VF24RFDOZDFCITEPHO3WVUHWJQ\m\target\test-classes\run-only-at-execution-root\pom.xml, line 24, column 11 -> [Help 2]
org.apache.maven.model.resolution.UnresolvableModelException: Could not find artifact org.apache.maven.plugin.rresource.it:it-parent:pom:1.6-SNAPSHOT in apache-snapshots (http://repository.apache.org/snapshots/)
        at org.apache.maven.project.ProjectModelResolver.resolveModel(ProjectModelResolver.java:197)
        at org.apache.maven.project.ProjectModelResolver.resolveModel(ProjectModelResolver.java:243)
        at org.apache.maven.model.building.DefaultModelBuilder.readParentExternally(DefaultModelBuilder.java:1051)
        at org.apache.maven.model.building.DefaultModelBuilder.readParent(DefaultModelBuilder.java:851)
        at org.apache.maven.model.building.DefaultModelBuilder.build(DefaultModelBuilder.java:331)
        at org.apache.maven.project.DefaultProjectBuilder.build(DefaultProjectBuilder.java:429)
        at org.apache.maven.project.DefaultProjectBuilder.build(DefaultProjectBuilder.java:398)
        at org.apache.maven.project.DefaultProjectBuilder.build(DefaultProjectBuilder.java:515)
        at org.apache.maven.project.DefaultProjectBuilder.build(DefaultProjectBuilder.java:398)
        at org.apache.maven.project.DefaultProjectBuilder.build(DefaultProjectBuilder.java:361)
        at org.apache.maven.graph.DefaultGraphBuilder.collectProjects(DefaultGraphBuilder.java:400)
        at org.apache.maven.graph.DefaultGraphBuilder.getProjectsForMavenReactor(DefaultGraphBuilder.java:391)
        at org.apache.maven.graph.DefaultGraphBuilder.build(DefaultGraphBuilder.java:78)
        at org.apache.maven.DefaultMaven.buildGraph(DefaultMaven.java:511)
        at org.apache.maven.DefaultMaven.doExecute(DefaultMaven.java:221)
        at org.apache.maven.DefaultMaven.doExecute(DefaultMaven.java:194)
        at org.apache.maven.DefaultMaven.execute(DefaultMaven.java:107)
        at org.apache.maven.cli.MavenCli.execute(MavenCli.java:993)
        at org.apache.maven.cli.MavenCli.doMain(MavenCli.java:345)
        at org.apache.maven.cli.MavenCli.main(MavenCli.java:191)
        at sun.reflect.NativeMethodAccessorImpl.invoke0(Native Method)
        at sun.reflect.NativeMethodAccessorImpl.invoke(NativeMethodAccessorImpl.java:57)
        at sun.reflect.DelegatingMethodAccessorImpl.invoke(DelegatingMethodAccessorImpl.java:43)
        at java.lang.reflect.Method.invoke(Method.java:606)
        at org.codehaus.plexus.classworlds.launcher.Launcher.launchEnhanced(Launcher.java:289)
        at org.codehaus.plexus.classworlds.launcher.Launcher.launch(Launcher.java:229)
        at org.codehaus.plexus.classworlds.launcher.Launcher.mainWithExitCode(Launcher.java:415)
        at org.codehaus.plexus.classworlds.launcher.Launcher.main(Launcher.java:356)
Caused by: org.eclipse.aether.resolution.ArtifactResolutionException: Could not find artifact org.apache.maven.plugin.rresource.it:it-parent:pom:1.6-SNAPSHOT in apache-snapshots (http://repository.apache.org/snapshots/)
        at org.eclipse.aether.internal.impl.DefaultArtifactResolver.resolve(DefaultArtifactResolver.java:453)
        at org.eclipse.aether.internal.impl.DefaultArtifactResolver.resolveArtifacts(DefaultArtifactResolver.java:255)
        at org.eclipse.aether.internal.impl.DefaultArtifactResolver.resolveArtifact(DefaultArtifactResolver.java:232)
        at org.eclipse.aether.internal.impl.DefaultRepositorySystem.resolveArtifact(DefaultRepositorySystem.java:303)
        at org.apache.maven.project.ProjectModelResolver.resolveModel(ProjectModelResolver.java:193)
        ... 27 more
Caused by: org.eclipse.aether.transfer.ArtifactNotFoundException: Could not find artifact org.apache.maven.plugin.rresource.it:it-parent:pom:1.6-SNAPSHOT in apache-snapshots (http://repository.apache.org/snapshots/)
        at org.eclipse.aether.connector.basic.ArtifactTransportListener.transferFailed(ArtifactTransportListener.java:48)
        at org.eclipse.aether.connector.basic.BasicRepositoryConnector$TaskRunner.run(BasicRepositoryConnector.java:364)
        at org.eclipse.aether.util.concurrency.RunnableErrorForwarder$1.run(RunnableErrorForwarder.java:76)
        at org.eclipse.aether.connector.basic.BasicRepositoryConnector$DirectExecutor.execute(BasicRepositoryConnector.java:590)
        at org.eclipse.aether.connector.basic.BasicRepositoryConnector.get(BasicRepositoryConnector.java:258)
        at org.eclipse.aether.internal.impl.DefaultArtifactResolver.performDownloads(DefaultArtifactResolver.java:529)
        at org.eclipse.aether.internal.impl.DefaultArtifactResolver.resolve(DefaultArtifactResolver.java:430)
        ... 31 more
[ERROR]  
[ERROR]   The project org.apache.maven.plugin.rresource.it.mrr41:child-2:[unknown-version] (F:\jenkins\jenkins-slave\workspace\rces-plugin_MRRESOURCES-103-OWZ3HFZ43MS4CUVJZUVLTQDPH6VF24RFDOZDFCITEPHO3WVUHWJQ\m\target\test-classes\run-only-at-execution-root\child2\pom.xml) has 1 error
[ERROR]     Non-resolvable parent POM for org.apache.maven.plugin.rresource.it.mrr41:parent:[unknown-version]: Failure to find org.apache.maven.plugin.rresource.it:it-parent:pom:1.6-SNAPSHOT in http://repository.apache.org/snapshots/ was cached in the local repository, resolution will not be reattempted until the update interval of apache-snapshots has elapsed or updates are forced and 'parent.relativePath' points at wrong local POM @ org.apache.maven.plugin.rresource.it.mrr41:parent:[unknown-version], F:\jenkins\jenkins-slave\workspace\rces-plugin_MRRESOURCES-103-OWZ3HFZ43MS4CUVJZUVLTQDPH6VF24RFDOZDFCITEPHO3WVUHWJQ\m\target\test-classes\run-only-at-execution-root\pom.xml, line 24, column 11 -> [Help 2]
org.apache.maven.model.resolution.UnresolvableModelException: Failure to find org.apache.maven.plugin.rresource.it:it-parent:pom:1.6-SNAPSHOT in http://repository.apache.org/snapshots/ was cached in the local repository, resolution will not be reattempted until the update interval of apache-snapshots has elapsed or updates are forced
        at org.apache.maven.project.ProjectModelResolver.resolveModel(ProjectModelResolver.java:197)
        at org.apache.maven.project.ProjectModelResolver.resolveModel(ProjectModelResolver.java:243)
        at org.apache.maven.model.building.DefaultModelBuilder.readParentExternally(DefaultModelBuilder.java:1051)
        at org.apache.maven.model.building.DefaultModelBuilder.readParent(DefaultModelBuilder.java:851)
        at org.apache.maven.model.building.DefaultModelBuilder.build(DefaultModelBuilder.java:331)
        at org.apache.maven.project.DefaultProjectBuilder.build(DefaultProjectBuilder.java:429)
        at org.apache.maven.project.DefaultProjectBuilder.build(DefaultProjectBuilder.java:398)
        at org.apache.maven.project.DefaultProjectBuilder.build(DefaultProjectBuilder.java:515)
        at org.apache.maven.project.DefaultProjectBuilder.build(DefaultProjectBuilder.java:398)
        at org.apache.maven.project.DefaultProjectBuilder.build(DefaultProjectBuilder.java:361)
        at org.apache.maven.graph.DefaultGraphBuilder.collectProjects(DefaultGraphBuilder.java:400)
        at org.apache.maven.graph.DefaultGraphBuilder.getProjectsForMavenReactor(DefaultGraphBuilder.java:391)
        at org.apache.maven.graph.DefaultGraphBuilder.build(DefaultGraphBuilder.java:78)
        at org.apache.maven.DefaultMaven.buildGraph(DefaultMaven.java:511)
        at org.apache.maven.DefaultMaven.doExecute(DefaultMaven.java:221)
        at org.apache.maven.DefaultMaven.doExecute(DefaultMaven.java:194)
        at org.apache.maven.DefaultMaven.execute(DefaultMaven.java:107)
        at org.apache.maven.cli.MavenCli.execute(MavenCli.java:993)
        at org.apache.maven.cli.MavenCli.doMain(MavenCli.java:345)
        at org.apache.maven.cli.MavenCli.main(MavenCli.java:191)
        at sun.reflect.NativeMethodAccessorImpl.invoke0(Native Method)
        at sun.reflect.NativeMethodAccessorImpl.invoke(NativeMethodAccessorImpl.java:57)
        at sun.reflect.DelegatingMethodAccessorImpl.invoke(DelegatingMethodAccessorImpl.java:43)
        at java.lang.reflect.Method.invoke(Method.java:606)
        at org.codehaus.plexus.classworlds.launcher.Launcher.launchEnhanced(Launcher.java:289)
        at org.codehaus.plexus.classworlds.launcher.Launcher.launch(Launcher.java:229)
        at org.codehaus.plexus.classworlds.launcher.Launcher.mainWithExitCode(Launcher.java:415)
        at org.codehaus.plexus.classworlds.launcher.Launcher.main(Launcher.java:356)
Caused by: org.eclipse.aether.resolution.ArtifactResolutionException: Failure to find org.apache.maven.plugin.rresource.it:it-parent:pom:1.6-SNAPSHOT in http://repository.apache.org/snapshots/ was cached in the local repository, resolution will not be reattempted until the update interval of apache-snapshots has elapsed or updates are forced
        at org.eclipse.aether.internal.impl.DefaultArtifactResolver.resolve(DefaultArtifactResolver.java:453)
        at org.eclipse.aether.internal.impl.DefaultArtifactResolver.resolveArtifacts(DefaultArtifactResolver.java:255)
        at org.eclipse.aether.internal.impl.DefaultArtifactResolver.resolveArtifact(DefaultArtifactResolver.java:232)
        at org.eclipse.aether.internal.impl.DefaultRepositorySystem.resolveArtifact(DefaultRepositorySystem.java:303)
        at org.apache.maven.project.ProjectModelResolver.resolveModel(ProjectModelResolver.java:193)
        ... 27 more
Caused by: org.eclipse.aether.transfer.ArtifactNotFoundException: Failure to find org.apache.maven.plugin.rresource.it:it-parent:pom:1.6-SNAPSHOT in http://repository.apache.org/snapshots/ was cached in the local repository, resolution will not be reattempted until the update interval of apache-snapshots has elapsed or updates are forced
        at org.eclipse.aether.internal.impl.DefaultUpdateCheckManager.newException(DefaultUpdateCheckManager.java:240)
        at org.eclipse.aether.internal.impl.DefaultUpdateCheckManager.checkArtifact(DefaultUpdateCheckManager.java:192)
        at org.eclipse.aether.internal.impl.DefaultArtifactResolver.gatherDownloads(DefaultArtifactResolver.java:594)
        at org.eclipse.aether.internal.impl.DefaultArtifactResolver.performDownloads(DefaultArtifactResolver.java:512)
        at org.eclipse.aether.internal.impl.DefaultArtifactResolver.resolve(DefaultArtifactResolver.java:430)
        ... 31 more
[ERROR]
[ERROR] Re-run Maven using the -X switch to enable full debug logging.
[ERROR]
[ERROR] For more information about the errors and possible solutions, please read the following articles:
[ERROR] [Help 1] http://cwiki.apache.org/confluence/display/MAVEN/ProjectBuildingException
[ERROR] [Help 2] http://cwiki.apache.org/confluence/display/MAVEN/UnresolvableModelException
Picked up JAVA_TOOL_OPTIONS: -Dmaven.ext.class.path="f:\jenkins\jenkins-slave\workspace\rces-plugin_MRRESOURCES-103-OWZ3HFZ43MS4CUVJZUVLTQDPH6VF24RFDOZDFCITEPHO3WVUHWJQ@tmp\withMavend4a3493b\pipeline-maven-spy.jar" -Dorg.jenkinsci.plugins.pipeline.maven.reportsFolder="f:\jenkins\jenkins-slave\workspace\rces-plugin_MRRESOURCES-103-OWZ3HFZ43MS4CUVJZUVLTQDPH6VF24RFDOZDFCITEPHO3WVUHWJQ@tmp\withMavend4a3493b"

        at org.apache.maven.plugin.resources.remote.it.IT_RunOnlyAtExecutionRoot.test(IT_RunOnlyAtExecutionRoot.java:60)


FAILED:  org.apache.maven.plugin.resources.remote.it.IT_RunOnlyAtExecutionRoot.test

Error Message:
Exit code was non-zero: 1; command line and log =
F:\jenkins\tools\maven\apache-maven-3.5.0\bin\mvn -e --batch-mode -Dmaven.repo.local=f:\jenkins\jenkins-slave\workspace\rces-plugin_MRRESOURCES-103-OWZ3HFZ43MS4CUVJZUVLTQDPH6VF24RFDOZDFCITEPHO3WVUHWJQ\m\target/it-repo org.apache.maven.plugins:maven-clean-plugin:clean generate-resources
[INFO] [jenkins-event-spy] Jenkins Maven Event Spy is disabled
[INFO] Error stacktraces are turned on.
[INFO] Scanning for projects...
[INFO] Downloading: http://repository.apache.org/snapshots/org/apache/maven/plugin/rresource/it/it-parent/1.6-SNAPSHOT/maven-metadata.xml
[INFO] Downloading: http://repository.apache.org/snapshots/org/apache/maven/plugin/rresource/it/it-parent/1.6-SNAPSHOT/it-parent-1.6-SNAPSHOT.pom
[ERROR] [ERROR] Some problems were encountered while processing the POMs:
[FATAL] Non-resolvable parent POM for org.apache.maven.plugin.rresource.it.mrr41:parent:[unknown-version]: Could not find artifact org.apache.maven.plugin.rresource.it:it-parent:pom:1.6-SNAPSHOT in apache-snapshots (http://repository.apache.org/snapshots/) and 'parent.relativePath' points at wrong local POM @ org.apache.maven.plugin.rresource.it.mrr41:parent:[unknown-version], F:\jenkins\jenkins-slave\workspace\rces-plugin_MRRESOURCES-103-OWZ3HFZ43MS4CUVJZUVLTQDPH6VF24RFDOZDFCITEPHO3WVUHWJQ\m\target\test-classes\run-only-at-execution-root\pom.xml, line 24, column 11
[FATAL] Non-resolvable parent POM for org.apache.maven.plugin.rresource.it.mrr41:parent:[unknown-version]: Failure to find org.apache.maven.plugin.rresource.it:it-parent:pom:1.6-SNAPSHOT in http://repository.apache.org/snapshots/ was cached in the local repository, resolution will not be reattempted until the update interval of apache-snapshots has elapsed or updates are forced and 'parent.relativePath' points at wrong local POM @ org.apache.maven.plugin.rresource.it.mrr41:parent:[unknown-version], F:\jenkins\jenkins-slave\workspace\rces-plugin_MRRESOURCES-103-OWZ3HFZ43MS4CUVJZUVLTQDPH6VF24RFDOZDFCITEPHO3WVUHWJQ\m\target\test-classes\run-only-at-execution-root\pom.xml, line 24, column 11
 @
[ERROR] The build could not read 2 projects -> [Help 1]
org.apache.maven.project.ProjectBuildingException: Some problems were encountered while processing the POMs:
[FATAL] Non-resolvable parent POM for org.apache.maven.plugin.rresource.it.mrr41:parent:[unknown-version]: Could not find artifact org.apache.maven.plugin.rresource.it:it-parent:pom:1.6-SNAPSHOT in apache-snapshots (http://repository.apache.org/snapshots/) and 'parent.relativePath' points at wrong local POM @ org.apache.maven.plugin.rresource.it.mrr41:parent:[unknown-version], F:\jenkins\jenkins-slave\workspace\rces-plugin_MRRESOURCES-103-OWZ3HFZ43MS4CUVJZUVLTQDPH6VF24RFDOZDFCITEPHO3WVUHWJQ\m\target\test-classes\run-only-at-execution-root\pom.xml, line 24, column 11
[FATAL] Non-resolvable parent POM for org.apache.maven.plugin.rresource.it.mrr41:parent:[unknown-version]: Failure to find org.apache.maven.plugin.rresource.it:it-parent:pom:1.6-SNAPSHOT in http://repository.apache.org/snapshots/ was cached in the local repository, resolution will not be reattempted until the update interval of apache-snapshots has elapsed or updates are forced and 'parent.relativePath' points at wrong local POM @ org.apache.maven.plugin.rresource.it.mrr41:parent:[unknown-version], F:\jenkins\jenkins-slave\workspace\rces-plugin_MRRESOURCES-103-OWZ3HFZ43MS4CUVJZUVLTQDPH6VF24RFDOZDFCITEPHO3WVUHWJQ\m\target\test-classes\run-only-at-execution-root\pom.xml, line 24, column 11

 at org.apache.maven.project.DefaultProjectBuilder.build(DefaultProjectBuilder.java:382)
 at org.apache.maven.graph.DefaultGraphBuilder.collectProjects(DefaultGraphBuilder.java:400)
 at org.apache.maven.graph.DefaultGraphBuilder.getProjectsForMavenReactor(DefaultGraphBuilder.java:391)
 at org.apache.maven.graph.DefaultGraphBuilder.build(DefaultGraphBuilder.java:78)
 at org.apache.maven.DefaultMaven.buildGraph(DefaultMaven.java:511)
 at org.apache.maven.DefaultMaven.doExecute(DefaultMaven.java:221)
 at org.apache.maven.DefaultMaven.doExecute(DefaultMaven.java:194)
 at org.apache.maven.DefaultMaven.execute(DefaultMaven.java:107)
 at org.apache.maven.cli.MavenCli.execute(MavenCli.java:993)
 at org.apache.maven.cli.MavenCli.doMain(MavenCli.java:345)
 at org.apache.maven.cli.MavenCli.main(MavenCli.java:191)
 at sun.reflect.NativeMethodAccessorImpl.invoke0(Native Method)
 at sun.reflect.NativeMethodAccessorImpl.invoke(NativeMethodAccessorImpl.java:62)
 at sun.reflect.DelegatingMethodAccessorImpl.invoke(DelegatingMethodAccessorImpl.java:43)
 at java.lang.reflect.Method.invoke(Method.java:498)
 at org.codehaus.plexus.classworlds.launcher.Launcher.launchEnhanced(Launcher.java:289)
 at org.codehaus.plexus.classworlds.launcher.Launcher.launch(Launcher.java:229)
 at org.codehaus.plexus.classworlds.launcher.Launcher.mainWithExitCode(Launcher.java:415)
 at org.codehaus.plexus.classworlds.launcher.Launcher.main(Launcher.java:356)
[ERROR]  
[ERROR]   The project org.apache.maven.plugin.rresource.it.mrr41:child-1:[unknown-version] (F:\jenkins\jenkins-slave\workspace\rces-plugin_MRRESOURCES-103-OWZ3HFZ43MS4CUVJZUVLTQDPH6VF24RFDOZDFCITEPHO3WVUHWJQ\m\target\test-classes\run-only-at-execution-root\child1\pom.xml) has 1 error
[ERROR]     Non-resolvable parent POM for org.apache.maven.plugin.rresource.it.mrr41:parent:[unknown-version]: Could not find artifact org.apache.maven.plugin.rresource.it:it-parent:pom:1.6-SNAPSHOT in apache-snapshots (http://repository.apache.org/snapshots/) and 'parent.relativePath' points at wrong local POM @ org.apache.maven.plugin.rresource.it.mrr41:parent:[unknown-version], F:\jenkins\jenkins-slave\workspace\rces-plugin_MRRESOURCES-103-OWZ3HFZ43MS4CUVJZUVLTQDPH6VF24RFDOZDFCITEPHO3WVUHWJQ\m\target\test-classes\run-only-at-execution-root\pom.xml, line 24, column 11 -> [Help 2]
org.apache.maven.model.resolution.UnresolvableModelException: Could not find artifact org.apache.maven.plugin.rresource.it:it-parent:pom:1.6-SNAPSHOT in apache-snapshots (http://repository.apache.org/snapshots/)
 at org.apache.maven.project.ProjectModelResolver.resolveModel(ProjectModelResolver.java:197)
 at org.apache.maven.project.ProjectModelResolver.resolveModel(ProjectModelResolver.java:243)
 at org.apache.maven.model.building.DefaultModelBuilder.readParentExternally(DefaultModelBuilder.java:1051)
 at org.apache.maven.model.building.DefaultModelBuilder.readParent(DefaultModelBuilder.java:851)
 at org.apache.maven.model.building.DefaultModelBuilder.build(DefaultModelBuilder.java:331)
 at org.apache.maven.project.DefaultProjectBuilder.build(DefaultProjectBuilder.java:429)
 at org.apache.maven.project.DefaultProjectBuilder.build(DefaultProjectBuilder.java:398)
 at org.apache.maven.project.DefaultProjectBuilder.build(DefaultProjectBuilder.java:515)
 at org.apache.maven.project.DefaultProjectBuilder.build(DefaultProjectBuilder.java:398)
 at org.apache.maven.project.DefaultProjectBuilder.build(DefaultProjectBuilder.java:361)
 at org.apache.maven.graph.DefaultGraphBuilder.collectProjects(DefaultGraphBuilder.java:400)
 at org.apache.maven.graph.DefaultGraphBuilder.getProjectsForMavenReactor(DefaultGraphBuilder.java:391)
 at org.apache.maven.graph.DefaultGraphBuilder.build(DefaultGraphBuilder.java:78)
 at org.apache.maven.DefaultMaven.buildGraph(DefaultMaven.java:511)
 at org.apache.maven.DefaultMaven.doExecute(DefaultMaven.java:221)
 at org.apache.maven.DefaultMaven.doExecute(DefaultMaven.java:194)
 at org.apache.maven.DefaultMaven.execute(DefaultMaven.java:107)
 at org.apache.maven.cli.MavenCli.execute(MavenCli.java:993)
 at org.apache.maven.cli.MavenCli.doMain(MavenCli.java:345)
 at org.apache.maven.cli.MavenCli.main(MavenCli.java:191)
 at sun.reflect.NativeMethodAccessorImpl.invoke0(Native Method)
 at sun.reflect.NativeMethodAccessorImpl.invoke(NativeMethodAccessorImpl.java:62)
 at sun.reflect.DelegatingMethodAccessorImpl.invoke(DelegatingMethodAccessorImpl.java:43)
 at java.lang.reflect.Method.invoke(Method.java:498)
 at org.codehaus.plexus.classworlds.launcher.Launcher.launchEnhanced(Launcher.java:289)
 at org.codehaus.plexus.classworlds.launcher.Launcher.launch(Launcher.java:229)
 at org.codehaus.plexus.classworlds.launcher.Launcher.mainWithExitCode(Launcher.java:415)
 at org.codehaus.plexus.classworlds.launcher.Launcher.main(Launcher.java:356)
Caused by: org.eclipse.aether.resolution.ArtifactResolutionException: Could not find artifact org.apache.maven.plugin.rresource.it:it-parent:pom:1.6-SNAPSHOT in apache-snapshots (http://repository.apache.org/snapshots/)
 at org.eclipse.aether.internal.impl.DefaultArtifactResolver.resolve(DefaultArtifactResolver.java:453)
 at org.eclipse.aether.internal.impl.DefaultArtifactResolver.resolveArtifacts(DefaultArtifactResolver.java:255)
 at org.eclipse.aether.internal.impl.DefaultArtifactResolver.resolveArtifact(DefaultArtifactResolver.java:232)
 at org.eclipse.aether.internal.impl.DefaultRepositorySystem.resolveArtifact(DefaultRepositorySystem.java:303)
 at org.apache.maven.project.ProjectModelResolver.resolveModel(ProjectModelResolver.java:193)
 ... 27 more
Caused by: org.eclipse.aether.transfer.ArtifactNotFoundException: Could not find artifact org.apache.maven.plugin.rresource.it:it-parent:pom:1.6-SNAPSHOT in apache-snapshots (http://repository.apache.org/snapshots/)
 at org.eclipse.aether.connector.basic.ArtifactTransportListener.transferFailed(ArtifactTransportListener.java:48)
 at org.eclipse.aether.connector.basic.BasicRepositoryConnector$TaskRunner.run(BasicRepositoryConnector.java:364)
 at org.eclipse.aether.util.concurrency.RunnableErrorForwarder$1.run(RunnableErrorForwarder.java:76)
 at org.eclipse.aether.connector.basic.BasicRepositoryConnector$DirectExecutor.execute(BasicRepositoryConnector.java:590)
 at org.eclipse.aether.connector.basic.BasicRepositoryConnector.get(BasicRepositoryConnector.java:258)
 at org.eclipse.aether.internal.impl.DefaultArtifactResolver.performDownloads(DefaultArtifactResolver.java:529)
 at org.eclipse.aether.internal.impl.DefaultArtifactResolver.resolve(DefaultArtifactResolver.java:430)
 ... 31 more
[ERROR]  
[ERROR]   The project org.apache.maven.plugin.rresource.it.mrr41:child-2:[unknown-version] (F:\jenkins\jenkins-slave\workspace\rces-plugin_MRRESOURCES-103-OWZ3HFZ43MS4CUVJZUVLTQDPH6VF24RFDOZDFCITEPHO3WVUHWJQ\m\target\test-classes\run-only-at-execution-root\child2\pom.xml) has 1 error
[ERROR]     Non-resolvable parent POM for org.apache.maven.plugin.rresource.it.mrr41:parent:[unknown-version]: Failure to find org.apache.maven.plugin.rresource.it:it-parent:pom:1.6-SNAPSHOT in http://repository.apache.org/snapshots/ was cached in the local repository, resolution will not be reattempted until the update interval of apache-snapshots has elapsed or updates are forced and 'parent.relativePath' points at wrong local POM @ org.apache.maven.plugin.rresource.it.mrr41:parent:[unknown-version], F:\jenkins\jenkins-slave\workspace\rces-plugin_MRRESOURCES-103-OWZ3HFZ43MS4CUVJZUVLTQDPH6VF24RFDOZDFCITEPHO3WVUHWJQ\m\target\test-classes\run-only-at-execution-root\pom.xml, line 24, column 11 -> [Help 2]
org.apache.maven.model.resolution.UnresolvableModelException: Failure to find org.apache.maven.plugin.rresource.it:it-parent:pom:1.6-SNAPSHOT in http://repository.apache.org/snapshots/ was cached in the local repository, resolution will not be reattempted until the update interval of apache-snapshots has elapsed or updates are forced
 at org.apache.maven.project.ProjectModelResolver.resolveModel(ProjectModelResolver.java:197)
 at org.apache.maven.project.ProjectModelResolver.resolveModel(ProjectModelResolver.java:243)
 at org.apache.maven.model.building.DefaultModelBuilder.readParentExternally(DefaultModelBuilder.java:1051)
 at org.apache.maven.model.building.DefaultModelBuilder.readParent(DefaultModelBuilder.java:851)
 at org.apache.maven.model.building.DefaultModelBuilder.build(DefaultModelBuilder.java:331)
 at org.apache.maven.project.DefaultProjectBuilder.build(DefaultProjectBuilder.java:429)
 at org.apache.maven.project.DefaultProjectBuilder.build(DefaultProjectBuilder.java:398)
 at org.apache.maven.project.DefaultProjectBuilder.build(DefaultProjectBuilder.java:515)
 at org.apache.maven.project.DefaultProjectBuilder.build(DefaultProjectBuilder.java:398)
 at org.apache.maven.project.DefaultProjectBuilder.build(DefaultProjectBuilder.java:361)
 at org.apache.maven.graph.DefaultGraphBuilder.collectProjects(DefaultGraphBuilder.java:400)
 at org.apache.maven.graph.DefaultGraphBuilder.getProjectsForMavenReactor(DefaultGraphBuilder.java:391)
 at org.apache.maven.graph.DefaultGraphBuilder.build(DefaultGraphBuilder.java:78)
 at org.apache.maven.DefaultMaven.buildGraph(DefaultMaven.java:511)
 at org.apache.maven.DefaultMaven.doExecute(DefaultMaven.java:221)
 at org.apache.maven.DefaultMaven.doExecute(DefaultMaven.java:194)
 at org.apache.maven.DefaultMaven.execute(DefaultMaven.java:107)
 at org.apache.maven.cli.MavenCli.execute(MavenCli.java:993)
 at org.apache.maven.cli.MavenCli.doMain(MavenCli.java:345)
 at org.apache.maven.cli.MavenCli.main(MavenCli.java:191)
 at sun.reflect.NativeMethodAccessorImpl.invoke0(Native Method)
 at sun.reflect.NativeMethodAccessorImpl.invoke(NativeMethodAccessorImpl.java:62)
 at sun.reflect.DelegatingMethodAccessorImpl.invoke(DelegatingMethodAccessorImpl.java:43)
 at java.lang.reflect.Method.invoke(Method.java:498)
 at org.codehaus.plexus.classworlds.launcher.Launcher.launchEnhanced(Launcher.java:289)
 at org.codehaus.plexus.classworlds.launcher.Launcher.launch(Launcher.java:229)
 at org.codehaus.plexus.classworlds.launcher.Launcher.mainWithExitCode(Launcher.java:415)
 at org.codehaus.plexus.classworlds.launcher.Launcher.main(Launcher.java:356)
Caused by: org.eclipse.aether.resolution.ArtifactResolutionException: Failure to find org.apache.maven.plugin.rresource.it:it-parent:pom:1.6-SNAPSHOT in http://repository.apache.org/snapshots/ was cached in the local repository, resolution will not be reattempted until the update interval of apache-snapshots has elapsed or updates are forced
 at org.eclipse.aether.internal.impl.DefaultArtifactResolver.resolve(DefaultArtifactResolver.java:453)
 at org.eclipse.aether.internal.impl.DefaultArtifactResolver.resolveArtifacts(DefaultArtifactResolver.java:255)
 at org.eclipse.aether.internal.impl.DefaultArtifactResolver.resolveArtifact(DefaultArtifactResolver.java:232)
 at org.eclipse.aether.internal.impl.DefaultRepositorySystem.resolveArtifact(DefaultRepositorySystem.java:303)
 at org.apache.maven.project.ProjectModelResolver.resolveModel(ProjectModelResolver.java:193)
 ... 27 more
Caused by: org.eclipse.aether.transfer.ArtifactNotFoundException: Failure to find org.apache.maven.plugin.rresource.it:it-parent:pom:1.6-SNAPSHOT in http://repository.apache.org/snapshots/ was cached in the local repository, resolution will not be reattempted until the update interval of apache-snapshots has elapsed or updates are forced
 at org.eclipse.aether.internal.impl.DefaultUpdateCheckManager.newException(DefaultUpdateCheckManager.java:240)
 at org.eclipse.aether.internal.impl.DefaultUpdateCheckManager.checkArtifact(DefaultUpdateCheckManager.java:192)
 at org.eclipse.aether.internal.impl.DefaultArtifactResolver.gatherDownloads(DefaultArtifactResolver.java:594)
 at org.eclipse.aether.internal.impl.DefaultArtifactResolver.performDownloads(DefaultArtifactResolver.java:512)
 at org.eclipse.aether.internal.impl.DefaultArtifactResolver.resolve(DefaultArtifactResolver.java:430)
 ... 31 more
[ERROR]
[ERROR] Re-run Maven using the -X switch to enable full debug logging.
[ERROR]
[ERROR] For more information about the errors and possible solutions, please read the following articles:
[ERROR] [Help 1] http://cwiki.apache.org/confluence/display/MAVEN/ProjectBuildingException
[ERROR] [Help 2] http://cwiki.apache.org/confluence/display/MAVEN/UnresolvableModelException
Picked up JAVA_TOOL_OPTIONS: -Dmaven.ext.class.path="f:\jenkins\jenkins-slave\workspace\rces-plugin_MRRESOURCES-103-OWZ3HFZ43MS4CUVJZUVLTQDPH6VF24RFDOZDFCITEPHO3WVUHWJQ@tmp\withMaven30bdc031\pipeline-maven-spy.jar" -Dorg.jenkinsci.plugins.pipeline.maven.reportsFolder="f:\jenkins\jenkins-slave\workspace\rces-plugin_MRRESOURCES-103-OWZ3HFZ43MS4CUVJZUVLTQDPH6VF24RFDOZDFCITEPHO3WVUHWJQ@tmp\withMaven30bdc031"


Stack Trace:
org.apache.maven.it.VerificationException:
Exit code was non-zero: 1; command line and log =
F:\jenkins\tools\maven\apache-maven-3.5.0\bin\mvn -e --batch-mode -Dmaven.repo.local=f:\jenkins\jenkins-slave\workspace\rces-plugin_MRRESOURCES-103-OWZ3HFZ43MS4CUVJZUVLTQDPH6VF24RFDOZDFCITEPHO3WVUHWJQ\m\target/it-repo org.apache.maven.plugins:maven-clean-plugin:clean generate-resources
[INFO] [jenkins-event-spy] Jenkins Maven Event Spy is disabled
[INFO] Error stacktraces are turned on.
[INFO] Scanning for projects...
[INFO] Downloading: http://repository.apache.org/snapshots/org/apache/maven/plugin/rresource/it/it-parent/1.6-SNAPSHOT/maven-metadata.xml
[INFO] Downloading: http://repository.apache.org/snapshots/org/apache/maven/plugin/rresource/it/it-parent/1.6-SNAPSHOT/it-parent-1.6-SNAPSHOT.pom
[ERROR] [ERROR] Some problems were encountered while processing the POMs:
[FATAL] Non-resolvable parent POM for org.apache.maven.plugin.rresource.it.mrr41:parent:[unknown-version]: Could not find artifact org.apache.maven.plugin.rresource.it:it-parent:pom:1.6-SNAPSHOT in apache-snapshots (http://repository.apache.org/snapshots/) and 'parent.relativePath' points at wrong local POM @ org.apache.maven.plugin.rresource.it.mrr41:parent:[unknown-version], F:\jenkins\jenkins-slave\workspace\rces-plugin_MRRESOURCES-103-OWZ3HFZ43MS4CUVJZUVLTQDPH6VF24RFDOZDFCITEPHO3WVUHWJQ\m\target\test-classes\run-only-at-execution-root\pom.xml, line 24, column 11
[FATAL] Non-resolvable parent POM for org.apache.maven.plugin.rresource.it.mrr41:parent:[unknown-version]: Failure to find org.apache.maven.plugin.rresource.it:it-parent:pom:1.6-SNAPSHOT in http://repository.apache.org/snapshots/ was cached in the local repository, resolution will not be reattempted until the update interval of apache-snapshots has elapsed or updates are forced and 'parent.relativePath' points at wrong local POM @ org.apache.maven.plugin.rresource.it.mrr41:parent:[unknown-version], F:\jenkins\jenkins-slave\workspace\rces-plugin_MRRESOURCES-103-OWZ3HFZ43MS4CUVJZUVLTQDPH6VF24RFDOZDFCITEPHO3WVUHWJQ\m\target\test-classes\run-only-at-execution-root\pom.xml, line 24, column 11
 @
[ERROR] The build could not read 2 projects -> [Help 1]
org.apache.maven.project.ProjectBuildingException: Some problems were encountered while processing the POMs:
[FATAL] Non-resolvable parent POM for org.apache.maven.plugin.rresource.it.mrr41:parent:[unknown-version]: Could not find artifact org.apache.maven.plugin.rresource.it:it-parent:pom:1.6-SNAPSHOT in apache-snapshots (http://repository.apache.org/snapshots/) and 'parent.relativePath' points at wrong local POM @ org.apache.maven.plugin.rresource.it.mrr41:parent:[unknown-version], F:\jenkins\jenkins-slave\workspace\rces-plugin_MRRESOURCES-103-OWZ3HFZ43MS4CUVJZUVLTQDPH6VF24RFDOZDFCITEPHO3WVUHWJQ\m\target\test-classes\run-only-at-execution-root\pom.xml, line 24, column 11
[FATAL] Non-resolvable parent POM for org.apache.maven.plugin.rresource.it.mrr41:parent:[unknown-version]: Failure to find org.apache.maven.plugin.rresource.it:it-parent:pom:1.6-SNAPSHOT in http://repository.apache.org/snapshots/ was cached in the local repository, resolution will not be reattempted until the update interval of apache-snapshots has elapsed or updates are forced and 'parent.relativePath' points at wrong local POM @ org.apache.maven.plugin.rresource.it.mrr41:parent:[unknown-version], F:\jenkins\jenkins-slave\workspace\rces-plugin_MRRESOURCES-103-OWZ3HFZ43MS4CUVJZUVLTQDPH6VF24RFDOZDFCITEPHO3WVUHWJQ\m\target\test-classes\run-only-at-execution-root\pom.xml, line 24, column 11

        at org.apache.maven.project.DefaultProjectBuilder.build(DefaultProjectBuilder.java:382)
        at org.apache.maven.graph.DefaultGraphBuilder.collectProjects(DefaultGraphBuilder.java:400)
        at org.apache.maven.graph.DefaultGraphBuilder.getProjectsForMavenReactor(DefaultGraphBuilder.java:391)
        at org.apache.maven.graph.DefaultGraphBuilder.build(DefaultGraphBuilder.java:78)
        at org.apache.maven.DefaultMaven.buildGraph(DefaultMaven.java:511)
        at org.apache.maven.DefaultMaven.doExecute(DefaultMaven.java:221)
        at org.apache.maven.DefaultMaven.doExecute(DefaultMaven.java:194)
        at org.apache.maven.DefaultMaven.execute(DefaultMaven.java:107)
        at org.apache.maven.cli.MavenCli.execute(MavenCli.java:993)
        at org.apache.maven.cli.MavenCli.doMain(MavenCli.java:345)
        at org.apache.maven.cli.MavenCli.main(MavenCli.java:191)
        at sun.reflect.NativeMethodAccessorImpl.invoke0(Native Method)
        at sun.reflect.NativeMethodAccessorImpl.invoke(NativeMethodAccessorImpl.java:62)
        at sun.reflect.DelegatingMethodAccessorImpl.invoke(DelegatingMethodAccessorImpl.java:43)
        at java.lang.reflect.Method.invoke(Method.java:498)
        at org.codehaus.plexus.classworlds.launcher.Launcher.launchEnhanced(Launcher.java:289)
        at org.codehaus.plexus.classworlds.launcher.Launcher.launch(Launcher.java:229)
        at org.codehaus.plexus.classworlds.launcher.Launcher.mainWithExitCode(Launcher.java:415)
        at org.codehaus.plexus.classworlds.launcher.Launcher.main(Launcher.java:356)
[ERROR]  
[ERROR]   The project org.apache.maven.plugin.rresource.it.mrr41:child-1:[unknown-version] (F:\jenkins\jenkins-slave\workspace\rces-plugin_MRRESOURCES-103-OWZ3HFZ43MS4CUVJZUVLTQDPH6VF24RFDOZDFCITEPHO3WVUHWJQ\m\target\test-classes\run-only-at-execution-root\child1\pom.xml) has 1 error
[ERROR]     Non-resolvable parent POM for org.apache.maven.plugin.rresource.it.mrr41:parent:[unknown-version]: Could not find artifact org.apache.maven.plugin.rresource.it:it-parent:pom:1.6-SNAPSHOT in apache-snapshots (http://repository.apache.org/snapshots/) and 'parent.relativePath' points at wrong local POM @ org.apache.maven.plugin.rresource.it.mrr41:parent:[unknown-version], F:\jenkins\jenkins-slave\workspace\rces-plugin_MRRESOURCES-103-OWZ3HFZ43MS4CUVJZUVLTQDPH6VF24RFDOZDFCITEPHO3WVUHWJQ\m\target\test-classes\run-only-at-execution-root\pom.xml, line 24, column 11 -> [Help 2]
org.apache.maven.model.resolution.UnresolvableModelException: Could not find artifact org.apache.maven.plugin.rresource.it:it-parent:pom:1.6-SNAPSHOT in apache-snapshots (http://repository.apache.org/snapshots/)
        at org.apache.maven.project.ProjectModelResolver.resolveModel(ProjectModelResolver.java:197)
        at org.apache.maven.project.ProjectModelResolver.resolveModel(ProjectModelResolver.java:243)
        at org.apache.maven.model.building.DefaultModelBuilder.readParentExternally(DefaultModelBuilder.java:1051)
        at org.apache.maven.model.building.DefaultModelBuilder.readParent(DefaultModelBuilder.java:851)
        at org.apache.maven.model.building.DefaultModelBuilder.build(DefaultModelBuilder.java:331)
        at org.apache.maven.project.DefaultProjectBuilder.build(DefaultProjectBuilder.java:429)
        at org.apache.maven.project.DefaultProjectBuilder.build(DefaultProjectBuilder.java:398)
        at org.apache.maven.project.DefaultProjectBuilder.build(DefaultProjectBuilder.java:515)
        at org.apache.maven.project.DefaultProjectBuilder.build(DefaultProjectBuilder.java:398)
        at org.apache.maven.project.DefaultProjectBuilder.build(DefaultProjectBuilder.java:361)
        at org.apache.maven.graph.DefaultGraphBuilder.collectProjects(DefaultGraphBuilder.java:400)
        at org.apache.maven.graph.DefaultGraphBuilder.getProjectsForMavenReactor(DefaultGraphBuilder.java:391)
        at org.apache.maven.graph.DefaultGraphBuilder.build(DefaultGraphBuilder.java:78)
        at org.apache.maven.DefaultMaven.buildGraph(DefaultMaven.java:511)
        at org.apache.maven.DefaultMaven.doExecute(DefaultMaven.java:221)
        at org.apache.maven.DefaultMaven.doExecute(DefaultMaven.java:194)
        at org.apache.maven.DefaultMaven.execute(DefaultMaven.java:107)
        at org.apache.maven.cli.MavenCli.execute(MavenCli.java:993)
        at org.apache.maven.cli.MavenCli.doMain(MavenCli.java:345)
        at org.apache.maven.cli.MavenCli.main(MavenCli.java:191)
        at sun.reflect.NativeMethodAccessorImpl.invoke0(Native Method)
        at sun.reflect.NativeMethodAccessorImpl.invoke(NativeMethodAccessorImpl.java:62)
        at sun.reflect.DelegatingMethodAccessorImpl.invoke(DelegatingMethodAccessorImpl.java:43)
        at java.lang.reflect.Method.invoke(Method.java:498)
        at org.codehaus.plexus.classworlds.launcher.Launcher.launchEnhanced(Launcher.java:289)
        at org.codehaus.plexus.classworlds.launcher.Launcher.launch(Launcher.java:229)
        at org.codehaus.plexus.classworlds.launcher.Launcher.mainWithExitCode(Launcher.java:415)
        at org.codehaus.plexus.classworlds.launcher.Launcher.main(Launcher.java:356)
Caused by: org.eclipse.aether.resolution.ArtifactResolutionException: Could not find artifact org.apache.maven.plugin.rresource.it:it-parent:pom:1.6-SNAPSHOT in apache-snapshots (http://repository.apache.org/snapshots/)
        at org.eclipse.aether.internal.impl.DefaultArtifactResolver.resolve(DefaultArtifactResolver.java:453)
        at org.eclipse.aether.internal.impl.DefaultArtifactResolver.resolveArtifacts(DefaultArtifactResolver.java:255)
        at org.eclipse.aether.internal.impl.DefaultArtifactResolver.resolveArtifact(DefaultArtifactResolver.java:232)
        at org.eclipse.aether.internal.impl.DefaultRepositorySystem.resolveArtifact(DefaultRepositorySystem.java:303)
        at org.apache.maven.project.ProjectModelResolver.resolveModel(ProjectModelResolver.java:193)
        ... 27 more
Caused by: org.eclipse.aether.transfer.ArtifactNotFoundException: Could not find artifact org.apache.maven.plugin.rresource.it:it-parent:pom:1.6-SNAPSHOT in apache-snapshots (http://repository.apache.org/snapshots/)
        at org.eclipse.aether.connector.basic.ArtifactTransportListener.transferFailed(ArtifactTransportListener.java:48)
        at org.eclipse.aether.connector.basic.BasicRepositoryConnector$TaskRunner.run(BasicRepositoryConnector.java:364)
        at org.eclipse.aether.util.concurrency.RunnableErrorForwarder$1.run(RunnableErrorForwarder.java:76)
        at org.eclipse.aether.connector.basic.BasicRepositoryConnector$DirectExecutor.execute(BasicRepositoryConnector.java:590)
        at org.eclipse.aether.connector.basic.BasicRepositoryConnector.get(BasicRepositoryConnector.java:258)
        at org.eclipse.aether.internal.impl.DefaultArtifactResolver.performDownloads(DefaultArtifactResolver.java:529)
        at org.eclipse.aether.internal.impl.DefaultArtifactResolver.resolve(DefaultArtifactResolver.java:430)
        ... 31 more
[ERROR]  
[ERROR]   The project org.apache.maven.plugin.rresource.it.mrr41:child-2:[unknown-version] (F:\jenkins\jenkins-slave\workspace\rces-plugin_MRRESOURCES-103-OWZ3HFZ43MS4CUVJZUVLTQDPH6VF24RFDOZDFCITEPHO3WVUHWJQ\m\target\test-classes\run-only-at-execution-root\child2\pom.xml) has 1 error
[ERROR]     Non-resolvable parent POM for org.apache.maven.plugin.rresource.it.mrr41:parent:[unknown-version]: Failure to find org.apache.maven.plugin.rresource.it:it-parent:pom:1.6-SNAPSHOT in http://repository.apache.org/snapshots/ was cached in the local repository, resolution will not be reattempted until the update interval of apache-snapshots has elapsed or updates are forced and 'parent.relativePath' points at wrong local POM @ org.apache.maven.plugin.rresource.it.mrr41:parent:[unknown-version], F:\jenkins\jenkins-slave\workspace\rces-plugin_MRRESOURCES-103-OWZ3HFZ43MS4CUVJZUVLTQDPH6VF24RFDOZDFCITEPHO3WVUHWJQ\m\target\test-classes\run-only-at-execution-root\pom.xml, line 24, column 11 -> [Help 2]
org.apache.maven.model.resolution.UnresolvableModelException: Failure to find org.apache.maven.plugin.rresource.it:it-parent:pom:1.6-SNAPSHOT in http://repository.apache.org/snapshots/ was cached in the local repository, resolution will not be reattempted until the update interval of apache-snapshots has elapsed or updates are forced
        at org.apache.maven.project.ProjectModelResolver.resolveModel(ProjectModelResolver.java:197)
        at org.apache.maven.project.ProjectModelResolver.resolveModel(ProjectModelResolver.java:243)
        at org.apache.maven.model.building.DefaultModelBuilder.readParentExternally(DefaultModelBuilder.java:1051)
        at org.apache.maven.model.building.DefaultModelBuilder.readParent(DefaultModelBuilder.java:851)
        at org.apache.maven.model.building.DefaultModelBuilder.build(DefaultModelBuilder.java:331)
        at org.apache.maven.project.DefaultProjectBuilder.build(DefaultProjectBuilder.java:429)
        at org.apache.maven.project.DefaultProjectBuilder.build(DefaultProjectBuilder.java:398)
        at org.apache.maven.project.DefaultProjectBuilder.build(DefaultProjectBuilder.java:515)
        at org.apache.maven.project.DefaultProjectBuilder.build(DefaultProjectBuilder.java:398)
        at org.apache.maven.project.DefaultProjectBuilder.build(DefaultProjectBuilder.java:361)
        at org.apache.maven.graph.DefaultGraphBuilder.collectProjects(DefaultGraphBuilder.java:400)
        at org.apache.maven.graph.DefaultGraphBuilder.getProjectsForMavenReactor(DefaultGraphBuilder.java:391)
        at org.apache.maven.graph.DefaultGraphBuilder.build(DefaultGraphBuilder.java:78)
        at org.apache.maven.DefaultMaven.buildGraph(DefaultMaven.java:511)
        at org.apache.maven.DefaultMaven.doExecute(DefaultMaven.java:221)
        at org.apache.maven.DefaultMaven.doExecute(DefaultMaven.java:194)
        at org.apache.maven.DefaultMaven.execute(DefaultMaven.java:107)
        at org.apache.maven.cli.MavenCli.execute(MavenCli.java:993)
        at org.apache.maven.cli.MavenCli.doMain(MavenCli.java:345)
        at org.apache.maven.cli.MavenCli.main(MavenCli.java:191)
        at sun.reflect.NativeMethodAccessorImpl.invoke0(Native Method)
        at sun.reflect.NativeMethodAccessorImpl.invoke(NativeMethodAccessorImpl.java:62)
        at sun.reflect.DelegatingMethodAccessorImpl.invoke(DelegatingMethodAccessorImpl.java:43)
        at java.lang.reflect.Method.invoke(Method.java:498)
        at org.codehaus.plexus.classworlds.launcher.Launcher.launchEnhanced(Launcher.java:289)
        at org.codehaus.plexus.classworlds.launcher.Launcher.launch(Launcher.java:229)
        at org.codehaus.plexus.classworlds.launcher.Launcher.mainWithExitCode(Launcher.java:415)
        at org.codehaus.plexus.classworlds.launcher.Launcher.main(Launcher.java:356)
Caused by: org.eclipse.aether.resolution.ArtifactResolutionException: Failure to find org.apache.maven.plugin.rresource.it:it-parent:pom:1.6-SNAPSHOT in http://repository.apache.org/snapshots/ was cached in the local repository, resolution will not be reattempted until the update interval of apache-snapshots has elapsed or updates are forced
        at org.eclipse.aether.internal.impl.DefaultArtifactResolver.resolve(DefaultArtifactResolver.java:453)
        at org.eclipse.aether.internal.impl.DefaultArtifactResolver.resolveArtifacts(DefaultArtifactResolver.java:255)
        at org.eclipse.aether.internal.impl.DefaultArtifactResolver.resolveArtifact(DefaultArtifactResolver.java:232)
        at org.eclipse.aether.internal.impl.DefaultRepositorySystem.resolveArtifact(DefaultRepositorySystem.java:303)
        at org.apache.maven.project.ProjectModelResolver.resolveModel(ProjectModelResolver.java:193)
        ... 27 more
Caused by: org.eclipse.aether.transfer.ArtifactNotFoundException: Failure to find org.apache.maven.plugin.rresource.it:it-parent:pom:1.6-SNAPSHOT in http://repository.apache.org/snapshots/ was cached in the local repository, resolution will not be reattempted until the update interval of apache-snapshots has elapsed or updates are forced
        at org.eclipse.aether.internal.impl.DefaultUpdateCheckManager.newException(DefaultUpdateCheckManager.java:240)
        at org.eclipse.aether.internal.impl.DefaultUpdateCheckManager.checkArtifact(DefaultUpdateCheckManager.java:192)
        at org.eclipse.aether.internal.impl.DefaultArtifactResolver.gatherDownloads(DefaultArtifactResolver.java:594)
        at org.eclipse.aether.internal.impl.DefaultArtifactResolver.performDownloads(DefaultArtifactResolver.java:512)
        at org.eclipse.aether.internal.impl.DefaultArtifactResolver.resolve(DefaultArtifactResolver.java:430)
        ... 31 more
[ERROR]
[ERROR] Re-run Maven using the -X switch to enable full debug logging.
[ERROR]
[ERROR] For more information about the errors and possible solutions, please read the following articles:
[ERROR] [Help 1] http://cwiki.apache.org/confluence/display/MAVEN/ProjectBuildingException
[ERROR] [Help 2] http://cwiki.apache.org/confluence/display/MAVEN/UnresolvableModelException
Picked up JAVA_TOOL_OPTIONS: -Dmaven.ext.class.path="f:\jenkins\jenkins-slave\workspace\rces-plugin_MRRESOURCES-103-OWZ3HFZ43MS4CUVJZUVLTQDPH6VF24RFDOZDFCITEPHO3WVUHWJQ@tmp\withMaven30bdc031\pipeline-maven-spy.jar" -Dorg.jenkinsci.plugins.pipeline.maven.reportsFolder="f:\jenkins\jenkins-slave\workspace\rces-plugin_MRRESOURCES-103-OWZ3HFZ43MS4CUVJZUVLTQDPH6VF24RFDOZDFCITEPHO3WVUHWJQ@tmp\withMaven30bdc031"

        at org.apache.maven.plugin.resources.remote.it.IT_RunOnlyAtExecutionRoot.test(IT_RunOnlyAtExecutionRoot.java:60)


FAILED:  org.apache.maven.plugin.resources.remote.it.IT_SupplementalArtifact.test

Error Message:
Exit code was non-zero: 1; command line and log =
F:\jenkins\tools\maven\apache-maven-3.5.0\bin\mvn -e --batch-mode -Dmaven.repo.local=f:\jenkins\jenkins-slave\workspace\rces-plugin_MRRESOURCES-103-OWZ3HFZ43MS4CUVJZUVLTQDPH6VF24RFDOZDFCITEPHO3WVUHWJQ\m\target/it-repo org.apache.maven.plugins:maven-clean-plugin:clean deploy
Picked up JAVA_TOOL_OPTIONS: -Dmaven.ext.class.path="f:\jenkins\jenkins-slave\workspace\rces-plugin_MRRESOURCES-103-OWZ3HFZ43MS4CUVJZUVLTQDPH6VF24RFDOZDFCITEPHO3WVUHWJQ@tmp\withMavene513d22a\pipeline-maven-spy.jar" -Dorg.jenkinsci.plugins.pipeline.maven.reportsFolder="f:\jenkins\jenkins-slave\workspace\rces-plugin_MRRESOURCES-103-OWZ3HFZ43MS4CUVJZUVLTQDPH6VF24RFDOZDFCITEPHO3WVUHWJQ@tmp\withMavene513d22a"
[INFO] [jenkins-event-spy] Jenkins Maven Event Spy is disabled
[INFO] Error stacktraces are turned on.
[INFO] Scanning for projects...
[INFO] ------------------------------------------------------------------------
[INFO] Reactor Build Order:
[INFO]
[INFO] resources
[INFO] supplemental-models
[INFO] deficient-dep
[INFO]
[INFO] ------------------------------------------------------------------------
[INFO] Building resources 1
[INFO] ------------------------------------------------------------------------
[INFO]
[INFO] --- maven-clean-plugin:2.5:clean (default-cli) @ resources ---
[INFO]
[INFO] --- maven-install-plugin:2.4:install (default-install) @ resources ---
[INFO] Installing f:\jenkins\jenkins-slave\workspace\rces-plugin_MRRESOURCES-103-OWZ3HFZ43MS4CUVJZUVLTQDPH6VF24RFDOZDFCITEPHO3WVUHWJQ\m\target\test-classes\supplemental-artifact\resource-projects\pom.xml to f:\jenkins\jenkins-slave\workspace\rces-plugin_MRRESOURCES-103-OWZ3HFZ43MS4CUVJZUVLTQDPH6VF24RFDOZDFCITEPHO3WVUHWJQ\m\target\it-repo\org\apache\maven\plugin\rresource\it\mrr43\resources\1\resources-1.pom
[INFO]
[INFO] --- maven-deploy-plugin:2.7:deploy (default-deploy) @ resources ---
[INFO] Uploading: file:f:\\jenkins\\jenkins-slave\\workspace\\rces-plugin_MRRESOURCES-103-OWZ3HFZ43MS4CUVJZUVLTQDPH6VF24RFDOZDFCITEPHO3WVUHWJQ\\m\\target/remote-repo/org/apache/maven/plugin/rresource/it/mrr43/resources/1/resources-1.pom
[INFO] Uploaded: file:f:\\jenkins\\jenkins-slave\\workspace\\rces-plugin_MRRESOURCES-103-OWZ3HFZ43MS4CUVJZUVLTQDPH6VF24RFDOZDFCITEPHO3WVUHWJQ\\m\\target/remote-repo/org/apache/maven/plugin/rresource/it/mrr43/resources/1/resources-1.pom (1.6 kB at 40 kB/s)
[INFO] Downloading: file:f:\\jenkins\\jenkins-slave\\workspace\\rces-plugin_MRRESOURCES-103-OWZ3HFZ43MS4CUVJZUVLTQDPH6VF24RFDOZDFCITEPHO3WVUHWJQ\\m\\target/remote-repo/org/apache/maven/plugin/rresource/it/mrr43/resources/maven-metadata.xml
[INFO] Uploading: file:f:\\jenkins\\jenkins-slave\\workspace\\rces-plugin_MRRESOURCES-103-OWZ3HFZ43MS4CUVJZUVLTQDPH6VF24RFDOZDFCITEPHO3WVUHWJQ\\m\\target/remote-repo/org/apache/maven/plugin/rresource/it/mrr43/resources/maven-metadata.xml
[INFO] Uploaded: file:f:\\jenkins\\jenkins-slave\\workspace\\rces-plugin_MRRESOURCES-103-OWZ3HFZ43MS4CUVJZUVLTQDPH6VF24RFDOZDFCITEPHO3WVUHWJQ\\m\\target/remote-repo/org/apache/maven/plugin/rresource/it/mrr43/resources/maven-metadata.xml (323 B at 162 kB/s)
[INFO]
[INFO] ------------------------------------------------------------------------
[INFO] Building supplemental-models 1
[INFO] ------------------------------------------------------------------------
[INFO]
[INFO] --- maven-clean-plugin:2.5:clean (default-cli) @ supplemental-models ---
[INFO]
[INFO] --- maven-resources-plugin:2.6:resources (default-resources) @ supplemental-models ---
[WARNING] Using platform encoding (Cp1252 actually) to copy filtered resources, i.e. build is platform dependent!
[INFO] Copying 1 resource
[INFO]
[INFO] --- maven-compiler-plugin:3.1:compile (default-compile) @ supplemental-models ---
[INFO] No sources to compile
[INFO]
[INFO] --- maven-resources-plugin:2.6:testResources (default-testResources) @ supplemental-models ---
[WARNING] Using platform encoding (Cp1252 actually) to copy filtered resources, i.e. build is platform dependent!
[INFO] skip non existing resourceDirectory F:\jenkins\jenkins-slave\workspace\rces-plugin_MRRESOURCES-103-OWZ3HFZ43MS4CUVJZUVLTQDPH6VF24RFDOZDFCITEPHO3WVUHWJQ\m\target\test-classes\supplemental-artifact\resource-projects\supplemental-models\src\test\resources
[INFO]
[INFO] --- maven-compiler-plugin:3.1:testCompile (default-testCompile) @ supplemental-models ---
[INFO] No sources to compile
[INFO]
[INFO] --- maven-surefire-plugin:2.12.4:test (default-test) @ supplemental-models ---
[INFO] No tests to run.
[INFO]
[INFO] --- maven-jar-plugin:2.4:jar (default-jar) @ supplemental-models ---
[INFO] Building jar: F:\jenkins\jenkins-slave\workspace\rces-plugin_MRRESOURCES-103-OWZ3HFZ43MS4CUVJZUVLTQDPH6VF24RFDOZDFCITEPHO3WVUHWJQ\m\target\test-classes\supplemental-artifact\resource-projects\supplemental-models\target\supplemental-models-1.jar
[INFO]
[INFO] --- maven-install-plugin:2.4:install (default-install) @ supplemental-models ---
[INFO] Installing F:\jenkins\jenkins-slave\workspace\rces-plugin_MRRESOURCES-103-OWZ3HFZ43MS4CUVJZUVLTQDPH6VF24RFDOZDFCITEPHO3WVUHWJQ\m\target\test-classes\supplemental-artifact\resource-projects\supplemental-models\target\supplemental-models-1.jar to f:\jenkins\jenkins-slave\workspace\rces-plugin_MRRESOURCES-103-OWZ3HFZ43MS4CUVJZUVLTQDPH6VF24RFDOZDFCITEPHO3WVUHWJQ\m\target\it-repo\org\apache\maven\plugin\rresource\it\mrr43\supplemental-models\1\supplemental-models-1.jar
[INFO] Installing F:\jenkins\jenkins-slave\workspace\rces-plugin_MRRESOURCES-103-OWZ3HFZ43MS4CUVJZUVLTQDPH6VF24RFDOZDFCITEPHO3WVUHWJQ\m\target\test-classes\supplemental-artifact\resource-projects\supplemental-models\pom.xml to f:\jenkins\jenkins-slave\workspace\rces-plugin_MRRESOURCES-103-OWZ3HFZ43MS4CUVJZUVLTQDPH6VF24RFDOZDFCITEPHO3WVUHWJQ\m\target\it-repo\org\apache\maven\plugin\rresource\it\mrr43\supplemental-models\1\supplemental-models-1.pom
[INFO]
[INFO] --- maven-deploy-plugin:2.7:deploy (default-deploy) @ supplemental-models ---
[INFO] Uploading: file:f:\\jenkins\\jenkins-slave\\workspace\\rces-plugin_MRRESOURCES-103-OWZ3HFZ43MS4CUVJZUVLTQDPH6VF24RFDOZDFCITEPHO3WVUHWJQ\\m\\target/remote-repo/org/apache/maven/plugin/rresource/it/mrr43/supplemental-models/1/supplemental-models-1.jar
[INFO] Uploaded: file:f:\\jenkins\\jenkins-slave\\workspace\\rces-plugin_MRRESOURCES-103-OWZ3HFZ43MS4CUVJZUVLTQDPH6VF24RFDOZDFCITEPHO3WVUHWJQ\\m\\target/remote-repo/org/apache/maven/plugin/rresource/it/mrr43/supplemental-models/1/supplemental-models-1.jar (3.0 kB at 995 kB/s)
[INFO] Uploading: file:f:\\jenkins\\jenkins-slave\\workspace\\rces-plugin_MRRESOURCES-103-OWZ3HFZ43MS4CUVJZUVLTQDPH6VF24RFDOZDFCITEPHO3WVUHWJQ\\m\\target/remote-repo/org/apache/maven/plugin/rresource/it/mrr43/supplemental-models/1/supplemental-models-1.pom
[INFO] Uploaded: file:f:\\jenkins\\jenkins-slave\\workspace\\rces-plugin_MRRESOURCES-103-OWZ3HFZ43MS4CUVJZUVLTQDPH6VF24RFDOZDFCITEPHO3WVUHWJQ\\m\\target/remote-repo/org/apache/maven/plugin/rresource/it/mrr43/supplemental-models/1/supplemental-models-1.pom (1.3 kB at 432 kB/s)
[INFO] Downloading: file:f:\\jenkins\\jenkins-slave\\workspace\\rces-plugin_MRRESOURCES-103-OWZ3HFZ43MS4CUVJZUVLTQDPH6VF24RFDOZDFCITEPHO3WVUHWJQ\\m\\target/remote-repo/org/apache/maven/plugin/rresource/it/mrr43/supplemental-models/maven-metadata.xml
[INFO] Uploading: file:f:\\jenkins\\jenkins-slave\\workspace\\rces-plugin_MRRESOURCES-103-OWZ3HFZ43MS4CUVJZUVLTQDPH6VF24RFDOZDFCITEPHO3WVUHWJQ\\m\\target/remote-repo/org/apache/maven/plugin/rresource/it/mrr43/supplemental-models/maven-metadata.xml
[INFO] Uploaded: file:f:\\jenkins\\jenkins-slave\\workspace\\rces-plugin_MRRESOURCES-103-OWZ3HFZ43MS4CUVJZUVLTQDPH6VF24RFDOZDFCITEPHO3WVUHWJQ\\m\\target/remote-repo/org/apache/maven/plugin/rresource/it/mrr43/supplemental-models/maven-metadata.xml (333 B at 166 kB/s)
[INFO]
[INFO] ------------------------------------------------------------------------
[INFO] Building deficient-dep 1
[INFO] ------------------------------------------------------------------------
[INFO]
[INFO] --- maven-clean-plugin:2.5:clean (default-cli) @ deficient-dep ---
[INFO]
[INFO] --- maven-resources-plugin:2.6:resources (default-resources) @ deficient-dep ---
[WARNING] Using platform encoding (Cp1252 actually) to copy filtered resources, i.e. build is platform dependent!
[INFO] skip non existing resourceDirectory F:\jenkins\jenkins-slave\workspace\rces-plugin_MRRESOURCES-103-OWZ3HFZ43MS4CUVJZUVLTQDPH6VF24RFDOZDFCITEPHO3WVUHWJQ\m\target\test-classes\supplemental-artifact\resource-projects\deficient-dep\src\main\resources
[INFO]
[INFO] --- maven-compiler-plugin:3.1:compile (default-compile) @ deficient-dep ---
[INFO] Changes detected - recompiling the module!
[WARNING] File encoding has not been set, using platform encoding Cp1252, i.e. build is platform dependent!
[INFO] Compiling 1 source file to F:\jenkins\jenkins-slave\workspace\rces-plugin_MRRESOURCES-103-OWZ3HFZ43MS4CUVJZUVLTQDPH6VF24RFDOZDFCITEPHO3WVUHWJQ\m\target\test-classes\supplemental-artifact\resource-projects\deficient-dep\target\classes
[INFO] -------------------------------------------------------------
[ERROR] COMPILATION ERROR :
[INFO] -------------------------------------------------------------
[ERROR] Source option 1.5 is no longer supported. Use 1.6 or later.
[ERROR] Target option 1.5 is no longer supported. Use 1.6 or later.
[INFO] 2 errors
[INFO] -------------------------------------------------------------
[INFO] ------------------------------------------------------------------------
[INFO] Reactor Summary:
[INFO]
[INFO] resources .......................................... SUCCESS [  0.791 s]
[INFO] supplemental-models ................................ SUCCESS [  1.245 s]
[INFO] deficient-dep ...................................... FAILURE [  0.713 s]
[INFO] ------------------------------------------------------------------------
[INFO] BUILD FAILURE
[INFO] ------------------------------------------------------------------------
[INFO] Total time: 3.122 s
[INFO] Finished at: 2018-02-13T19:22:26Z
[INFO] Final Memory: 14M/47M
[INFO] ------------------------------------------------------------------------
[ERROR] Failed to execute goal org.apache.maven.plugins:maven-compiler-plugin:3.1:compile (default-compile) on project deficient-dep: Compilation failure: Compilation failure:
[ERROR] Source option 1.5 is no longer supported. Use 1.6 or later.
[ERROR] Target option 1.5 is no longer supported. Use 1.6 or later.
[ERROR] -> [Help 1]
org.apache.maven.lifecycle.LifecycleExecutionException: Failed to execute goal org.apache.maven.plugins:maven-compiler-plugin:3.1:compile (default-compile) on project deficient-dep: Compilation failure
 at org.apache.maven.lifecycle.internal.MojoExecutor.execute(MojoExecutor.java:213)
 at org.apache.maven.lifecycle.internal.MojoExecutor.execute(MojoExecutor.java:154)
 at org.apache.maven.lifecycle.internal.MojoExecutor.execute(MojoExecutor.java:146)
 at org.apache.maven.lifecycle.internal.LifecycleModuleBuilder.buildProject(LifecycleModuleBuilder.java:117)
 at org.apache.maven.lifecycle.internal.LifecycleModuleBuilder.buildProject(LifecycleModuleBuilder.java:81)
 at org.apache.maven.lifecycle.internal.builder.singlethreaded.SingleThreadedBuilder.build(SingleThreadedBuilder.java:51)
 at org.apache.maven.lifecycle.internal.LifecycleStarter.execute(LifecycleStarter.java:128)
 at org.apache.maven.DefaultMaven.doExecute(DefaultMaven.java:309)
 at org.apache.maven.DefaultMaven.doExecute(DefaultMaven.java:194)
 at org.apache.maven.DefaultMaven.execute(DefaultMaven.java:107)
 at org.apache.maven.cli.MavenCli.execute(MavenCli.java:993)
 at org.apache.maven.cli.MavenCli.doMain(MavenCli.java:345)
 at org.apache.maven.cli.MavenCli.main(MavenCli.java:191)
 at java.base/jdk.internal.reflect.NativeMethodAccessorImpl.invoke0(Native Method)
 at java.base/jdk.internal.reflect.NativeMethodAccessorImpl.invoke(NativeMethodAccessorImpl.java:62)
 at java.base/jdk.internal.reflect.DelegatingMethodAccessorImpl.invoke(DelegatingMethodAccessorImpl.java:43)
 at java.base/java.lang.reflect.Method.invoke(Method.java:564)
 at org.codehaus.plexus.classworlds.launcher.Launcher.launchEnhanced(Launcher.java:289)
 at org.codehaus.plexus.classworlds.launcher.Launcher.launch(Launcher.java:229)
 at org.codehaus.plexus.classworlds.launcher.Launcher.mainWithExitCode(Launcher.java:415)
 at org.codehaus.plexus.classworlds.launcher.Launcher.main(Launcher.java:356)
Caused by: org.apache.maven.plugin.compiler.CompilationFailureException: Compilation failure
 at org.apache.maven.plugin.compiler.AbstractCompilerMojo.execute(AbstractCompilerMojo.java:858)
 at org.apache.maven.plugin.compiler.CompilerMojo.execute(CompilerMojo.java:129)
 at org.apache.maven.plugin.DefaultBuildPluginManager.executeMojo(DefaultBuildPluginManager.java:134)
 at org.apache.maven.lifecycle.internal.MojoExecutor.execute(MojoExecutor.java:208)
 ... 20 more
[ERROR]
[ERROR] Re-run Maven using the -X switch to enable full debug logging.
[ERROR]
[ERROR] For more information about the errors and possible solutions, please read the following articles:
[ERROR] [Help 1] http://cwiki.apache.org/confluence/display/MAVEN/MojoFailureException
[ERROR]
[ERROR] After correcting the problems, you can resume the build with the command
[ERROR]   mvn <goals> -rf :deficient-dep


Stack Trace:
org.apache.maven.it.VerificationException:
Exit code was non-zero: 1; command line and log =
F:\jenkins\tools\maven\apache-maven-3.5.0\bin\mvn -e --batch-mode -Dmaven.repo.local=f:\jenkins\jenkins-slave\workspace\rces-plugin_MRRESOURCES-103-OWZ3HFZ43MS4CUVJZUVLTQDPH6VF24RFDOZDFCITEPHO3WVUHWJQ\m\target/it-repo org.apache.maven.plugins:maven-clean-plugin:clean deploy
Picked up JAVA_TOOL_OPTIONS: -Dmaven.ext.class.path="f:\jenkins\jenkins-slave\workspace\rces-plugin_MRRESOURCES-103-OWZ3HFZ43MS4CUVJZUVLTQDPH6VF24RFDOZDFCITEPHO3WVUHWJQ@tmp\withMavene513d22a\pipeline-maven-spy.jar" -Dorg.jenkinsci.plugins.pipeline.maven.reportsFolder="f:\jenkins\jenkins-slave\workspace\rces-plugin_MRRESOURCES-103-OWZ3HFZ43MS4CUVJZUVLTQDPH6VF24RFDOZDFCITEPHO3WVUHWJQ@tmp\withMavene513d22a"
[INFO] [jenkins-event-spy] Jenkins Maven Event Spy is disabled
[INFO] Error stacktraces are turned on.
[INFO] Scanning for projects...
[INFO] ------------------------------------------------------------------------
[INFO] Reactor Build Order:
[INFO]
[INFO] resources
[INFO] supplemental-models
[INFO] deficient-dep
[INFO]
[INFO] ------------------------------------------------------------------------
[INFO] Building resources 1
[INFO] ------------------------------------------------------------------------
[INFO]
[INFO] --- maven-clean-plugin:2.5:clean (default-cli) @ resources ---
[INFO]
[INFO] --- maven-install-plugin:2.4:install (default-install) @ resources ---
[INFO] Installing f:\jenkins\jenkins-slave\workspace\rces-plugin_MRRESOURCES-103-OWZ3HFZ43MS4CUVJZUVLTQDPH6VF24RFDOZDFCITEPHO3WVUHWJQ\m\target\test-classes\supplemental-artifact\resource-projects\pom.xml to f:\jenkins\jenkins-slave\workspace\rces-plugin_MRRESOURCES-103-OWZ3HFZ43MS4CUVJZUVLTQDPH6VF24RFDOZDFCITEPHO3WVUHWJQ\m\target\it-repo\org\apache\maven\plugin\rresource\it\mrr43\resources\1\resources-1.pom
[INFO]
[INFO] --- maven-deploy-plugin:2.7:deploy (default-deploy) @ resources ---
[INFO] Uploading: file:f:\\jenkins\\jenkins-slave\\workspace\\rces-plugin_MRRESOURCES-103-OWZ3HFZ43MS4CUVJZUVLTQDPH6VF24RFDOZDFCITEPHO3WVUHWJQ\\m\\target/remote-repo/org/apache/maven/plugin/rresource/it/mrr43/resources/1/resources-1.pom
[INFO] Uploaded: file:f:\\jenkins\\jenkins-slave\\workspace\\rces-plugin_MRRESOURCES-103-OWZ3HFZ43MS4CUVJZUVLTQDPH6VF24RFDOZDFCITEPHO3WVUHWJQ\\m\\target/remote-repo/org/apache/maven/plugin/rresource/it/mrr43/resources/1/resources-1.pom (1.6 kB at 40 kB/s)
[INFO] Downloading: file:f:\\jenkins\\jenkins-slave\\workspace\\rces-plugin_MRRESOURCES-103-OWZ3HFZ43MS4CUVJZUVLTQDPH6VF24RFDOZDFCITEPHO3WVUHWJQ\\m\\target/remote-repo/org/apache/maven/plugin/rresource/it/mrr43/resources/maven-metadata.xml
[INFO] Uploading: file:f:\\jenkins\\jenkins-slave\\workspace\\rces-plugin_MRRESOURCES-103-OWZ3HFZ43MS4CUVJZUVLTQDPH6VF24RFDOZDFCITEPHO3WVUHWJQ\\m\\target/remote-repo/org/apache/maven/plugin/rresource/it/mrr43/resources/maven-metadata.xml
[INFO] Uploaded: file:f:\\jenkins\\jenkins-slave\\workspace\\rces-plugin_MRRESOURCES-103-OWZ3HFZ43MS4CUVJZUVLTQDPH6VF24RFDOZDFCITEPHO3WVUHWJQ\\m\\target/remote-repo/org/apache/maven/plugin/rresource/it/mrr43/resources/maven-metadata.xml (323 B at 162 kB/s)
[INFO]
[INFO] ------------------------------------------------------------------------
[INFO] Building supplemental-models 1
[INFO] ------------------------------------------------------------------------
[INFO]
[INFO] --- maven-clean-plugin:2.5:clean (default-cli) @ supplemental-models ---
[INFO]
[INFO] --- maven-resources-plugin:2.6:resources (default-resources) @ supplemental-models ---
[WARNING] Using platform encoding (Cp1252 actually) to copy filtered resources, i.e. build is platform dependent!
[INFO] Copying 1 resource
[INFO]
[INFO] --- maven-compiler-plugin:3.1:compile (default-compile) @ supplemental-models ---
[INFO] No sources to compile
[INFO]
[INFO] --- maven-resources-plugin:2.6:testResources (default-testResources) @ supplemental-models ---
[WARNING] Using platform encoding (Cp1252 actually) to copy filtered resources, i.e. build is platform dependent!
[INFO] skip non existing resourceDirectory F:\jenkins\jenkins-slave\workspace\rces-plugin_MRRESOURCES-103-OWZ3HFZ43MS4CUVJZUVLTQDPH6VF24RFDOZDFCITEPHO3WVUHWJQ\m\target\test-classes\supplemental-artifact\resource-projects\supplemental-models\src\test\resources
[INFO]
[INFO] --- maven-compiler-plugin:3.1:testCompile (default-testCompile) @ supplemental-models ---
[INFO] No sources to compile
[INFO]
[INFO] --- maven-surefire-plugin:2.12.4:test (default-test) @ supplemental-models ---
[INFO] No tests to run.
[INFO]
[INFO] --- maven-jar-plugin:2.4:jar (default-jar) @ supplemental-models ---
[INFO] Building jar: F:\jenkins\jenkins-slave\workspace\rces-plugin_MRRESOURCES-103-OWZ3HFZ43MS4CUVJZUVLTQDPH6VF24RFDOZDFCITEPHO3WVUHWJQ\m\target\test-classes\supplemental-artifact\resource-projects\supplemental-models\target\supplemental-models-1.jar
[INFO]
[INFO] --- maven-install-plugin:2.4:install (default-install) @ supplemental-models ---
[INFO] Installing F:\jenkins\jenkins-slave\workspace\rces-plugin_MRRESOURCES-103-OWZ3HFZ43MS4CUVJZUVLTQDPH6VF24RFDOZDFCITEPHO3WVUHWJQ\m\target\test-classes\supplemental-artifact\resource-projects\supplemental-models\target\supplemental-models-1.jar to f:\jenkins\jenkins-slave\workspace\rces-plugin_MRRESOURCES-103-OWZ3HFZ43MS4CUVJZUVLTQDPH6VF24RFDOZDFCITEPHO3WVUHWJQ\m\target\it-repo\org\apache\maven\plugin\rresource\it\mrr43\supplemental-models\1\supplemental-models-1.jar
[INFO] Installing F:\jenkins\jenkins-slave\workspace\rces-plugin_MRRESOURCES-103-OWZ3HFZ43MS4CUVJZUVLTQDPH6VF24RFDOZDFCITEPHO3WVUHWJQ\m\target\test-classes\supplemental-artifact\resource-projects\supplemental-models\pom.xml to f:\jenkins\jenkins-slave\workspace\rces-plugin_MRRESOURCES-103-OWZ3HFZ43MS4CUVJZUVLTQDPH6VF24RFDOZDFCITEPHO3WVUHWJQ\m\target\it-repo\org\apache\maven\plugin\rresource\it\mrr43\supplemental-models\1\supplemental-models-1.pom
[INFO]
[INFO] --- maven-deploy-plugin:2.7:deploy (default-deploy) @ supplemental-models ---
[INFO] Uploading: file:f:\\jenkins\\jenkins-slave\\workspace\\rces-plugin_MRRESOURCES-103-OWZ3HFZ43MS4CUVJZUVLTQDPH6VF24RFDOZDFCITEPHO3WVUHWJQ\\m\\target/remote-repo/org/apache/maven/plugin/rresource/it/mrr43/supplemental-models/1/supplemental-models-1.jar
[INFO] Uploaded: file:f:\\jenkins\\jenkins-slave\\workspace\\rces-plugin_MRRESOURCES-103-OWZ3HFZ43MS4CUVJZUVLTQDPH6VF24RFDOZDFCITEPHO3WVUHWJQ\\m\\target/remote-repo/org/apache/maven/plugin/rresource/it/mrr43/supplemental-models/1/supplemental-models-1.jar (3.0 kB at 995 kB/s)
[INFO] Uploading: file:f:\\jenkins\\jenkins-slave\\workspace\\rces-plugin_MRRESOURCES-103-OWZ3HFZ43MS4CUVJZUVLTQDPH6VF24RFDOZDFCITEPHO3WVUHWJQ\\m\\target/remote-repo/org/apache/maven/plugin/rresource/it/mrr43/supplemental-models/1/supplemental-models-1.pom
[INFO] Uploaded: file:f:\\jenkins\\jenkins-slave\\workspace\\rces-plugin_MRRESOURCES-103-OWZ3HFZ43MS4CUVJZUVLTQDPH6VF24RFDOZDFCITEPHO3WVUHWJQ\\m\\target/remote-repo/org/apache/maven/plugin/rresource/it/mrr43/supplemental-models/1/supplemental-models-1.pom (1.3 kB at 432 kB/s)
[INFO] Downloading: file:f:\\jenkins\\jenkins-slave\\workspace\\rces-plugin_MRRESOURCES-103-OWZ3HFZ43MS4CUVJZUVLTQDPH6VF24RFDOZDFCITEPHO3WVUHWJQ\\m\\target/remote-repo/org/apache/maven/plugin/rresource/it/mrr43/supplemental-models/maven-metadata.xml
[INFO] Uploading: file:f:\\jenkins\\jenkins-slave\\workspace\\rces-plugin_MRRESOURCES-103-OWZ3HFZ43MS4CUVJZUVLTQDPH6VF24RFDOZDFCITEPHO3WVUHWJQ\\m\\target/remote-repo/org/apache/maven/plugin/rresource/it/mrr43/supplemental-models/maven-metadata.xml
[INFO] Uploaded: file:f:\\jenkins\\jenkins-slave\\workspace\\rces-plugin_MRRESOURCES-103-OWZ3HFZ43MS4CUVJZUVLTQDPH6VF24RFDOZDFCITEPHO3WVUHWJQ\\m\\target/remote-repo/org/apache/maven/plugin/rresource/it/mrr43/supplemental-models/maven-metadata.xml (333 B at 166 kB/s)
[INFO]
[INFO] ------------------------------------------------------------------------
[INFO] Building deficient-dep 1
[INFO] ------------------------------------------------------------------------
[INFO]
[INFO] --- maven-clean-plugin:2.5:clean (default-cli) @ deficient-dep ---
[INFO]
[INFO] --- maven-resources-plugin:2.6:resources (default-resources) @ deficient-dep ---
[WARNING] Using platform encoding (Cp1252 actually) to copy filtered resources, i.e. build is platform dependent!
[INFO] skip non existing resourceDirectory F:\jenkins\jenkins-slave\workspace\rces-plugin_MRRESOURCES-103-OWZ3HFZ43MS4CUVJZUVLTQDPH6VF24RFDOZDFCITEPHO3WVUHWJQ\m\target\test-classes\supplemental-artifact\resource-projects\deficient-dep\src\main\resources
[INFO]
[INFO] --- maven-compiler-plugin:3.1:compile (default-compile) @ deficient-dep ---
[INFO] Changes detected - recompiling the module!
[WARNING] File encoding has not been set, using platform encoding Cp1252, i.e. build is platform dependent!
[INFO] Compiling 1 source file to F:\jenkins\jenkins-slave\workspace\rces-plugin_MRRESOURCES-103-OWZ3HFZ43MS4CUVJZUVLTQDPH6VF24RFDOZDFCITEPHO3WVUHWJQ\m\target\test-classes\supplemental-artifact\resource-projects\deficient-dep\target\classes
[INFO] -------------------------------------------------------------
[ERROR] COMPILATION ERROR :
[INFO] -------------------------------------------------------------
[ERROR] Source option 1.5 is no longer supported. Use 1.6 or later.
[ERROR] Target option 1.5 is no longer supported. Use 1.6 or later.
[INFO] 2 errors
[INFO] -------------------------------------------------------------
[INFO] ------------------------------------------------------------------------
[INFO] Reactor Summary:
[INFO]
[INFO] resources .......................................... SUCCESS [  0.791 s]
[INFO] supplemental-models ................................ SUCCESS [  1.245 s]
[INFO] deficient-dep ...................................... FAILURE [  0.713 s]
[INFO] ------------------------------------------------------------------------
[INFO] BUILD FAILURE
[INFO] ------------------------------------------------------------------------
[INFO] Total time: 3.122 s
[INFO] Finished at: 2018-02-13T19:22:26Z
[INFO] Final Memory: 14M/47M
[INFO] ------------------------------------------------------------------------
[ERROR] Failed to execute goal org.apache.maven.plugins:maven-compiler-plugin:3.1:compile (default-compile) on project deficient-dep: Compilation failure: Compilation failure:
[ERROR] Source option 1.5 is no longer supported. Use 1.6 or later.
[ERROR] Target option 1.5 is no longer supported. Use 1.6 or later.
[ERROR] -> [Help 1]
org.apache.maven.lifecycle.LifecycleExecutionException: Failed to execute goal org.apache.maven.plugins:maven-compiler-plugin:3.1:compile (default-compile) on project deficient-dep: Compilation failure
        at org.apache.maven.lifecycle.internal.MojoExecutor.execute(MojoExecutor.java:213)
        at org.apache.maven.lifecycle.internal.MojoExecutor.execute(MojoExecutor.java:154)
        at org.apache.maven.lifecycle.internal.MojoExecutor.execute(MojoExecutor.java:146)
        at org.apache.maven.lifecycle.internal.LifecycleModuleBuilder.buildProject(LifecycleModuleBuilder.java:117)
        at org.apache.maven.lifecycle.internal.LifecycleModuleBuilder.buildProject(LifecycleModuleBuilder.java:81)
        at org.apache.maven.lifecycle.internal.builder.singlethreaded.SingleThreadedBuilder.build(SingleThreadedBuilder.java:51)
        at org.apache.maven.lifecycle.internal.LifecycleStarter.execute(LifecycleStarter.java:128)
        at org.apache.maven.DefaultMaven.doExecute(DefaultMaven.java:309)
        at org.apache.maven.DefaultMaven.doExecute(DefaultMaven.java:194)
        at org.apache.maven.DefaultMaven.execute(DefaultMaven.java:107)
        at org.apache.maven.cli.MavenCli.execute(MavenCli.java:993)
        at org.apache.maven.cli.MavenCli.doMain(MavenCli.java:345)
        at org.apache.maven.cli.MavenCli.main(MavenCli.java:191)
        at java.base/jdk.internal.reflect.NativeMethodAccessorImpl.invoke0(Native Method)
        at java.base/jdk.internal.reflect.NativeMethodAccessorImpl.invoke(NativeMethodAccessorImpl.java:62)
        at java.base/jdk.internal.reflect.DelegatingMethodAccessorImpl.invoke(DelegatingMethodAccessorImpl.java:43)
        at java.base/java.lang.reflect.Method.invoke(Method.java:564)
        at org.codehaus.plexus.classworlds.launcher.Launcher.launchEnhanced(Launcher.java:289)
        at org.codehaus.plexus.classworlds.launcher.Launcher.launch(Launcher.java:229)
        at org.codehaus.plexus.classworlds.launcher.Launcher.mainWithExitCode(Launcher.java:415)
        at org.codehaus.plexus.classworlds.launcher.Launcher.main(Launcher.java:356)
Caused by: org.apache.maven.plugin.compiler.CompilationFailureException: Compilation failure
        at org.apache.maven.plugin.compiler.AbstractCompilerMojo.execute(AbstractCompilerMojo.java:858)
        at org.apache.maven.plugin.compiler.CompilerMojo.execute(CompilerMojo.java:129)
        at org.apache.maven.plugin.DefaultBuildPluginManager.executeMojo(DefaultBuildPluginManager.java:134)
        at org.apache.maven.lifecycle.internal.MojoExecutor.execute(MojoExecutor.java:208)
        ... 20 more
[ERROR]
[ERROR] Re-run Maven using the -X switch to enable full debug logging.
[ERROR]
[ERROR] For more information about the errors and possible solutions, please read the following articles:
[ERROR] [Help 1] http://cwiki.apache.org/confluence/display/MAVEN/MojoFailureException
[ERROR]
[ERROR] After correcting the problems, you can resume the build with the command
[ERROR]   mvn <goals> -rf :deficient-dep

        at org.apache.maven.plugin.resources.remote.it.IT_SupplementalArtifact.test(IT_SupplementalArtifact.java:50)


FAILED:  org.apache.maven.plugin.resources.remote.it.IT_SupplementalArtifact.test

Error Message:
Exit code was non-zero: 1; command line and log =
/home/jenkins/tools/maven/apache-maven-3.5.2/bin/mvn -e --batch-mode -Dmaven.repo.local=/home/jenkins/jenkins-slave/workspace/rces-plugin_MRRESOURCES-103-OWZ3HFZ43MS4CUVJZUVLTQDPH6VF24RFDOZDFCITEPHO3WVUHWJQ/m/target/it-repo org.apache.maven.plugins:maven-clean-plugin:clean deploy
Picked up JAVA_TOOL_OPTIONS: -Dmaven.ext.class.path="/home/jenkins/jenkins-slave/workspace/rces-plugin_MRRESOURCES-103-OWZ3HFZ43MS4CUVJZUVLTQDPH6VF24RFDOZDFCITEPHO3WVUHWJQ@tmp/withMavenedeb8f07/pipeline-maven-spy.jar" -Dorg.jenkinsci.plugins.pipeline.maven.reportsFolder="/home/jenkins/jenkins-slave/workspace/rces-plugin_MRRESOURCES-103-OWZ3HFZ43MS4CUVJZUVLTQDPH6VF24RFDOZDFCITEPHO3WVUHWJQ@tmp/withMavenedeb8f07"
[INFO] [jenkins-event-spy] Jenkins Maven Event Spy is disabled
[INFO] Error stacktraces are turned on.
[INFO] Scanning for projects...
[INFO] ------------------------------------------------------------------------
[INFO] Reactor Build Order:
[INFO]
[INFO] resources
[INFO] supplemental-models
[INFO] deficient-dep
[INFO]
[INFO] ------------------------------------------------------------------------
[INFO] Building resources 1
[INFO] ------------------------------------------------------------------------
[INFO]
[INFO] --- maven-clean-plugin:2.5:clean (default-cli) @ resources ---
[INFO]
[INFO] --- maven-install-plugin:2.4:install (default-install) @ resources ---
[INFO] Installing /home/jenkins/jenkins-slave/workspace/rces-plugin_MRRESOURCES-103-OWZ3HFZ43MS4CUVJZUVLTQDPH6VF24RFDOZDFCITEPHO3WVUHWJQ/m/target/test-classes/supplemental-artifact/resource-projects/pom.xml to /home/jenkins/jenkins-slave/workspace/rces-plugin_MRRESOURCES-103-OWZ3HFZ43MS4CUVJZUVLTQDPH6VF24RFDOZDFCITEPHO3WVUHWJQ/m/target/it-repo/org/apache/maven/plugin/rresource/it/mrr43/resources/1/resources-1.pom
[INFO]
[INFO] --- maven-deploy-plugin:2.7:deploy (default-deploy) @ resources ---
[INFO] Uploading to it-remote: file:/home/jenkins/jenkins-slave/workspace/rces-plugin_MRRESOURCES-103-OWZ3HFZ43MS4CUVJZUVLTQDPH6VF24RFDOZDFCITEPHO3WVUHWJQ/m/target/remote-repo/org/apache/maven/plugin/rresource/it/mrr43/resources/1/resources-1.pom
[INFO] Uploaded to it-remote: file:/home/jenkins/jenkins-slave/workspace/rces-plugin_MRRESOURCES-103-OWZ3HFZ43MS4CUVJZUVLTQDPH6VF24RFDOZDFCITEPHO3WVUHWJQ/m/target/remote-repo/org/apache/maven/plugin/rresource/it/mrr43/resources/1/resources-1.pom (1.6 kB at 122 kB/s)
[INFO] Downloading from it-remote: file:/home/jenkins/jenkins-slave/workspace/rces-plugin_MRRESOURCES-103-OWZ3HFZ43MS4CUVJZUVLTQDPH6VF24RFDOZDFCITEPHO3WVUHWJQ/m/target/remote-repo/org/apache/maven/plugin/rresource/it/mrr43/resources/maven-metadata.xml
[INFO] Uploading to it-remote: file:/home/jenkins/jenkins-slave/workspace/rces-plugin_MRRESOURCES-103-OWZ3HFZ43MS4CUVJZUVLTQDPH6VF24RFDOZDFCITEPHO3WVUHWJQ/m/target/remote-repo/org/apache/maven/plugin/rresource/it/mrr43/resources/maven-metadata.xml
[INFO] Uploaded to it-remote: file:/home/jenkins/jenkins-slave/workspace/rces-plugin_MRRESOURCES-103-OWZ3HFZ43MS4CUVJZUVLTQDPH6VF24RFDOZDFCITEPHO3WVUHWJQ/m/target/remote-repo/org/apache/maven/plugin/rresource/it/mrr43/resources/maven-metadata.xml (323 B at 65 kB/s)
[INFO]
[INFO] ------------------------------------------------------------------------
[INFO] Building supplemental-models 1
[INFO] ------------------------------------------------------------------------
[INFO]
[INFO] --- maven-clean-plugin:2.5:clean (default-cli) @ supplemental-models ---
[INFO]
[INFO] --- maven-resources-plugin:2.6:resources (default-resources) @ supplemental-models ---
[WARNING] Using platform encoding (ISO-8859-1 actually) to copy filtered resources, i.e. build is platform dependent!
[INFO] Copying 1 resource
[INFO]
[INFO] --- maven-compiler-plugin:3.1:compile (default-compile) @ supplemental-models ---
[INFO] No sources to compile
[INFO]
[INFO] --- maven-resources-plugin:2.6:testResources (default-testResources) @ supplemental-models ---
[WARNING] Using platform encoding (ISO-8859-1 actually) to copy filtered resources, i.e. build is platform dependent!
[INFO] skip non existing resourceDirectory /home/jenkins/jenkins-slave/workspace/rces-plugin_MRRESOURCES-103-OWZ3HFZ43MS4CUVJZUVLTQDPH6VF24RFDOZDFCITEPHO3WVUHWJQ/m/target/test-classes/supplemental-artifact/resource-projects/supplemental-models/src/test/resources
[INFO]
[INFO] --- maven-compiler-plugin:3.1:testCompile (default-testCompile) @ supplemental-models ---
[INFO] No sources to compile
[INFO]
[INFO] --- maven-surefire-plugin:2.12.4:test (default-test) @ supplemental-models ---
[INFO] No tests to run.
[INFO]
[INFO] --- maven-jar-plugin:2.4:jar (default-jar) @ supplemental-models ---
[INFO] Building jar: /home/jenkins/jenkins-slave/workspace/rces-plugin_MRRESOURCES-103-OWZ3HFZ43MS4CUVJZUVLTQDPH6VF24RFDOZDFCITEPHO3WVUHWJQ/m/target/test-classes/supplemental-artifact/resource-projects/supplemental-models/target/supplemental-models-1.jar
[INFO]
[INFO] --- maven-install-plugin:2.4:install (default-install) @ supplemental-models ---
[INFO] Installing /home/jenkins/jenkins-slave/workspace/rces-plugin_MRRESOURCES-103-OWZ3HFZ43MS4CUVJZUVLTQDPH6VF24RFDOZDFCITEPHO3WVUHWJQ/m/target/test-classes/supplemental-artifact/resource-projects/supplemental-models/target/supplemental-models-1.jar to /home/jenkins/jenkins-slave/workspace/rces-plugin_MRRESOURCES-103-OWZ3HFZ43MS4CUVJZUVLTQDPH6VF24RFDOZDFCITEPHO3WVUHWJQ/m/target/it-repo/org/apache/maven/plugin/rresource/it/mrr43/supplemental-models/1/supplemental-models-1.jar
[INFO] Installing /home/jenkins/jenkins-slave/workspace/rces-plugin_MRRESOURCES-103-OWZ3HFZ43MS4CUVJZUVLTQDPH6VF24RFDOZDFCITEPHO3WVUHWJQ/m/target/test-classes/supplemental-artifact/resource-projects/supplemental-models/pom.xml to /home/jenkins/jenkins-slave/workspace/rces-plugin_MRRESOURCES-103-OWZ3HFZ43MS4CUVJZUVLTQDPH6VF24RFDOZDFCITEPHO3WVUHWJQ/m/target/it-repo/org/apache/maven/plugin/rresource/it/mrr43/supplemental-models/1/supplemental-models-1.pom
[INFO]
[INFO] --- maven-deploy-plugin:2.7:deploy (default-deploy) @ supplemental-models ---
[INFO] Uploading to it-remote: file:/home/jenkins/jenkins-slave/workspace/rces-plugin_MRRESOURCES-103-OWZ3HFZ43MS4CUVJZUVLTQDPH6VF24RFDOZDFCITEPHO3WVUHWJQ/m/target/remote-repo/org/apache/maven/plugin/rresource/it/mrr43/supplemental-models/1/supplemental-models-1.jar
[INFO] Uploaded to it-remote: file:/home/jenkins/jenkins-slave/workspace/rces-plugin_MRRESOURCES-103-OWZ3HFZ43MS4CUVJZUVLTQDPH6VF24RFDOZDFCITEPHO3WVUHWJQ/m/target/remote-repo/org/apache/maven/plugin/rresource/it/mrr43/supplemental-models/1/supplemental-models-1.jar (3.0 kB at 1.5 MB/s)
[INFO] Uploading to it-remote: file:/home/jenkins/jenkins-slave/workspace/rces-plugin_MRRESOURCES-103-OWZ3HFZ43MS4CUVJZUVLTQDPH6VF24RFDOZDFCITEPHO3WVUHWJQ/m/target/remote-repo/org/apache/maven/plugin/rresource/it/mrr43/supplemental-models/1/supplemental-models-1.pom
[INFO] Uploaded to it-remote: file:/home/jenkins/jenkins-slave/workspace/rces-plugin_MRRESOURCES-103-OWZ3HFZ43MS4CUVJZUVLTQDPH6VF24RFDOZDFCITEPHO3WVUHWJQ/m/target/remote-repo/org/apache/maven/plugin/rresource/it/mrr43/supplemental-models/1/supplemental-models-1.pom (1.3 kB at 1.3 MB/s)
[INFO] Downloading from it-remote: file:/home/jenkins/jenkins-slave/workspace/rces-plugin_MRRESOURCES-103-OWZ3HFZ43MS4CUVJZUVLTQDPH6VF24RFDOZDFCITEPHO3WVUHWJQ/m/target/remote-repo/org/apache/maven/plugin/rresource/it/mrr43/supplemental-models/maven-metadata.xml
[INFO] Uploading to it-remote: file:/home/jenkins/jenkins-slave/workspace/rces-plugin_MRRESOURCES-103-OWZ3HFZ43MS4CUVJZUVLTQDPH6VF24RFDOZDFCITEPHO3WVUHWJQ/m/target/remote-repo/org/apache/maven/plugin/rresource/it/mrr43/supplemental-models/maven-metadata.xml
[INFO] Uploaded to it-remote: file:/home/jenkins/jenkins-slave/workspace/rces-plugin_MRRESOURCES-103-OWZ3HFZ43MS4CUVJZUVLTQDPH6VF24RFDOZDFCITEPHO3WVUHWJQ/m/target/remote-repo/org/apache/maven/plugin/rresource/it/mrr43/supplemental-models/maven-metadata.xml (333 B)
[INFO]
[INFO] ------------------------------------------------------------------------
[INFO] Building deficient-dep 1
[INFO] ------------------------------------------------------------------------
[INFO]
[INFO] --- maven-clean-plugin:2.5:clean (default-cli) @ deficient-dep ---
[INFO]
[INFO] --- maven-resources-plugin:2.6:resources (default-resources) @ deficient-dep ---
[WARNING] Using platform encoding (ISO-8859-1 actually) to copy filtered resources, i.e. build is platform dependent!
[INFO] skip non existing resourceDirectory /home/jenkins/jenkins-slave/workspace/rces-plugin_MRRESOURCES-103-OWZ3HFZ43MS4CUVJZUVLTQDPH6VF24RFDOZDFCITEPHO3WVUHWJQ/m/target/test-classes/supplemental-artifact/resource-projects/deficient-dep/src/main/resources
[INFO]
[INFO] --- maven-compiler-plugin:3.1:compile (default-compile) @ deficient-dep ---
[INFO] Changes detected - recompiling the module!
[WARNING] File encoding has not been set, using platform encoding ISO-8859-1, i.e. build is platform dependent!
[INFO] Compiling 1 source file to /home/jenkins/jenkins-slave/workspace/rces-plugin_MRRESOURCES-103-OWZ3HFZ43MS4CUVJZUVLTQDPH6VF24RFDOZDFCITEPHO3WVUHWJQ/m/target/test-classes/supplemental-artifact/resource-projects/deficient-dep/target/classes
[INFO] -------------------------------------------------------------
[ERROR] COMPILATION ERROR :
[INFO] -------------------------------------------------------------
[ERROR] Source option 1.5 is no longer supported. Use 1.6 or later.
[ERROR] Target option 1.5 is no longer supported. Use 1.6 or later.
[INFO] 2 errors
[INFO] -------------------------------------------------------------
[INFO] ------------------------------------------------------------------------
[INFO] Reactor Summary:
[INFO]
[INFO] resources .......................................... SUCCESS [  0.410 s]
[INFO] supplemental-models ................................ SUCCESS [  0.778 s]
[INFO] deficient-dep ...................................... FAILURE [  0.407 s]
[INFO] ------------------------------------------------------------------------
[INFO] BUILD FAILURE
[INFO] ------------------------------------------------------------------------
[INFO] Total time: 1.761 s
[INFO] Finished at: 2018-02-13T19:31:00Z
[INFO] Final Memory: 14M/48M
[INFO] ------------------------------------------------------------------------
[ERROR] Failed to execute goal org.apache.maven.plugins:maven-compiler-plugin:3.1:compile (default-compile) on project deficient-dep: Compilation failure: Compilation failure:
[ERROR] Source option 1.5 is no longer supported. Use 1.6 or later.
[ERROR] Target option 1.5 is no longer supported. Use 1.6 or later.
[ERROR] -> [Help 1]
org.apache.maven.lifecycle.LifecycleExecutionException: Failed to execute goal org.apache.maven.plugins:maven-compiler-plugin:3.1:compile (default-compile) on project deficient-dep: Compilation failure
    at org.apache.maven.lifecycle.internal.MojoExecutor.execute (MojoExecutor.java:213)
    at org.apache.maven.lifecycle.internal.MojoExecutor.execute (MojoExecutor.java:154)
    at org.apache.maven.lifecycle.internal.MojoExecutor.execute (MojoExecutor.java:146)
    at org.apache.maven.lifecycle.internal.LifecycleModuleBuilder.buildProject (LifecycleModuleBuilder.java:117)
    at org.apache.maven.lifecycle.internal.LifecycleModuleBuilder.buildProject (LifecycleModuleBuilder.java:81)
    at org.apache.maven.lifecycle.internal.builder.singlethreaded.SingleThreadedBuilder.build (SingleThreadedBuilder.java:51)
    at org.apache.maven.lifecycle.internal.LifecycleStarter.execute (LifecycleStarter.java:128)
    at org.apache.maven.DefaultMaven.doExecute (DefaultMaven.java:309)
    at org.apache.maven.DefaultMaven.doExecute (DefaultMaven.java:194)
    at org.apache.maven.DefaultMaven.execute (DefaultMaven.java:107)
    at org.apache.maven.cli.MavenCli.execute (MavenCli.java:955)
    at org.apache.maven.cli.MavenCli.doMain (MavenCli.java:290)
    at org.apache.maven.cli.MavenCli.main (MavenCli.java:194)
    at jdk.internal.reflect.NativeMethodAccessorImpl.invoke0 (Native Method)
    at jdk.internal.reflect.NativeMethodAccessorImpl.invoke (NativeMethodAccessorImpl.java:62)
    at jdk.internal.reflect.DelegatingMethodAccessorImpl.invoke (DelegatingMethodAccessorImpl.java:43)
    at java.lang.reflect.Method.invoke (Method.java:564)
    at org.codehaus.plexus.classworlds.launcher.Launcher.launchEnhanced (Launcher.java:289)
    at org.codehaus.plexus.classworlds.launcher.Launcher.launch (Launcher.java:229)
    at org.codehaus.plexus.classworlds.launcher.Launcher.mainWithExitCode (Launcher.java:415)
    at org.codehaus.plexus.classworlds.launcher.Launcher.main (Launcher.java:356)
Caused by: org.apache.maven.plugin.compiler.CompilationFailureException: Compilation failure
    at org.apache.maven.plugin.compiler.AbstractCompilerMojo.execute (AbstractCompilerMojo.java:858)
    at org.apache.maven.plugin.compiler.CompilerMojo.execute (CompilerMojo.java:129)
    at org.apache.maven.plugin.DefaultBuildPluginManager.executeMojo (DefaultBuildPluginManager.java:134)
    at org.apache.maven.lifecycle.internal.MojoExecutor.execute (MojoExecutor.java:208)
    at org.apache.maven.lifecycle.internal.MojoExecutor.execute (MojoExecutor.java:154)
    at org.apache.maven.lifecycle.internal.MojoExecutor.execute (MojoExecutor.java:146)
    at org.apache.maven.lifecycle.internal.LifecycleModuleBuilder.buildProject (LifecycleModuleBuilder.java:117)
    at org.apache.maven.lifecycle.internal.LifecycleModuleBuilder.buildProject (LifecycleModuleBuilder.java:81)
    at org.apache.maven.lifecycle.internal.builder.singlethreaded.SingleThreadedBuilder.build (SingleThreadedBuilder.java:51)
    at org.apache.maven.lifecycle.internal.LifecycleStarter.execute (LifecycleStarter.java:128)
    at org.apache.maven.DefaultMaven.doExecute (DefaultMaven.java:309)
    at org.apache.maven.DefaultMaven.doExecute (DefaultMaven.java:194)
    at org.apache.maven.DefaultMaven.execute (DefaultMaven.java:107)
    at org.apache.maven.cli.MavenCli.execute (MavenCli.java:955)
    at org.apache.maven.cli.MavenCli.doMain (MavenCli.java:290)
    at org.apache.maven.cli.MavenCli.main (MavenCli.java:194)
    at jdk.internal.reflect.NativeMethodAccessorImpl.invoke0 (Native Method)
    at jdk.internal.reflect.NativeMethodAccessorImpl.invoke (NativeMethodAccessorImpl.java:62)
    at jdk.internal.reflect.DelegatingMethodAccessorImpl.invoke (DelegatingMethodAccessorImpl.java:43)
    at java.lang.reflect.Method.invoke (Method.java:564)
    at org.codehaus.plexus.classworlds.launcher.Launcher.launchEnhanced (Launcher.java:289)
    at org.codehaus.plexus.classworlds.launcher.Launcher.launch (Launcher.java:229)
    at org.codehaus.plexus.classworlds.launcher.Launcher.mainWithExitCode (Launcher.java:415)
    at org.codehaus.plexus.classworlds.launcher.Launcher.main (Launcher.java:356)
[ERROR]
[ERROR] Re-run Maven using the -X switch to enable full debug logging.
[ERROR]
[ERROR] For more information about the errors and possible solutions, please read the following articles:
[ERROR] [Help 1] http://cwiki.apache.org/confluence/display/MAVEN/MojoFailureException
[ERROR]
[ERROR] After correcting the problems, you can resume the build with the command
[ERROR]   mvn <goals> -rf :deficient-dep


Stack Trace:
org.apache.maven.it.VerificationException:
Exit code was non-zero: 1; command line and log =
/home/jenkins/tools/maven/apache-maven-3.5.2/bin/mvn -e --batch-mode -Dmaven.repo.local=/home/jenkins/jenkins-slave/workspace/rces-plugin_MRRESOURCES-103-OWZ3HFZ43MS4CUVJZUVLTQDPH6VF24RFDOZDFCITEPHO3WVUHWJQ/m/target/it-repo org.apache.maven.plugins:maven-clean-plugin:clean deploy
Picked up JAVA_TOOL_OPTIONS: -Dmaven.ext.class.path="/home/jenkins/jenkins-slave/workspace/rces-plugin_MRRESOURCES-103-OWZ3HFZ43MS4CUVJZUVLTQDPH6VF24RFDOZDFCITEPHO3WVUHWJQ@tmp/withMavenedeb8f07/pipeline-maven-spy.jar" -Dorg.jenkinsci.plugins.pipeline.maven.reportsFolder="/home/jenkins/jenkins-slave/workspace/rces-plugin_MRRESOURCES-103-OWZ3HFZ43MS4CUVJZUVLTQDPH6VF24RFDOZDFCITEPHO3WVUHWJQ@tmp/withMavenedeb8f07"
[INFO] [jenkins-event-spy] Jenkins Maven Event Spy is disabled
[INFO] Error stacktraces are turned on.
[INFO] Scanning for projects...
[INFO] ------------------------------------------------------------------------
[INFO] Reactor Build Order:
[INFO]
[INFO] resources
[INFO] supplemental-models
[INFO] deficient-dep
[INFO]
[INFO] ------------------------------------------------------------------------
[INFO] Building resources 1
[INFO] ------------------------------------------------------------------------
[INFO]
[INFO] --- maven-clean-plugin:2.5:clean (default-cli) @ resources ---
[INFO]
[INFO] --- maven-install-plugin:2.4:install (default-install) @ resources ---
[INFO] Installing /home/jenkins/jenkins-slave/workspace/rces-plugin_MRRESOURCES-103-OWZ3HFZ43MS4CUVJZUVLTQDPH6VF24RFDOZDFCITEPHO3WVUHWJQ/m/target/test-classes/supplemental-artifact/resource-projects/pom.xml to /home/jenkins/jenkins-slave/workspace/rces-plugin_MRRESOURCES-103-OWZ3HFZ43MS4CUVJZUVLTQDPH6VF24RFDOZDFCITEPHO3WVUHWJQ/m/target/it-repo/org/apache/maven/plugin/rresource/it/mrr43/resources/1/resources-1.pom
[INFO]
[INFO] --- maven-deploy-plugin:2.7:deploy (default-deploy) @ resources ---
[INFO] Uploading to it-remote: file:/home/jenkins/jenkins-slave/workspace/rces-plugin_MRRESOURCES-103-OWZ3HFZ43MS4CUVJZUVLTQDPH6VF24RFDOZDFCITEPHO3WVUHWJQ/m/target/remote-repo/org/apache/maven/plugin/rresource/it/mrr43/resources/1/resources-1.pom
[INFO] Uploaded to it-remote: file:/home/jenkins/jenkins-slave/workspace/rces-plugin_MRRESOURCES-103-OWZ3HFZ43MS4CUVJZUVLTQDPH6VF24RFDOZDFCITEPHO3WVUHWJQ/m/target/remote-repo/org/apache/maven/plugin/rresource/it/mrr43/resources/1/resources-1.pom (1.6 kB at 122 kB/s)
[INFO] Downloading from it-remote: file:/home/jenkins/jenkins-slave/workspace/rces-plugin_MRRESOURCES-103-OWZ3HFZ43MS4CUVJZUVLTQDPH6VF24RFDOZDFCITEPHO3WVUHWJQ/m/target/remote-repo/org/apache/maven/plugin/rresource/it/mrr43/resources/maven-metadata.xml
[INFO] Uploading to it-remote: file:/home/jenkins/jenkins-slave/workspace/rces-plugin_MRRESOURCES-103-OWZ3HFZ43MS4CUVJZUVLTQDPH6VF24RFDOZDFCITEPHO3WVUHWJQ/m/target/remote-repo/org/apache/maven/plugin/rresource/it/mrr43/resources/maven-metadata.xml
[INFO] Uploaded to it-remote: file:/home/jenkins/jenkins-slave/workspace/rces-plugin_MRRESOURCES-103-OWZ3HFZ43MS4CUVJZUVLTQDPH6VF24RFDOZDFCITEPHO3WVUHWJQ/m/target/remote-repo/org/apache/maven/plugin/rresource/it/mrr43/resources/maven-metadata.xml (323 B at 65 kB/s)
[INFO]
[INFO] ------------------------------------------------------------------------
[INFO] Building supplemental-models 1
[INFO] ------------------------------------------------------------------------
[INFO]
[INFO] --- maven-clean-plugin:2.5:clean (default-cli) @ supplemental-models ---
[INFO]
[INFO] --- maven-resources-plugin:2.6:resources (default-resources) @ supplemental-models ---
[WARNING] Using platform encoding (ISO-8859-1 actually) to copy filtered resources, i.e. build is platform dependent!
[INFO] Copying 1 resource
[INFO]
[INFO] --- maven-compiler-plugin:3.1:compile (default-compile) @ supplemental-models ---
[INFO] No sources to compile
[INFO]
[INFO] --- maven-resources-plugin:2.6:testResources (default-testResources) @ supplemental-models ---
[WARNING] Using platform encoding (ISO-8859-1 actually) to copy filtered resources, i.e. build is platform dependent!
[INFO] skip non existing resourceDirectory /home/jenkins/jenkins-slave/workspace/rces-plugin_MRRESOURCES-103-OWZ3HFZ43MS4CUVJZUVLTQDPH6VF24RFDOZDFCITEPHO3WVUHWJQ/m/target/test-classes/supplemental-artifact/resource-projects/supplemental-models/src/test/resources
[INFO]
[INFO] --- maven-compiler-plugin:3.1:testCompile (default-testCompile) @ supplemental-models ---
[INFO] No sources to compile
[INFO]
[INFO] --- maven-surefire-plugin:2.12.4:test (default-test) @ supplemental-models ---
[INFO] No tests to run.
[INFO]
[INFO] --- maven-jar-plugin:2.4:jar (default-jar) @ supplemental-models ---
[INFO] Building jar: /home/jenkins/jenkins-slave/workspace/rces-plugin_MRRESOURCES-103-OWZ3HFZ43MS4CUVJZUVLTQDPH6VF24RFDOZDFCITEPHO3WVUHWJQ/m/target/test-classes/supplemental-artifact/resource-projects/supplemental-models/target/supplemental-models-1.jar
[INFO]
[INFO] --- maven-install-plugin:2.4:install (default-install) @ supplemental-models ---
[INFO] Installing /home/jenkins/jenkins-slave/workspace/rces-plugin_MRRESOURCES-103-OWZ3HFZ43MS4CUVJZUVLTQDPH6VF24RFDOZDFCITEPHO3WVUHWJQ/m/target/test-classes/supplemental-artifact/resource-projects/supplemental-models/target/supplemental-models-1.jar to /home/jenkins/jenkins-slave/workspace/rces-plugin_MRRESOURCES-103-OWZ3HFZ43MS4CUVJZUVLTQDPH6VF24RFDOZDFCITEPHO3WVUHWJQ/m/target/it-repo/org/apache/maven/plugin/rresource/it/mrr43/supplemental-models/1/supplemental-models-1.jar
[INFO] Installing /home/jenkins/jenkins-slave/workspace/rces-plugin_MRRESOURCES-103-OWZ3HFZ43MS4CUVJZUVLTQDPH6VF24RFDOZDFCITEPHO3WVUHWJQ/m/target/test-classes/supplemental-artifact/resource-projects/supplemental-models/pom.xml to /home/jenkins/jenkins-slave/workspace/rces-plugin_MRRESOURCES-103-OWZ3HFZ43MS4CUVJZUVLTQDPH6VF24RFDOZDFCITEPHO3WVUHWJQ/m/target/it-repo/org/apache/maven/plugin/rresource/it/mrr43/supplemental-models/1/supplemental-models-1.pom
[INFO]
[INFO] --- maven-deploy-plugin:2.7:deploy (default-deploy) @ supplemental-models ---
[INFO] Uploading to it-remote: file:/home/jenkins/jenkins-slave/workspace/rces-plugin_MRRESOURCES-103-OWZ3HFZ43MS4CUVJZUVLTQDPH6VF24RFDOZDFCITEPHO3WVUHWJQ/m/target/remote-repo/org/apache/maven/plugin/rresource/it/mrr43/supplemental-models/1/supplemental-models-1.jar
[INFO] Uploaded to it-remote: file:/home/jenkins/jenkins-slave/workspace/rces-plugin_MRRESOURCES-103-OWZ3HFZ43MS4CUVJZUVLTQDPH6VF24RFDOZDFCITEPHO3WVUHWJQ/m/target/remote-repo/org/apache/maven/plugin/rresource/it/mrr43/supplemental-models/1/supplemental-models-1.jar (3.0 kB at 1.5 MB/s)
[INFO] Uploading to it-remote: file:/home/jenkins/jenkins-slave/workspace/rces-plugin_MRRESOURCES-103-OWZ3HFZ43MS4CUVJZUVLTQDPH6VF24RFDOZDFCITEPHO3WVUHWJQ/m/target/remote-repo/org/apache/maven/plugin/rresource/it/mrr43/supplemental-models/1/supplemental-models-1.pom
[INFO] Uploaded to it-remote: file:/home/jenkins/jenkins-slave/workspace/rces-plugin_MRRESOURCES-103-OWZ3HFZ43MS4CUVJZUVLTQDPH6VF24RFDOZDFCITEPHO3WVUHWJQ/m/target/remote-repo/org/apache/maven/plugin/rresource/it/mrr43/supplemental-models/1/supplemental-models-1.pom (1.3 kB at 1.3 MB/s)
[INFO] Downloading from it-remote: file:/home/jenkins/jenkins-slave/workspace/rces-plugin_MRRESOURCES-103-OWZ3HFZ43MS4CUVJZUVLTQDPH6VF24RFDOZDFCITEPHO3WVUHWJQ/m/target/remote-repo/org/apache/maven/plugin/rresource/it/mrr43/supplemental-models/maven-metadata.xml
[INFO] Uploading to it-remote: file:/home/jenkins/jenkins-slave/workspace/rces-plugin_MRRESOURCES-103-OWZ3HFZ43MS4CUVJZUVLTQDPH6VF24RFDOZDFCITEPHO3WVUHWJQ/m/target/remote-repo/org/apache/maven/plugin/rresource/it/mrr43/supplemental-models/maven-metadata.xml
[INFO] Uploaded to it-remote: file:/home/jenkins/jenkins-slave/workspace/rces-plugin_MRRESOURCES-103-OWZ3HFZ43MS4CUVJZUVLTQDPH6VF24RFDOZDFCITEPHO3WVUHWJQ/m/target/remote-repo/org/apache/maven/plugin/rresource/it/mrr43/supplemental-models/maven-metadata.xml (333 B)
[INFO]
[INFO] ------------------------------------------------------------------------
[INFO] Building deficient-dep 1
[INFO] ------------------------------------------------------------------------
[INFO]
[INFO] --- maven-clean-plugin:2.5:clean (default-cli) @ deficient-dep ---
[INFO]
[INFO] --- maven-resources-plugin:2.6:resources (default-resources) @ deficient-dep ---
[WARNING] Using platform encoding (ISO-8859-1 actually) to copy filtered resources, i.e. build is platform dependent!
[INFO] skip non existing resourceDirectory /home/jenkins/jenkins-slave/workspace/rces-plugin_MRRESOURCES-103-OWZ3HFZ43MS4CUVJZUVLTQDPH6VF24RFDOZDFCITEPHO3WVUHWJQ/m/target/test-classes/supplemental-artifact/resource-projects/deficient-dep/src/main/resources
[INFO]
[INFO] --- maven-compiler-plugin:3.1:compile (default-compile) @ deficient-dep ---
[INFO] Changes detected - recompiling the module!
[WARNING] File encoding has not been set, using platform encoding ISO-8859-1, i.e. build is platform dependent!
[INFO] Compiling 1 source file to /home/jenkins/jenkins-slave/workspace/rces-plugin_MRRESOURCES-103-OWZ3HFZ43MS4CUVJZUVLTQDPH6VF24RFDOZDFCITEPHO3WVUHWJQ/m/target/test-classes/supplemental-artifact/resource-projects/deficient-dep/target/classes
[INFO] -------------------------------------------------------------
[ERROR] COMPILATION ERROR :
[INFO] -------------------------------------------------------------
[ERROR] Source option 1.5 is no longer supported. Use 1.6 or later.
[ERROR] Target option 1.5 is no longer supported. Use 1.6 or later.
[INFO] 2 errors
[INFO] -------------------------------------------------------------
[INFO] ------------------------------------------------------------------------
[INFO] Reactor Summary:
[INFO]
[INFO] resources .......................................... SUCCESS [  0.410 s]
[INFO] supplemental-models ................................ SUCCESS [  0.778 s]
[INFO] deficient-dep ...................................... FAILURE [  0.407 s]
[INFO] ------------------------------------------------------------------------
[INFO] BUILD FAILURE
[INFO] ------------------------------------------------------------------------
[INFO] Total time: 1.761 s
[INFO] Finished at: 2018-02-13T19:31:00Z
[INFO] Final Memory: 14M/48M
[INFO] ------------------------------------------------------------------------
[ERROR] Failed to execute goal org.apache.maven.plugins:maven-compiler-plugin:3.1:compile (default-compile) on project deficient-dep: Compilation failure: Compilation failure:
[ERROR] Source option 1.5 is no longer supported. Use 1.6 or later.
[ERROR] Target option 1.5 is no longer supported. Use 1.6 or later.
[ERROR] -> [Help 1]
org.apache.maven.lifecycle.LifecycleExecutionException: Failed to execute goal org.apache.maven.plugins:maven-compiler-plugin:3.1:compile (default-compile) on project deficient-dep: Compilation failure
    at org.apache.maven.lifecycle.internal.MojoExecutor.execute (MojoExecutor.java:213)
    at org.apache.maven.lifecycle.internal.MojoExecutor.execute (MojoExecutor.java:154)
    at org.apache.maven.lifecycle.internal.MojoExecutor.execute (MojoExecutor.java:146)
    at org.apache.maven.lifecycle.internal.LifecycleModuleBuilder.buildProject (LifecycleModuleBuilder.java:117)
    at org.apache.maven.lifecycle.internal.LifecycleModuleBuilder.buildProject (LifecycleModuleBuilder.java:81)
    at org.apache.maven.lifecycle.internal.builder.singlethreaded.SingleThreadedBuilder.build (SingleThreadedBuilder.java:51)
    at org.apache.maven.lifecycle.internal.LifecycleStarter.execute (LifecycleStarter.java:128)
    at org.apache.maven.DefaultMaven.doExecute (DefaultMaven.java:309)
    at org.apache.maven.DefaultMaven.doExecute (DefaultMaven.java:194)
    at org.apache.maven.DefaultMaven.execute (DefaultMaven.java:107)
    at org.apache.maven.cli.MavenCli.execute (MavenCli.java:955)
    at org.apache.maven.cli.MavenCli.doMain (MavenCli.java:290)
    at org.apache.maven.cli.MavenCli.main (MavenCli.java:194)
    at jdk.internal.reflect.NativeMethodAccessorImpl.invoke0 (Native Method)
    at jdk.internal.reflect.NativeMethodAccessorImpl.invoke (NativeMethodAccessorImpl.java:62)
    at jdk.internal.reflect.DelegatingMethodAccessorImpl.invoke (DelegatingMethodAccessorImpl.java:43)
    at java.lang.reflect.Method.invoke (Method.java:564)
    at org.codehaus.plexus.classworlds.launcher.Launcher.launchEnhanced (Launcher.java:289)
    at org.codehaus.plexus.classworlds.launcher.Launcher.launch (Launcher.java:229)
    at org.codehaus.plexus.classworlds.launcher.Launcher.mainWithExitCode (Launcher.java:415)
    at org.codehaus.plexus.classworlds.launcher.Launcher.main (Launcher.java:356)
Caused by: org.apache.maven.plugin.compiler.CompilationFailureException: Compilation failure
    at org.apache.maven.plugin.compiler.AbstractCompilerMojo.execute (AbstractCompilerMojo.java:858)
    at org.apache.maven.plugin.compiler.CompilerMojo.execute (CompilerMojo.java:129)
    at org.apache.maven.plugin.DefaultBuildPluginManager.executeMojo (DefaultBuildPluginManager.java:134)
    at org.apache.maven.lifecycle.internal.MojoExecutor.execute (MojoExecutor.java:208)
    at org.apache.maven.lifecycle.internal.MojoExecutor.execute (MojoExecutor.java:154)
    at org.apache.maven.lifecycle.internal.MojoExecutor.execute (MojoExecutor.java:146)
    at org.apache.maven.lifecycle.internal.LifecycleModuleBuilder.buildProject (LifecycleModuleBuilder.java:117)
    at org.apache.maven.lifecycle.internal.LifecycleModuleBuilder.buildProject (LifecycleModuleBuilder.java:81)
    at org.apache.maven.lifecycle.internal.builder.singlethreaded.SingleThreadedBuilder.build (SingleThreadedBuilder.java:51)
    at org.apache.maven.lifecycle.internal.LifecycleStarter.execute (LifecycleStarter.java:128)
    at org.apache.maven.DefaultMaven.doExecute (DefaultMaven.java:309)
    at org.apache.maven.DefaultMaven.doExecute (DefaultMaven.java:194)
    at org.apache.maven.DefaultMaven.execute (DefaultMaven.java:107)
    at org.apache.maven.cli.MavenCli.execute (MavenCli.java:955)
    at org.apache.maven.cli.MavenCli.doMain (MavenCli.java:290)
    at org.apache.maven.cli.MavenCli.main (MavenCli.java:194)
    at jdk.internal.reflect.NativeMethodAccessorImpl.invoke0 (Native Method)
    at jdk.internal.reflect.NativeMethodAccessorImpl.invoke (NativeMethodAccessorImpl.java:62)
    at jdk.internal.reflect.DelegatingMethodAccessorImpl.invoke (DelegatingMethodAccessorImpl.java:43)
    at java.lang.reflect.Method.invoke (Method.java:564)
    at org.codehaus.plexus.classworlds.launcher.Launcher.launchEnhanced (Launcher.java:289)
    at org.codehaus.plexus.classworlds.launcher.Launcher.launch (Launcher.java:229)
    at org.codehaus.plexus.classworlds.launcher.Launcher.mainWithExitCode (Launcher.java:415)
    at org.codehaus.plexus.classworlds.launcher.Launcher.main (Launcher.java:356)
[ERROR]
[ERROR] Re-run Maven using the -X switch to enable full debug logging.
[ERROR]
[ERROR] For more information about the errors and possible solutions, please read the following articles:
[ERROR] [Help 1] http://cwiki.apache.org/confluence/display/MAVEN/MojoFailureException
[ERROR]
[ERROR] After correcting the problems, you can resume the build with the command
[ERROR]   mvn <goals> -rf :deficient-dep

        at org.apache.maven.plugin.resources.remote.it.IT_SupplementalArtifact.test(IT_SupplementalArtifact.java:50)




Build log:
[...truncated 1.98 MB...]
[linux-jdk7] [INFO] Downloaded from central: https://repo.maven.apache.org/maven2/com/puppycrawl/tools/checkstyle/6.18/checkstyle-6.18.jar (1.2 MB at 18 MB/s)
[linux-jdk7] [INFO] Downloaded from central: https://repo.maven.apache.org/maven2/commons-lang/commons-lang/2.1/commons-lang-2.1.jar (208 kB at 3.0 MB/s)
[linux-jdk7] [INFO] Downloaded from central: https://repo.maven.apache.org/maven2/com/google/guava/guava/19.0/guava-19.0.jar (2.3 MB at 21 MB/s)
[linux-jdk9] [INFO]           maven-remote-resources-test/pom.xml .............. SUCCESS (6.8 s)
[linux-jdk9] [INFO]
[linux-jdk9] [INFO] --- maven-checkstyle-plugin:3.0.0:check (checkstyle-check) @ maven-remote-resources-plugin ---
[linux-jdk9] [INFO] Downloading from central: https://repo.maven.apache.org/maven2/org/apache/maven/shared/maven-shared-resources/2/maven-shared-resources-2.pom
[linux-jdk9] [INFO] Downloaded from central: https://repo.maven.apache.org/maven2/org/apache/maven/shared/maven-shared-resources/2/maven-shared-resources-2.pom (3.0 kB at 197 kB/s)
[linux-jdk9] [INFO] Downloading from central: https://repo.maven.apache.org/maven2/org/codehaus/plexus/plexus-utils/3.0.10/plexus-utils-3.0.10.pom
[linux-jdk9] [INFO] Downloaded from central: https://repo.maven.apache.org/maven2/org/codehaus/plexus/plexus-utils/3.0.10/plexus-utils-3.0.10.pom (3.1 kB at 286 kB/s)
[linux-jdk9] [INFO] Downloading from central: https://repo.maven.apache.org/maven2/org/codehaus/plexus/plexus/3.3/plexus-3.3.pom
[linux-jdk9] [INFO] Downloaded from central: https://repo.maven.apache.org/maven2/org/codehaus/plexus/plexus/3.3/plexus-3.3.pom (20 kB at 1.8 MB/s)
[linux-jdk9] [INFO] Downloading from central: https://repo.maven.apache.org/maven2/org/apache/maven/doxia/doxia-integration-tools/1.6/doxia-integration-tools-1.6.pom
[linux-jdk9] [INFO] Downloaded from central: https://repo.maven.apache.org/maven2/org/apache/maven/doxia/doxia-integration-tools/1.6/doxia-integration-tools-1.6.pom (7.0 kB at 632 kB/s)
[linux-jdk9] [INFO] Downloading from central: https://repo.maven.apache.org/maven2/org/apache/maven/doxia/doxia-tools/3/doxia-tools-3.pom
[linux-jdk9] [INFO] Downloaded from central: https://repo.maven.apache.org/maven2/org/apache/maven/doxia/doxia-tools/3/doxia-tools-3.pom (9.9 kB at 827 kB/s)
[linux-jdk9] [INFO] Downloading from central: https://repo.maven.apache.org/maven2/org/codehaus/plexus/plexus-resources/1.1.0/plexus-resources-1.1.0.pom
[linux-jdk9] [INFO] Downloaded from central: https://repo.maven.apache.org/maven2/org/codehaus/plexus/plexus-resources/1.1.0/plexus-resources-1.1.0.pom (3.2 kB at 265 kB/s)
[linux-jdk9] [INFO] Downloading from central: https://repo.maven.apache.org/maven2/com/puppycrawl/tools/checkstyle/6.18/checkstyle-6.18.pom
[linux-jdk9] [INFO] Downloaded from central: https://repo.maven.apache.org/maven2/com/puppycrawl/tools/checkstyle/6.18/checkstyle-6.18.pom (71 kB at 5.5 MB/s)
[linux-jdk9] [INFO] Downloading from central: https://repo.maven.apache.org/maven2/antlr/antlr/2.7.7/antlr-2.7.7.pom
[linux-jdk9] [INFO] Downloaded from central: https://repo.maven.apache.org/maven2/antlr/antlr/2.7.7/antlr-2.7.7.pom (632 B at 57 kB/s)
[linux-jdk9] [INFO] Downloading from central: https://repo.maven.apache.org/maven2/org/antlr/antlr4-runtime/4.5.3/antlr4-runtime-4.5.3.pom
[linux-jdk9] [INFO] Downloaded from central: https://repo.maven.apache.org/maven2/org/antlr/antlr4-runtime/4.5.3/antlr4-runtime-4.5.3.pom (2.3 kB at 210 kB/s)
[linux-jdk9] [INFO] Downloading from central: https://repo.maven.apache.org/maven2/org/antlr/antlr4-master/4.5.3/antlr4-master-4.5.3.pom
[linux-jdk9] [INFO] Downloaded from central: https://repo.maven.apache.org/maven2/org/antlr/antlr4-master/4.5.3/antlr4-master-4.5.3.pom (3.7 kB at 335 kB/s)
[linux-jdk9] [INFO] Downloading from central: https://repo.maven.apache.org/maven2/commons-beanutils/commons-beanutils/1.9.2/commons-beanutils-1.9.2.pom
[linux-jdk9] [INFO] Downloaded from central: https://repo.maven.apache.org/maven2/commons-beanutils/commons-beanutils/1.9.2/commons-beanutils-1.9.2.pom (14 kB at 1.2 MB/s)
[linux-jdk9] [INFO] Downloading from central: https://repo.maven.apache.org/maven2/org/apache/commons/commons-parent/33/commons-parent-33.pom
[linux-jdk9] [INFO] Downloaded from central: https://repo.maven.apache.org/maven2/org/apache/commons/commons-parent/33/commons-parent-33.pom (53 kB at 4.4 MB/s)
[linux-jdk9] [INFO] Downloading from central: https://repo.maven.apache.org/maven2/commons-cli/commons-cli/1.3.1/commons-cli-1.3.1.pom
[linux-jdk9] [INFO] Downloaded from central: https://repo.maven.apache.org/maven2/commons-cli/commons-cli/1.3.1/commons-cli-1.3.1.pom (10 kB at 945 kB/s)
[linux-jdk9] [INFO] Downloading from central: https://repo.maven.apache.org/maven2/com/google/guava/guava/19.0/guava-19.0.pom
[linux-jdk9] [INFO] Downloaded from central: https://repo.maven.apache.org/maven2/com/google/guava/guava/19.0/guava-19.0.pom (6.8 kB at 566 kB/s)
[linux-jdk9] [INFO] Downloading from central: https://repo.maven.apache.org/maven2/com/google/guava/guava-parent/19.0/guava-parent-19.0.pom
[linux-jdk9] [INFO] Downloaded from central: https://repo.maven.apache.org/maven2/com/google/guava/guava-parent/19.0/guava-parent-19.0.pom (9.9 kB at 898 kB/s)
[linux-jdk9] [INFO] Downloading from central: https://repo.maven.apache.org/maven2/org/sonatype/oss/oss-parent/7/oss-parent-7.pom
[linux-jdk9] [INFO] Downloaded from central: https://repo.maven.apache.org/maven2/org/sonatype/oss/oss-parent/7/oss-parent-7.pom (4.8 kB at 482 kB/s)
[linux-jdk9] [INFO] Downloading from central: https://repo.maven.apache.org/maven2/javax/xml/bind/jaxb-api/2.3.0/jaxb-api-2.3.0.pom
[linux-jdk9] [INFO] Downloaded from central: https://repo.maven.apache.org/maven2/javax/xml/bind/jaxb-api/2.3.0/jaxb-api-2.3.0.pom (23 kB at 1.9 MB/s)
[linux-jdk9] [INFO] Downloading from central: https://repo.maven.apache.org/maven2/javax/xml/bind/jaxb-api-parent/2.3.0/jaxb-api-parent-2.3.0.pom
[linux-jdk9] [INFO] Downloaded from central: https://repo.maven.apache.org/maven2/javax/xml/bind/jaxb-api-parent/2.3.0/jaxb-api-parent-2.3.0.pom (5.6 kB at 434 kB/s)
[linux-jdk9] [INFO] Downloading from central: https://repo.maven.apache.org/maven2/net/java/jvnet-parent/5/jvnet-parent-5.pom
[linux-jdk9] [INFO] Downloaded from central: https://repo.maven.apache.org/maven2/net/java/jvnet-parent/5/jvnet-parent-5.pom (8.9 kB at 806 kB/s)
[linux-jdk9] [INFO] Downloading from central: https://repo.maven.apache.org/maven2/org/apache/maven/shared/maven-shared-resources/2/maven-shared-resources-2.jar
[linux-jdk9] [INFO] Downloading from central: https://repo.maven.apache.org/maven2/org/apache/maven/doxia/doxia-core/1.2/doxia-core-1.2.jar
[linux-jdk9] [INFO] Downloading from central: https://repo.maven.apache.org/maven2/commons-digester/commons-digester/1.6/commons-digester-1.6.jar
[linux-jdk9] [INFO] Downloading from central: https://repo.maven.apache.org/maven2/commons-logging/commons-logging/1.0.4/commons-logging-1.0.4.jar
[linux-jdk9] [INFO] Downloading from central: https://repo.maven.apache.org/maven2/org/apache/maven/doxia/doxia-integration-tools/1.6/doxia-integration-tools-1.6.jar
[linux-jdk9] [INFO] Downloaded from central: https://repo.maven.apache.org/maven2/commons-logging/commons-logging/1.0.4/commons-logging-1.0.4.jar (38 kB at 2.5 MB/s)
[linux-jdk9] [INFO] Downloading from central: https://repo.maven.apache.org/maven2/commons-io/commons-io/1.4/commons-io-1.4.jar
[linux-jdk9] [INFO] Downloaded from central: https://repo.maven.apache.org/maven2/org/apache/maven/doxia/doxia-core/1.2/doxia-core-1.2.jar (154 kB at 9.1 MB/s)
[linux-jdk9] [INFO] Downloading from central: https://repo.maven.apache.org/maven2/org/codehaus/plexus/plexus-resources/1.1.0/plexus-resources-1.1.0.jar
[linux-jdk9] [INFO] Downloaded from central: https://repo.maven.apache.org/maven2/org/apache/maven/shared/maven-shared-resources/2/maven-shared-resources-2.jar (13 kB at 768 kB/s)
[linux-jdk9] [INFO] Downloading from central: https://repo.maven.apache.org/maven2/com/puppycrawl/tools/checkstyle/6.18/checkstyle-6.18.jar
[linux-jdk9] [INFO] Downloaded from central: https://repo.maven.apache.org/maven2/org/apache/maven/doxia/doxia-integration-tools/1.6/doxia-integration-tools-1.6.jar (45 kB at 2.8 MB/s)
[linux-jdk9] [INFO] Downloading from central: https://repo.maven.apache.org/maven2/antlr/antlr/2.7.7/antlr-2.7.7.jar
[linux-jdk9] [INFO] Downloaded from central: https://repo.maven.apache.org/maven2/commons-digester/commons-digester/1.6/commons-digester-1.6.jar (168 kB at 7.7 MB/s)
[linux-jdk9] [INFO] Downloading from central: https://repo.maven.apache.org/maven2/org/antlr/antlr4-runtime/4.5.3/antlr4-runtime-4.5.3.jar
[linux-jdk9] [INFO] Downloaded from central: https://repo.maven.apache.org/maven2/org/codehaus/plexus/plexus-resources/1.1.0/plexus-resources-1.1.0.jar (23 kB at 725 kB/s)
[linux-jdk9] [INFO] Downloading from central: https://repo.maven.apache.org/maven2/commons-beanutils/commons-beanutils/1.9.2/commons-beanutils-1.9.2.jar
[linux-jdk9] [INFO] Downloaded from central: https://repo.maven.apache.org/maven2/commons-io/commons-io/1.4/commons-io-1.4.jar (109 kB at 3.3 MB/s)
[linux-jdk9] [INFO] Downloading from central: https://repo.maven.apache.org/maven2/commons-cli/commons-cli/1.3.1/commons-cli-1.3.1.jar
[linux-jdk9] [INFO] Downloaded from central: https://repo.maven.apache.org/maven2/org/antlr/antlr4-runtime/4.5.3/antlr4-runtime-4.5.3.jar (302 kB at 7.2 MB/s)
[linux-jdk9] [INFO] Downloading from central: https://repo.maven.apache.org/maven2/com/google/guava/guava/19.0/guava-19.0.jar
[linux-jdk9] [INFO] Downloaded from central: https://repo.maven.apache.org/maven2/antlr/antlr/2.7.7/antlr-2.7.7.jar (445 kB at 10 MB/s)
[linux-jdk9] [INFO] Downloading from central: https://repo.maven.apache.org/maven2/commons-lang/commons-lang/2.1/commons-lang-2.1.jar
[linux-jdk9] [INFO] Downloaded from central: https://repo.maven.apache.org/maven2/commons-cli/commons-cli/1.3.1/commons-cli-1.3.1.jar (53 kB at 1.2 MB/s)
[linux-jdk9] [INFO] Downloading from central: https://repo.maven.apache.org/maven2/javax/xml/bind/jaxb-api/2.3.0/jaxb-api-2.3.0.jar
[linux-jdk9] [INFO] Downloaded from central: https://repo.maven.apache.org/maven2/commons-beanutils/commons-beanutils/1.9.2/commons-beanutils-1.9.2.jar (234 kB at 5.0 MB/s)
[linux-jdk9] [INFO] Downloaded from central: https://repo.maven.apache.org/maven2/com/puppycrawl/tools/checkstyle/6.18/checkstyle-6.18.jar (1.2 MB at 21 MB/s)
[linux-jdk9] [INFO] Downloaded from central: https://repo.maven.apache.org/maven2/commons-lang/commons-lang/2.1/commons-lang-2.1.jar (208 kB at 3.4 MB/s)
[linux-jdk9] [INFO] Downloaded from central: https://repo.maven.apache.org/maven2/javax/xml/bind/jaxb-api/2.3.0/jaxb-api-2.3.0.jar (126 kB at 2.0 MB/s)
[linux-jdk9] [INFO] Downloaded from central: https://repo.maven.apache.org/maven2/com/google/guava/guava/19.0/guava-19.0.jar (2.3 MB at 23 MB/s)
[linux-jdk7] [INFO]
[linux-jdk7] [INFO] --- maven-failsafe-plugin:2.20.1:verify (integration-tests) @ maven-remote-resources-plugin ---
[linux-jdk7] [INFO]
[linux-jdk7] [INFO] --- maven-invoker-plugin:3.0.1:verify (integration-test) @ maven-remote-resources-plugin ---
[linux-jdk7] [INFO] -------------------------------------------------
[linux-jdk7] [INFO] Build Summary:
[linux-jdk7] [INFO]   Passed: 1, Failed: 0, Errors: 0, Skipped: 0
[linux-jdk7] [INFO] -------------------------------------------------
[linux-jdk7] [INFO] ------------------------------------------------------------------------
[linux-jdk7] [INFO] BUILD SUCCESS
[linux-jdk7] [INFO] ------------------------------------------------------------------------
[linux-jdk7] [INFO] Total time: 01:39 min
[linux-jdk7] [INFO] Finished at: 2018-02-13T19:31:15Z
[linux-jdk7] [INFO] Final Memory: 53M/1758M
[linux-jdk7] [INFO] ------------------------------------------------------------------------
[linux-jdk7] [INFO] [jenkins-event-spy] Generated /home/jenkins/jenkins-slave/workspace/rces-plugin_MRRESOURCES-103-OWZ3HFZ43MS4CUVJZUVLTQDPH6VF24RFDOZDFCITEPHO3WVUHWJQ@tmp/withMaven79b60ea2/maven-spy-20180213-192936-1605960910969797876671.log
[linux-jdk9] [INFO]
[linux-jdk9] [INFO] --- maven-failsafe-plugin:2.20.1:verify (integration-tests) @ maven-remote-resources-plugin ---
[linux-jdk9] [ERROR] There are test failures.
[linux-jdk9]
[linux-jdk9] Please refer to /home/jenkins/jenkins-slave/workspace/rces-plugin_MRRESOURCES-103-OWZ3HFZ43MS4CUVJZUVLTQDPH6VF24RFDOZDFCITEPHO3WVUHWJQ/m/target/failsafe-reports for the individual test results.
[linux-jdk9] Please refer to dump files (if any exist) [date]-jvmRun[N].dump, [date].dumpstream and [date]-jvmRun[N].dumpstream.
[linux-jdk9] [INFO]
[linux-jdk9] [INFO] --- maven-invoker-plugin:3.0.1:verify (integration-test) @ maven-remote-resources-plugin ---
[linux-jdk9] [INFO] -------------------------------------------------
[linux-jdk9] [INFO] Build Summary:
[linux-jdk9] [INFO]   Passed: 1, Failed: 0, Errors: 0, Skipped: 0
[linux-jdk9] [INFO] -------------------------------------------------
[linux-jdk9] [INFO] ------------------------------------------------------------------------
[linux-jdk9] [INFO] BUILD SUCCESS
[linux-jdk9] [INFO] ------------------------------------------------------------------------
[linux-jdk9] [INFO] Total time: 01:24 min
[linux-jdk9] [INFO] Finished at: 2018-02-13T19:31:16Z
[linux-jdk9] [INFO] Final Memory: 57M/188M
[linux-jdk9] [INFO] ------------------------------------------------------------------------
[linux-jdk9] [INFO] [jenkins-event-spy] Generated /home/jenkins/jenkins-slave/workspace/rces-plugin_MRRESOURCES-103-OWZ3HFZ43MS4CUVJZUVLTQDPH6VF24RFDOZDFCITEPHO3WVUHWJQ@tmp/withMavenedeb8f07/maven-spy-20180213-192950-9066117811749133870995.log
[Pipeline] [linux-jdk7] }
[linux-jdk8] [INFO]           maven-remote-resources-test/pom.xml .............. SUCCESS (8.5 s)
[linux-jdk8] [INFO]
[linux-jdk8] [INFO] --- maven-checkstyle-plugin:3.0.0:check (checkstyle-check) @ maven-remote-resources-plugin ---
[linux-jdk8] [INFO] Downloading from central: https://repo.maven.apache.org/maven2/org/apache/maven/shared/maven-shared-resources/2/maven-shared-resources-2.pom
[linux-jdk8] [INFO] Downloaded from central: https://repo.maven.apache.org/maven2/org/apache/maven/shared/maven-shared-resources/2/maven-shared-resources-2.pom (3.0 kB at 227 kB/s)
[linux-jdk8] [INFO] Downloading from central: https://repo.maven.apache.org/maven2/org/codehaus/plexus/plexus-utils/3.0.10/plexus-utils-3.0.10.pom
[linux-jdk8] [INFO] Downloaded from central: https://repo.maven.apache.org/maven2/org/codehaus/plexus/plexus-utils/3.0.10/plexus-utils-3.0.10.pom (3.1 kB at 262 kB/s)
[linux-jdk8] [INFO] Downloading from central: https://repo.maven.apache.org/maven2/org/codehaus/plexus/plexus/3.3/plexus-3.3.pom
[linux-jdk8] [INFO] Downloaded from central: https://repo.maven.apache.org/maven2/org/codehaus/plexus/plexus/3.3/plexus-3.3.pom (20 kB at 1.7 MB/s)
[linux-jdk8] [INFO] Downloading from central: https://repo.maven.apache.org/maven2/org/apache/maven/doxia/doxia-integration-tools/1.6/doxia-integration-tools-1.6.pom
[linux-jdk8] [INFO] Downloaded from central: https://repo.maven.apache.org/maven2/org/apache/maven/doxia/doxia-integration-tools/1.6/doxia-integration-tools-1.6.pom (7.0 kB at 632 kB/s)
[linux-jdk8] [INFO] Downloading from central: https://repo.maven.apache.org/maven2/org/apache/maven/doxia/doxia-tools/3/doxia-tools-3.pom
[linux-jdk8] [INFO] Downloaded from central: https://repo.maven.apache.org/maven2/org/apache/maven/doxia/doxia-tools/3/doxia-tools-3.pom (9.9 kB at 903 kB/s)
[linux-jdk8] [INFO] Downloading from central: https://repo.maven.apache.org/maven2/org/codehaus/plexus/plexus-resources/1.1.0/plexus-resources-1.1.0.pom
[linux-jdk8] [INFO] Downloaded from central: https://repo.maven.apache.org/maven2/org/codehaus/plexus/plexus-resources/1.1.0/plexus-resources-1.1.0.pom (3.2 kB at 289 kB/s)
[linux-jdk8] [INFO] Downloading from central: https://repo.maven.apache.org/maven2/com/puppycrawl/tools/checkstyle/6.18/checkstyle-6.18.pom
[linux-jdk8] [INFO] Downloaded from central: https://repo.maven.apache.org/maven2/com/puppycrawl/tools/checkstyle/6.18/checkstyle-6.18.pom (71 kB at 4.2 MB/s)
[linux-jdk8] [INFO] Downloading from central: https://repo.maven.apache.org/maven2/antlr/antlr/2.7.7/antlr-2.7.7.pom
[linux-jdk8] [INFO] Downloaded from central: https://repo.maven.apache.org/maven2/antlr/antlr/2.7.7/antlr-2.7.7.pom (632 B at 53 kB/s)
[linux-jdk8] [INFO] Downloading from central: https://repo.maven.apache.org/maven2/org/antlr/antlr4-runtime/4.5.3/antlr4-runtime-4.5.3.pom
[linux-jdk8] [INFO] Downloaded from central: https://repo.maven.apache.org/maven2/org/antlr/antlr4-runtime/4.5.3/antlr4-runtime-4.5.3.pom (2.3 kB at 192 kB/s)
[linux-jdk8] [INFO] Downloading from central: https://repo.maven.apache.org/maven2/org/antlr/antlr4-master/4.5.3/antlr4-master-4.5.3.pom
[linux-jdk8] [INFO] Downloaded from central: https://repo.maven.apache.org/maven2/org/antlr/antlr4-master/4.5.3/antlr4-master-4.5.3.pom (3.7 kB at 335 kB/s)
[linux-jdk8] [INFO] Downloading from central: https://repo.maven.apache.org/maven2/commons-beanutils/commons-beanutils/1.9.2/commons-beanutils-1.9.2.pom
[linux-jdk8] [INFO] Downloaded from central: https://repo.maven.apache.org/maven2/commons-beanutils/commons-beanutils/1.9.2/commons-beanutils-1.9.2.pom (14 kB at 1.1 MB/s)
[linux-jdk8] [INFO] Downloading from central: https://repo.maven.apache.org/maven2/org/apache/commons/commons-parent/33/commons-parent-33.pom
[linux-jdk8] [INFO] Downloaded from central: https://repo.maven.apache.org/maven2/org/apache/commons/commons-parent/33/commons-parent-33.pom (53 kB at 3.5 MB/s)
[linux-jdk8] [INFO] Downloading from central: https://repo.maven.apache.org/maven2/commons-cli/commons-cli/1.3.1/commons-cli-1.3.1.pom
[linux-jdk8] [INFO] Downloaded from central: https://repo.maven.apache.org/maven2/commons-cli/commons-cli/1.3.1/commons-cli-1.3.1.pom (10 kB at 866 kB/s)
[linux-jdk8] [INFO] Downloading from central: https://repo.maven.apache.org/maven2/com/google/guava/guava/19.0/guava-19.0.pom
[linux-jdk8] [INFO] Downloaded from central: https://repo.maven.apache.org/maven2/com/google/guava/guava/19.0/guava-19.0.pom (6.8 kB at 566 kB/s)
[linux-jdk8] [INFO] Downloading from central: https://repo.maven.apache.org/maven2/com/google/guava/guava-parent/19.0/guava-parent-19.0.pom
[linux-jdk8] [INFO] Downloaded from central: https://repo.maven.apache.org/maven2/com/google/guava/guava-parent/19.0/guava-parent-19.0.pom (9.9 kB at 823 kB/s)
[linux-jdk8] [INFO] Downloading from central: https://repo.maven.apache.org/maven2/org/sonatype/oss/oss-parent/7/oss-parent-7.pom
[linux-jdk8] [INFO] Downloaded from central: https://repo.maven.apache.org/maven2/org/sonatype/oss/oss-parent/7/oss-parent-7.pom (4.8 kB at 439 kB/s)
[linux-jdk8] [INFO] Downloading from central: https://repo.maven.apache.org/maven2/org/apache/maven/shared/maven-shared-resources/2/maven-shared-resources-2.jar
[linux-jdk8] [INFO] Downloading from central: https://repo.maven.apache.org/maven2/org/apache/maven/doxia/doxia-core/1.2/doxia-core-1.2.jar
[linux-jdk8] [INFO] Downloading from central: https://repo.maven.apache.org/maven2/commons-digester/commons-digester/1.6/commons-digester-1.6.jar
[linux-jdk8] [INFO] Downloading from central: https://repo.maven.apache.org/maven2/commons-logging/commons-logging/1.0.4/commons-logging-1.0.4.jar
[linux-jdk8] [INFO] Downloading from central: https://repo.maven.apache.org/maven2/org/apache/maven/doxia/doxia-integration-tools/1.6/doxia-integration-tools-1.6.jar
[linux-jdk8] [INFO] Downloaded from central: https://repo.maven.apache.org/maven2/org/apache/maven/shared/maven-shared-resources/2/maven-shared-resources-2.jar (13 kB at 725 kB/s)
[linux-jdk8] [INFO] Downloading from central: https://repo.maven.apache.org/maven2/commons-io/commons-io/1.4/commons-io-1.4.jar
[linux-jdk8] [INFO] Downloaded from central: https://repo.maven.apache.org/maven2/commons-logging/commons-logging/1.0.4/commons-logging-1.0.4.jar (38 kB at 1.9 MB/s)
[linux-jdk8] [INFO] Downloading from central: https://repo.maven.apache.org/maven2/org/codehaus/plexus/plexus-resources/1.1.0/plexus-resources-1.1.0.jar
[linux-jdk8] [INFO] Downloaded from central: https://repo.maven.apache.org/maven2/org/apache/maven/doxia/doxia-integration-tools/1.6/doxia-integration-tools-1.6.jar (45 kB at 1.9 MB/s)
[linux-jdk8] [INFO] Downloading from central: https://repo.maven.apache.org/maven2/com/puppycrawl/tools/checkstyle/6.18/checkstyle-6.18.jar
[linux-jdk8] [INFO] Downloaded from central: https://repo.maven.apache.org/maven2/org/apache/maven/doxia/doxia-core/1.2/doxia-core-1.2.jar (154 kB at 5.1 MB/s)
[linux-jdk8] [INFO] Downloading from central: https://repo.maven.apache.org/maven2/antlr/antlr/2.7.7/antlr-2.7.7.jar
[linux-jdk8] [INFO] Downloaded from central: https://repo.maven.apache.org/maven2/org/codehaus/plexus/plexus-resources/1.1.0/plexus-resources-1.1.0.jar (23 kB at 749 kB/s)
[linux-jdk8] [INFO] Downloading from central: https://repo.maven.apache.org/maven2/org/antlr/antlr4-runtime/4.5.3/antlr4-runtime-4.5.3.jar
[linux-jdk8] [INFO] Downloaded from central: https://repo.maven.apache.org/maven2/commons-digester/commons-digester/1.6/commons-digester-1.6.jar (168 kB at 4.8 MB/s)
[linux-jdk8] [INFO] Downloading from central: https://repo.maven.apache.org/maven2/commons-beanutils/commons-beanutils/1.9.2/commons-beanutils-1.9.2.jar
[linux-jdk8] [INFO] Downloaded from central: https://repo.maven.apache.org/maven2/commons-io/commons-io/1.4/commons-io-1.4.jar (109 kB at 3.1 MB/s)
[linux-jdk8] [INFO] Downloading from central: https://repo.maven.apache.org/maven2/commons-cli/commons-cli/1.3.1/commons-cli-1.3.1.jar
[linux-jdk8] [INFO] Downloaded from central: https://repo.maven.apache.org/maven2/commons-cli/commons-cli/1.3.1/commons-cli-1.3.1.jar (53 kB at 981 kB/s)
[linux-jdk8] [INFO] Downloading from central: https://repo.maven.apache.org/maven2/com/google/guava/guava/19.0/guava-19.0.jar
[linux-jdk8] [INFO] Downloaded from central: https://repo.maven.apache.org/maven2/commons-beanutils/commons-beanutils/1.9.2/commons-beanutils-1.9.2.jar (234 kB at 3.7 MB/s)
[linux-jdk8] [INFO] Downloading from central: https://repo.maven.apache.org/maven2/commons-lang/commons-lang/2.1/commons-lang-2.1.jar
[linux-jdk8] [INFO] Downloaded from central: https://repo.maven.apache.org/maven2/org/antlr/antlr4-runtime/4.5.3/antlr4-runtime-4.5.3.jar (302 kB at 4.3 MB/s)
[linux-jdk8] [INFO] Downloaded from central: https://repo.maven.apache.org/maven2/antlr/antlr/2.7.7/antlr-2.7.7.jar (445 kB at 6.3 MB/s)
[linux-jdk8] [INFO] Downloaded from central: https://repo.maven.apache.org/maven2/commons-lang/commons-lang/2.1/commons-lang-2.1.jar (208 kB at 2.4 MB/s)
[linux-jdk8] [INFO] Downloaded from central: https://repo.maven.apache.org/maven2/com/puppycrawl/tools/checkstyle/6.18/checkstyle-6.18.jar (1.2 MB at 12 MB/s)
[linux-jdk8] [INFO] Downloaded from central: https://repo.maven.apache.org/maven2/com/google/guava/guava/19.0/guava-19.0.jar (2.3 MB at 12 MB/s)
[linux-jdk8] [INFO]
[linux-jdk8] [INFO] --- maven-failsafe-plugin:2.20.1:verify (integration-tests) @ maven-remote-resources-plugin ---
[linux-jdk8] [INFO]
[linux-jdk8] [INFO] --- maven-invoker-plugin:3.0.1:verify (integration-test) @ maven-remote-resources-plugin ---
[linux-jdk8] [INFO] -------------------------------------------------
[linux-jdk8] [INFO] Build Summary:
[linux-jdk8] [INFO]   Passed: 1, Failed: 0, Errors: 0, Skipped: 0
[linux-jdk8] [INFO] -------------------------------------------------
[linux-jdk8] [INFO] ------------------------------------------------------------------------
[linux-jdk8] [INFO] BUILD SUCCESS
[linux-jdk8] [INFO] ------------------------------------------------------------------------
[linux-jdk8] [INFO] Total time: 01:40 min
[linux-jdk8] [INFO] Finished at: 2018-02-13T19:31:21Z
[linux-jdk8] [INFO] Final Memory: 52M/2376M
[linux-jdk8] [INFO] ------------------------------------------------------------------------
[linux-jdk8] [INFO] [jenkins-event-spy] Generated /home/jenkins/jenkins-slave/workspace/rces-plugin_MRRESOURCES-103-OWZ3HFZ43MS4CUVJZUVLTQDPH6VF24RFDOZDFCITEPHO3WVUHWJQ@tmp/withMaven898a602c/maven-spy-20180213-192940-6123973169246993423226.log
[Pipeline] [linux-jdk7] // dir
[Pipeline] [linux-jdk7] }
[linux-jdk7] [withMaven] artifactsPublisher - Archive artifact m/pom.xml under org/apache/maven/plugins/maven-remote-resources-plugin/1.6-SNAPSHOT/maven-remote-resources-plugin-1.6-SNAPSHOT.pom
[linux-jdk7] [withMaven] artifactsPublisher - Archive artifact m/target/maven-remote-resources-plugin-1.6-SNAPSHOT.jar under org/apache/maven/plugins/maven-remote-resources-plugin/1.6-SNAPSHOT/maven-remote-resources-plugin-1.6-SNAPSHOT.jar
[linux-jdk7] [Fast Archiver] No prior successful build to compare, so performing full copy of artifacts
[linux-jdk7] [withMaven] junitPublisher - Archive test results for Maven artifact org.apache.maven.plugins:maven-remote-resources-plugin:1.6-SNAPSHOT generated by maven-surefire-plugin:test (default-test): m/target/surefire-reports/*.xml
[linux-jdk7] [withMaven] junitPublisher - Jenkins JUnit Attachments Plugin not found, can't publish test attachments.Recording test results
[linux-jdk7] [withMaven] junitPublisher - Archive test results for Maven artifact org.apache.maven.plugins:maven-remote-resources-plugin:1.6-SNAPSHOT generated by maven-failsafe-plugin:integration-test (integration-tests): m/target/failsafe-reports/*.xml
[linux-jdk7] [withMaven] junitPublisher - Jenkins JUnit Attachments Plugin not found, can't publish test attachments.Recording test results
[linux-jdk7] [withMaven] openTasksPublisher - Scan Tasks for Maven artifact org.apache.maven.plugins:maven-remote-resources-plugin:1.6-SNAPSHOT in source directory m/src/main/java
[linux-jdk7] [TASKS] Scanning folder '/home/jenkins/jenkins-slave/workspace/rces-plugin_MRRESOURCES-103-OWZ3HFZ43MS4CUVJZUVLTQDPH6VF24RFDOZDFCITEPHO3WVUHWJQ' for files matching the pattern 'm/src/main/java/**/*' - excludes: null
[linux-jdk7] [TASKS] Found 3 files to scan for tasks
[linux-jdk7] [TASKS] Found 2 open tasks.
[linux-jdk7] Skipping warnings blame since pipelines do not have an SCM link.%n
[Pipeline] [linux-jdk9] }
[Pipeline] [linux-jdk7] // withMaven
[Pipeline] [linux-jdk9] // dir
[Pipeline] [linux-jdk7] }
[Pipeline] [linux-jdk8] }
[Pipeline] [linux-jdk9] }
[linux-jdk9] [withMaven] Skip 'Generated Artifacts Publisher' disabled by configuration
[linux-jdk9] [withMaven] junitPublisher - Archive test results for Maven artifact org.apache.maven.plugins:maven-remote-resources-plugin:1.6-SNAPSHOT generated by maven-surefire-plugin:test (default-test): m/target/surefire-reports/*.xml
[linux-jdk9] [withMaven] junitPublisher - Jenkins JUnit Attachments Plugin not found, can't publish test attachments.Recording test results
[linux-jdk9] [withMaven] junitPublisher - Archive test results for Maven artifact org.apache.maven.plugins:maven-remote-resources-plugin:1.6-SNAPSHOT generated by maven-failsafe-plugin:integration-test (integration-tests): m/target/failsafe-reports/*.xml
[linux-jdk9] [withMaven] junitPublisher - Jenkins JUnit Attachments Plugin not found, can't publish test attachments.Recording test results
[linux-jdk9] [withMaven] Skip 'Findbugs Publisher' disabled by configuration
[linux-jdk9] [withMaven] Skip 'Open Task Scanner Publisher' disabled by configuration
[Pipeline] [linux-jdk7] // stage
[Pipeline] [linux-jdk8] // dir
[Pipeline] [linux-jdk9] // withMaven
[Pipeline] [linux-jdk7] }
[Pipeline] [linux-jdk8] }
[linux-jdk8] [withMaven] Skip 'Generated Artifacts Publisher' disabled by configuration
[linux-jdk8] [withMaven] junitPublisher - Archive test results for Maven artifact org.apache.maven.plugins:maven-remote-resources-plugin:1.6-SNAPSHOT generated by maven-surefire-plugin:test (default-test): m/target/surefire-reports/*.xml
[linux-jdk8] [withMaven] junitPublisher - Jenkins JUnit Attachments Plugin not found, can't publish test attachments.Recording test results
[linux-jdk8] [withMaven] junitPublisher - Archive test results for Maven artifact org.apache.maven.plugins:maven-remote-resources-plugin:1.6-SNAPSHOT generated by maven-failsafe-plugin:integration-test (integration-tests): m/target/failsafe-reports/*.xml
[linux-jdk8] [withMaven] junitPublisher - Jenkins JUnit Attachments Plugin not found, can't publish test attachments.Recording test results
[linux-jdk8] [withMaven] Skip 'Findbugs Publisher' disabled by configuration
[linux-jdk8] [withMaven] Skip 'Open Task Scanner Publisher' disabled by configuration
[Pipeline] [linux-jdk9] }
[Pipeline] [linux-jdk7] // node
[Pipeline] [linux-jdk8] // withMaven
[Pipeline] [linux-jdk9] // stage
[Pipeline] [linux-jdk7] }
[Pipeline] [linux-jdk8] }
[Pipeline] [linux-jdk9] }
[Pipeline] [linux-jdk8] // stage
[Pipeline] [linux-jdk9] // node
[Pipeline] [linux-jdk9] }
[Pipeline] [linux-jdk8] }
[Pipeline] [linux-jdk8] // node
[Pipeline] [linux-jdk8] }
[Pipeline] // parallel
[Pipeline] stage
[Pipeline] { (Notifications)
[Pipeline] echo
Build result: UNSTABLE
[Pipeline] jiraIssueSelector
[Pipeline] emailext