Build unstable in Jenkins: Maven TLP » maven-release » MRELEASE-980 #1

classic Classic list List threaded Threaded
2 messages Options
Reply | Threaded
Open this post in threaded view
|

Build unstable in Jenkins: Maven TLP » maven-release » MRELEASE-980 #1

Apache Jenkins Server-2
See https://builds.apache.org/job/maven-box/job/maven-release/job/MRELEASE-980/1/

No changes.

128 tests failed.
FAILED:  org.apache.maven.shared.release.config.PropertiesReleaseDescriptorStoreTest.linux-jdk7-m3.2.x_build / Build linux-jdk7-m3.2.x_build / testOverwriteFile

Error Message:
compare configuration expected:<org.apache.maven.shared.release.config.ReleaseDescriptorBuilder$BuilderReleaseDescriptor@cbd6cd1f> but was:<org.apache.maven.shared.release.config.ReleaseDescriptorBuilder$BuilderReleaseDescriptor@81b50ffe>

Stack Trace:
junit.framework.AssertionFailedError: compare configuration expected:<org.apache.maven.shared.release.config.ReleaseDescriptorBuilder$BuilderReleaseDescriptor@cbd6cd1f> but was:<org.apache.maven.shared.release.config.ReleaseDescriptorBuilder$BuilderReleaseDescriptor@81b50ffe>
        at org.apache.maven.shared.release.config.PropertiesReleaseDescriptorStoreTest.testOverwriteFile(PropertiesReleaseDescriptorStoreTest.java:249)


FAILED:  org.apache.maven.shared.release.config.PropertiesReleaseDescriptorStoreTest.linux-jdk7-m3.2.x_build / Build linux-jdk7-m3.2.x_build / testWriteToNewFileNullMappedScm

Error Message:
compare configuration expected:<org.apache.maven.shared.release.config.ReleaseDescriptorBuilder$BuilderReleaseDescriptor@dfb3f5ac> but was:<org.apache.maven.shared.release.config.ReleaseDescriptorBuilder$BuilderReleaseDescriptor@f3f99072>

Stack Trace:
junit.framework.AssertionFailedError: compare configuration expected:<org.apache.maven.shared.release.config.ReleaseDescriptorBuilder$BuilderReleaseDescriptor@dfb3f5ac> but was:<org.apache.maven.shared.release.config.ReleaseDescriptorBuilder$BuilderReleaseDescriptor@f3f99072>
        at org.apache.maven.shared.release.config.PropertiesReleaseDescriptorStoreTest.testWriteToNewFileNullMappedScm(PropertiesReleaseDescriptorStoreTest.java:231)


FAILED:  org.apache.maven.shared.release.config.PropertiesReleaseDescriptorStoreTest.linux-jdk7-m3.2.x_build / Build linux-jdk7-m3.2.x_build / testWriteToWorkingDirectory

Error Message:
compare configuration expected:<org.apache.maven.shared.release.config.ReleaseDescriptorBuilder$BuilderReleaseDescriptor@7352cced> but was:<org.apache.maven.shared.release.config.ReleaseDescriptorBuilder$BuilderReleaseDescriptor@25436c80>

Stack Trace:
junit.framework.AssertionFailedError: compare configuration expected:<org.apache.maven.shared.release.config.ReleaseDescriptorBuilder$BuilderReleaseDescriptor@7352cced> but was:<org.apache.maven.shared.release.config.ReleaseDescriptorBuilder$BuilderReleaseDescriptor@25436c80>
        at org.apache.maven.shared.release.config.PropertiesReleaseDescriptorStoreTest.testWriteToWorkingDirectory(PropertiesReleaseDescriptorStoreTest.java:158)


FAILED:  org.apache.maven.shared.release.config.PropertiesReleaseDescriptorStoreTest.linux-jdk7-m3.2.x_build / Build linux-jdk7-m3.2.x_build / testWriteToNewFileDottedIds

Error Message:
compare configuration expected:<org.apache.maven.shared.release.config.ReleaseDescriptorBuilder$BuilderReleaseDescriptor@83753189> but was:<org.apache.maven.shared.release.config.ReleaseDescriptorBuilder$BuilderReleaseDescriptor@9c433593>

Stack Trace:
junit.framework.AssertionFailedError: compare configuration expected:<org.apache.maven.shared.release.config.ReleaseDescriptorBuilder$BuilderReleaseDescriptor@83753189> but was:<org.apache.maven.shared.release.config.ReleaseDescriptorBuilder$BuilderReleaseDescriptor@9c433593>
        at org.apache.maven.shared.release.config.PropertiesReleaseDescriptorStoreTest.testWriteToNewFileDottedIds(PropertiesReleaseDescriptorStoreTest.java:205)


FAILED:  org.apache.maven.shared.release.config.PropertiesReleaseDescriptorStoreTest.linux-jdk7-m3.2.x_build / Build linux-jdk7-m3.2.x_build / testWriteToNewFileRequiredOnly

Error Message:
compare configuration expected:<org.apache.maven.shared.release.config.ReleaseDescriptorBuilder$BuilderReleaseDescriptor@592de242> but was:<org.apache.maven.shared.release.config.ReleaseDescriptorBuilder$BuilderReleaseDescriptor@6d737d08>

Stack Trace:
junit.framework.AssertionFailedError: compare configuration expected:<org.apache.maven.shared.release.config.ReleaseDescriptorBuilder$BuilderReleaseDescriptor@592de242> but was:<org.apache.maven.shared.release.config.ReleaseDescriptorBuilder$BuilderReleaseDescriptor@6d737d08>
        at org.apache.maven.shared.release.config.PropertiesReleaseDescriptorStoreTest.testWriteToNewFileRequiredOnly(PropertiesReleaseDescriptorStoreTest.java:176)


FAILED:  org.apache.maven.shared.release.config.PropertiesReleaseDescriptorStoreTest.linux-jdk7-m3.2.x_build / Build linux-jdk7-m3.2.x_build / testWriteToNewFile

Error Message:
compare configuration expected:<org.apache.maven.shared.release.config.ReleaseDescriptorBuilder$BuilderReleaseDescriptor@f9fedb68> but was:<org.apache.maven.shared.release.config.ReleaseDescriptorBuilder$BuilderReleaseDescriptor@f1cdf94e>

Stack Trace:
junit.framework.AssertionFailedError: compare configuration expected:<org.apache.maven.shared.release.config.ReleaseDescriptorBuilder$BuilderReleaseDescriptor@f9fedb68> but was:<org.apache.maven.shared.release.config.ReleaseDescriptorBuilder$BuilderReleaseDescriptor@f1cdf94e>
        at org.apache.maven.shared.release.config.PropertiesReleaseDescriptorStoreTest.testWriteToNewFile(PropertiesReleaseDescriptorStoreTest.java:136)


FAILED:  org.apache.maven.shared.release.config.PropertiesReleaseDescriptorStoreTest.windows-jdk7-m3.2.x_build / Build windows-jdk7-m3.2.x_build / testOverwriteFile

Error Message:
compare configuration expected:<org.apache.maven.shared.release.config.ReleaseDescriptorBuilder$BuilderReleaseDescriptor@ea27d3b8> but was:<org.apache.maven.shared.release.config.ReleaseDescriptorBuilder$BuilderReleaseDescriptor@ff8ceb38>

Stack Trace:
junit.framework.AssertionFailedError: compare configuration expected:<org.apache.maven.shared.release.config.ReleaseDescriptorBuilder$BuilderReleaseDescriptor@ea27d3b8> but was:<org.apache.maven.shared.release.config.ReleaseDescriptorBuilder$BuilderReleaseDescriptor@ff8ceb38>
        at org.apache.maven.shared.release.config.PropertiesReleaseDescriptorStoreTest.testOverwriteFile(PropertiesReleaseDescriptorStoreTest.java:249)


FAILED:  org.apache.maven.shared.release.config.PropertiesReleaseDescriptorStoreTest.windows-jdk7-m3.2.x_build / Build windows-jdk7-m3.2.x_build / testWriteToNewFileNullMappedScm

Error Message:
compare configuration expected:<org.apache.maven.shared.release.config.ReleaseDescriptorBuilder$BuilderReleaseDescriptor@dfb3f5ac> but was:<org.apache.maven.shared.release.config.ReleaseDescriptorBuilder$BuilderReleaseDescriptor@f3f99072>

Stack Trace:
junit.framework.AssertionFailedError: compare configuration expected:<org.apache.maven.shared.release.config.ReleaseDescriptorBuilder$BuilderReleaseDescriptor@dfb3f5ac> but was:<org.apache.maven.shared.release.config.ReleaseDescriptorBuilder$BuilderReleaseDescriptor@f3f99072>
        at org.apache.maven.shared.release.config.PropertiesReleaseDescriptorStoreTest.testWriteToNewFileNullMappedScm(PropertiesReleaseDescriptorStoreTest.java:231)


FAILED:  org.apache.maven.shared.release.config.PropertiesReleaseDescriptorStoreTest.windows-jdk7-m3.2.x_build / Build windows-jdk7-m3.2.x_build / testWriteToWorkingDirectory

Error Message:
compare configuration expected:<org.apache.maven.shared.release.config.ReleaseDescriptorBuilder$BuilderReleaseDescriptor@60053403> but was:<org.apache.maven.shared.release.config.ReleaseDescriptorBuilder$BuilderReleaseDescriptor@6ee3ad98>

Stack Trace:
junit.framework.AssertionFailedError: compare configuration expected:<org.apache.maven.shared.release.config.ReleaseDescriptorBuilder$BuilderReleaseDescriptor@60053403> but was:<org.apache.maven.shared.release.config.ReleaseDescriptorBuilder$BuilderReleaseDescriptor@6ee3ad98>
        at org.apache.maven.shared.release.config.PropertiesReleaseDescriptorStoreTest.testWriteToWorkingDirectory(PropertiesReleaseDescriptorStoreTest.java:158)


FAILED:  org.apache.maven.shared.release.config.PropertiesReleaseDescriptorStoreTest.windows-jdk7-m3.2.x_build / Build windows-jdk7-m3.2.x_build / testWriteToNewFileDottedIds

Error Message:
compare configuration expected:<org.apache.maven.shared.release.config.ReleaseDescriptorBuilder$BuilderReleaseDescriptor@5dc5cae7> but was:<org.apache.maven.shared.release.config.ReleaseDescriptorBuilder$BuilderReleaseDescriptor@3555a9ec>

Stack Trace:
junit.framework.AssertionFailedError: compare configuration expected:<org.apache.maven.shared.release.config.ReleaseDescriptorBuilder$BuilderReleaseDescriptor@5dc5cae7> but was:<org.apache.maven.shared.release.config.ReleaseDescriptorBuilder$BuilderReleaseDescriptor@3555a9ec>
        at org.apache.maven.shared.release.config.PropertiesReleaseDescriptorStoreTest.testWriteToNewFileDottedIds(PropertiesReleaseDescriptorStoreTest.java:205)


FAILED:  org.apache.maven.shared.release.config.PropertiesReleaseDescriptorStoreTest.windows-jdk7-m3.2.x_build / Build windows-jdk7-m3.2.x_build / testWriteToNewFileRequiredOnly

Error Message:
compare configuration expected:<org.apache.maven.shared.release.config.ReleaseDescriptorBuilder$BuilderReleaseDescriptor@592de242> but was:<org.apache.maven.shared.release.config.ReleaseDescriptorBuilder$BuilderReleaseDescriptor@6d737d08>

Stack Trace:
junit.framework.AssertionFailedError: compare configuration expected:<org.apache.maven.shared.release.config.ReleaseDescriptorBuilder$BuilderReleaseDescriptor@592de242> but was:<org.apache.maven.shared.release.config.ReleaseDescriptorBuilder$BuilderReleaseDescriptor@6d737d08>
        at org.apache.maven.shared.release.config.PropertiesReleaseDescriptorStoreTest.testWriteToNewFileRequiredOnly(PropertiesReleaseDescriptorStoreTest.java:176)


FAILED:  org.apache.maven.shared.release.config.PropertiesReleaseDescriptorStoreTest.windows-jdk7-m3.2.x_build / Build windows-jdk7-m3.2.x_build / testWriteToNewFile

Error Message:
compare configuration expected:<org.apache.maven.shared.release.config.ReleaseDescriptorBuilder$BuilderReleaseDescriptor@80d95b95> but was:<org.apache.maven.shared.release.config.ReleaseDescriptorBuilder$BuilderReleaseDescriptor@a509da64>

Stack Trace:
junit.framework.AssertionFailedError: compare configuration expected:<org.apache.maven.shared.release.config.ReleaseDescriptorBuilder$BuilderReleaseDescriptor@80d95b95> but was:<org.apache.maven.shared.release.config.ReleaseDescriptorBuilder$BuilderReleaseDescriptor@a509da64>
        at org.apache.maven.shared.release.config.PropertiesReleaseDescriptorStoreTest.testWriteToNewFile(PropertiesReleaseDescriptorStoreTest.java:136)


FAILED:  org.apache.maven.shared.release.config.PropertiesReleaseDescriptorStoreTest.windows-jdk7-m3.5.x_build / Build windows-jdk7-m3.5.x_build / testOverwriteFile

Error Message:
compare configuration expected:<org.apache.maven.shared.release.config.ReleaseDescriptorBuilder$BuilderReleaseDescriptor@126456a7> but was:<org.apache.maven.shared.release.config.ReleaseDescriptorBuilder$BuilderReleaseDescriptor@27c96e27>

Stack Trace:
junit.framework.AssertionFailedError: compare configuration expected:<org.apache.maven.shared.release.config.ReleaseDescriptorBuilder$BuilderReleaseDescriptor@126456a7> but was:<org.apache.maven.shared.release.config.ReleaseDescriptorBuilder$BuilderReleaseDescriptor@27c96e27>
        at org.apache.maven.shared.release.config.PropertiesReleaseDescriptorStoreTest.testOverwriteFile(PropertiesReleaseDescriptorStoreTest.java:249)


FAILED:  org.apache.maven.shared.release.config.PropertiesReleaseDescriptorStoreTest.windows-jdk7-m3.5.x_build / Build windows-jdk7-m3.5.x_build / testWriteToNewFileNullMappedScm

Error Message:
compare configuration expected:<org.apache.maven.shared.release.config.ReleaseDescriptorBuilder$BuilderReleaseDescriptor@dfb3f5ac> but was:<org.apache.maven.shared.release.config.ReleaseDescriptorBuilder$BuilderReleaseDescriptor@f3f99072>

Stack Trace:
junit.framework.AssertionFailedError: compare configuration expected:<org.apache.maven.shared.release.config.ReleaseDescriptorBuilder$BuilderReleaseDescriptor@dfb3f5ac> but was:<org.apache.maven.shared.release.config.ReleaseDescriptorBuilder$BuilderReleaseDescriptor@f3f99072>
        at org.apache.maven.shared.release.config.PropertiesReleaseDescriptorStoreTest.testWriteToNewFileNullMappedScm(PropertiesReleaseDescriptorStoreTest.java:231)


FAILED:  org.apache.maven.shared.release.config.PropertiesReleaseDescriptorStoreTest.windows-jdk7-m3.5.x_build / Build windows-jdk7-m3.5.x_build / testWriteToWorkingDirectory

Error Message:
compare configuration expected:<org.apache.maven.shared.release.config.ReleaseDescriptorBuilder$BuilderReleaseDescriptor@48a7ed11> but was:<org.apache.maven.shared.release.config.ReleaseDescriptorBuilder$BuilderReleaseDescriptor@578666a6>

Stack Trace:
junit.framework.AssertionFailedError: compare configuration expected:<org.apache.maven.shared.release.config.ReleaseDescriptorBuilder$BuilderReleaseDescriptor@48a7ed11> but was:<org.apache.maven.shared.release.config.ReleaseDescriptorBuilder$BuilderReleaseDescriptor@578666a6>
        at org.apache.maven.shared.release.config.PropertiesReleaseDescriptorStoreTest.testWriteToWorkingDirectory(PropertiesReleaseDescriptorStoreTest.java:158)


FAILED:  org.apache.maven.shared.release.config.PropertiesReleaseDescriptorStoreTest.windows-jdk7-m3.5.x_build / Build windows-jdk7-m3.5.x_build / testWriteToNewFileDottedIds

Error Message:
compare configuration expected:<org.apache.maven.shared.release.config.ReleaseDescriptorBuilder$BuilderReleaseDescriptor@f9a83558> but was:<org.apache.maven.shared.release.config.ReleaseDescriptorBuilder$BuilderReleaseDescriptor@572007c7>

Stack Trace:
junit.framework.AssertionFailedError: compare configuration expected:<org.apache.maven.shared.release.config.ReleaseDescriptorBuilder$BuilderReleaseDescriptor@f9a83558> but was:<org.apache.maven.shared.release.config.ReleaseDescriptorBuilder$BuilderReleaseDescriptor@572007c7>
        at org.apache.maven.shared.release.config.PropertiesReleaseDescriptorStoreTest.testWriteToNewFileDottedIds(PropertiesReleaseDescriptorStoreTest.java:205)


FAILED:  org.apache.maven.shared.release.config.PropertiesReleaseDescriptorStoreTest.windows-jdk7-m3.5.x_build / Build windows-jdk7-m3.5.x_build / testWriteToNewFileRequiredOnly

Error Message:
compare configuration expected:<org.apache.maven.shared.release.config.ReleaseDescriptorBuilder$BuilderReleaseDescriptor@592de242> but was:<org.apache.maven.shared.release.config.ReleaseDescriptorBuilder$BuilderReleaseDescriptor@6d737d08>

Stack Trace:
junit.framework.AssertionFailedError: compare configuration expected:<org.apache.maven.shared.release.config.ReleaseDescriptorBuilder$BuilderReleaseDescriptor@592de242> but was:<org.apache.maven.shared.release.config.ReleaseDescriptorBuilder$BuilderReleaseDescriptor@6d737d08>
        at org.apache.maven.shared.release.config.PropertiesReleaseDescriptorStoreTest.testWriteToNewFileRequiredOnly(PropertiesReleaseDescriptorStoreTest.java:176)


FAILED:  org.apache.maven.shared.release.config.PropertiesReleaseDescriptorStoreTest.windows-jdk7-m3.5.x_build / Build windows-jdk7-m3.5.x_build / testWriteToNewFile

Error Message:
compare configuration expected:<org.apache.maven.shared.release.config.ReleaseDescriptorBuilder$BuilderReleaseDescriptor@c80fa0c> but was:<org.apache.maven.shared.release.config.ReleaseDescriptorBuilder$BuilderReleaseDescriptor@57499eac>

Stack Trace:
junit.framework.AssertionFailedError: compare configuration expected:<org.apache.maven.shared.release.config.ReleaseDescriptorBuilder$BuilderReleaseDescriptor@c80fa0c> but was:<org.apache.maven.shared.release.config.ReleaseDescriptorBuilder$BuilderReleaseDescriptor@57499eac>
        at org.apache.maven.shared.release.config.PropertiesReleaseDescriptorStoreTest.testWriteToNewFile(PropertiesReleaseDescriptorStoreTest.java:136)


FAILED:  org.apache.maven.shared.release.config.PropertiesReleaseDescriptorStoreTest.windows-jdk7-m3.3.x_build / Build windows-jdk7-m3.3.x_build / testOverwriteFile

Error Message:
compare configuration expected:<org.apache.maven.shared.release.config.ReleaseDescriptorBuilder$BuilderReleaseDescriptor@ba346579> but was:<org.apache.maven.shared.release.config.ReleaseDescriptorBuilder$BuilderReleaseDescriptor@ffb9382b>

Stack Trace:
junit.framework.AssertionFailedError: compare configuration expected:<org.apache.maven.shared.release.config.ReleaseDescriptorBuilder$BuilderReleaseDescriptor@ba346579> but was:<org.apache.maven.shared.release.config.ReleaseDescriptorBuilder$BuilderReleaseDescriptor@ffb9382b>
        at org.apache.maven.shared.release.config.PropertiesReleaseDescriptorStoreTest.testOverwriteFile(PropertiesReleaseDescriptorStoreTest.java:249)


FAILED:  org.apache.maven.shared.release.config.PropertiesReleaseDescriptorStoreTest.windows-jdk7-m3.3.x_build / Build windows-jdk7-m3.3.x_build / testWriteToNewFileNullMappedScm

Error Message:
compare configuration expected:<org.apache.maven.shared.release.config.ReleaseDescriptorBuilder$BuilderReleaseDescriptor@dfb3f5ac> but was:<org.apache.maven.shared.release.config.ReleaseDescriptorBuilder$BuilderReleaseDescriptor@f3f99072>

Stack Trace:
junit.framework.AssertionFailedError: compare configuration expected:<org.apache.maven.shared.release.config.ReleaseDescriptorBuilder$BuilderReleaseDescriptor@dfb3f5ac> but was:<org.apache.maven.shared.release.config.ReleaseDescriptorBuilder$BuilderReleaseDescriptor@f3f99072>
        at org.apache.maven.shared.release.config.PropertiesReleaseDescriptorStoreTest.testWriteToNewFileNullMappedScm(PropertiesReleaseDescriptorStoreTest.java:231)


FAILED:  org.apache.maven.shared.release.config.PropertiesReleaseDescriptorStoreTest.windows-jdk7-m3.3.x_build / Build windows-jdk7-m3.3.x_build / testWriteToWorkingDirectory

Error Message:
compare configuration expected:<org.apache.maven.shared.release.config.ReleaseDescriptorBuilder$BuilderReleaseDescriptor@89b0bcbb> but was:<org.apache.maven.shared.release.config.ReleaseDescriptorBuilder$BuilderReleaseDescriptor@fe0820f3>

Stack Trace:
junit.framework.AssertionFailedError: compare configuration expected:<org.apache.maven.shared.release.config.ReleaseDescriptorBuilder$BuilderReleaseDescriptor@89b0bcbb> but was:<org.apache.maven.shared.release.config.ReleaseDescriptorBuilder$BuilderReleaseDescriptor@fe0820f3>
        at org.apache.maven.shared.release.config.PropertiesReleaseDescriptorStoreTest.testWriteToWorkingDirectory(PropertiesReleaseDescriptorStoreTest.java:158)


FAILED:  org.apache.maven.shared.release.config.PropertiesReleaseDescriptorStoreTest.windows-jdk7-m3.3.x_build / Build windows-jdk7-m3.3.x_build / testWriteToNewFileDottedIds

Error Message:
compare configuration expected:<org.apache.maven.shared.release.config.ReleaseDescriptorBuilder$BuilderReleaseDescriptor@589fa61e> but was:<org.apache.maven.shared.release.config.ReleaseDescriptorBuilder$BuilderReleaseDescriptor@c55d2cf6>

Stack Trace:
junit.framework.AssertionFailedError: compare configuration expected:<org.apache.maven.shared.release.config.ReleaseDescriptorBuilder$BuilderReleaseDescriptor@589fa61e> but was:<org.apache.maven.shared.release.config.ReleaseDescriptorBuilder$BuilderReleaseDescriptor@c55d2cf6>
        at org.apache.maven.shared.release.config.PropertiesReleaseDescriptorStoreTest.testWriteToNewFileDottedIds(PropertiesReleaseDescriptorStoreTest.java:205)


FAILED:  org.apache.maven.shared.release.config.PropertiesReleaseDescriptorStoreTest.windows-jdk7-m3.3.x_build / Build windows-jdk7-m3.3.x_build / testWriteToNewFileRequiredOnly

Error Message:
compare configuration expected:<org.apache.maven.shared.release.config.ReleaseDescriptorBuilder$BuilderReleaseDescriptor@592de242> but was:<org.apache.maven.shared.release.config.ReleaseDescriptorBuilder$BuilderReleaseDescriptor@6d737d08>

Stack Trace:
junit.framework.AssertionFailedError: compare configuration expected:<org.apache.maven.shared.release.config.ReleaseDescriptorBuilder$BuilderReleaseDescriptor@592de242> but was:<org.apache.maven.shared.release.config.ReleaseDescriptorBuilder$BuilderReleaseDescriptor@6d737d08>
        at org.apache.maven.shared.release.config.PropertiesReleaseDescriptorStoreTest.testWriteToNewFileRequiredOnly(PropertiesReleaseDescriptorStoreTest.java:176)


FAILED:  org.apache.maven.shared.release.config.PropertiesReleaseDescriptorStoreTest.windows-jdk7-m3.3.x_build / Build windows-jdk7-m3.3.x_build / testWriteToNewFile

Error Message:
compare configuration expected:<org.apache.maven.shared.release.config.ReleaseDescriptorBuilder$BuilderReleaseDescriptor@46d22774> but was:<org.apache.maven.shared.release.config.ReleaseDescriptorBuilder$BuilderReleaseDescriptor@28574d85>

Stack Trace:
junit.framework.AssertionFailedError: compare configuration expected:<org.apache.maven.shared.release.config.ReleaseDescriptorBuilder$BuilderReleaseDescriptor@46d22774> but was:<org.apache.maven.shared.release.config.ReleaseDescriptorBuilder$BuilderReleaseDescriptor@28574d85>
        at org.apache.maven.shared.release.config.PropertiesReleaseDescriptorStoreTest.testWriteToNewFile(PropertiesReleaseDescriptorStoreTest.java:136)


FAILED:  org.apache.maven.shared.release.config.PropertiesReleaseDescriptorStoreTest.linux-jdk11-m3.6.x_build / Build linux-jdk11-m3.6.x_build / testOverwriteFile

Error Message:
compare configuration expected:<org.apache.maven.shared.release.config.ReleaseDescriptorBuilder$BuilderReleaseDescriptor@81e0014e> but was:<org.apache.maven.shared.release.config.ReleaseDescriptorBuilder$BuilderReleaseDescriptor@2f3cfa7f>

Stack Trace:
junit.framework.AssertionFailedError: compare configuration expected:<org.apache.maven.shared.release.config.ReleaseDescriptorBuilder$BuilderReleaseDescriptor@81e0014e> but was:<org.apache.maven.shared.release.config.ReleaseDescriptorBuilder$BuilderReleaseDescriptor@2f3cfa7f>
        at org.apache.maven.shared.release.config.PropertiesReleaseDescriptorStoreTest.testOverwriteFile(PropertiesReleaseDescriptorStoreTest.java:249)


FAILED:  org.apache.maven.shared.release.config.PropertiesReleaseDescriptorStoreTest.linux-jdk11-m3.6.x_build / Build linux-jdk11-m3.6.x_build / testWriteToNewFileNullMappedScm

Error Message:
compare configuration expected:<org.apache.maven.shared.release.config.ReleaseDescriptorBuilder$BuilderReleaseDescriptor@dfb3f5ac> but was:<org.apache.maven.shared.release.config.ReleaseDescriptorBuilder$BuilderReleaseDescriptor@f3f99072>

Stack Trace:
junit.framework.AssertionFailedError: compare configuration expected:<org.apache.maven.shared.release.config.ReleaseDescriptorBuilder$BuilderReleaseDescriptor@dfb3f5ac> but was:<org.apache.maven.shared.release.config.ReleaseDescriptorBuilder$BuilderReleaseDescriptor@f3f99072>
        at org.apache.maven.shared.release.config.PropertiesReleaseDescriptorStoreTest.testWriteToNewFileNullMappedScm(PropertiesReleaseDescriptorStoreTest.java:231)


FAILED:  org.apache.maven.shared.release.config.PropertiesReleaseDescriptorStoreTest.linux-jdk11-m3.6.x_build / Build linux-jdk11-m3.6.x_build / testWriteToWorkingDirectory

Error Message:
compare configuration expected:<org.apache.maven.shared.release.config.ReleaseDescriptorBuilder$BuilderReleaseDescriptor@c2114fb7> but was:<org.apache.maven.shared.release.config.ReleaseDescriptorBuilder$BuilderReleaseDescriptor@75e900d6>

Stack Trace:
junit.framework.AssertionFailedError: compare configuration expected:<org.apache.maven.shared.release.config.ReleaseDescriptorBuilder$BuilderReleaseDescriptor@c2114fb7> but was:<org.apache.maven.shared.release.config.ReleaseDescriptorBuilder$BuilderReleaseDescriptor@75e900d6>
        at org.apache.maven.shared.release.config.PropertiesReleaseDescriptorStoreTest.testWriteToWorkingDirectory(PropertiesReleaseDescriptorStoreTest.java:158)


FAILED:  org.apache.maven.shared.release.config.PropertiesReleaseDescriptorStoreTest.linux-jdk11-m3.6.x_build / Build linux-jdk11-m3.6.x_build / testWriteToNewFileDottedIds

Error Message:
compare configuration expected:<org.apache.maven.shared.release.config.ReleaseDescriptorBuilder$BuilderReleaseDescriptor@39c50f69> but was:<org.apache.maven.shared.release.config.ReleaseDescriptorBuilder$BuilderReleaseDescriptor@463f129a>

Stack Trace:
junit.framework.AssertionFailedError: compare configuration expected:<org.apache.maven.shared.release.config.ReleaseDescriptorBuilder$BuilderReleaseDescriptor@39c50f69> but was:<org.apache.maven.shared.release.config.ReleaseDescriptorBuilder$BuilderReleaseDescriptor@463f129a>
        at org.apache.maven.shared.release.config.PropertiesReleaseDescriptorStoreTest.testWriteToNewFileDottedIds(PropertiesReleaseDescriptorStoreTest.java:205)


FAILED:  org.apache.maven.shared.release.config.PropertiesReleaseDescriptorStoreTest.linux-jdk11-m3.6.x_build / Build linux-jdk11-m3.6.x_build / testWriteToNewFileRequiredOnly

Error Message:
compare configuration expected:<org.apache.maven.shared.release.config.ReleaseDescriptorBuilder$BuilderReleaseDescriptor@592de242> but was:<org.apache.maven.shared.release.config.ReleaseDescriptorBuilder$BuilderReleaseDescriptor@6d737d08>

Stack Trace:
junit.framework.AssertionFailedError: compare configuration expected:<org.apache.maven.shared.release.config.ReleaseDescriptorBuilder$BuilderReleaseDescriptor@592de242> but was:<org.apache.maven.shared.release.config.ReleaseDescriptorBuilder$BuilderReleaseDescriptor@6d737d08>
        at org.apache.maven.shared.release.config.PropertiesReleaseDescriptorStoreTest.testWriteToNewFileRequiredOnly(PropertiesReleaseDescriptorStoreTest.java:176)


FAILED:  org.apache.maven.shared.release.config.PropertiesReleaseDescriptorStoreTest.linux-jdk11-m3.6.x_build / Build linux-jdk11-m3.6.x_build / testWriteToNewFile

Error Message:
compare configuration expected:<org.apache.maven.shared.release.config.ReleaseDescriptorBuilder$BuilderReleaseDescriptor@40c70e19> but was:<org.apache.maven.shared.release.config.ReleaseDescriptorBuilder$BuilderReleaseDescriptor@ad2b0d2d>

Stack Trace:
junit.framework.AssertionFailedError: compare configuration expected:<org.apache.maven.shared.release.config.ReleaseDescriptorBuilder$BuilderReleaseDescriptor@40c70e19> but was:<org.apache.maven.shared.release.config.ReleaseDescriptorBuilder$BuilderReleaseDescriptor@ad2b0d2d>
        at org.apache.maven.shared.release.config.PropertiesReleaseDescriptorStoreTest.testWriteToNewFile(PropertiesReleaseDescriptorStoreTest.java:136)


FAILED:  org.apache.maven.shared.release.config.PropertiesReleaseDescriptorStoreTest.windows-jdk7-m3.6.x_build / Build windows-jdk7-m3.6.x_build / testOverwriteFile

Error Message:
compare configuration expected:<org.apache.maven.shared.release.config.ReleaseDescriptorBuilder$BuilderReleaseDescriptor@dfb983b7> but was:<org.apache.maven.shared.release.config.ReleaseDescriptorBuilder$BuilderReleaseDescriptor@319308df>

Stack Trace:
junit.framework.AssertionFailedError: compare configuration expected:<org.apache.maven.shared.release.config.ReleaseDescriptorBuilder$BuilderReleaseDescriptor@dfb983b7> but was:<org.apache.maven.shared.release.config.ReleaseDescriptorBuilder$BuilderReleaseDescriptor@319308df>
        at org.apache.maven.shared.release.config.PropertiesReleaseDescriptorStoreTest.testOverwriteFile(PropertiesReleaseDescriptorStoreTest.java:249)


FAILED:  org.apache.maven.shared.release.config.PropertiesReleaseDescriptorStoreTest.windows-jdk7-m3.6.x_build / Build windows-jdk7-m3.6.x_build / testWriteToNewFileNullMappedScm

Error Message:
compare configuration expected:<org.apache.maven.shared.release.config.ReleaseDescriptorBuilder$BuilderReleaseDescriptor@dfb3f5ac> but was:<org.apache.maven.shared.release.config.ReleaseDescriptorBuilder$BuilderReleaseDescriptor@f3f99072>

Stack Trace:
junit.framework.AssertionFailedError: compare configuration expected:<org.apache.maven.shared.release.config.ReleaseDescriptorBuilder$BuilderReleaseDescriptor@dfb3f5ac> but was:<org.apache.maven.shared.release.config.ReleaseDescriptorBuilder$BuilderReleaseDescriptor@f3f99072>
        at org.apache.maven.shared.release.config.PropertiesReleaseDescriptorStoreTest.testWriteToNewFileNullMappedScm(PropertiesReleaseDescriptorStoreTest.java:231)


FAILED:  org.apache.maven.shared.release.config.PropertiesReleaseDescriptorStoreTest.windows-jdk7-m3.6.x_build / Build windows-jdk7-m3.6.x_build / testWriteToWorkingDirectory

Error Message:
compare configuration expected:<org.apache.maven.shared.release.config.ReleaseDescriptorBuilder$BuilderReleaseDescriptor@13ba5d6c> but was:<org.apache.maven.shared.release.config.ReleaseDescriptorBuilder$BuilderReleaseDescriptor@fd50b2e6>

Stack Trace:
junit.framework.AssertionFailedError: compare configuration expected:<org.apache.maven.shared.release.config.ReleaseDescriptorBuilder$BuilderReleaseDescriptor@13ba5d6c> but was:<org.apache.maven.shared.release.config.ReleaseDescriptorBuilder$BuilderReleaseDescriptor@fd50b2e6>
        at org.apache.maven.shared.release.config.PropertiesReleaseDescriptorStoreTest.testWriteToWorkingDirectory(PropertiesReleaseDescriptorStoreTest.java:158)


FAILED:  org.apache.maven.shared.release.config.PropertiesReleaseDescriptorStoreTest.windows-jdk7-m3.6.x_build / Build windows-jdk7-m3.6.x_build / testWriteToNewFileDottedIds

Error Message:
compare configuration expected:<org.apache.maven.shared.release.config.ReleaseDescriptorBuilder$BuilderReleaseDescriptor@b1179230> but was:<org.apache.maven.shared.release.config.ReleaseDescriptorBuilder$BuilderReleaseDescriptor@10e92037>

Stack Trace:
junit.framework.AssertionFailedError: compare configuration expected:<org.apache.maven.shared.release.config.ReleaseDescriptorBuilder$BuilderReleaseDescriptor@b1179230> but was:<org.apache.maven.shared.release.config.ReleaseDescriptorBuilder$BuilderReleaseDescriptor@10e92037>
        at org.apache.maven.shared.release.config.PropertiesReleaseDescriptorStoreTest.testWriteToNewFileDottedIds(PropertiesReleaseDescriptorStoreTest.java:205)


FAILED:  org.apache.maven.shared.release.config.PropertiesReleaseDescriptorStoreTest.windows-jdk7-m3.6.x_build / Build windows-jdk7-m3.6.x_build / testWriteToNewFileRequiredOnly

Error Message:
compare configuration expected:<org.apache.maven.shared.release.config.ReleaseDescriptorBuilder$BuilderReleaseDescriptor@592de242> but was:<org.apache.maven.shared.release.config.ReleaseDescriptorBuilder$BuilderReleaseDescriptor@6d737d08>

Stack Trace:
junit.framework.AssertionFailedError: compare configuration expected:<org.apache.maven.shared.release.config.ReleaseDescriptorBuilder$BuilderReleaseDescriptor@592de242> but was:<org.apache.maven.shared.release.config.ReleaseDescriptorBuilder$BuilderReleaseDescriptor@6d737d08>
        at org.apache.maven.shared.release.config.PropertiesReleaseDescriptorStoreTest.testWriteToNewFileRequiredOnly(PropertiesReleaseDescriptorStoreTest.java:176)


FAILED:  org.apache.maven.shared.release.config.PropertiesReleaseDescriptorStoreTest.windows-jdk7-m3.6.x_build / Build windows-jdk7-m3.6.x_build / testWriteToNewFile

Error Message:
compare configuration expected:<org.apache.maven.shared.release.config.ReleaseDescriptorBuilder$BuilderReleaseDescriptor@4a30d237> but was:<org.apache.maven.shared.release.config.ReleaseDescriptorBuilder$BuilderReleaseDescriptor@edda838f>

Stack Trace:
junit.framework.AssertionFailedError: compare configuration expected:<org.apache.maven.shared.release.config.ReleaseDescriptorBuilder$BuilderReleaseDescriptor@4a30d237> but was:<org.apache.maven.shared.release.config.ReleaseDescriptorBuilder$BuilderReleaseDescriptor@edda838f>
        at org.apache.maven.shared.release.config.PropertiesReleaseDescriptorStoreTest.testWriteToNewFile(PropertiesReleaseDescriptorStoreTest.java:136)


FAILED:  org.apache.maven.shared.release.config.PropertiesReleaseDescriptorStoreTest.windows-jdk8-m3.6.x_build / Build windows-jdk8-m3.6.x_build / testOverwriteFile

Error Message:
compare configuration expected:<org.apache.maven.shared.release.config.ReleaseDescriptorBuilder$BuilderReleaseDescriptor@5996d6d3> but was:<org.apache.maven.shared.release.config.ReleaseDescriptorBuilder$BuilderReleaseDescriptor@7f8ed55d>

Stack Trace:
junit.framework.AssertionFailedError: compare configuration expected:<org.apache.maven.shared.release.config.ReleaseDescriptorBuilder$BuilderReleaseDescriptor@5996d6d3> but was:<org.apache.maven.shared.release.config.ReleaseDescriptorBuilder$BuilderReleaseDescriptor@7f8ed55d>
        at org.apache.maven.shared.release.config.PropertiesReleaseDescriptorStoreTest.testOverwriteFile(PropertiesReleaseDescriptorStoreTest.java:249)


FAILED:  org.apache.maven.shared.release.config.PropertiesReleaseDescriptorStoreTest.windows-jdk8-m3.6.x_build / Build windows-jdk8-m3.6.x_build / testWriteToNewFileNullMappedScm

Error Message:
compare configuration expected:<org.apache.maven.shared.release.config.ReleaseDescriptorBuilder$BuilderReleaseDescriptor@dfb3f5ac> but was:<org.apache.maven.shared.release.config.ReleaseDescriptorBuilder$BuilderReleaseDescriptor@f3f99072>

Stack Trace:
junit.framework.AssertionFailedError: compare configuration expected:<org.apache.maven.shared.release.config.ReleaseDescriptorBuilder$BuilderReleaseDescriptor@dfb3f5ac> but was:<org.apache.maven.shared.release.config.ReleaseDescriptorBuilder$BuilderReleaseDescriptor@f3f99072>
        at org.apache.maven.shared.release.config.PropertiesReleaseDescriptorStoreTest.testWriteToNewFileNullMappedScm(PropertiesReleaseDescriptorStoreTest.java:231)


FAILED:  org.apache.maven.shared.release.config.PropertiesReleaseDescriptorStoreTest.windows-jdk8-m3.6.x_build / Build windows-jdk8-m3.6.x_build / testWriteToWorkingDirectory

Error Message:
compare configuration expected:<org.apache.maven.shared.release.config.ReleaseDescriptorBuilder$BuilderReleaseDescriptor@7505b47d> but was:<org.apache.maven.shared.release.config.ReleaseDescriptorBuilder$BuilderReleaseDescriptor@b822190e>

Stack Trace:
junit.framework.AssertionFailedError: compare configuration expected:<org.apache.maven.shared.release.config.ReleaseDescriptorBuilder$BuilderReleaseDescriptor@7505b47d> but was:<org.apache.maven.shared.release.config.ReleaseDescriptorBuilder$BuilderReleaseDescriptor@b822190e>
        at org.apache.maven.shared.release.config.PropertiesReleaseDescriptorStoreTest.testWriteToWorkingDirectory(PropertiesReleaseDescriptorStoreTest.java:158)


FAILED:  org.apache.maven.shared.release.config.PropertiesReleaseDescriptorStoreTest.windows-jdk8-m3.6.x_build / Build windows-jdk8-m3.6.x_build / testWriteToNewFileDottedIds

Error Message:
compare configuration expected:<org.apache.maven.shared.release.config.ReleaseDescriptorBuilder$BuilderReleaseDescriptor@eb5c474b> but was:<org.apache.maven.shared.release.config.ReleaseDescriptorBuilder$BuilderReleaseDescriptor@a40fcc3a>

Stack Trace:
junit.framework.AssertionFailedError: compare configuration expected:<org.apache.maven.shared.release.config.ReleaseDescriptorBuilder$BuilderReleaseDescriptor@eb5c474b> but was:<org.apache.maven.shared.release.config.ReleaseDescriptorBuilder$BuilderReleaseDescriptor@a40fcc3a>
        at org.apache.maven.shared.release.config.PropertiesReleaseDescriptorStoreTest.testWriteToNewFileDottedIds(PropertiesReleaseDescriptorStoreTest.java:205)


FAILED:  org.apache.maven.shared.release.config.PropertiesReleaseDescriptorStoreTest.windows-jdk8-m3.6.x_build / Build windows-jdk8-m3.6.x_build / testWriteToNewFileRequiredOnly

Error Message:
compare configuration expected:<org.apache.maven.shared.release.config.ReleaseDescriptorBuilder$BuilderReleaseDescriptor@592de242> but was:<org.apache.maven.shared.release.config.ReleaseDescriptorBuilder$BuilderReleaseDescriptor@6d737d08>

Stack Trace:
junit.framework.AssertionFailedError: compare configuration expected:<org.apache.maven.shared.release.config.ReleaseDescriptorBuilder$BuilderReleaseDescriptor@592de242> but was:<org.apache.maven.shared.release.config.ReleaseDescriptorBuilder$BuilderReleaseDescriptor@6d737d08>
        at org.apache.maven.shared.release.config.PropertiesReleaseDescriptorStoreTest.testWriteToNewFileRequiredOnly(PropertiesReleaseDescriptorStoreTest.java:176)


FAILED:  org.apache.maven.shared.release.config.PropertiesReleaseDescriptorStoreTest.windows-jdk8-m3.6.x_build / Build windows-jdk8-m3.6.x_build / testWriteToNewFile

Error Message:
compare configuration expected:<org.apache.maven.shared.release.config.ReleaseDescriptorBuilder$BuilderReleaseDescriptor@6bc33d9e> but was:<org.apache.maven.shared.release.config.ReleaseDescriptorBuilder$BuilderReleaseDescriptor@fb5cd069>

Stack Trace:
junit.framework.AssertionFailedError: compare configuration expected:<org.apache.maven.shared.release.config.ReleaseDescriptorBuilder$BuilderReleaseDescriptor@6bc33d9e> but was:<org.apache.maven.shared.release.config.ReleaseDescriptorBuilder$BuilderReleaseDescriptor@fb5cd069>
        at org.apache.maven.shared.release.config.PropertiesReleaseDescriptorStoreTest.testWriteToNewFile(PropertiesReleaseDescriptorStoreTest.java:136)


FAILED:  org.apache.maven.shared.release.config.PropertiesReleaseDescriptorStoreTest.linux-jdk8-m3.6.x_build / Build linux-jdk8-m3.6.x_build / testOverwriteFile

Error Message:
compare configuration expected:<org.apache.maven.shared.release.config.ReleaseDescriptorBuilder$BuilderReleaseDescriptor@b3401919> but was:<org.apache.maven.shared.release.config.ReleaseDescriptorBuilder$BuilderReleaseDescriptor@61629a96>

Stack Trace:
junit.framework.AssertionFailedError: compare configuration expected:<org.apache.maven.shared.release.config.ReleaseDescriptorBuilder$BuilderReleaseDescriptor@b3401919> but was:<org.apache.maven.shared.release.config.ReleaseDescriptorBuilder$BuilderReleaseDescriptor@61629a96>
        at org.apache.maven.shared.release.config.PropertiesReleaseDescriptorStoreTest.testOverwriteFile(PropertiesReleaseDescriptorStoreTest.java:249)


FAILED:  org.apache.maven.shared.release.config.PropertiesReleaseDescriptorStoreTest.linux-jdk8-m3.6.x_build / Build linux-jdk8-m3.6.x_build / testWriteToNewFileNullMappedScm

Error Message:
compare configuration expected:<org.apache.maven.shared.release.config.ReleaseDescriptorBuilder$BuilderReleaseDescriptor@dfb3f5ac> but was:<org.apache.maven.shared.release.config.ReleaseDescriptorBuilder$BuilderReleaseDescriptor@f3f99072>

Stack Trace:
junit.framework.AssertionFailedError: compare configuration expected:<org.apache.maven.shared.release.config.ReleaseDescriptorBuilder$BuilderReleaseDescriptor@dfb3f5ac> but was:<org.apache.maven.shared.release.config.ReleaseDescriptorBuilder$BuilderReleaseDescriptor@f3f99072>
        at org.apache.maven.shared.release.config.PropertiesReleaseDescriptorStoreTest.testWriteToNewFileNullMappedScm(PropertiesReleaseDescriptorStoreTest.java:231)


FAILED:  org.apache.maven.shared.release.config.PropertiesReleaseDescriptorStoreTest.linux-jdk8-m3.6.x_build / Build linux-jdk8-m3.6.x_build / testWriteToWorkingDirectory

Error Message:
compare configuration expected:<org.apache.maven.shared.release.config.ReleaseDescriptorBuilder$BuilderReleaseDescriptor@5b23b30> but was:<org.apache.maven.shared.release.config.ReleaseDescriptorBuilder$BuilderReleaseDescriptor@225350f>

Stack Trace:
junit.framework.AssertionFailedError: compare configuration expected:<org.apache.maven.shared.release.config.ReleaseDescriptorBuilder$BuilderReleaseDescriptor@5b23b30> but was:<org.apache.maven.shared.release.config.ReleaseDescriptorBuilder$BuilderReleaseDescriptor@225350f>
        at org.apache.maven.shared.release.config.PropertiesReleaseDescriptorStoreTest.testWriteToWorkingDirectory(PropertiesReleaseDescriptorStoreTest.java:158)


FAILED:  org.apache.maven.shared.release.config.PropertiesReleaseDescriptorStoreTest.linux-jdk8-m3.6.x_build / Build linux-jdk8-m3.6.x_build / testWriteToNewFileDottedIds

Error Message:
compare configuration expected:<org.apache.maven.shared.release.config.ReleaseDescriptorBuilder$BuilderReleaseDescriptor@7737a936> but was:<org.apache.maven.shared.release.config.ReleaseDescriptorBuilder$BuilderReleaseDescriptor@99577556>

Stack Trace:
junit.framework.AssertionFailedError: compare configuration expected:<org.apache.maven.shared.release.config.ReleaseDescriptorBuilder$BuilderReleaseDescriptor@7737a936> but was:<org.apache.maven.shared.release.config.ReleaseDescriptorBuilder$BuilderReleaseDescriptor@99577556>
        at org.apache.maven.shared.release.config.PropertiesReleaseDescriptorStoreTest.testWriteToNewFileDottedIds(PropertiesReleaseDescriptorStoreTest.java:205)


FAILED:  org.apache.maven.shared.release.config.PropertiesReleaseDescriptorStoreTest.linux-jdk8-m3.6.x_build / Build linux-jdk8-m3.6.x_build / testWriteToNewFileRequiredOnly

Error Message:
compare configuration expected:<org.apache.maven.shared.release.config.ReleaseDescriptorBuilder$BuilderReleaseDescriptor@592de242> but was:<org.apache.maven.shared.release.config.ReleaseDescriptorBuilder$BuilderReleaseDescriptor@6d737d08>

Stack Trace:
junit.framework.AssertionFailedError: compare configuration expected:<org.apache.maven.shared.release.config.ReleaseDescriptorBuilder$BuilderReleaseDescriptor@592de242> but was:<org.apache.maven.shared.release.config.ReleaseDescriptorBuilder$BuilderReleaseDescriptor@6d737d08>
        at org.apache.maven.shared.release.config.PropertiesReleaseDescriptorStoreTest.testWriteToNewFileRequiredOnly(PropertiesReleaseDescriptorStoreTest.java:176)


FAILED:  org.apache.maven.shared.release.config.PropertiesReleaseDescriptorStoreTest.linux-jdk8-m3.6.x_build / Build linux-jdk8-m3.6.x_build / testWriteToNewFile

Error Message:
compare configuration expected:<org.apache.maven.shared.release.config.ReleaseDescriptorBuilder$BuilderReleaseDescriptor@ed4f1e86> but was:<org.apache.maven.shared.release.config.ReleaseDescriptorBuilder$BuilderReleaseDescriptor@10eba823>

Stack Trace:
junit.framework.AssertionFailedError: compare configuration expected:<org.apache.maven.shared.release.config.ReleaseDescriptorBuilder$BuilderReleaseDescriptor@ed4f1e86> but was:<org.apache.maven.shared.release.config.ReleaseDescriptorBuilder$BuilderReleaseDescriptor@10eba823>
        at org.apache.maven.shared.release.config.PropertiesReleaseDescriptorStoreTest.testWriteToNewFile(PropertiesReleaseDescriptorStoreTest.java:136)


FAILED:  org.apache.maven.shared.release.config.PropertiesReleaseDescriptorStoreTest.linux-jdk13-m3.6.x_build / Build linux-jdk13-m3.6.x_build / testOverwriteFile

Error Message:
compare configuration expected:<org.apache.maven.shared.release.config.ReleaseDescriptorBuilder$BuilderReleaseDescriptor@d7d2812d> but was:<org.apache.maven.shared.release.config.ReleaseDescriptorBuilder$BuilderReleaseDescriptor@f7769c8f>

Stack Trace:
junit.framework.AssertionFailedError: compare configuration expected:<org.apache.maven.shared.release.config.ReleaseDescriptorBuilder$BuilderReleaseDescriptor@d7d2812d> but was:<org.apache.maven.shared.release.config.ReleaseDescriptorBuilder$BuilderReleaseDescriptor@f7769c8f>
        at org.apache.maven.shared.release.config.PropertiesReleaseDescriptorStoreTest.testOverwriteFile(PropertiesReleaseDescriptorStoreTest.java:249)


FAILED:  org.apache.maven.shared.release.config.PropertiesReleaseDescriptorStoreTest.linux-jdk13-m3.6.x_build / Build linux-jdk13-m3.6.x_build / testWriteToNewFileNullMappedScm

Error Message:
compare configuration expected:<org.apache.maven.shared.release.config.ReleaseDescriptorBuilder$BuilderReleaseDescriptor@dfb3f5ac> but was:<org.apache.maven.shared.release.config.ReleaseDescriptorBuilder$BuilderReleaseDescriptor@f3f99072>

Stack Trace:
junit.framework.AssertionFailedError: compare configuration expected:<org.apache.maven.shared.release.config.ReleaseDescriptorBuilder$BuilderReleaseDescriptor@dfb3f5ac> but was:<org.apache.maven.shared.release.config.ReleaseDescriptorBuilder$BuilderReleaseDescriptor@f3f99072>
        at org.apache.maven.shared.release.config.PropertiesReleaseDescriptorStoreTest.testWriteToNewFileNullMappedScm(PropertiesReleaseDescriptorStoreTest.java:231)


FAILED:  org.apache.maven.shared.release.config.PropertiesReleaseDescriptorStoreTest.linux-jdk13-m3.6.x_build / Build linux-jdk13-m3.6.x_build / testWriteToWorkingDirectory

Error Message:
compare configuration expected:<org.apache.maven.shared.release.config.ReleaseDescriptorBuilder$BuilderReleaseDescriptor@f8f11b0f> but was:<org.apache.maven.shared.release.config.ReleaseDescriptorBuilder$BuilderReleaseDescriptor@dae20bed>

Stack Trace:
junit.framework.AssertionFailedError: compare configuration expected:<org.apache.maven.shared.release.config.ReleaseDescriptorBuilder$BuilderReleaseDescriptor@f8f11b0f> but was:<org.apache.maven.shared.release.config.ReleaseDescriptorBuilder$BuilderReleaseDescriptor@dae20bed>
        at org.apache.maven.shared.release.config.PropertiesReleaseDescriptorStoreTest.testWriteToWorkingDirectory(PropertiesReleaseDescriptorStoreTest.java:158)


FAILED:  org.apache.maven.shared.release.config.PropertiesReleaseDescriptorStoreTest.linux-jdk13-m3.6.x_build / Build linux-jdk13-m3.6.x_build / testWriteToNewFileDottedIds

Error Message:
compare configuration expected:<org.apache.maven.shared.release.config.ReleaseDescriptorBuilder$BuilderReleaseDescriptor@d890180a> but was:<org.apache.maven.shared.release.config.ReleaseDescriptorBuilder$BuilderReleaseDescriptor@a81530a3>

Stack Trace:
junit.framework.AssertionFailedError: compare configuration expected:<org.apache.maven.shared.release.config.ReleaseDescriptorBuilder$BuilderReleaseDescriptor@d890180a> but was:<org.apache.maven.shared.release.config.ReleaseDescriptorBuilder$BuilderReleaseDescriptor@a81530a3>
        at org.apache.maven.shared.release.config.PropertiesReleaseDescriptorStoreTest.testWriteToNewFileDottedIds(PropertiesReleaseDescriptorStoreTest.java:205)


FAILED:  org.apache.maven.shared.release.config.PropertiesReleaseDescriptorStoreTest.linux-jdk13-m3.6.x_build / Build linux-jdk13-m3.6.x_build / testWriteToNewFileRequiredOnly

Error Message:
compare configuration expected:<org.apache.maven.shared.release.config.ReleaseDescriptorBuilder$BuilderReleaseDescriptor@592de242> but was:<org.apache.maven.shared.release.config.ReleaseDescriptorBuilder$BuilderReleaseDescriptor@6d737d08>

Stack Trace:
junit.framework.AssertionFailedError: compare configuration expected:<org.apache.maven.shared.release.config.ReleaseDescriptorBuilder$BuilderReleaseDescriptor@592de242> but was:<org.apache.maven.shared.release.config.ReleaseDescriptorBuilder$BuilderReleaseDescriptor@6d737d08>
        at org.apache.maven.shared.release.config.PropertiesReleaseDescriptorStoreTest.testWriteToNewFileRequiredOnly(PropertiesReleaseDescriptorStoreTest.java:176)


FAILED:  org.apache.maven.shared.release.config.PropertiesReleaseDescriptorStoreTest.linux-jdk13-m3.6.x_build / Build linux-jdk13-m3.6.x_build / testWriteToNewFile

Error Message:
compare configuration expected:<org.apache.maven.shared.release.config.ReleaseDescriptorBuilder$BuilderReleaseDescriptor@f01e0efa> but was:<org.apache.maven.shared.release.config.ReleaseDescriptorBuilder$BuilderReleaseDescriptor@41c335a2>

Stack Trace:
junit.framework.AssertionFailedError: compare configuration expected:<org.apache.maven.shared.release.config.ReleaseDescriptorBuilder$BuilderReleaseDescriptor@f01e0efa> but was:<org.apache.maven.shared.release.config.ReleaseDescriptorBuilder$BuilderReleaseDescriptor@41c335a2>
        at org.apache.maven.shared.release.config.PropertiesReleaseDescriptorStoreTest.testWriteToNewFile(PropertiesReleaseDescriptorStoreTest.java:136)


FAILED:  org.apache.maven.shared.release.config.PropertiesReleaseDescriptorStoreTest.linux-jdk7-m3.3.x_build / Build linux-jdk7-m3.3.x_build / testOverwriteFile

Error Message:
compare configuration expected:<org.apache.maven.shared.release.config.ReleaseDescriptorBuilder$BuilderReleaseDescriptor@618467c4> but was:<org.apache.maven.shared.release.config.ReleaseDescriptorBuilder$BuilderReleaseDescriptor@30756f86>

Stack Trace:
junit.framework.AssertionFailedError: compare configuration expected:<org.apache.maven.shared.release.config.ReleaseDescriptorBuilder$BuilderReleaseDescriptor@618467c4> but was:<org.apache.maven.shared.release.config.ReleaseDescriptorBuilder$BuilderReleaseDescriptor@30756f86>
        at org.apache.maven.shared.release.config.PropertiesReleaseDescriptorStoreTest.testOverwriteFile(PropertiesReleaseDescriptorStoreTest.java:249)


FAILED:  org.apache.maven.shared.release.config.PropertiesReleaseDescriptorStoreTest.linux-jdk7-m3.3.x_build / Build linux-jdk7-m3.3.x_build / testWriteToNewFileNullMappedScm

Error Message:
compare configuration expected:<org.apache.maven.shared.release.config.ReleaseDescriptorBuilder$BuilderReleaseDescriptor@dfb3f5ac> but was:<org.apache.maven.shared.release.config.ReleaseDescriptorBuilder$BuilderReleaseDescriptor@f3f99072>

Stack Trace:
junit.framework.AssertionFailedError: compare configuration expected:<org.apache.maven.shared.release.config.ReleaseDescriptorBuilder$BuilderReleaseDescriptor@dfb3f5ac> but was:<org.apache.maven.shared.release.config.ReleaseDescriptorBuilder$BuilderReleaseDescriptor@f3f99072>
        at org.apache.maven.shared.release.config.PropertiesReleaseDescriptorStoreTest.testWriteToNewFileNullMappedScm(PropertiesReleaseDescriptorStoreTest.java:231)


FAILED:  org.apache.maven.shared.release.config.PropertiesReleaseDescriptorStoreTest.linux-jdk7-m3.3.x_build / Build linux-jdk7-m3.3.x_build / testWriteToWorkingDirectory

Error Message:
compare configuration expected:<org.apache.maven.shared.release.config.ReleaseDescriptorBuilder$BuilderReleaseDescriptor@1a8aba2a> but was:<org.apache.maven.shared.release.config.ReleaseDescriptorBuilder$BuilderReleaseDescriptor@60ca68f7>

Stack Trace:
junit.framework.AssertionFailedError: compare configuration expected:<org.apache.maven.shared.release.config.ReleaseDescriptorBuilder$BuilderReleaseDescriptor@1a8aba2a> but was:<org.apache.maven.shared.release.config.ReleaseDescriptorBuilder$BuilderReleaseDescriptor@60ca68f7>
        at org.apache.maven.shared.release.config.PropertiesReleaseDescriptorStoreTest.testWriteToWorkingDirectory(PropertiesReleaseDescriptorStoreTest.java:158)


FAILED:  org.apache.maven.shared.release.config.PropertiesReleaseDescriptorStoreTest.linux-jdk7-m3.3.x_build / Build linux-jdk7-m3.3.x_build / testWriteToNewFileDottedIds

Error Message:
compare configuration expected:<org.apache.maven.shared.release.config.ReleaseDescriptorBuilder$BuilderReleaseDescriptor@8ea898f7> but was:<org.apache.maven.shared.release.config.ReleaseDescriptorBuilder$BuilderReleaseDescriptor@c6129bf3>

Stack Trace:
junit.framework.AssertionFailedError: compare configuration expected:<org.apache.maven.shared.release.config.ReleaseDescriptorBuilder$BuilderReleaseDescriptor@8ea898f7> but was:<org.apache.maven.shared.release.config.ReleaseDescriptorBuilder$BuilderReleaseDescriptor@c6129bf3>
        at org.apache.maven.shared.release.config.PropertiesReleaseDescriptorStoreTest.testWriteToNewFileDottedIds(PropertiesReleaseDescriptorStoreTest.java:205)


FAILED:  org.apache.maven.shared.release.config.PropertiesReleaseDescriptorStoreTest.linux-jdk7-m3.3.x_build / Build linux-jdk7-m3.3.x_build / testWriteToNewFileRequiredOnly

Error Message:
compare configuration expected:<org.apache.maven.shared.release.config.ReleaseDescriptorBuilder$BuilderReleaseDescriptor@592de242> but was:<org.apache.maven.shared.release.config.ReleaseDescriptorBuilder$BuilderReleaseDescriptor@6d737d08>

Stack Trace:
junit.framework.AssertionFailedError: compare configuration expected:<org.apache.maven.shared.release.config.ReleaseDescriptorBuilder$BuilderReleaseDescriptor@592de242> but was:<org.apache.maven.shared.release.config.ReleaseDescriptorBuilder$BuilderReleaseDescriptor@6d737d08>
        at org.apache.maven.shared.release.config.PropertiesReleaseDescriptorStoreTest.testWriteToNewFileRequiredOnly(PropertiesReleaseDescriptorStoreTest.java:176)


FAILED:  org.apache.maven.shared.release.config.PropertiesReleaseDescriptorStoreTest.linux-jdk7-m3.3.x_build / Build linux-jdk7-m3.3.x_build / testWriteToNewFile

Error Message:
compare configuration expected:<org.apache.maven.shared.release.config.ReleaseDescriptorBuilder$BuilderReleaseDescriptor@5603ce08> but was:<org.apache.maven.shared.release.config.ReleaseDescriptorBuilder$BuilderReleaseDescriptor@a01d7830>

Stack Trace:
junit.framework.AssertionFailedError: compare configuration expected:<org.apache.maven.shared.release.config.ReleaseDescriptorBuilder$BuilderReleaseDescriptor@5603ce08> but was:<org.apache.maven.shared.release.config.ReleaseDescriptorBuilder$BuilderReleaseDescriptor@a01d7830>
        at org.apache.maven.shared.release.config.PropertiesReleaseDescriptorStoreTest.testWriteToNewFile(PropertiesReleaseDescriptorStoreTest.java:136)


FAILED:  org.apache.maven.shared.release.config.PropertiesReleaseDescriptorStoreTest.linux-jdk7-m3.5.x_build / Build linux-jdk7-m3.5.x_build / testOverwriteFile

Error Message:
compare configuration expected:<org.apache.maven.shared.release.config.ReleaseDescriptorBuilder$BuilderReleaseDescriptor@b1835973> but was:<org.apache.maven.shared.release.config.ReleaseDescriptorBuilder$BuilderReleaseDescriptor@3b429e5f>

Stack Trace:
junit.framework.AssertionFailedError: compare configuration expected:<org.apache.maven.shared.release.config.ReleaseDescriptorBuilder$BuilderReleaseDescriptor@b1835973> but was:<org.apache.maven.shared.release.config.ReleaseDescriptorBuilder$BuilderReleaseDescriptor@3b429e5f>
        at org.apache.maven.shared.release.config.PropertiesReleaseDescriptorStoreTest.testOverwriteFile(PropertiesReleaseDescriptorStoreTest.java:249)


FAILED:  org.apache.maven.shared.release.config.PropertiesReleaseDescriptorStoreTest.linux-jdk7-m3.5.x_build / Build linux-jdk7-m3.5.x_build / testWriteToNewFileNullMappedScm

Error Message:
compare configuration expected:<org.apache.maven.shared.release.config.ReleaseDescriptorBuilder$BuilderReleaseDescriptor@dfb3f5ac> but was:<org.apache.maven.shared.release.config.ReleaseDescriptorBuilder$BuilderReleaseDescriptor@f3f99072>

Stack Trace:
junit.framework.AssertionFailedError: compare configuration expected:<org.apache.maven.shared.release.config.ReleaseDescriptorBuilder$BuilderReleaseDescriptor@dfb3f5ac> but was:<org.apache.maven.shared.release.config.ReleaseDescriptorBuilder$BuilderReleaseDescriptor@f3f99072>
        at org.apache.maven.shared.release.config.PropertiesReleaseDescriptorStoreTest.testWriteToNewFileNullMappedScm(PropertiesReleaseDescriptorStoreTest.java:231)


FAILED:  org.apache.maven.shared.release.config.PropertiesReleaseDescriptorStoreTest.linux-jdk7-m3.5.x_build / Build linux-jdk7-m3.5.x_build / testWriteToWorkingDirectory

Error Message:
compare configuration expected:<org.apache.maven.shared.release.config.ReleaseDescriptorBuilder$BuilderReleaseDescriptor@d5c6c89b> but was:<org.apache.maven.shared.release.config.ReleaseDescriptorBuilder$BuilderReleaseDescriptor@d35adf60>

Stack Trace:
junit.framework.AssertionFailedError: compare configuration expected:<org.apache.maven.shared.release.config.ReleaseDescriptorBuilder$BuilderReleaseDescriptor@d5c6c89b> but was:<org.apache.maven.shared.release.config.ReleaseDescriptorBuilder$BuilderReleaseDescriptor@d35adf60>
        at org.apache.maven.shared.release.config.PropertiesReleaseDescriptorStoreTest.testWriteToWorkingDirectory(PropertiesReleaseDescriptorStoreTest.java:158)


FAILED:  org.apache.maven.shared.release.config.PropertiesReleaseDescriptorStoreTest.linux-jdk7-m3.5.x_build / Build linux-jdk7-m3.5.x_build / testWriteToNewFileDottedIds

Error Message:
compare configuration expected:<org.apache.maven.shared.release.config.ReleaseDescriptorBuilder$BuilderReleaseDescriptor@b8a8df9> but was:<org.apache.maven.shared.release.config.ReleaseDescriptorBuilder$BuilderReleaseDescriptor@c3f923f7>

Stack Trace:
junit.framework.AssertionFailedError: compare configuration expected:<org.apache.maven.shared.release.config.ReleaseDescriptorBuilder$BuilderReleaseDescriptor@b8a8df9> but was:<org.apache.maven.shared.release.config.ReleaseDescriptorBuilder$BuilderReleaseDescriptor@c3f923f7>
        at org.apache.maven.shared.release.config.PropertiesReleaseDescriptorStoreTest.testWriteToNewFileDottedIds(PropertiesReleaseDescriptorStoreTest.java:205)


FAILED:  org.apache.maven.shared.release.config.PropertiesReleaseDescriptorStoreTest.linux-jdk7-m3.5.x_build / Build linux-jdk7-m3.5.x_build / testWriteToNewFileRequiredOnly

Error Message:
compare configuration expected:<org.apache.maven.shared.release.config.ReleaseDescriptorBuilder$BuilderReleaseDescriptor@592de242> but was:<org.apache.maven.shared.release.config.ReleaseDescriptorBuilder$BuilderReleaseDescriptor@6d737d08>

Stack Trace:
junit.framework.AssertionFailedError: compare configuration expected:<org.apache.maven.shared.release.config.ReleaseDescriptorBuilder$BuilderReleaseDescriptor@592de242> but was:<org.apache.maven.shared.release.config.ReleaseDescriptorBuilder$BuilderReleaseDescriptor@6d737d08>
        at org.apache.maven.shared.release.config.PropertiesReleaseDescriptorStoreTest.testWriteToNewFileRequiredOnly(PropertiesReleaseDescriptorStoreTest.java:176)


FAILED:  org.apache.maven.shared.release.config.PropertiesReleaseDescriptorStoreTest.linux-jdk7-m3.5.x_build / Build linux-jdk7-m3.5.x_build / testWriteToNewFile

Error Message:
compare configuration expected:<org.apache.maven.shared.release.config.ReleaseDescriptorBuilder$BuilderReleaseDescriptor@6a073070> but was:<org.apache.maven.shared.release.config.ReleaseDescriptorBuilder$BuilderReleaseDescriptor@fc05b40a>

Stack Trace:
junit.framework.AssertionFailedError: compare configuration expected:<org.apache.maven.shared.release.config.ReleaseDescriptorBuilder$BuilderReleaseDescriptor@6a073070> but was:<org.apache.maven.shared.release.config.ReleaseDescriptorBuilder$BuilderReleaseDescriptor@fc05b40a>
        at org.apache.maven.shared.release.config.PropertiesReleaseDescriptorStoreTest.testWriteToNewFile(PropertiesReleaseDescriptorStoreTest.java:136)


FAILED:  org.apache.maven.shared.release.config.PropertiesReleaseDescriptorStoreTest.linux-jdk7-m3.6.x_build / Build linux-jdk7-m3.6.x_build / testOverwriteFile

Error Message:
compare configuration expected:<org.apache.maven.shared.release.config.ReleaseDescriptorBuilder$BuilderReleaseDescriptor@5b115c4b> but was:<org.apache.maven.shared.release.config.ReleaseDescriptorBuilder$BuilderReleaseDescriptor@9285128a>

Stack Trace:
junit.framework.AssertionFailedError: compare configuration expected:<org.apache.maven.shared.release.config.ReleaseDescriptorBuilder$BuilderReleaseDescriptor@5b115c4b> but was:<org.apache.maven.shared.release.config.ReleaseDescriptorBuilder$BuilderReleaseDescriptor@9285128a>
        at org.apache.maven.shared.release.config.PropertiesReleaseDescriptorStoreTest.testOverwriteFile(PropertiesReleaseDescriptorStoreTest.java:249)


FAILED:  org.apache.maven.shared.release.config.PropertiesReleaseDescriptorStoreTest.linux-jdk7-m3.6.x_build / Build linux-jdk7-m3.6.x_build / testWriteToNewFileNullMappedScm

Error Message:
compare configuration expected:<org.apache.maven.shared.release.config.ReleaseDescriptorBuilder$BuilderReleaseDescriptor@dfb3f5ac> but was:<org.apache.maven.shared.release.config.ReleaseDescriptorBuilder$BuilderReleaseDescriptor@f3f99072>

Stack Trace:
junit.framework.AssertionFailedError: compare configuration expected:<org.apache.maven.shared.release.config.ReleaseDescriptorBuilder$BuilderReleaseDescriptor@dfb3f5ac> but was:<org.apache.maven.shared.release.config.ReleaseDescriptorBuilder$BuilderReleaseDescriptor@f3f99072>
        at org.apache.maven.shared.release.config.PropertiesReleaseDescriptorStoreTest.testWriteToNewFileNullMappedScm(PropertiesReleaseDescriptorStoreTest.java:231)


FAILED:  org.apache.maven.shared.release.config.PropertiesReleaseDescriptorStoreTest.linux-jdk7-m3.6.x_build / Build linux-jdk7-m3.6.x_build / testWriteToWorkingDirectory

Error Message:
compare configuration expected:<org.apache.maven.shared.release.config.ReleaseDescriptorBuilder$BuilderReleaseDescriptor@fadbb498> but was:<org.apache.maven.shared.release.config.ReleaseDescriptorBuilder$BuilderReleaseDescriptor@c9363b56>

Stack Trace:
junit.framework.AssertionFailedError: compare configuration expected:<org.apache.maven.shared.release.config.ReleaseDescriptorBuilder$BuilderReleaseDescriptor@fadbb498> but was:<org.apache.maven.shared.release.config.ReleaseDescriptorBuilder$BuilderReleaseDescriptor@c9363b56>
        at org.apache.maven.shared.release.config.PropertiesReleaseDescriptorStoreTest.testWriteToWorkingDirectory(PropertiesReleaseDescriptorStoreTest.java:158)


FAILED:  org.apache.maven.shared.release.config.PropertiesReleaseDescriptorStoreTest.linux-jdk7-m3.6.x_build / Build linux-jdk7-m3.6.x_build / testWriteToNewFileDottedIds

Error Message:
compare configuration expected:<org.apache.maven.shared.release.config.ReleaseDescriptorBuilder$BuilderReleaseDescriptor@9590255> but was:<org.apache.maven.shared.release.config.ReleaseDescriptorBuilder$BuilderReleaseDescriptor@3d92b920>

Stack Trace:
junit.framework.AssertionFailedError: compare configuration expected:<org.apache.maven.shared.release.config.ReleaseDescriptorBuilder$BuilderReleaseDescriptor@9590255> but was:<org.apache.maven.shared.release.config.ReleaseDescriptorBuilder$BuilderReleaseDescriptor@3d92b920>
        at org.apache.maven.shared.release.config.PropertiesReleaseDescriptorStoreTest.testWriteToNewFileDottedIds(PropertiesReleaseDescriptorStoreTest.java:205)


FAILED:  org.apache.maven.shared.release.config.PropertiesReleaseDescriptorStoreTest.linux-jdk7-m3.6.x_build / Build linux-jdk7-m3.6.x_build / testWriteToNewFileRequiredOnly

Error Message:
compare configuration expected:<org.apache.maven.shared.release.config.ReleaseDescriptorBuilder$BuilderReleaseDescriptor@592de242> but was:<org.apache.maven.shared.release.config.ReleaseDescriptorBuilder$BuilderReleaseDescriptor@6d737d08>

Stack Trace:
junit.framework.AssertionFailedError: compare configuration expected:<org.apache.maven.shared.release.config.ReleaseDescriptorBuilder$BuilderReleaseDescriptor@592de242> but was:<org.apache.maven.shared.release.config.ReleaseDescriptorBuilder$BuilderReleaseDescriptor@6d737d08>
        at org.apache.maven.shared.release.config.PropertiesReleaseDescriptorStoreTest.testWriteToNewFileRequiredOnly(PropertiesReleaseDescriptorStoreTest.java:176)


FAILED:  org.apache.maven.shared.release.config.PropertiesReleaseDescriptorStoreTest.linux-jdk7-m3.6.x_build / Build linux-jdk7-m3.6.x_build / testWriteToNewFile

Error Message:
compare configuration expected:<org.apache.maven.shared.release.config.ReleaseDescriptorBuilder$BuilderReleaseDescriptor@87c2f9d> but was:<org.apache.maven.shared.release.config.ReleaseDescriptorBuilder$BuilderReleaseDescriptor@69a9548a>

Stack Trace:
junit.framework.AssertionFailedError: compare configuration expected:<org.apache.maven.shared.release.config.ReleaseDescriptorBuilder$BuilderReleaseDescriptor@87c2f9d> but was:<org.apache.maven.shared.release.config.ReleaseDescriptorBuilder$BuilderReleaseDescriptor@69a9548a>
        at org.apache.maven.shared.release.config.PropertiesReleaseDescriptorStoreTest.testWriteToNewFile(PropertiesReleaseDescriptorStoreTest.java:136)


FAILED:  org.apache.maven.shared.release.config.PropertiesReleaseDescriptorStoreTest.linux-jdk14-m3.6.x_build / Build linux-jdk14-m3.6.x_build / testOverwriteFile

Error Message:
compare configuration expected:<org.apache.maven.shared.release.config.ReleaseDescriptorBuilder$BuilderReleaseDescriptor@6265e68d> but was:<org.apache.maven.shared.release.config.ReleaseDescriptorBuilder$BuilderReleaseDescriptor@86b1d4e6>

Stack Trace:
junit.framework.AssertionFailedError: compare configuration expected:<org.apache.maven.shared.release.config.ReleaseDescriptorBuilder$BuilderReleaseDescriptor@6265e68d> but was:<org.apache.maven.shared.release.config.ReleaseDescriptorBuilder$BuilderReleaseDescriptor@86b1d4e6>
        at org.apache.maven.shared.release.config.PropertiesReleaseDescriptorStoreTest.testOverwriteFile(PropertiesReleaseDescriptorStoreTest.java:249)


FAILED:  org.apache.maven.shared.release.config.PropertiesReleaseDescriptorStoreTest.linux-jdk14-m3.6.x_build / Build linux-jdk14-m3.6.x_build / testWriteToNewFileNullMappedScm

Error Message:
compare configuration expected:<org.apache.maven.shared.release.config.ReleaseDescriptorBuilder$BuilderReleaseDescriptor@dfb3f5ac> but was:<org.apache.maven.shared.release.config.ReleaseDescriptorBuilder$BuilderReleaseDescriptor@f3f99072>

Stack Trace:
junit.framework.AssertionFailedError: compare configuration expected:<org.apache.maven.shared.release.config.ReleaseDescriptorBuilder$BuilderReleaseDescriptor@dfb3f5ac> but was:<org.apache.maven.shared.release.config.ReleaseDescriptorBuilder$BuilderReleaseDescriptor@f3f99072>
        at org.apache.maven.shared.release.config.PropertiesReleaseDescriptorStoreTest.testWriteToNewFileNullMappedScm(PropertiesReleaseDescriptorStoreTest.java:231)


FAILED:  org.apache.maven.shared.release.config.PropertiesReleaseDescriptorStoreTest.linux-jdk14-m3.6.x_build / Build linux-jdk14-m3.6.x_build / testWriteToWorkingDirectory

Error Message:
compare configuration expected:<org.apache.maven.shared.release.config.ReleaseDescriptorBuilder$BuilderReleaseDescriptor@33113cc4> but was:<org.apache.maven.shared.release.config.ReleaseDescriptorBuilder$BuilderReleaseDescriptor@b166b246>

Stack Trace:
junit.framework.AssertionFailedError: compare configuration expected:<org.apache.maven.shared.release.config.ReleaseDescriptorBuilder$BuilderReleaseDescriptor@33113cc4> but was:<org.apache.maven.shared.release.config.ReleaseDescriptorBuilder$BuilderReleaseDescriptor@b166b246>
        at org.apache.maven.shared.release.config.PropertiesReleaseDescriptorStoreTest.testWriteToWorkingDirectory(PropertiesReleaseDescriptorStoreTest.java:158)


FAILED:  org.apache.maven.shared.release.config.PropertiesReleaseDescriptorStoreTest.linux-jdk14-m3.6.x_build / Build linux-jdk14-m3.6.x_build / testWriteToNewFileDottedIds

Error Message:
compare configuration expected:<org.apache.maven.shared.release.config.ReleaseDescriptorBuilder$BuilderReleaseDescriptor@b4734de9> but was:<org.apache.maven.shared.release.config.ReleaseDescriptorBuilder$BuilderReleaseDescriptor@1aa9f768>

Stack Trace:
junit.framework.AssertionFailedError: compare configuration expected:<org.apache.maven.shared.release.config.ReleaseDescriptorBuilder$BuilderReleaseDescriptor@b4734de9> but was:<org.apache.maven.shared.release.config.ReleaseDescriptorBuilder$BuilderReleaseDescriptor@1aa9f768>
        at org.apache.maven.shared.release.config.PropertiesReleaseDescriptorStoreTest.testWriteToNewFileDottedIds(PropertiesReleaseDescriptorStoreTest.java:205)


FAILED:  org.apache.maven.shared.release.config.PropertiesReleaseDescriptorStoreTest.linux-jdk14-m3.6.x_build / Build linux-jdk14-m3.6.x_build / testWriteToNewFileRequiredOnly

Error Message:
compare configuration expected:<org.apache.maven.shared.release.config.ReleaseDescriptorBuilder$BuilderReleaseDescriptor@592de242> but was:<org.apache.maven.shared.release.config.ReleaseDescriptorBuilder$BuilderReleaseDescriptor@6d737d08>

Stack Trace:
junit.framework.AssertionFailedError: compare configuration expected:<org.apache.maven.shared.release.config.ReleaseDescriptorBuilder$BuilderReleaseDescriptor@592de242> but was:<org.apache.maven.shared.release.config.ReleaseDescriptorBuilder$BuilderReleaseDescriptor@6d737d08>
        at org.apache.maven.shared.release.config.PropertiesReleaseDescriptorStoreTest.testWriteToNewFileRequiredOnly(PropertiesReleaseDescriptorStoreTest.java:176)


FAILED:  org.apache.maven.shared.release.config.PropertiesReleaseDescriptorStoreTest.linux-jdk14-m3.6.x_build / Build linux-jdk14-m3.6.x_build / testWriteToNewFile

Error Message:
compare configuration expected:<org.apache.maven.shared.release.config.ReleaseDescriptorBuilder$BuilderReleaseDescriptor@323b1f3a> but was:<org.apache.maven.shared.release.config.ReleaseDescriptorBuilder$BuilderReleaseDescriptor@ab22c0c5>

Stack Trace:
junit.framework.AssertionFailedError: compare configuration expected:<org.apache.maven.shared.release.config.ReleaseDescriptorBuilder$BuilderReleaseDescriptor@323b1f3a> but was:<org.apache.maven.shared.release.config.ReleaseDescriptorBuilder$BuilderReleaseDescriptor@ab22c0c5>
        at org.apache.maven.shared.release.config.PropertiesReleaseDescriptorStoreTest.testWriteToNewFile(PropertiesReleaseDescriptorStoreTest.java:136)


FAILED:  org.apache.maven.shared.release.config.PropertiesReleaseDescriptorStoreTest.windows-jdk11-m3.6.x_build / Build windows-jdk11-m3.6.x_build / testOverwriteFile

Error Message:
compare configuration expected:<org.apache.maven.shared.release.config.ReleaseDescriptorBuilder$BuilderReleaseDescriptor@9ded3709> but was:<org.apache.maven.shared.release.config.ReleaseDescriptorBuilder$BuilderReleaseDescriptor@addbfa6e>

Stack Trace:
junit.framework.AssertionFailedError: compare configuration expected:<org.apache.maven.shared.release.config.ReleaseDescriptorBuilder$BuilderReleaseDescriptor@9ded3709> but was:<org.apache.maven.shared.release.config.ReleaseDescriptorBuilder$BuilderReleaseDescriptor@addbfa6e>
        at org.apache.maven.shared.release.config.PropertiesReleaseDescriptorStoreTest.testOverwriteFile(PropertiesReleaseDescriptorStoreTest.java:249)


FAILED:  org.apache.maven.shared.release.config.PropertiesReleaseDescriptorStoreTest.windows-jdk11-m3.6.x_build / Build windows-jdk11-m3.6.x_build / testWriteToNewFileNullMappedScm

Error Message:
compare configuration expected:<org.apache.maven.shared.release.config.ReleaseDescriptorBuilder$BuilderReleaseDescriptor@dfb3f5ac> but was:<org.apache.maven.shared.release.config.ReleaseDescriptorBuilder$BuilderReleaseDescriptor@f3f99072>

Stack Trace:
junit.framework.AssertionFailedError: compare configuration expected:<org.apache.maven.shared.release.config.ReleaseDescriptorBuilder$BuilderReleaseDescriptor@dfb3f5ac> but was:<org.apache.maven.shared.release.config.ReleaseDescriptorBuilder$BuilderReleaseDescriptor@f3f99072>
        at org.apache.maven.shared.release.config.PropertiesReleaseDescriptorStoreTest.testWriteToNewFileNullMappedScm(PropertiesReleaseDescriptorStoreTest.java:231)


FAILED:  org.apache.maven.shared.release.config.PropertiesReleaseDescriptorStoreTest.windows-jdk11-m3.6.x_build / Build windows-jdk11-m3.6.x_build / testWriteToWorkingDirectory

Error Message:
compare configuration expected:<org.apache.maven.shared.release.config.ReleaseDescriptorBuilder$BuilderReleaseDescriptor@61e9f27d> but was:<org.apache.maven.shared.release.config.ReleaseDescriptorBuilder$BuilderReleaseDescriptor@8aff4d06>

Stack Trace:
junit.framework.AssertionFailedError: compare configuration expected:<org.apache.maven.shared.release.config.ReleaseDescriptorBuilder$BuilderReleaseDescriptor@61e9f27d> but was:<org.apache.maven.shared.release.config.ReleaseDescriptorBuilder$BuilderReleaseDescriptor@8aff4d06>
        at org.apache.maven.shared.release.config.PropertiesReleaseDescriptorStoreTest.testWriteToWorkingDirectory(PropertiesReleaseDescriptorStoreTest.java:158)


FAILED:  org.apache.maven.shared.release.config.PropertiesReleaseDescriptorStoreTest.windows-jdk11-m3.6.x_build / Build windows-jdk11-m3.6.x_build / testWriteToNewFileDottedIds

Error Message:
compare configuration expected:<org.apache.maven.shared.release.config.ReleaseDescriptorBuilder$BuilderReleaseDescriptor@d3de934e> but was:<org.apache.maven.shared.release.config.ReleaseDescriptorBuilder$BuilderReleaseDescriptor@ef69ba27>

Stack Trace:
junit.framework.AssertionFailedError: compare configuration expected:<org.apache.maven.shared.release.config.ReleaseDescriptorBuilder$BuilderReleaseDescriptor@d3de934e> but was:<org.apache.maven.shared.release.config.ReleaseDescriptorBuilder$BuilderReleaseDescriptor@ef69ba27>
        at org.apache.maven.shared.release.config.PropertiesReleaseDescriptorStoreTest.testWriteToNewFileDottedIds(PropertiesReleaseDescriptorStoreTest.java:205)


FAILED:  org.apache.maven.shared.release.config.PropertiesReleaseDescriptorStoreTest.windows-jdk11-m3.6.x_build / Build windows-jdk11-m3.6.x_build / testWriteToNewFileRequiredOnly

Error Message:
compare configuration expected:<org.apache.maven.shared.release.config.ReleaseDescriptorBuilder$BuilderReleaseDescriptor@592de242> but was:<org.apache.maven.shared.release.config.ReleaseDescriptorBuilder$BuilderReleaseDescriptor@6d737d08>

Stack Trace:
junit.framework.AssertionFailedError: compare configuration expected:<org.apache.maven.shared.release.config.ReleaseDescriptorBuilder$BuilderReleaseDescriptor@592de242> but was:<org.apache.maven.shared.release.config.ReleaseDescriptorBuilder$BuilderReleaseDescriptor@6d737d08>
        at org.apache.maven.shared.release.config.PropertiesReleaseDescriptorStoreTest.testWriteToNewFileRequiredOnly(PropertiesReleaseDescriptorStoreTest.java:176)


FAILED:  org.apache.maven.shared.release.config.PropertiesReleaseDescriptorStoreTest.windows-jdk11-m3.6.x_build / Build windows-jdk11-m3.6.x_build / testWriteToNewFile

Error Message:
compare configuration expected:<org.apache.maven.shared.release.config.ReleaseDescriptorBuilder$BuilderReleaseDescriptor@4ea533cc> but was:<org.apache.maven.shared.release.config.ReleaseDescriptorBuilder$BuilderReleaseDescriptor@a54b4aba>

Stack Trace:
junit.framework.AssertionFailedError: compare configuration expected:<org.apache.maven.shared.release.config.ReleaseDescriptorBuilder$BuilderReleaseDescriptor@4ea533cc> but was:<org.apache.maven.shared.release.config.ReleaseDescriptorBuilder$BuilderReleaseDescriptor@a54b4aba>
        at org.apache.maven.shared.release.config.PropertiesReleaseDescriptorStoreTest.testWriteToNewFile(PropertiesReleaseDescriptorStoreTest.java:136)


FAILED:  org.apache.maven.shared.release.config.PropertiesReleaseDescriptorStoreTest.windows-jdk13-m3.6.x_build / Build windows-jdk13-m3.6.x_build / testOverwriteFile

Error Message:
compare configuration expected:<org.apache.maven.shared.release.config.ReleaseDescriptorBuilder$BuilderReleaseDescriptor@4a4cea5f> but was:<org.apache.maven.shared.release.config.ReleaseDescriptorBuilder$BuilderReleaseDescriptor@485047ae>

Stack Trace:
junit.framework.AssertionFailedError: compare configuration expected:<org.apache.maven.shared.release.config.ReleaseDescriptorBuilder$BuilderReleaseDescriptor@4a4cea5f> but was:<org.apache.maven.shared.release.config.ReleaseDescriptorBuilder$BuilderReleaseDescriptor@485047ae>
        at org.apache.maven.shared.release.config.PropertiesReleaseDescriptorStoreTest.testOverwriteFile(PropertiesReleaseDescriptorStoreTest.java:249)


FAILED:  org.apache.maven.shared.release.config.PropertiesReleaseDescriptorStoreTest.windows-jdk13-m3.6.x_build / Build windows-jdk13-m3.6.x_build / testWriteToNewFileNullMappedScm

Error Message:
compare configuration expected:<org.apache.maven.shared.release.config.ReleaseDescriptorBuilder$BuilderReleaseDescriptor@dfb3f5ac> but was:<org.apache.maven.shared.release.config.ReleaseDescriptorBuilder$BuilderReleaseDescriptor@f3f99072>

Stack Trace:
junit.framework.AssertionFailedError: compare configuration expected:<org.apache.maven.shared.release.config.ReleaseDescriptorBuilder$BuilderReleaseDescriptor@dfb3f5ac> but was:<org.apache.maven.shared.release.config.ReleaseDescriptorBuilder$BuilderReleaseDescriptor@f3f99072>
        at org.apache.maven.shared.release.config.PropertiesReleaseDescriptorStoreTest.testWriteToNewFileNullMappedScm(PropertiesReleaseDescriptorStoreTest.java:231)


FAILED:  org.apache.maven.shared.release.config.PropertiesReleaseDescriptorStoreTest.windows-jdk13-m3.6.x_build / Build windows-jdk13-m3.6.x_build / testWriteToWorkingDirectory

Error Message:
compare configuration expected:<org.apache.maven.shared.release.config.ReleaseDescriptorBuilder$BuilderReleaseDescriptor@dcada65f> but was:<org.apache.maven.shared.release.config.ReleaseDescriptorBuilder$BuilderReleaseDescriptor@db7311e2>

Stack Trace:
junit.framework.AssertionFailedError: compare configuration expected:<org.apache.maven.shared.release.config.ReleaseDescriptorBuilder$BuilderReleaseDescriptor@dcada65f> but was:<org.apache.maven.shared.release.config.ReleaseDescriptorBuilder$BuilderReleaseDescriptor@db7311e2>
        at org.apache.maven.shared.release.config.PropertiesReleaseDescriptorStoreTest.testWriteToWorkingDirectory(PropertiesReleaseDescriptorStoreTest.java:158)


FAILED:  org.apache.maven.shared.release.config.PropertiesReleaseDescriptorStoreTest.windows-jdk13-m3.6.x_build / Build windows-jdk13-m3.6.x_build / testWriteToNewFileDottedIds

Error Message:
compare configuration expected:<org.apache.maven.shared.release.config.ReleaseDescriptorBuilder$BuilderReleaseDescriptor@3d55010d> but was:<org.apache.maven.shared.release.config.ReleaseDescriptorBuilder$BuilderReleaseDescriptor@d1bca9fa>

Stack Trace:
junit.framework.AssertionFailedError: compare configuration expected:<org.apache.maven.shared.release.config.ReleaseDescriptorBuilder$BuilderReleaseDescriptor@3d55010d> but was:<org.apache.maven.shared.release.config.ReleaseDescriptorBuilder$BuilderReleaseDescriptor@d1bca9fa>
        at org.apache.maven.shared.release.config.PropertiesReleaseDescriptorStoreTest.testWriteToNewFileDottedIds(PropertiesReleaseDescriptorStoreTest.java:205)


FAILED:  org.apache.maven.shared.release.config.PropertiesReleaseDescriptorStoreTest.windows-jdk13-m3.6.x_build / Build windows-jdk13-m3.6.x_build / testWriteToNewFileRequiredOnly

Error Message:
compare configuration expected:<org.apache.maven.shared.release.config.ReleaseDescriptorBuilder$BuilderReleaseDescriptor@592de242> but was:<org.apache.maven.shared.release.config.ReleaseDescriptorBuilder$BuilderReleaseDescriptor@6d737d08>

Stack Trace:
junit.framework.AssertionFailedError: compare configuration expected:<org.apache.maven.shared.release.config.ReleaseDescriptorBuilder$BuilderReleaseDescriptor@592de242> but was:<org.apache.maven.shared.release.config.ReleaseDescriptorBuilder$BuilderReleaseDescriptor@6d737d08>
        at org.apache.maven.shared.release.config.PropertiesReleaseDescriptorStoreTest.testWriteToNewFileRequiredOnly(PropertiesReleaseDescriptorStoreTest.java:176)


FAILED:  org.apache.maven.shared.release.config.PropertiesReleaseDescriptorStoreTest.windows-jdk13-m3.6.x_build / Build windows-jdk13-m3.6.x_build / testWriteToNewFile

Error Message:
compare configuration expected:<org.apache.maven.shared.release.config.ReleaseDescriptorBuilder$BuilderReleaseDescriptor@6793c4f3> but was:<org.apache.maven.shared.release.config.ReleaseDescriptorBuilder$BuilderReleaseDescriptor@1589db9f>

Stack Trace:
junit.framework.AssertionFailedError: compare configuration expected:<org.apache.maven.shared.release.config.ReleaseDescriptorBuilder$BuilderReleaseDescriptor@6793c4f3> but was:<org.apache.maven.shared.release.config.ReleaseDescriptorBuilder$BuilderReleaseDescriptor@1589db9f>
        at org.apache.maven.shared.release.config.PropertiesReleaseDescriptorStoreTest.testWriteToNewFile(PropertiesReleaseDescriptorStoreTest.java:136)


FAILED:  org.apache.maven.shared.release.config.PropertiesReleaseDescriptorStoreTest.windows-jdk14-m3.6.x_build / Build windows-jdk14-m3.6.x_build / testOverwriteFile

Error Message:
compare configuration expected:<org.apache.maven.shared.release.config.ReleaseDescriptorBuilder$BuilderReleaseDescriptor@fa42b557> but was:<org.apache.maven.shared.release.config.ReleaseDescriptorBuilder$BuilderReleaseDescriptor@ec4a3b42>

Stack Trace:
junit.framework.AssertionFailedError: compare configuration expected:<org.apache.maven.shared.release.config.ReleaseDescriptorBuilder$BuilderReleaseDescriptor@fa42b557> but was:<org.apache.maven.shared.release.config.ReleaseDescriptorBuilder$BuilderReleaseDescriptor@ec4a3b42>
        at org.apache.maven.shared.release.config.PropertiesReleaseDescriptorStoreTest.testOverwriteFile(PropertiesReleaseDescriptorStoreTest.java:249)


FAILED:  org.apache.maven.shared.release.config.PropertiesReleaseDescriptorStoreTest.windows-jdk14-m3.6.x_build / Build windows-jdk14-m3.6.x_build / testWriteToNewFileNullMappedScm

Error Message:
compare configuration expected:<org.apache.maven.shared.release.config.ReleaseDescriptorBuilder$BuilderReleaseDescriptor@dfb3f5ac> but was:<org.apache.maven.shared.release.config.ReleaseDescriptorBuilder$BuilderReleaseDescriptor@f3f99072>

Stack Trace:
junit.framework.AssertionFailedError: compare configuration expected:<org.apache.maven.shared.release.config.ReleaseDescriptorBuilder$BuilderReleaseDescriptor@dfb3f5ac> but was:<org.apache.maven.shared.release.config.ReleaseDescriptorBuilder$BuilderReleaseDescriptor@f3f99072>
        at org.apache.maven.shared.release.config.PropertiesReleaseDescriptorStoreTest.testWriteToNewFileNullMappedScm(PropertiesReleaseDescriptorStoreTest.java:231)


FAILED:  org.apache.maven.shared.release.config.PropertiesReleaseDescriptorStoreTest.windows-jdk14-m3.6.x_build / Build windows-jdk14-m3.6.x_build / testWriteToWorkingDirectory

Error Message:
compare configuration expected:<org.apache.maven.shared.release.config.ReleaseDescriptorBuilder$BuilderReleaseDescriptor@efd23c15> but was:<org.apache.maven.shared.release.config.ReleaseDescriptorBuilder$BuilderReleaseDescriptor@16e03a75>

Stack Trace:
junit.framework.AssertionFailedError: compare configuration expected:<org.apache.maven.shared.release.config.ReleaseDescriptorBuilder$BuilderReleaseDescriptor@efd23c15> but was:<org.apache.maven.shared.release.config.ReleaseDescriptorBuilder$BuilderReleaseDescriptor@16e03a75>
        at org.apache.maven.shared.release.config.PropertiesReleaseDescriptorStoreTest.testWriteToWorkingDirectory(PropertiesReleaseDescriptorStoreTest.java:158)


FAILED:  org.apache.maven.shared.release.config.PropertiesReleaseDescriptorStoreTest.windows-jdk14-m3.6.x_build / Build windows-jdk14-m3.6.x_build / testWriteToNewFileDottedIds

Error Message:
compare configuration expected:<org.apache.maven.shared.release.config.ReleaseDescriptorBuilder$BuilderReleaseDescriptor@ef760abe> but was:<org.apache.maven.shared.release.config.ReleaseDescriptorBuilder$BuilderReleaseDescriptor@3809e678>

Stack Trace:
junit.framework.AssertionFailedError: compare configuration expected:<org.apache.maven.shared.release.config.ReleaseDescriptorBuilder$BuilderReleaseDescriptor@ef760abe> but was:<org.apache.maven.shared.release.config.ReleaseDescriptorBuilder$BuilderReleaseDescriptor@3809e678>
        at org.apache.maven.shared.release.config.PropertiesReleaseDescriptorStoreTest.testWriteToNewFileDottedIds(PropertiesReleaseDescriptorStoreTest.java:205)


FAILED:  org.apache.maven.shared.release.config.PropertiesReleaseDescriptorStoreTest.windows-jdk14-m3.6.x_build / Build windows-jdk14-m3.6.x_build / testWriteToNewFileRequiredOnly

Error Message:
compare configuration expected:<org.apache.maven.shared.release.config.ReleaseDescriptorBuilder$BuilderReleaseDescriptor@592de242> but was:<org.apache.maven.shared.release.config.ReleaseDescriptorBuilder$BuilderReleaseDescriptor@6d737d08>

Stack Trace:
junit.framework.AssertionFailedError: compare configuration expected:<org.apache.maven.shared.release.config.ReleaseDescriptorBuilder$BuilderReleaseDescriptor@592de242> but was:<org.apache.maven.shared.release.config.ReleaseDescriptorBuilder$BuilderReleaseDescriptor@6d737d08>
        at org.apache.maven.shared.release.config.PropertiesReleaseDescriptorStoreTest.testWriteToNewFileRequiredOnly(PropertiesReleaseDescriptorStoreTest.java:176)


FAILED:  org.apache.maven.shared.release.config.PropertiesReleaseDescriptorStoreTest.windows-jdk14-m3.6.x_build / Build windows-jdk14-m3.6.x_build / testWriteToNewFile

Error Message:
compare configuration expected:<org.apache.maven.shared.release.config.ReleaseDescriptorBuilder$BuilderReleaseDescriptor@d118b52d> but was:<org.apache.maven.shared.release.config.ReleaseDescriptorBuilder$BuilderReleaseDescriptor@18d7b7fb>

Stack Trace:
junit.framework.AssertionFailedError: compare configuration expected:<org.apache.maven.shared.release.config.ReleaseDescriptorBuilder$BuilderReleaseDescriptor@d118b52d> but was:<org.apache.maven.shared.release.config.ReleaseDescriptorBuilder$BuilderReleaseDescriptor@18d7b7fb>
        at org.apache.maven.shared.release.config.PropertiesReleaseDescriptorStoreTest.testWriteToNewFile(PropertiesReleaseDescriptorStoreTest.java:136)


FAILED:  org.apache.maven.shared.release.phase.ScmCommitDevelopmentPhaseTest.linux-jdk7-m3.2.x_build / Build linux-jdk7-m3.2.x_build / testCommitsNextVersionsAlternateMessage

Error Message:
null

Stack Trace:
java.lang.NullPointerException
        at org.apache.maven.shared.release.phase.ScmCommitDevelopmentPhaseTest.testCommitsNextVersionsAlternateMessage(ScmCommitDevelopmentPhaseTest.java:132)


FAILED:  org.apache.maven.shared.release.phase.ScmCommitDevelopmentPhaseTest.windows-jdk7-m3.2.x_build / Build windows-jdk7-m3.2.x_build / testCommitsNextVersionsAlternateMessage

Error Message:
null

Stack Trace:
java.lang.NullPointerException
        at org.apache.maven.shared.release.phase.ScmCommitDevelopmentPhaseTest.testCommitsNextVersionsAlternateMessage(ScmCommitDevelopmentPhaseTest.java:132)


FAILED:  org.apache.maven.shared.release.phase.ScmCommitDevelopmentPhaseTest.windows-jdk7-m3.5.x_build / Build windows-jdk7-m3.5.x_build / testCommitsNextVersionsAlternateMessage

Error Message:
null

Stack Trace:
java.lang.NullPointerException
        at org.apache.maven.shared.release.phase.ScmCommitDevelopmentPhaseTest.testCommitsNextVersionsAlternateMessage(ScmCommitDevelopmentPhaseTest.java:132)


FAILED:  org.apache.maven.shared.release.phase.ScmCommitDevelopmentPhaseTest.windows-jdk7-m3.3.x_build / Build windows-jdk7-m3.3.x_build / testCommitsNextVersionsAlternateMessage

Error Message:
null

Stack Trace:
java.lang.NullPointerException
        at org.apache.maven.shared.release.phase.ScmCommitDevelopmentPhaseTest.testCommitsNextVersionsAlternateMessage(ScmCommitDevelopmentPhaseTest.java:132)


FAILED:  org.apache.maven.shared.release.phase.ScmCommitDevelopmentPhaseTest.linux-jdk11-m3.6.x_build / Build linux-jdk11-m3.6.x_build / testCommitsNextVersionsAlternateMessage

Error Message:
null

Stack Trace:
java.lang.NullPointerException
        at org.apache.maven.shared.release.phase.ScmCommitDevelopmentPhaseTest.testCommitsNextVersionsAlternateMessage(ScmCommitDevelopmentPhaseTest.java:132)


FAILED:  org.apache.maven.shared.release.phase.ScmCommitDevelopmentPhaseTest.windows-jdk7-m3.6.x_build / Build windows-jdk7-m3.6.x_build / testCommitsNextVersionsAlternateMessage

Error Message:
null

Stack Trace:
java.lang.NullPointerException
        at org.apache.maven.shared.release.phase.ScmCommitDevelopmentPhaseTest.testCommitsNextVersionsAlternateMessage(ScmCommitDevelopmentPhaseTest.java:132)


FAILED:  org.apache.maven.shared.release.phase.ScmCommitDevelopmentPhaseTest.windows-jdk8-m3.6.x_build / Build windows-jdk8-m3.6.x_build / testCommitsNextVersionsAlternateMessage

Error Message:
null

Stack Trace:
java.lang.NullPointerException
        at org.apache.maven.shared.release.phase.ScmCommitDevelopmentPhaseTest.testCommitsNextVersionsAlternateMessage(ScmCommitDevelopmentPhaseTest.java:132)


FAILED:  org.apache.maven.shared.release.phase.ScmCommitDevelopmentPhaseTest.linux-jdk8-m3.6.x_build / Build linux-jdk8-m3.6.x_build / testCommitsNextVersionsAlternateMessage

Error Message:
null

Stack Trace:
java.lang.NullPointerException
        at org.apache.maven.shared.release.phase.ScmCommitDevelopmentPhaseTest.testCommitsNextVersionsAlternateMessage(ScmCommitDevelopmentPhaseTest.java:132)


FAILED:  org.apache.maven.shared.release.phase.ScmCommitDevelopmentPhaseTest.linux-jdk13-m3.6.x_build / Build linux-jdk13-m3.6.x_build / testCommitsNextVersionsAlternateMessage

Error Message:
null

Stack Trace:
java.lang.NullPointerException
        at org.apache.maven.shared.release.phase.ScmCommitDevelopmentPhaseTest.testCommitsNextVersionsAlternateMessage(ScmCommitDevelopmentPhaseTest.java:132)


FAILED:  org.apache.maven.shared.release.phase.ScmCommitDevelopmentPhaseTest.linux-jdk7-m3.3.x_build / Build linux-jdk7-m3.3.x_build / testCommitsNextVersionsAlternateMessage

Error Message:
null

Stack Trace:
java.lang.NullPointerException
        at org.apache.maven.shared.release.phase.ScmCommitDevelopmentPhaseTest.testCommitsNextVersionsAlternateMessage(ScmCommitDevelopmentPhaseTest.java:132)


FAILED:  org.apache.maven.shared.release.phase.ScmCommitDevelopmentPhaseTest.linux-jdk7-m3.5.x_build / Build linux-jdk7-m3.5.x_build / testCommitsNextVersionsAlternateMessage

Error Message:
null

Stack Trace:
java.lang.NullPointerException
        at org.apache.maven.shared.release.phase.ScmCommitDevelopmentPhaseTest.testCommitsNextVersionsAlternateMessage(ScmCommitDevelopmentPhaseTest.java:132)


FAILED:  org.apache.maven.shared.release.phase.ScmCommitDevelopmentPhaseTest.linux-jdk7-m3.6.x_build / Build linux-jdk7-m3.6.x_build / testCommitsNextVersionsAlternateMessage

Error Message:
null

Stack Trace:
java.lang.NullPointerException
        at org.apache.maven.shared.release.phase.ScmCommitDevelopmentPhaseTest.testCommitsNextVersionsAlternateMessage(ScmCommitDevelopmentPhaseTest.java:132)


FAILED:  org.apache.maven.shared.release.phase.ScmCommitDevelopmentPhaseTest.linux-jdk14-m3.6.x_build / Build linux-jdk14-m3.6.x_build / testCommitsNextVersionsAlternateMessage

Error Message:
null

Stack Trace:
java.lang.NullPointerException
        at org.apache.maven.shared.release.phase.ScmCommitDevelopmentPhaseTest.testCommitsNextVersionsAlternateMessage(ScmCommitDevelopmentPhaseTest.java:132)


FAILED:  org.apache.maven.shared.release.phase.ScmCommitDevelopmentPhaseTest.windows-jdk11-m3.6.x_build / Build windows-jdk11-m3.6.x_build / testCommitsNextVersionsAlternateMessage

Error Message:
null

Stack Trace:
java.lang.NullPointerException
        at org.apache.maven.shared.release.phase.ScmCommitDevelopmentPhaseTest.testCommitsNextVersionsAlternateMessage(ScmCommitDevelopmentPhaseTest.java:132)


FAILED:  org.apache.maven.shared.release.phase.ScmCommitDevelopmentPhaseTest.windows-jdk13-m3.6.x_build / Build windows-jdk13-m3.6.x_build / testCommitsNextVersionsAlternateMessage

Error Message:
null

Stack Trace:
java.lang.NullPointerException
        at org.apache.maven.shared.release.phase.ScmCommitDevelopmentPhaseTest.testCommitsNextVersionsAlternateMessage(ScmCommitDevelopmentPhaseTest.java:132)


FAILED:  org.apache.maven.shared.release.phase.ScmCommitDevelopmentPhaseTest.windows-jdk14-m3.6.x_build / Build windows-jdk14-m3.6.x_build / testCommitsNextVersionsAlternateMessage

Error Message:
null

Stack Trace:
java.lang.NullPointerException
        at org.apache.maven.shared.release.phase.ScmCommitDevelopmentPhaseTest.testCommitsNextVersionsAlternateMessage(ScmCommitDevelopmentPhaseTest.java:132)


FAILED:  org.apache.maven.shared.release.phase.ScmCommitPreparationPhaseTest.linux-jdk7-m3.2.x_build / Build linux-jdk7-m3.2.x_build / testCommitDevelopmentAlternateMessage

Error Message:
null

Stack Trace:
java.lang.NullPointerException
        at org.apache.maven.shared.release.phase.ScmCommitPreparationPhaseTest.testCommitDevelopmentAlternateMessage(ScmCommitPreparationPhaseTest.java:271)


FAILED:  org.apache.maven.shared.release.phase.ScmCommitPreparationPhaseTest.windows-jdk7-m3.2.x_build / Build windows-jdk7-m3.2.x_build / testCommitDevelopmentAlternateMessage

Error Message:
null

Stack Trace:
java.lang.NullPointerException
        at org.apache.maven.shared.release.phase.ScmCommitPreparationPhaseTest.testCommitDevelopmentAlternateMessage(ScmCommitPreparationPhaseTest.java:271)


FAILED:  org.apache.maven.shared.release.phase.ScmCommitPreparationPhaseTest.windows-jdk7-m3.5.x_build / Build windows-jdk7-m3.5.x_build / testCommitDevelopmentAlternateMessage

Error Message:
null

Stack Trace:
java.lang.NullPointerException
        at org.apache.maven.shared.release.phase.ScmCommitPreparationPhaseTest.testCommitDevelopmentAlternateMessage(ScmCommitPreparationPhaseTest.java:271)


FAILED:  org.apache.maven.shared.release.phase.ScmCommitPreparationPhaseTest.windows-jdk7-m3.3.x_build / Build windows-jdk7-m3.3.x_build / testCommitDevelopmentAlternateMessage

Error Message:
null

Stack Trace:
java.lang.NullPointerException
        at org.apache.maven.shared.release.phase.ScmCommitPreparationPhaseTest.testCommitDevelopmentAlternateMessage(ScmCommitPreparationPhaseTest.java:271)


FAILED:  org.apache.maven.shared.release.phase.ScmCommitPreparationPhaseTest.linux-jdk11-m3.6.x_build / Build linux-jdk11-m3.6.x_build / testCommitDevelopmentAlternateMessage

Error Message:
null

Stack Trace:
java.lang.NullPointerException
        at org.apache.maven.shared.release.phase.ScmCommitPreparationPhaseTest.testCommitDevelopmentAlternateMessage(ScmCommitPreparationPhaseTest.java:271)


FAILED:  org.apache.maven.shared.release.phase.ScmCommitPreparationPhaseTest.windows-jdk7-m3.6.x_build / Build windows-jdk7-m3.6.x_build / testCommitDevelopmentAlternateMessage

Error Message:
null

Stack Trace:
java.lang.NullPointerException
        at org.apache.maven.shared.release.phase.ScmCommitPreparationPhaseTest.testCommitDevelopmentAlternateMessage(ScmCommitPreparationPhaseTest.java:271)


FAILED:  org.apache.maven.shared.release.phase.ScmCommitPreparationPhaseTest.windows-jdk8-m3.6.x_build / Build windows-jdk8-m3.6.x_build / testCommitDevelopmentAlternateMessage

Error Message:
null

Stack Trace:
java.lang.NullPointerException
        at org.apache.maven.shared.release.phase.ScmCommitPreparationPhaseTest.testCommitDevelopmentAlternateMessage(ScmCommitPreparationPhaseTest.java:271)


FAILED:  org.apache.maven.shared.release.phase.ScmCommitPreparationPhaseTest.linux-jdk8-m3.6.x_build / Build linux-jdk8-m3.6.x_build / testCommitDevelopmentAlternateMessage

Error Message:
null

Stack Trace:
java.lang.NullPointerException
        at org.apache.maven.shared.release.phase.ScmCommitPreparationPhaseTest.testCommitDevelopmentAlternateMessage(ScmCommitPreparationPhaseTest.java:271)


FAILED:  org.apache.maven.shared.release.phase.ScmCommitPreparationPhaseTest.linux-jdk13-m3.6.x_build / Build linux-jdk13-m3.6.x_build / testCommitDevelopmentAlternateMessage

Error Message:
null

Stack Trace:
java.lang.NullPointerException
        at org.apache.maven.shared.release.phase.ScmCommitPreparationPhaseTest.testCommitDevelopmentAlternateMessage(ScmCommitPreparationPhaseTest.java:271)


FAILED:  org.apache.maven.shared.release.phase.ScmCommitPreparationPhaseTest.linux-jdk7-m3.3.x_build / Build linux-jdk7-m3.3.x_build / testCommitDevelopmentAlternateMessage

Error Message:
null

Stack Trace:
java.lang.NullPointerException
        at org.apache.maven.shared.release.phase.ScmCommitPreparationPhaseTest.testCommitDevelopmentAlternateMessage(ScmCommitPreparationPhaseTest.java:271)


FAILED:  org.apache.maven.shared.release.phase.ScmCommitPreparationPhaseTest.linux-jdk7-m3.5.x_build / Build linux-jdk7-m3.5.x_build / testCommitDevelopmentAlternateMessage

Error Message:
null

Stack Trace:
java.lang.NullPointerException
        at org.apache.maven.shared.release.phase.ScmCommitPreparationPhaseTest.testCommitDevelopmentAlternateMessage(ScmCommitPreparationPhaseTest.java:271)


FAILED:  org.apache.maven.shared.release.phase.ScmCommitPreparationPhaseTest.linux-jdk7-m3.6.x_build / Build linux-jdk7-m3.6.x_build / testCommitDevelopmentAlternateMessage

Error Message:
null

Stack Trace:
java.lang.NullPointerException
        at org.apache.maven.shared.release.phase.ScmCommitPreparationPhaseTest.testCommitDevelopmentAlternateMessage(ScmCommitPreparationPhaseTest.java:271)


FAILED:  org.apache.maven.shared.release.phase.ScmCommitPreparationPhaseTest.linux-jdk14-m3.6.x_build / Build linux-jdk14-m3.6.x_build / testCommitDevelopmentAlternateMessage

Error Message:
null

Stack Trace:
java.lang.NullPointerException
        at org.apache.maven.shared.release.phase.ScmCommitPreparationPhaseTest.testCommitDevelopmentAlternateMessage(ScmCommitPreparationPhaseTest.java:271)


FAILED:  org.apache.maven.shared.release.phase.ScmCommitPreparationPhaseTest.windows-jdk11-m3.6.x_build / Build windows-jdk11-m3.6.x_build / testCommitDevelopmentAlternateMessage

Error Message:
null

Stack Trace:
java.lang.NullPointerException
        at org.apache.maven.shared.release.phase.ScmCommitPreparationPhaseTest.testCommitDevelopmentAlternateMessage(ScmCommitPreparationPhaseTest.java:271)


FAILED:  org.apache.maven.shared.release.phase.ScmCommitPreparationPhaseTest.windows-jdk13-m3.6.x_build / Build windows-jdk13-m3.6.x_build / testCommitDevelopmentAlternateMessage

Error Message:
null

Stack Trace:
java.lang.NullPointerException
        at org.apache.maven.shared.release.phase.ScmCommitPreparationPhaseTest.testCommitDevelopmentAlternateMessage(ScmCommitPreparationPhaseTest.java:271)


FAILED:  org.apache.maven.shared.release.phase.ScmCommitPreparationPhaseTest.windows-jdk14-m3.6.x_build / Build windows-jdk14-m3.6.x_build / testCommitDevelopmentAlternateMessage

Error Message:
null

Stack Trace:
java.lang.NullPointerException
        at org.apache.maven.shared.release.phase.ScmCommitPreparationPhaseTest.testCommitDevelopmentAlternateMessage(ScmCommitPreparationPhaseTest.java:271)




Build log:
[...truncated 29136 lines...]
[Pipeline] cleanWs
[WS-CLEANUP] Deleting project workspace...
[WS-CLEANUP] Deferred wipeout is used...
[WS-CLEANUP] done
[Pipeline] }
[Pipeline] // stage
[Pipeline] }
[Pipeline] // ws
[Pipeline] }
[Pipeline] // node
[Pipeline] }
[INFO] run post-build script verify.groovy
[INFO]           projects\prepare-with-pom\MRELEASE-808\pom.xml ... SUCCESS (8.9 s)
[INFO] Building: projects\update-versions\MRELEASE-555\pom.xml
[INFO] run post-build script verify.groovy
[INFO]           projects\update-versions\MRELEASE-555\pom.xml .... SUCCESS (3.9 s)
[INFO] Building: projects\update-versions\MRELEASE-611\pom.xml
[INFO] run post-build script verify.groovy
[INFO]           projects\update-versions\MRELEASE-611\pom.xml .... SUCCESS (3.8 s)
[INFO] Building: projects\update-versions\MRELEASE-783\pom.xml
[INFO]           projects\update-versions\MRELEASE-783\pom.xml .... SUCCESS (4.2 s)
[INFO] Building: projects\update-versions\MRELEASE-976\pom.xml
[INFO] run post-build script verify.groovy
[INFO]           projects\update-versions\MRELEASE-976\pom.xml .... SUCCESS (3.6 s)
[INFO] -------------------------------------------------
[INFO] Build Summary:
[INFO]   Passed: 37, Failed: 0, Errors: 0, Skipped: 0
[INFO] -------------------------------------------------
[INFO]
[INFO] --- mrm-maven-plugin:1.2.0:stop (default) @ maven-release-plugin ---
[INFO] Stopping Mock Repository Manager on http://localhost:65185
[INFO] Stopped SocketConnector@0.0.0.0:65185
[INFO] Mock Repository Manager http://localhost:65185 is stopped.
[INFO]
[INFO] --- maven-checkstyle-plugin:3.0.0:check (checkstyle-check) @ maven-release-plugin ---
[INFO]
[INFO] -------< org.apache.maven.release:maven-release-oddeven-policy >--------
[INFO] Building Maven Release Odd-Even Policy 3.0.0-SNAPSHOT              [5/6]
[INFO] --------------------------------[ jar ]---------------------------------
[INFO]
[INFO] --- maven-clean-plugin:3.1.0:clean (default-clean) @ maven-release-oddeven-policy ---
[INFO]
[INFO] --- maven-enforcer-plugin:1.4.1:enforce (enforce-maven-version) @ maven-release-oddeven-policy ---
[INFO]
[INFO] --- maven-enforcer-plugin:1.4.1:enforce (enforce-bytecode-version) @ maven-release-oddeven-policy ---
[INFO]
[INFO] --- maven-enforcer-plugin:1.4.1:enforce (ban-known-bad-maven-versions) @ maven-release-oddeven-policy ---
[INFO]
[INFO] --- apache-rat-plugin:0.12:check (rat-check) @ maven-release-oddeven-policy ---
[INFO] Enabled default license matchers.
[INFO] Will parse SCM ignores for exclusions...
[INFO] Finished adding exclusions from SCM ignore files.
[INFO] 61 implicit excludes (use -debug for more details).
[INFO] Exclude: .repository
[INFO] Exclude: .repository/**
[INFO] Exclude: .maven/spy.log
[INFO] Exclude: dependency-reduced-pom.xml
[INFO] Exclude: .java-version
[INFO] 5 resources included (use -debug for more details)
[INFO] Rat check: Summary over all files. Unapproved: 0, unknown: 0, generated: 0, approved: 5 licenses.
[INFO]
[INFO] --- maven-remote-resources-plugin:1.5:process (process-resource-bundles) @ maven-release-oddeven-policy ---
[INFO]
[INFO] --- maven-resources-plugin:3.1.0:resources (default-resources) @ maven-release-oddeven-policy ---
[INFO] Using 'UTF-8' encoding to copy filtered resources.
[INFO] skip non existing resourceDirectory F:\jenkins\jenkins-slave\workspace\n-box_maven-release_MRELEASE-980@3\windows-jdk14-m3.6.x_build\maven-release-policies\maven-release-oddeven-policy\src\main\resources
[INFO] Copying 3 resources
[INFO]
[INFO] --- maven-compiler-plugin:3.7.0:compile (default-compile) @ maven-release-oddeven-policy ---
[INFO] Changes detected - recompiling the module!
[INFO] Compiling 2 source files to F:\jenkins\jenkins-slave\workspace\n-box_maven-release_MRELEASE-980@3\windows-jdk14-m3.6.x_build\maven-release-policies\maven-release-oddeven-policy\target\classes
[INFO]
[INFO] --- plexus-component-metadata:1.7.1:generate-metadata (process-classes) @ maven-release-oddeven-policy ---
[INFO] Discovered 1 component descriptors(s)
[INFO]
[INFO] --- maven-resources-plugin:3.1.0:testResources (default-testResources) @ maven-release-oddeven-policy ---
[INFO] Using 'UTF-8' encoding to copy filtered resources.
[INFO] skip non existing resourceDirectory F:\jenkins\jenkins-slave\workspace\n-box_maven-release_MRELEASE-980@3\windows-jdk14-m3.6.x_build\maven-release-policies\maven-release-oddeven-policy\src\test\resources
[INFO] Copying 3 resources
[INFO]
[INFO] --- maven-compiler-plugin:3.7.0:testCompile (default-testCompile) @ maven-release-oddeven-policy ---
[INFO] Changes detected - recompiling the module!
[INFO] Compiling 1 source file to F:\jenkins\jenkins-slave\workspace\n-box_maven-release_MRELEASE-980@3\windows-jdk14-m3.6.x_build\maven-release-policies\maven-release-oddeven-policy\target\test-classes
[INFO]
[INFO] --- maven-surefire-plugin:2.22.0:test (default-test) @ maven-release-oddeven-policy ---
[INFO] Surefire report directory: F:\jenkins\jenkins-slave\workspace\n-box_maven-release_MRELEASE-980@3\windows-jdk14-m3.6.x_build\maven-release-policies\maven-release-oddeven-policy\target\surefire-reports
[INFO]
[INFO] -------------------------------------------------------
[INFO]  T E S T S
[INFO] -------------------------------------------------------
[INFO] Running org.apache.maven.shared.release.policy.oddeven.OddEvenVersionPolicyTestCase
[INFO] Tests run: 3, Failures: 0, Errors: 0, Skipped: 0, Time elapsed: 0.127 s - in org.apache.maven.shared.release.policy.oddeven.OddEvenVersionPolicyTestCase
[INFO]
[INFO] Results:
[INFO]
[INFO] Tests run: 3, Failures: 0, Errors: 0, Skipped: 0
[INFO]
[INFO]
[INFO] --- maven-jar-plugin:3.1.0:jar (default-jar) @ maven-release-oddeven-policy ---
[INFO] Building jar: F:\jenkins\jenkins-slave\workspace\n-box_maven-release_MRELEASE-980@3\windows-jdk14-m3.6.x_build\maven-release-policies\maven-release-oddeven-policy\target\maven-release-oddeven-policy-3.0.0-SNAPSHOT.jar
[INFO]
[INFO] --- maven-site-plugin:3.7.1:attach-descriptor (attach-descriptor) @ maven-release-oddeven-policy ---
[INFO] Skipping because packaging 'jar' is not pom.
[INFO]
[INFO] --- maven-checkstyle-plugin:3.0.0:check (checkstyle-check) @ maven-release-oddeven-policy ---
[INFO]
[INFO] --------< org.apache.maven.release:maven-release-semver-policy >--------
[INFO] Building Maven Release SemVer Policy 3.0.0-SNAPSHOT                [6/6]
[INFO] --------------------------------[ jar ]---------------------------------
[INFO]
[INFO] --- maven-clean-plugin:3.1.0:clean (default-clean) @ maven-release-semver-policy ---
[INFO]
[INFO] --- maven-enforcer-plugin:1.4.1:enforce (enforce-maven-version) @ maven-release-semver-policy ---
[INFO]
[INFO] --- maven-enforcer-plugin:1.4.1:enforce (enforce-bytecode-version) @ maven-release-semver-policy ---
[INFO]
[INFO] --- maven-enforcer-plugin:1.4.1:enforce (ban-known-bad-maven-versions) @ maven-release-semver-policy ---
[INFO]
[INFO] --- apache-rat-plugin:0.12:check (rat-check) @ maven-release-semver-policy ---
[INFO] Enabled default license matchers.
[INFO] Will parse SCM ignores for exclusions...
[INFO] Finished adding exclusions from SCM ignore files.
[INFO] 61 implicit excludes (use -debug for more details).
[INFO] Exclude: .repository
[INFO] Exclude: .repository/**
[INFO] Exclude: .maven/spy.log
[INFO] Exclude: dependency-reduced-pom.xml
[INFO] Exclude: .java-version
[INFO] 4 resources included (use -debug for more details)
[INFO] Rat check: Summary over all files. Unapproved: 0, unknown: 0, generated: 0, approved: 4 licenses.
[INFO]
[INFO] --- maven-remote-resources-plugin:1.5:process (process-resource-bundles) @ maven-release-semver-policy ---
[INFO]
[INFO] --- maven-resources-plugin:3.1.0:resources (default-resources) @ maven-release-semver-policy ---
[INFO] Using 'UTF-8' encoding to copy filtered resources.
[INFO] skip non existing resourceDirectory F:\jenkins\jenkins-slave\workspace\n-box_maven-release_MRELEASE-980@3\windows-jdk14-m3.6.x_build\maven-release-policies\maven-release-semver-policy\src\main\resources
[INFO] Copying 3 resources
[INFO]
[INFO] --- maven-compiler-plugin:3.7.0:compile (default-compile) @ maven-release-semver-policy ---
[INFO] Changes detected - recompiling the module!
[INFO] Compiling 1 source file to F:\jenkins\jenkins-slave\workspace\n-box_maven-release_MRELEASE-980@3\windows-jdk14-m3.6.x_build\maven-release-policies\maven-release-semver-policy\target\classes
[INFO]
[INFO] --- plexus-component-metadata:1.7.1:generate-metadata (process-classes) @ maven-release-semver-policy ---
[INFO] Discovered 1 component descriptors(s)
[INFO]
[INFO] --- maven-resources-plugin:3.1.0:testResources (default-testResources) @ maven-release-semver-policy ---
[INFO] Using 'UTF-8' encoding to copy filtered resources.
[INFO] skip non existing resourceDirectory F:\jenkins\jenkins-slave\workspace\n-box_maven-release_MRELEASE-980@3\windows-jdk14-m3.6.x_build\maven-release-policies\maven-release-semver-policy\src\test\resources
[INFO] Copying 3 resources
[INFO]
[INFO] --- maven-compiler-plugin:3.7.0:testCompile (default-testCompile) @ maven-release-semver-policy ---
[INFO] Changes detected - recompiling the module!
[INFO] Compiling 1 source file to F:\jenkins\jenkins-slave\workspace\n-box_maven-release_MRELEASE-980@3\windows-jdk14-m3.6.x_build\maven-release-policies\maven-release-semver-policy\target\test-classes
[INFO]
[INFO] --- maven-surefire-plugin:2.22.0:test (default-test) @ maven-release-semver-policy ---
[INFO] Surefire report directory: F:\jenkins\jenkins-slave\workspace\n-box_maven-release_MRELEASE-980@3\windows-jdk14-m3.6.x_build\maven-release-policies\maven-release-semver-policy\target\surefire-reports
[INFO]
[INFO] -------------------------------------------------------
[INFO]  T E S T S
[INFO] -------------------------------------------------------
[INFO] Running org.apache.maven.shared.release.policy.semver.SemVerVersionPolicyTest
[INFO] Tests run: 2, Failures: 0, Errors: 0, Skipped: 0, Time elapsed: 0.098 s - in org.apache.maven.shared.release.policy.semver.SemVerVersionPolicyTest
[INFO]
[INFO] Results:
[INFO]
[INFO] Tests run: 2, Failures: 0, Errors: 0, Skipped: 0
[INFO]
[INFO]
[INFO] --- maven-jar-plugin:3.1.0:jar (default-jar) @ maven-release-semver-policy ---
[INFO] Building jar: F:\jenkins\jenkins-slave\workspace\n-box_maven-release_MRELEASE-980@3\windows-jdk14-m3.6.x_build\maven-release-policies\maven-release-semver-policy\target\maven-release-semver-policy-3.0.0-SNAPSHOT.jar
[INFO]
[INFO] --- maven-site-plugin:3.7.1:attach-descriptor (attach-descriptor) @ maven-release-semver-policy ---
[INFO] Skipping because packaging 'jar' is not pom.
[INFO]
[INFO] --- maven-checkstyle-plugin:3.0.0:check (checkstyle-check) @ maven-release-semver-policy ---
[INFO] ------------------------------------------------------------------------
[INFO] Reactor Summary for Maven Release 3.0.0-SNAPSHOT:
[INFO]
[INFO] Maven Release ...................................... SUCCESS [  5.631 s]
[INFO] Maven Release APIs ................................. SUCCESS [  6.890 s]
[INFO] Maven Release Manager .............................. SUCCESS [02:16 min]
[INFO] Maven Release Plugin ............................... SUCCESS [06:12 min]
[INFO] Maven Release Odd-Even Policy ...................... SUCCESS [  2.583 s]
[INFO] Maven Release SemVer Policy ........................ SUCCESS [  2.892 s]
[INFO] ------------------------------------------------------------------------
[INFO] BUILD SUCCESS
[INFO] ------------------------------------------------------------------------
[INFO] Total time:  08:47 min
[INFO] Finished at: 2019-12-01T05:21:10-08:00
[INFO] ------------------------------------------------------------------------
[INFO] [jenkins-event-spy] Generated F:\jenkins\jenkins-slave\workspace\n-box_maven-release_MRELEASE-980@3@tmp\withMaven515543a0\maven-spy-20191201-051222-1571282017796066834179.log
[Pipeline] }
[Pipeline] // dir
[Pipeline] }
[withMaven] artifactsPublisher - Archive artifact windows-jdk14-m3.6.x_build\pom.xml under org\apache\maven\release\maven-release\3.0.0-SNAPSHOT\maven-release-3.0.0-SNAPSHOT.pom
[withMaven] artifactsPublisher - Archive artifact windows-jdk14-m3.6.x_build\target\maven-release-3.0.0-SNAPSHOT-site.xml under org\apache\maven\release\maven-release\3.0.0-SNAPSHOT\maven-release-3.0.0-SNAPSHOT-site.xml
[withMaven] artifactsPublisher - Archive artifact windows-jdk14-m3.6.x_build\maven-release-api\pom.xml under org\apache\maven\release\maven-release-api\3.0.0-SNAPSHOT\maven-release-api-3.0.0-SNAPSHOT.pom
[withMaven] artifactsPublisher - Archive artifact windows-jdk14-m3.6.x_build\maven-release-api\target\maven-release-api-3.0.0-SNAPSHOT.jar under org\apache\maven\release\maven-release-api\3.0.0-SNAPSHOT\maven-release-api-3.0.0-SNAPSHOT.jar
[withMaven] artifactsPublisher - Archive artifact windows-jdk14-m3.6.x_build\maven-release-manager\pom.xml under org\apache\maven\release\maven-release-manager\3.0.0-SNAPSHOT\maven-release-manager-3.0.0-SNAPSHOT.pom
[withMaven] artifactsPublisher - Archive artifact windows-jdk14-m3.6.x_build\maven-release-manager\target\maven-release-manager-3.0.0-SNAPSHOT.jar under org\apache\maven\release\maven-release-manager\3.0.0-SNAPSHOT\maven-release-manager-3.0.0-SNAPSHOT.jar
[withMaven] artifactsPublisher - Archive artifact windows-jdk14-m3.6.x_build\maven-release-plugin\pom.xml under org\apache\maven\plugins\maven-release-plugin\3.0.0-SNAPSHOT\maven-release-plugin-3.0.0-SNAPSHOT.pom
[withMaven] artifactsPublisher - Archive artifact windows-jdk14-m3.6.x_build\maven-release-plugin\target\maven-release-plugin-3.0.0-SNAPSHOT.jar under org\apache\maven\plugins\maven-release-plugin\3.0.0-SNAPSHOT\maven-release-plugin-3.0.0-SNAPSHOT.jar
[withMaven] artifactsPublisher - Archive artifact windows-jdk14-m3.6.x_build\maven-release-policies\maven-release-oddeven-policy\pom.xml under org\apache\maven\release\maven-release-oddeven-policy\3.0.0-SNAPSHOT\maven-release-oddeven-policy-3.0.0-SNAPSHOT.pom
[withMaven] artifactsPublisher - Archive artifact windows-jdk14-m3.6.x_build\maven-release-policies\maven-release-oddeven-policy\target\maven-release-oddeven-policy-3.0.0-SNAPSHOT.jar under org\apache\maven\release\maven-release-oddeven-policy\3.0.0-SNAPSHOT\maven-release-oddeven-policy-3.0.0-SNAPSHOT.jar
[withMaven] artifactsPublisher - Archive artifact windows-jdk14-m3.6.x_build\maven-release-policies\maven-release-semver-policy\pom.xml under org\apache\maven\release\maven-release-semver-policy\3.0.0-SNAPSHOT\maven-release-semver-policy-3.0.0-SNAPSHOT.pom
[withMaven] artifactsPublisher - Archive artifact windows-jdk14-m3.6.x_build\maven-release-policies\maven-release-semver-policy\target\maven-release-semver-policy-3.0.0-SNAPSHOT.jar under org\apache\maven\release\maven-release-semver-policy\3.0.0-SNAPSHOT\maven-release-semver-policy-3.0.0-SNAPSHOT.jar
[Fast Archiver] No prior successful build to compare, so performing full copy of artifacts
[withMaven] junitPublisher - Archive test results for Maven artifact org.apache.maven.release:maven-release-api:jar:3.0.0-SNAPSHOT generated by maven-surefire-plugin:test (default-test): windows-jdk14-m3.6.x_build\maven-release-api\target\surefire-reports\*.xml
[withMaven] junitPublisher - Archive test results for Maven artifact org.apache.maven.release:maven-release-manager:jar:3.0.0-SNAPSHOT generated by maven-surefire-plugin:test (default-test): windows-jdk14-m3.6.x_build\maven-release-manager\target\surefire-reports\*.xml
[withMaven] junitPublisher - Archive test results for Maven artifact org.apache.maven.plugins:maven-release-plugin:maven-plugin:3.0.0-SNAPSHOT generated by maven-surefire-plugin:test (default-test): windows-jdk14-m3.6.x_build\maven-release-plugin\target\surefire-reports\*.xml
[withMaven] junitPublisher - Archive test results for Maven artifact org.apache.maven.release:maven-release-oddeven-policy:jar:3.0.0-SNAPSHOT generated by maven-surefire-plugin:test (default-test): windows-jdk14-m3.6.x_build\maven-release-policies\maven-release-oddeven-policy\target\surefire-reports\*.xml
[withMaven] junitPublisher - Archive test results for Maven artifact org.apache.maven.release:maven-release-semver-policy:jar:3.0.0-SNAPSHOT generated by maven-surefire-plugin:test (default-test): windows-jdk14-m3.6.x_build\maven-release-policies\maven-release-semver-policy\target\surefire-reports\*.xml
Recording test results
[withMaven] junitPublisher - Archive test results for Maven artifact org.apache.maven.release:maven-release-manager:jar:3.0.0-SNAPSHOT generated by maven-failsafe-plugin:integration-test (default): windows-jdk14-m3.6.x_build\maven-release-manager\target\failsafe-reports\*.xml
Recording test results
[withMaven] openTasksPublisher - Scan Tasks for Maven artifact org.apache.maven.release:maven-release-api:jar:3.0.0-SNAPSHOT in source directory windows-jdk14-m3.6.x_build\maven-release-api\src\main\java
[withMaven] openTasksPublisher - Scan Tasks for Maven artifact org.apache.maven.release:maven-release-manager:jar:3.0.0-SNAPSHOT in source directory windows-jdk14-m3.6.x_build\maven-release-manager\src\main\java
[withMaven] openTasksPublisher - Scan Tasks for Maven artifact org.apache.maven.plugins:maven-release-plugin:maven-plugin:3.0.0-SNAPSHOT in source directory windows-jdk14-m3.6.x_build\maven-release-plugin\src\main\java
[withMaven] openTasksPublisher - Scan Tasks for Maven artifact org.apache.maven.release:maven-release-oddeven-policy:jar:3.0.0-SNAPSHOT in source directory windows-jdk14-m3.6.x_build\maven-release-policies\maven-release-oddeven-policy\src\main\java
[withMaven] openTasksPublisher - Scan Tasks for Maven artifact org.apache.maven.release:maven-release-semver-policy:jar:3.0.0-SNAPSHOT in source directory windows-jdk14-m3.6.x_build\maven-release-policies\maven-release-semver-policy\src\main\java
[TASKS] Scanning folder 'f:\jenkins\jenkins-slave\workspace\n-box_maven-release_MRELEASE-980@3' for files matching the pattern 'windows-jdk14-m3.6.x_build\maven-release-api\src\main\java\**\*,windows-jdk14-m3.6.x_build\maven-release-manager\src\main\java\**\*,windows-jdk14-m3.6.x_build\maven-release-plugin\src\main\java\**\*,windows-jdk14-m3.6.x_build\maven-release-policies\maven-release-oddeven-policy\src\main\java\**\*,windows-jdk14-m3.6.x_build\maven-release-policies\maven-release-semver-policy\src\main\java\**\*' - excludes: null
[TASKS] Found 131 files to scan for tasks
[TASKS] Found 20 open tasks.
Skipping warnings blame since pipelines do not have an SCM link.%n
[withMaven] invokerPublisher - Archive invoker results for Maven artifact MavenArtifact{org.apache.maven.plugins:maven-release-plugin:maven-plugin:3.0.0-SNAPSHOT(version: 3.0.0-SNAPSHOT, snapshot:false) } generated by PluginInvocation{org.apache.maven.plugins:maven-invoker-plugin:3.2.0@run  integration-test-prepare}: windows-jdk14-m3.6.x_build\maven-release-plugin\target\invoker-reports\*.xml
[withMaven] Publishers: Generated Artifacts Publisher: 284 ms, Junit Publisher: 2752 ms, Open Task Scanner Publisher: 302 ms, Dependencies Fingerprint Publisher: 107 ms, Invoker Publisher: 16731 ms, Pipeline Graph Publisher: 4 ms
[Pipeline] // withMaven
[Pipeline] cleanWs
[WS-CLEANUP] Deleting project workspace...
[WS-CLEANUP] Deferred wipeout is used...
[WS-CLEANUP] done
[Pipeline] }
[Pipeline] // stage
[Pipeline] }
[Pipeline] // ws
[Pipeline] }
[Pipeline] // node
[Pipeline] }
[Pipeline] // parallel
[Pipeline] stage
[Pipeline] { (Notifications)
[Pipeline] echo
Build result: UNSTABLE
[Pipeline] jiraIssueSelector
[Pipeline] echo
The authors of changes [].
[Pipeline] echo
Sending email ...
[Pipeline] emailext
Reply | Threaded
Open this post in threaded view
|

Build succeeded in Jenkins: Maven TLP » maven-release » MRELEASE-980 #2

Apache Jenkins Server-2
See https://builds.apache.org/job/maven-box/job/maven-release/job/MRELEASE-980/2/

Changes:

* Fix ReleaseDescriptorBuilder, as exposed by unittests

All tests passed