Build unstable in Jenkins: Maven TLP » maven-plugin-tools » unstable-build #1

Previous Topic Next Topic
 
classic Classic list List threaded Threaded
1 message Options
Reply | Threaded
Open this post in threaded view
|

Build unstable in Jenkins: Maven TLP » maven-plugin-tools » unstable-build #1

Apache Jenkins Server-2
See https://builds.apache.org/job/maven-box/job/maven-plugin-tools/job/unstable-build/1/

No changes.

6 tests failed.
FAILED:  org.apache.maven.tools.plugin.util.PluginUtilsTest.testShouldTrimArtifactIdToFindPluginId

Error Message:
expected:<[tru]e> but was:<[fals]e>

Stack Trace:
junit.framework.ComparisonFailure: expected:<[tru]e> but was:<[fals]e>
        at junit.framework.Assert.assertEquals(Assert.java:81)
        at junit.framework.Assert.assertEquals(Assert.java:87)
        at org.apache.maven.tools.plugin.util.PluginUtilsTest.testShouldTrimArtifactIdToFindPluginId(PluginUtilsTest.java:33)


FAILED:  org.apache.maven.tools.plugin.util.PluginUtilsTest.testShouldTrimArtifactIdToFindPluginId

Error Message:
expected:<[tru]e> but was:<[fals]e>

Stack Trace:
junit.framework.ComparisonFailure: expected:<[tru]e> but was:<[fals]e>
        at junit.framework.Assert.assertEquals(Assert.java:81)
        at junit.framework.Assert.assertEquals(Assert.java:87)
        at org.apache.maven.tools.plugin.util.PluginUtilsTest.testShouldTrimArtifactIdToFindPluginId(PluginUtilsTest.java:33)


FAILED:  org.apache.maven.tools.plugin.util.PluginUtilsTest.testShouldTrimArtifactIdToFindPluginId

Error Message:
expected:<[tru]e> but was:<[fals]e>

Stack Trace:
junit.framework.ComparisonFailure: expected:<[tru]e> but was:<[fals]e>
        at junit.framework.Assert.assertEquals(Assert.java:81)
        at junit.framework.Assert.assertEquals(Assert.java:87)
        at org.apache.maven.tools.plugin.util.PluginUtilsTest.testShouldTrimArtifactIdToFindPluginId(PluginUtilsTest.java:33)


FAILED:  org.apache.maven.tools.plugin.util.PluginUtilsTest.testShouldTrimArtifactIdToFindPluginId

Error Message:
expected:<[tru]e> but was:<[fals]e>

Stack Trace:
junit.framework.ComparisonFailure: expected:<[tru]e> but was:<[fals]e>
        at junit.framework.Assert.assertEquals(Assert.java:81)
        at junit.framework.Assert.assertEquals(Assert.java:87)
        at org.apache.maven.tools.plugin.util.PluginUtilsTest.testShouldTrimArtifactIdToFindPluginId(PluginUtilsTest.java:33)


FAILED:  org.apache.maven.tools.plugin.util.PluginUtilsTest.testShouldTrimArtifactIdToFindPluginId

Error Message:
expected:<[tru]e> but was:<[fals]e>

Stack Trace:
junit.framework.ComparisonFailure: expected:<[tru]e> but was:<[fals]e>
        at junit.framework.Assert.assertEquals(Assert.java:81)
        at junit.framework.Assert.assertEquals(Assert.java:87)
        at org.apache.maven.tools.plugin.util.PluginUtilsTest.testShouldTrimArtifactIdToFindPluginId(PluginUtilsTest.java:33)


FAILED:  org.apache.maven.tools.plugin.util.PluginUtilsTest.testShouldTrimArtifactIdToFindPluginId

Error Message:
expected:<[tru]e> but was:<[fals]e>

Stack Trace:
junit.framework.ComparisonFailure: expected:<[tru]e> but was:<[fals]e>
        at junit.framework.Assert.assertEquals(Assert.java:81)
        at junit.framework.Assert.assertEquals(Assert.java:87)
        at org.apache.maven.tools.plugin.util.PluginUtilsTest.testShouldTrimArtifactIdToFindPluginId(PluginUtilsTest.java:33)




Build log:
[...truncated 2.39 MB...]
[linux-jdk7] [withMaven] artifactsPublisher - Archive artifact m/maven-plugin-plugin/pom.xml under org/apache/maven/plugins/maven-plugin-plugin/3.5.1-SNAPSHOT/maven-plugin-plugin-3.5.1-SNAPSHOT.pom
[linux-jdk7] [withMaven] artifactsPublisher - Archive artifact m/maven-plugin-plugin/target/maven-plugin-plugin-3.5.1-SNAPSHOT.jar under org/apache/maven/plugins/maven-plugin-plugin/3.5.1-SNAPSHOT/maven-plugin-plugin-3.5.1-SNAPSHOT.jar
[linux-jdk7] [withMaven] artifactsPublisher - Archive artifact m/target/maven-plugin-tools-3.5.1-SNAPSHOT-site.xml under org/apache/maven/plugin-tools/maven-plugin-tools/3.5.1-SNAPSHOT/maven-plugin-tools-3.5.1-SNAPSHOT-site.xml
[linux-jdk7] [withMaven] artifactsPublisher - Archive artifact m/maven-plugin-tools-annotations/target/maven-plugin-tools-annotations-3.5.1-SNAPSHOT-tests.jar under org/apache/maven/plugin-tools/maven-plugin-tools-annotations/3.5.1-SNAPSHOT/maven-plugin-tools-annotations-3.5.1-SNAPSHOT-tests.jar
[linux-jdk7] [withMaven] artifactsPublisher - Archive artifact m/maven-plugin-tools-annotations/target/maven-plugin-tools-annotations-3.5.1-SNAPSHOT-test-sources.jar under org/apache/maven/plugin-tools/maven-plugin-tools-annotations/3.5.1-SNAPSHOT/maven-plugin-tools-annotations-3.5.1-SNAPSHOT-test-sources.jar
[linux-jdk7] [withMaven] artifactsPublisher - Archive artifact m/maven-script/target/maven-script-3.5.1-SNAPSHOT-site.xml under org/apache/maven/plugin-tools/maven-script/3.5.1-SNAPSHOT/maven-script-3.5.1-SNAPSHOT-site.xml
[linux-jdk7] [Fast Archiver] No prior successful build to compare, so performing full copy of artifacts
[linux-jdk7] [withMaven] junitPublisher - Archive test results for Maven artifact org.apache.maven.plugin-tools:maven-plugin-tools-api:3.5.1-SNAPSHOT generated by maven-surefire-plugin:test (default-test): m/maven-plugin-tools-api/target/surefire-reports/*.xml
[linux-jdk7] [withMaven] junitPublisher - Jenkins JUnit Attachments Plugin not found, can't publish test attachments.Recording test results
[linux-jdk7] [withMaven] junitPublisher - Archive test results for Maven artifact org.apache.maven.plugin-tools:maven-plugin-tools-generators:3.5.1-SNAPSHOT generated by maven-surefire-plugin:test (default-test): m/maven-plugin-tools-generators/target/surefire-reports/*.xml
[linux-jdk7] [withMaven] junitPublisher - Jenkins JUnit Attachments Plugin not found, can't publish test attachments.Recording test results
[linux-jdk7] [withMaven] junitPublisher - Archive test results for Maven artifact org.apache.maven.plugin-tools:maven-plugin-tools-java:3.5.1-SNAPSHOT generated by maven-surefire-plugin:test (default-test): m/maven-plugin-tools-java/target/surefire-reports/*.xml
[linux-jdk7] [withMaven] junitPublisher - Jenkins JUnit Attachments Plugin not found, can't publish test attachments.Recording test results
[linux-jdk7] [withMaven] junitPublisher - Archive test results for Maven artifact org.apache.maven.plugin-tools:maven-plugin-annotations:3.5.1-SNAPSHOT generated by maven-surefire-plugin:test (default-test): m/maven-plugin-annotations/target/surefire-reports/*.xml
[linux-jdk7] [withMaven] junitPublisher - Jenkins JUnit Attachments Plugin not found, can't publish test attachments.Recording test results
[linux-jdk7] None of the test reports contained any result
[linux-jdk7] [withMaven] junitPublisher - Archive test results for Maven artifact org.apache.maven.plugin-tools:maven-plugin-tools-annotations:3.5.1-SNAPSHOT generated by maven-surefire-plugin:test (default-test): m/maven-plugin-tools-annotations/target/surefire-reports/*.xml
[linux-jdk7] [withMaven] junitPublisher - Jenkins JUnit Attachments Plugin not found, can't publish test attachments.Recording test results
[linux-jdk7] [withMaven] junitPublisher - Archive test results for Maven artifact org.apache.maven.plugin-tools:maven-plugin-tools-javadoc:3.5.1-SNAPSHOT generated by maven-surefire-plugin:test (default-test): m/maven-plugin-tools-javadoc/target/surefire-reports/*.xml
[linux-jdk7] [withMaven] junitPublisher - Jenkins JUnit Attachments Plugin not found, can't publish test attachments.Recording test results
[linux-jdk7] None of the test reports contained any result
[linux-jdk7] [withMaven] junitPublisher - Archive test results for Maven artifact org.apache.maven.plugin-tools:maven-plugin-tools-model:3.5.1-SNAPSHOT generated by maven-surefire-plugin:test (default-test): m/maven-script/maven-plugin-tools-model/target/surefire-reports/*.xml
[linux-jdk7] [withMaven] junitPublisher - Jenkins JUnit Attachments Plugin not found, can't publish test attachments.Recording test results
[linux-jdk7] [withMaven] junitPublisher - Archive test results for Maven artifact org.apache.maven.plugin-tools:maven-plugin-tools-ant:3.5.1-SNAPSHOT generated by maven-surefire-plugin:test (default-test): m/maven-script/maven-plugin-tools-ant/target/surefire-reports/*.xml
[linux-jdk7] [withMaven] junitPublisher - Jenkins JUnit Attachments Plugin not found, can't publish test attachments.Recording test results
[linux-jdk7] [withMaven] junitPublisher - Archive test results for Maven artifact org.apache.maven.plugin-tools:maven-script-ant:3.5.1-SNAPSHOT generated by maven-surefire-plugin:test (default-test): m/maven-script/maven-script-ant/target/surefire-reports/*.xml
[linux-jdk7] [withMaven] junitPublisher - Jenkins JUnit Attachments Plugin not found, can't publish test attachments.Recording test results
[linux-jdk7] [withMaven] junitPublisher - Archive test results for Maven artifact org.apache.maven.plugin-tools:maven-plugin-tools-beanshell:3.5.1-SNAPSHOT generated by maven-surefire-plugin:test (default-test): m/maven-script/maven-plugin-tools-beanshell/target/surefire-reports/*.xml
[linux-jdk7] [withMaven] junitPublisher - Jenkins JUnit Attachments Plugin not found, can't publish test attachments.Recording test results
[linux-jdk7] None of the test reports contained any result
[linux-jdk7] [withMaven] junitPublisher - Archive test results for Maven artifact org.apache.maven.plugin-tools:maven-script-beanshell:3.5.1-SNAPSHOT generated by maven-surefire-plugin:test (default-test): m/maven-script/maven-script-beanshell/target/surefire-reports/*.xml
[linux-jdk7] [withMaven] junitPublisher - Jenkins JUnit Attachments Plugin not found, can't publish test attachments.Recording test results
[linux-jdk7] None of the test reports contained any result
[linux-jdk7] [withMaven] junitPublisher - Archive test results for Maven artifact org.apache.maven.plugins:maven-plugin-plugin:3.5.1-SNAPSHOT generated by maven-surefire-plugin:test (default-test): m/maven-plugin-plugin/target/surefire-reports/*.xml
[linux-jdk7] [withMaven] junitPublisher - Jenkins JUnit Attachments Plugin not found, can't publish test attachments.Recording test results
[linux-jdk7] None of the test reports contained any result
[linux-jdk7] [withMaven] openTasksPublisher - Scan Tasks for Maven artifact org.apache.maven.plugin-tools:maven-plugin-tools-api:3.5.1-SNAPSHOT in source directory m/maven-plugin-tools-api/src/main/java
[linux-jdk7] [withMaven] openTasksPublisher - Scan Tasks for Maven artifact org.apache.maven.plugin-tools:maven-plugin-tools-generators:3.5.1-SNAPSHOT in source directory m/maven-plugin-tools-generators/src/main/java
[linux-jdk7] [withMaven] openTasksPublisher - Scan Tasks for Maven artifact org.apache.maven.plugin-tools:maven-plugin-tools-java:3.5.1-SNAPSHOT in source directory m/maven-plugin-tools-java/src/main/java
[linux-jdk7] [withMaven] openTasksPublisher - Scan Tasks for Maven artifact org.apache.maven.plugin-tools:maven-plugin-annotations:3.5.1-SNAPSHOT in source directory m/maven-plugin-annotations/src/main/java
[linux-jdk7] [withMaven] openTasksPublisher - Scan Tasks for Maven artifact org.apache.maven.plugin-tools:maven-plugin-tools-annotations:3.5.1-SNAPSHOT in source directory m/maven-plugin-tools-annotations/src/main/java
[linux-jdk7] [withMaven] openTasksPublisher - Scan Tasks for Maven artifact org.apache.maven.plugin-tools:maven-plugin-tools-javadoc:3.5.1-SNAPSHOT in source directory m/maven-plugin-tools-javadoc/src/main/java
[linux-jdk7] [withMaven] openTasksPublisher - Scan Tasks for Maven artifact org.apache.maven.plugin-tools:maven-plugin-tools-model:3.5.1-SNAPSHOT in source directory m/maven-script/maven-plugin-tools-model/src/main/java
[linux-jdk7] [withMaven] openTasksPublisher - Scan Tasks for Maven artifact org.apache.maven.plugin-tools:maven-plugin-tools-ant:3.5.1-SNAPSHOT in source directory m/maven-script/maven-plugin-tools-ant/src/main/java
[linux-jdk7] [withMaven] openTasksPublisher - Scan Tasks for Maven artifact org.apache.maven.plugin-tools:maven-script-ant:3.5.1-SNAPSHOT in source directory m/maven-script/maven-script-ant/src/main/java
[linux-jdk7] [withMaven] openTasksPublisher - Scan Tasks for Maven artifact org.apache.maven.plugin-tools:maven-plugin-tools-beanshell:3.5.1-SNAPSHOT in source directory m/maven-script/maven-plugin-tools-beanshell/src/main/java
[linux-jdk7] [withMaven] openTasksPublisher - Scan Tasks for Maven artifact org.apache.maven.plugin-tools:maven-script-beanshell:3.5.1-SNAPSHOT in source directory m/maven-script/maven-script-beanshell/src/main/java
[linux-jdk7] [withMaven] openTasksPublisher - Scan Tasks for Maven artifact org.apache.maven.plugins:maven-plugin-plugin:3.5.1-SNAPSHOT in source directory m/maven-plugin-plugin/src/main/java
[linux-jdk7] [TASKS] Scanning folder '/home/jenkins/jenkins-slave/workspace/plugin-tools_unstable-build-F7IS5RQOOI5GUPNSAK63UPHQT7SY6E4756WLWUVAGEDRDP2O7O3A' for files matching the pattern 'm/maven-plugin-tools-api/src/main/java/**/*,m/maven-plugin-tools-generators/src/main/java/**/*,m/maven-plugin-tools-java/src/main/java/**/*,m/maven-plugin-annotations/src/main/java/**/*,m/maven-plugin-tools-annotations/src/main/java/**/*,m/maven-plugin-tools-javadoc/src/main/java/**/*,m/maven-script/maven-plugin-tools-model/src/main/java/**/*,m/maven-script/maven-plugin-tools-ant/src/main/java/**/*,m/maven-script/maven-script-ant/src/main/java/**/*,m/maven-script/maven-plugin-tools-beanshell/src/main/java/**/*,m/maven-script/maven-script-beanshell/src/main/java/**/*,m/maven-plugin-plugin/src/main/java/**/*' - excludes: null
[linux-jdk7] [TASKS] Found 75 files to scan for tasks
[linux-jdk7] [TASKS] Found 11 open tasks.
[linux-jdk7] Skipping warnings blame since pipelines do not have an SCM link.%n
[Pipeline] [linux-jdk9] // node
[Pipeline] [windows-jdk7] // withMaven
[Pipeline] [linux-jdk8] // withMaven
[Pipeline] [linux-jdk7] // withMaven
[Pipeline] [linux-jdk9] }
[Pipeline] [windows-jdk7] }
[Pipeline] [windows-jdk8] }
[Pipeline] [windows-jdk9] }
[Pipeline] [linux-jdk8] }
[Pipeline] [linux-jdk7] }
[Pipeline] [windows-jdk7] // stage
[Pipeline] [windows-jdk8] // dir
[Pipeline] [windows-jdk9] // dir
[Pipeline] [linux-jdk8] // stage
[Pipeline] [linux-jdk7] // stage
[Pipeline] [linux-jdk7] }
[Pipeline] [linux-jdk8] }
[Pipeline] [windows-jdk7] }
[Pipeline] [windows-jdk8] }
[windows-jdk8] [withMaven] artifactsPublisher - Archive artifact m\pom.xml under org\apache\maven\plugin-tools\maven-plugin-tools\3.5.1-SNAPSHOT\maven-plugin-tools-3.5.1-SNAPSHOT.pom
[windows-jdk8] [withMaven] artifactsPublisher - Archive artifact m\maven-plugin-tools-api\pom.xml under org\apache\maven\plugin-tools\maven-plugin-tools-api\3.5.1-SNAPSHOT\maven-plugin-tools-api-3.5.1-SNAPSHOT.pom
[windows-jdk8] [withMaven] artifactsPublisher - Archive artifact m\maven-plugin-tools-api\target\maven-plugin-tools-api-3.5.1-SNAPSHOT.jar under org\apache\maven\plugin-tools\maven-plugin-tools-api\3.5.1-SNAPSHOT\maven-plugin-tools-api-3.5.1-SNAPSHOT.jar
[windows-jdk8] [withMaven] artifactsPublisher - Archive artifact m\maven-plugin-tools-generators\pom.xml under org\apache\maven\plugin-tools\maven-plugin-tools-generators\3.5.1-SNAPSHOT\maven-plugin-tools-generators-3.5.1-SNAPSHOT.pom
[windows-jdk8] [withMaven] artifactsPublisher - Archive artifact m\maven-plugin-tools-generators\target\maven-plugin-tools-generators-3.5.1-SNAPSHOT.jar under org\apache\maven\plugin-tools\maven-plugin-tools-generators\3.5.1-SNAPSHOT\maven-plugin-tools-generators-3.5.1-SNAPSHOT.jar
[windows-jdk8] [withMaven] artifactsPublisher - Archive artifact m\maven-plugin-tools-java\pom.xml under org\apache\maven\plugin-tools\maven-plugin-tools-java\3.5.1-SNAPSHOT\maven-plugin-tools-java-3.5.1-SNAPSHOT.pom
[windows-jdk8] [withMaven] artifactsPublisher - Archive artifact m\maven-plugin-tools-java\target\maven-plugin-tools-java-3.5.1-SNAPSHOT.jar under org\apache\maven\plugin-tools\maven-plugin-tools-java\3.5.1-SNAPSHOT\maven-plugin-tools-java-3.5.1-SNAPSHOT.jar
[windows-jdk8] [withMaven] artifactsPublisher - Archive artifact m\maven-plugin-annotations\pom.xml under org\apache\maven\plugin-tools\maven-plugin-annotations\3.5.1-SNAPSHOT\maven-plugin-annotations-3.5.1-SNAPSHOT.pom
[windows-jdk8] [withMaven] artifactsPublisher - Archive artifact m\maven-plugin-annotations\target\maven-plugin-annotations-3.5.1-SNAPSHOT.jar under org\apache\maven\plugin-tools\maven-plugin-annotations\3.5.1-SNAPSHOT\maven-plugin-annotations-3.5.1-SNAPSHOT.jar
[windows-jdk8] [withMaven] artifactsPublisher - Archive artifact m\maven-plugin-tools-annotations\pom.xml under org\apache\maven\plugin-tools\maven-plugin-tools-annotations\3.5.1-SNAPSHOT\maven-plugin-tools-annotations-3.5.1-SNAPSHOT.pom
[windows-jdk8] [withMaven] artifactsPublisher - Archive artifact m\maven-plugin-tools-annotations\target\maven-plugin-tools-annotations-3.5.1-SNAPSHOT.jar under org\apache\maven\plugin-tools\maven-plugin-tools-annotations\3.5.1-SNAPSHOT\maven-plugin-tools-annotations-3.5.1-SNAPSHOT.jar
[windows-jdk8] [withMaven] artifactsPublisher - Archive artifact m\maven-plugin-tools-javadoc\pom.xml under org\apache\maven\plugin-tools\maven-plugin-tools-javadoc\3.5.1-SNAPSHOT\maven-plugin-tools-javadoc-3.5.1-SNAPSHOT.pom
[windows-jdk8] [withMaven] artifactsPublisher - Archive artifact m\maven-plugin-tools-javadoc\target\maven-plugin-tools-javadoc-3.5.1-SNAPSHOT.jar under org\apache\maven\plugin-tools\maven-plugin-tools-javadoc\3.5.1-SNAPSHOT\maven-plugin-tools-javadoc-3.5.1-SNAPSHOT.jar
[windows-jdk8] [withMaven] artifactsPublisher - Archive artifact m\maven-script\pom.xml under org\apache\maven\plugin-tools\maven-script\3.5.1-SNAPSHOT\maven-script-3.5.1-SNAPSHOT.pom
[windows-jdk8] [withMaven] artifactsPublisher - Archive artifact m\maven-script\maven-plugin-tools-model\pom.xml under org\apache\maven\plugin-tools\maven-plugin-tools-model\3.5.1-SNAPSHOT\maven-plugin-tools-model-3.5.1-SNAPSHOT.pom
[windows-jdk8] [withMaven] artifactsPublisher - Archive artifact m\maven-script\maven-plugin-tools-model\target\maven-plugin-tools-model-3.5.1-SNAPSHOT.jar under org\apache\maven\plugin-tools\maven-plugin-tools-model\3.5.1-SNAPSHOT\maven-plugin-tools-model-3.5.1-SNAPSHOT.jar
[windows-jdk8] [withMaven] artifactsPublisher - Archive artifact m\maven-script\maven-plugin-tools-ant\pom.xml under org\apache\maven\plugin-tools\maven-plugin-tools-ant\3.5.1-SNAPSHOT\maven-plugin-tools-ant-3.5.1-SNAPSHOT.pom
[windows-jdk8] [withMaven] artifactsPublisher - Archive artifact m\maven-script\maven-plugin-tools-ant\target\maven-plugin-tools-ant-3.5.1-SNAPSHOT.jar under org\apache\maven\plugin-tools\maven-plugin-tools-ant\3.5.1-SNAPSHOT\maven-plugin-tools-ant-3.5.1-SNAPSHOT.jar
[windows-jdk8] [withMaven] artifactsPublisher - Archive artifact m\maven-script\maven-script-ant\pom.xml under org\apache\maven\plugin-tools\maven-script-ant\3.5.1-SNAPSHOT\maven-script-ant-3.5.1-SNAPSHOT.pom
[windows-jdk8] [withMaven] artifactsPublisher - Archive artifact m\maven-script\maven-script-ant\target\maven-script-ant-3.5.1-SNAPSHOT.jar under org\apache\maven\plugin-tools\maven-script-ant\3.5.1-SNAPSHOT\maven-script-ant-3.5.1-SNAPSHOT.jar
[windows-jdk8] [withMaven] artifactsPublisher - Archive artifact m\maven-script\maven-plugin-tools-beanshell\pom.xml under org\apache\maven\plugin-tools\maven-plugin-tools-beanshell\3.5.1-SNAPSHOT\maven-plugin-tools-beanshell-3.5.1-SNAPSHOT.pom
[windows-jdk8] [withMaven] artifactsPublisher - Archive artifact m\maven-script\maven-plugin-tools-beanshell\target\maven-plugin-tools-beanshell-3.5.1-SNAPSHOT.jar under org\apache\maven\plugin-tools\maven-plugin-tools-beanshell\3.5.1-SNAPSHOT\maven-plugin-tools-beanshell-3.5.1-SNAPSHOT.jar
[windows-jdk8] [withMaven] artifactsPublisher - Archive artifact m\maven-script\maven-script-beanshell\pom.xml under org\apache\maven\plugin-tools\maven-script-beanshell\3.5.1-SNAPSHOT\maven-script-beanshell-3.5.1-SNAPSHOT.pom
[windows-jdk8] [withMaven] artifactsPublisher - Archive artifact m\maven-script\maven-script-beanshell\target\maven-script-beanshell-3.5.1-SNAPSHOT.jar under org\apache\maven\plugin-tools\maven-script-beanshell\3.5.1-SNAPSHOT\maven-script-beanshell-3.5.1-SNAPSHOT.jar
[windows-jdk8] [withMaven] artifactsPublisher - Archive artifact m\maven-plugin-plugin\pom.xml under org\apache\maven\plugins\maven-plugin-plugin\3.5.1-SNAPSHOT\maven-plugin-plugin-3.5.1-SNAPSHOT.pom
[windows-jdk8] [withMaven] artifactsPublisher - Archive artifact m\maven-plugin-plugin\target\maven-plugin-plugin-3.5.1-SNAPSHOT.jar under org\apache\maven\plugins\maven-plugin-plugin\3.5.1-SNAPSHOT\maven-plugin-plugin-3.5.1-SNAPSHOT.jar
[windows-jdk8] [withMaven] artifactsPublisher - Archive artifact m\target\maven-plugin-tools-3.5.1-SNAPSHOT-site.xml under org\apache\maven\plugin-tools\maven-plugin-tools\3.5.1-SNAPSHOT\maven-plugin-tools-3.5.1-SNAPSHOT-site.xml
[windows-jdk8] [withMaven] artifactsPublisher - Archive artifact m\maven-plugin-tools-annotations\target\maven-plugin-tools-annotations-3.5.1-SNAPSHOT-tests.jar under org\apache\maven\plugin-tools\maven-plugin-tools-annotations\3.5.1-SNAPSHOT\maven-plugin-tools-annotations-3.5.1-SNAPSHOT-tests.jar
[windows-jdk8] [withMaven] artifactsPublisher - Archive artifact m\maven-plugin-tools-annotations\target\maven-plugin-tools-annotations-3.5.1-SNAPSHOT-test-sources.jar under org\apache\maven\plugin-tools\maven-plugin-tools-annotations\3.5.1-SNAPSHOT\maven-plugin-tools-annotations-3.5.1-SNAPSHOT-test-sources.jar
[windows-jdk8] [withMaven] artifactsPublisher - Archive artifact m\maven-script\target\maven-script-3.5.1-SNAPSHOT-site.xml under org\apache\maven\plugin-tools\maven-script\3.5.1-SNAPSHOT\maven-script-3.5.1-SNAPSHOT-site.xml
[windows-jdk8] [Fast Archiver] No prior successful build to compare, so performing full copy of artifacts
[windows-jdk8] [withMaven] junitPublisher - Archive test results for Maven artifact org.apache.maven.plugin-tools:maven-plugin-tools-api:3.5.1-SNAPSHOT generated by maven-surefire-plugin:test (default-test): m\maven-plugin-tools-api\target\surefire-reports\*.xml
[windows-jdk8] [withMaven] junitPublisher - Jenkins JUnit Attachments Plugin not found, can't publish test attachments.Recording test results
[windows-jdk8] [withMaven] junitPublisher - Archive test results for Maven artifact org.apache.maven.plugin-tools:maven-plugin-tools-generators:3.5.1-SNAPSHOT generated by maven-surefire-plugin:test (default-test): m\maven-plugin-tools-generators\target\surefire-reports\*.xml
[windows-jdk8] [withMaven] junitPublisher - Jenkins JUnit Attachments Plugin not found, can't publish test attachments.Recording test results
[windows-jdk8] [withMaven] junitPublisher - Archive test results for Maven artifact org.apache.maven.plugin-tools:maven-plugin-tools-java:3.5.1-SNAPSHOT generated by maven-surefire-plugin:test (default-test): m\maven-plugin-tools-java\target\surefire-reports\*.xml
[windows-jdk8] [withMaven] junitPublisher - Jenkins JUnit Attachments Plugin not found, can't publish test attachments.Recording test results
[windows-jdk8] [withMaven] junitPublisher - Archive test results for Maven artifact org.apache.maven.plugin-tools:maven-plugin-annotations:3.5.1-SNAPSHOT generated by maven-surefire-plugin:test (default-test): m\maven-plugin-annotations\target\surefire-reports\*.xml
[windows-jdk8] [withMaven] junitPublisher - Jenkins JUnit Attachments Plugin not found, can't publish test attachments.Recording test results
[windows-jdk8] None of the test reports contained any result
[windows-jdk8] [withMaven] junitPublisher - Archive test results for Maven artifact org.apache.maven.plugin-tools:maven-plugin-tools-annotations:3.5.1-SNAPSHOT generated by maven-surefire-plugin:test (default-test): m\maven-plugin-tools-annotations\target\surefire-reports\*.xml
[windows-jdk8] [withMaven] junitPublisher - Jenkins JUnit Attachments Plugin not found, can't publish test attachments.Recording test results
[windows-jdk8] [withMaven] junitPublisher - Archive test results for Maven artifact org.apache.maven.plugin-tools:maven-plugin-tools-javadoc:3.5.1-SNAPSHOT generated by maven-surefire-plugin:test (default-test): m\maven-plugin-tools-javadoc\target\surefire-reports\*.xml
[windows-jdk8] [withMaven] junitPublisher - Jenkins JUnit Attachments Plugin not found, can't publish test attachments.Recording test results
[windows-jdk8] None of the test reports contained any result
[windows-jdk8] [withMaven] junitPublisher - Archive test results for Maven artifact org.apache.maven.plugin-tools:maven-plugin-tools-model:3.5.1-SNAPSHOT generated by maven-surefire-plugin:test (default-test): m\maven-script\maven-plugin-tools-model\target\surefire-reports\*.xml
[windows-jdk8] [withMaven] junitPublisher - Jenkins JUnit Attachments Plugin not found, can't publish test attachments.Recording test results
[windows-jdk8] [withMaven] junitPublisher - Archive test results for Maven artifact org.apache.maven.plugin-tools:maven-plugin-tools-ant:3.5.1-SNAPSHOT generated by maven-surefire-plugin:test (default-test): m\maven-script\maven-plugin-tools-ant\target\surefire-reports\*.xml
[windows-jdk8] [withMaven] junitPublisher - Jenkins JUnit Attachments Plugin not found, can't publish test attachments.Recording test results
[windows-jdk8] [withMaven] junitPublisher - Archive test results for Maven artifact org.apache.maven.plugin-tools:maven-script-ant:3.5.1-SNAPSHOT generated by maven-surefire-plugin:test (default-test): m\maven-script\maven-script-ant\target\surefire-reports\*.xml
[windows-jdk8] [withMaven] junitPublisher - Jenkins JUnit Attachments Plugin not found, can't publish test attachments.Recording test results
[windows-jdk8] [withMaven] junitPublisher - Archive test results for Maven artifact org.apache.maven.plugin-tools:maven-plugin-tools-beanshell:3.5.1-SNAPSHOT generated by maven-surefire-plugin:test (default-test): m\maven-script\maven-plugin-tools-beanshell\target\surefire-reports\*.xml
[windows-jdk8] [withMaven] junitPublisher - Jenkins JUnit Attachments Plugin not found, can't publish test attachments.Recording test results
[windows-jdk8] None of the test reports contained any result
[windows-jdk8] [withMaven] junitPublisher - Archive test results for Maven artifact org.apache.maven.plugin-tools:maven-script-beanshell:3.5.1-SNAPSHOT generated by maven-surefire-plugin:test (default-test): m\maven-script\maven-script-beanshell\target\surefire-reports\*.xml
[windows-jdk8] [withMaven] junitPublisher - Jenkins JUnit Attachments Plugin not found, can't publish test attachments.Recording test results
[windows-jdk8] None of the test reports contained any result
[windows-jdk8] [withMaven] junitPublisher - Archive test results for Maven artifact org.apache.maven.plugins:maven-plugin-plugin:3.5.1-SNAPSHOT generated by maven-surefire-plugin:test (default-test): m\maven-plugin-plugin\target\surefire-reports\*.xml
[windows-jdk8] [withMaven] junitPublisher - Jenkins JUnit Attachments Plugin not found, can't publish test attachments.Recording test results
[windows-jdk8] None of the test reports contained any result
[windows-jdk8] [withMaven] openTasksPublisher - Scan Tasks for Maven artifact org.apache.maven.plugin-tools:maven-plugin-tools-api:3.5.1-SNAPSHOT in source directory m\maven-plugin-tools-api\src\main\java
[windows-jdk8] [withMaven] openTasksPublisher - Scan Tasks for Maven artifact org.apache.maven.plugin-tools:maven-plugin-tools-generators:3.5.1-SNAPSHOT in source directory m\maven-plugin-tools-generators\src\main\java
[windows-jdk8] [withMaven] openTasksPublisher - Scan Tasks for Maven artifact org.apache.maven.plugin-tools:maven-plugin-tools-java:3.5.1-SNAPSHOT in source directory m\maven-plugin-tools-java\src\main\java
[windows-jdk8] [withMaven] openTasksPublisher - Scan Tasks for Maven artifact org.apache.maven.plugin-tools:maven-plugin-annotations:3.5.1-SNAPSHOT in source directory m\maven-plugin-annotations\src\main\java
[windows-jdk8] [withMaven] openTasksPublisher - Scan Tasks for Maven artifact org.apache.maven.plugin-tools:maven-plugin-tools-annotations:3.5.1-SNAPSHOT in source directory m\maven-plugin-tools-annotations\src\main\java
[windows-jdk8] [withMaven] openTasksPublisher - Scan Tasks for Maven artifact org.apache.maven.plugin-tools:maven-plugin-tools-javadoc:3.5.1-SNAPSHOT in source directory m\maven-plugin-tools-javadoc\src\main\java
[windows-jdk8] [withMaven] openTasksPublisher - Scan Tasks for Maven artifact org.apache.maven.plugin-tools:maven-plugin-tools-model:3.5.1-SNAPSHOT in source directory m\maven-script\maven-plugin-tools-model\src\main\java
[windows-jdk8] [withMaven] openTasksPublisher - Scan Tasks for Maven artifact org.apache.maven.plugin-tools:maven-plugin-tools-ant:3.5.1-SNAPSHOT in source directory m\maven-script\maven-plugin-tools-ant\src\main\java
[windows-jdk8] [withMaven] openTasksPublisher - Scan Tasks for Maven artifact org.apache.maven.plugin-tools:maven-script-ant:3.5.1-SNAPSHOT in source directory m\maven-script\maven-script-ant\src\main\java
[windows-jdk8] [withMaven] openTasksPublisher - Scan Tasks for Maven artifact org.apache.maven.plugin-tools:maven-plugin-tools-beanshell:3.5.1-SNAPSHOT in source directory m\maven-script\maven-plugin-tools-beanshell\src\main\java
[windows-jdk8] [withMaven] openTasksPublisher - Scan Tasks for Maven artifact org.apache.maven.plugin-tools:maven-script-beanshell:3.5.1-SNAPSHOT in source directory m\maven-script\maven-script-beanshell\src\main\java
[windows-jdk8] [withMaven] openTasksPublisher - Scan Tasks for Maven artifact org.apache.maven.plugins:maven-plugin-plugin:3.5.1-SNAPSHOT in source directory m\maven-plugin-plugin\src\main\java
[windows-jdk8] [TASKS] Scanning folder 'f:\jenkins\jenkins-slave\workspace\plugin-tools_unstable-build-F7IS5RQOOI5GUPNSAK63UPHQT7SY6E4756WLWUVAGEDRDP2O7O3A' for files matching the pattern 'm\maven-plugin-tools-api\src\main\java\**\*,m\maven-plugin-tools-generators\src\main\java\**\*,m\maven-plugin-tools-java\src\main\java\**\*,m\maven-plugin-annotations\src\main\java\**\*,m\maven-plugin-tools-annotations\src\main\java\**\*,m\maven-plugin-tools-javadoc\src\main\java\**\*,m\maven-script\maven-plugin-tools-model\src\main\java\**\*,m\maven-script\maven-plugin-tools-ant\src\main\java\**\*,m\maven-script\maven-script-ant\src\main\java\**\*,m\maven-script\maven-plugin-tools-beanshell\src\main\java\**\*,m\maven-script\maven-script-beanshell\src\main\java\**\*,m\maven-plugin-plugin\src\main\java\**\*' - excludes: null
[windows-jdk8] [TASKS] Found 75 files to scan for tasks
[windows-jdk8] [TASKS] Found 11 open tasks.
[windows-jdk8] Skipping warnings blame since pipelines do not have an SCM link.%n
[Pipeline] [windows-jdk9] }
[windows-jdk9] [withMaven] artifactsPublisher - Archive artifact m\pom.xml under org\apache\maven\plugin-tools\maven-plugin-tools\3.5.1-SNAPSHOT\maven-plugin-tools-3.5.1-SNAPSHOT.pom
[windows-jdk9] [withMaven] artifactsPublisher - Archive artifact m\maven-plugin-tools-api\pom.xml under org\apache\maven\plugin-tools\maven-plugin-tools-api\3.5.1-SNAPSHOT\maven-plugin-tools-api-3.5.1-SNAPSHOT.pom
[windows-jdk9] [withMaven] artifactsPublisher - Archive artifact m\maven-plugin-tools-api\target\maven-plugin-tools-api-3.5.1-SNAPSHOT.jar under org\apache\maven\plugin-tools\maven-plugin-tools-api\3.5.1-SNAPSHOT\maven-plugin-tools-api-3.5.1-SNAPSHOT.jar
[windows-jdk9] [withMaven] artifactsPublisher - Archive artifact m\maven-plugin-tools-generators\pom.xml under org\apache\maven\plugin-tools\maven-plugin-tools-generators\3.5.1-SNAPSHOT\maven-plugin-tools-generators-3.5.1-SNAPSHOT.pom
[windows-jdk9] [withMaven] artifactsPublisher - Archive artifact m\maven-plugin-tools-generators\target\maven-plugin-tools-generators-3.5.1-SNAPSHOT.jar under org\apache\maven\plugin-tools\maven-plugin-tools-generators\3.5.1-SNAPSHOT\maven-plugin-tools-generators-3.5.1-SNAPSHOT.jar
[windows-jdk9] [withMaven] artifactsPublisher - Archive artifact m\maven-plugin-tools-java\pom.xml under org\apache\maven\plugin-tools\maven-plugin-tools-java\3.5.1-SNAPSHOT\maven-plugin-tools-java-3.5.1-SNAPSHOT.pom
[windows-jdk9] [withMaven] artifactsPublisher - Archive artifact m\maven-plugin-tools-java\target\maven-plugin-tools-java-3.5.1-SNAPSHOT.jar under org\apache\maven\plugin-tools\maven-plugin-tools-java\3.5.1-SNAPSHOT\maven-plugin-tools-java-3.5.1-SNAPSHOT.jar
[windows-jdk9] [withMaven] artifactsPublisher - Archive artifact m\maven-plugin-annotations\pom.xml under org\apache\maven\plugin-tools\maven-plugin-annotations\3.5.1-SNAPSHOT\maven-plugin-annotations-3.5.1-SNAPSHOT.pom
[windows-jdk9] [withMaven] artifactsPublisher - Archive artifact m\maven-plugin-annotations\target\maven-plugin-annotations-3.5.1-SNAPSHOT.jar under org\apache\maven\plugin-tools\maven-plugin-annotations\3.5.1-SNAPSHOT\maven-plugin-annotations-3.5.1-SNAPSHOT.jar
[windows-jdk9] [withMaven] artifactsPublisher - Archive artifact m\maven-plugin-tools-annotations\pom.xml under org\apache\maven\plugin-tools\maven-plugin-tools-annotations\3.5.1-SNAPSHOT\maven-plugin-tools-annotations-3.5.1-SNAPSHOT.pom
[windows-jdk9] [withMaven] artifactsPublisher - Archive artifact m\maven-plugin-tools-annotations\target\maven-plugin-tools-annotations-3.5.1-SNAPSHOT.jar under org\apache\maven\plugin-tools\maven-plugin-tools-annotations\3.5.1-SNAPSHOT\maven-plugin-tools-annotations-3.5.1-SNAPSHOT.jar
[windows-jdk9] [withMaven] artifactsPublisher - Archive artifact m\maven-plugin-tools-javadoc\pom.xml under org\apache\maven\plugin-tools\maven-plugin-tools-javadoc\3.5.1-SNAPSHOT\maven-plugin-tools-javadoc-3.5.1-SNAPSHOT.pom
[windows-jdk9] [withMaven] artifactsPublisher - Archive artifact m\maven-plugin-tools-javadoc\target\maven-plugin-tools-javadoc-3.5.1-SNAPSHOT.jar under org\apache\maven\plugin-tools\maven-plugin-tools-javadoc\3.5.1-SNAPSHOT\maven-plugin-tools-javadoc-3.5.1-SNAPSHOT.jar
[windows-jdk9] [withMaven] artifactsPublisher - Archive artifact m\maven-script\pom.xml under org\apache\maven\plugin-tools\maven-script\3.5.1-SNAPSHOT\maven-script-3.5.1-SNAPSHOT.pom
[windows-jdk9] [withMaven] artifactsPublisher - Archive artifact m\maven-script\maven-plugin-tools-model\pom.xml under org\apache\maven\plugin-tools\maven-plugin-tools-model\3.5.1-SNAPSHOT\maven-plugin-tools-model-3.5.1-SNAPSHOT.pom
[windows-jdk9] [withMaven] artifactsPublisher - Archive artifact m\maven-script\maven-plugin-tools-model\target\maven-plugin-tools-model-3.5.1-SNAPSHOT.jar under org\apache\maven\plugin-tools\maven-plugin-tools-model\3.5.1-SNAPSHOT\maven-plugin-tools-model-3.5.1-SNAPSHOT.jar
[windows-jdk9] [withMaven] artifactsPublisher - Archive artifact m\maven-script\maven-plugin-tools-ant\pom.xml under org\apache\maven\plugin-tools\maven-plugin-tools-ant\3.5.1-SNAPSHOT\maven-plugin-tools-ant-3.5.1-SNAPSHOT.pom
[windows-jdk9] [withMaven] artifactsPublisher - Archive artifact m\maven-script\maven-plugin-tools-ant\target\maven-plugin-tools-ant-3.5.1-SNAPSHOT.jar under org\apache\maven\plugin-tools\maven-plugin-tools-ant\3.5.1-SNAPSHOT\maven-plugin-tools-ant-3.5.1-SNAPSHOT.jar
[windows-jdk9] [withMaven] artifactsPublisher - Archive artifact m\maven-script\maven-script-ant\pom.xml under org\apache\maven\plugin-tools\maven-script-ant\3.5.1-SNAPSHOT\maven-script-ant-3.5.1-SNAPSHOT.pom
[windows-jdk9] [withMaven] artifactsPublisher - Archive artifact m\maven-script\maven-script-ant\target\maven-script-ant-3.5.1-SNAPSHOT.jar under org\apache\maven\plugin-tools\maven-script-ant\3.5.1-SNAPSHOT\maven-script-ant-3.5.1-SNAPSHOT.jar
[windows-jdk9] [withMaven] artifactsPublisher - Archive artifact m\maven-script\maven-plugin-tools-beanshell\pom.xml under org\apache\maven\plugin-tools\maven-plugin-tools-beanshell\3.5.1-SNAPSHOT\maven-plugin-tools-beanshell-3.5.1-SNAPSHOT.pom
[windows-jdk9] [withMaven] artifactsPublisher - Archive artifact m\maven-script\maven-plugin-tools-beanshell\target\maven-plugin-tools-beanshell-3.5.1-SNAPSHOT.jar under org\apache\maven\plugin-tools\maven-plugin-tools-beanshell\3.5.1-SNAPSHOT\maven-plugin-tools-beanshell-3.5.1-SNAPSHOT.jar
[windows-jdk9] [withMaven] artifactsPublisher - Archive artifact m\maven-script\maven-script-beanshell\pom.xml under org\apache\maven\plugin-tools\maven-script-beanshell\3.5.1-SNAPSHOT\maven-script-beanshell-3.5.1-SNAPSHOT.pom
[windows-jdk9] [withMaven] artifactsPublisher - Archive artifact m\maven-script\maven-script-beanshell\target\maven-script-beanshell-3.5.1-SNAPSHOT.jar under org\apache\maven\plugin-tools\maven-script-beanshell\3.5.1-SNAPSHOT\maven-script-beanshell-3.5.1-SNAPSHOT.jar
[windows-jdk9] [withMaven] artifactsPublisher - Archive artifact m\maven-plugin-plugin\pom.xml under org\apache\maven\plugins\maven-plugin-plugin\3.5.1-SNAPSHOT\maven-plugin-plugin-3.5.1-SNAPSHOT.pom
[windows-jdk9] [withMaven] artifactsPublisher - Archive artifact m\maven-plugin-plugin\target\maven-plugin-plugin-3.5.1-SNAPSHOT.jar under org\apache\maven\plugins\maven-plugin-plugin\3.5.1-SNAPSHOT\maven-plugin-plugin-3.5.1-SNAPSHOT.jar
[windows-jdk9] [withMaven] artifactsPublisher - Archive artifact m\target\maven-plugin-tools-3.5.1-SNAPSHOT-site.xml under org\apache\maven\plugin-tools\maven-plugin-tools\3.5.1-SNAPSHOT\maven-plugin-tools-3.5.1-SNAPSHOT-site.xml
[windows-jdk9] [withMaven] artifactsPublisher - Archive artifact m\maven-plugin-tools-annotations\target\maven-plugin-tools-annotations-3.5.1-SNAPSHOT-tests.jar under org\apache\maven\plugin-tools\maven-plugin-tools-annotations\3.5.1-SNAPSHOT\maven-plugin-tools-annotations-3.5.1-SNAPSHOT-tests.jar
[windows-jdk9] [withMaven] artifactsPublisher - Archive artifact m\maven-plugin-tools-annotations\target\maven-plugin-tools-annotations-3.5.1-SNAPSHOT-test-sources.jar under org\apache\maven\plugin-tools\maven-plugin-tools-annotations\3.5.1-SNAPSHOT\maven-plugin-tools-annotations-3.5.1-SNAPSHOT-test-sources.jar
[windows-jdk9] [withMaven] artifactsPublisher - Archive artifact m\maven-script\target\maven-script-3.5.1-SNAPSHOT-site.xml under org\apache\maven\plugin-tools\maven-script\3.5.1-SNAPSHOT\maven-script-3.5.1-SNAPSHOT-site.xml
[windows-jdk9] [Fast Archiver] No prior successful build to compare, so performing full copy of artifacts
[windows-jdk9] [withMaven] junitPublisher - Archive test results for Maven artifact org.apache.maven.plugin-tools:maven-plugin-tools-api:3.5.1-SNAPSHOT generated by maven-surefire-plugin:test (default-test): m\maven-plugin-tools-api\target\surefire-reports\*.xml
[windows-jdk9] [withMaven] junitPublisher - Jenkins JUnit Attachments Plugin not found, can't publish test attachments.Recording test results
[windows-jdk9] [withMaven] junitPublisher - Archive test results for Maven artifact org.apache.maven.plugin-tools:maven-plugin-tools-generators:3.5.1-SNAPSHOT generated by maven-surefire-plugin:test (default-test): m\maven-plugin-tools-generators\target\surefire-reports\*.xml
[windows-jdk9] [withMaven] junitPublisher - Jenkins JUnit Attachments Plugin not found, can't publish test attachments.Recording test results
[windows-jdk9] [withMaven] junitPublisher - Archive test results for Maven artifact org.apache.maven.plugin-tools:maven-plugin-tools-java:3.5.1-SNAPSHOT generated by maven-surefire-plugin:test (default-test): m\maven-plugin-tools-java\target\surefire-reports\*.xml
[windows-jdk9] [withMaven] junitPublisher - Jenkins JUnit Attachments Plugin not found, can't publish test attachments.Recording test results
[windows-jdk9] [withMaven] junitPublisher - Archive test results for Maven artifact org.apache.maven.plugin-tools:maven-plugin-annotations:3.5.1-SNAPSHOT generated by maven-surefire-plugin:test (default-test): m\maven-plugin-annotations\target\surefire-reports\*.xml
[windows-jdk9] [withMaven] junitPublisher - Jenkins JUnit Attachments Plugin not found, can't publish test attachments.Recording test results
[windows-jdk9] None of the test reports contained any result
[windows-jdk9] [withMaven] junitPublisher - Archive test results for Maven artifact org.apache.maven.plugin-tools:maven-plugin-tools-annotations:3.5.1-SNAPSHOT generated by maven-surefire-plugin:test (default-test): m\maven-plugin-tools-annotations\target\surefire-reports\*.xml
[windows-jdk9] [withMaven] junitPublisher - Jenkins JUnit Attachments Plugin not found, can't publish test attachments.Recording test results
[windows-jdk9] [withMaven] junitPublisher - Archive test results for Maven artifact org.apache.maven.plugin-tools:maven-plugin-tools-javadoc:3.5.1-SNAPSHOT generated by maven-surefire-plugin:test (default-test): m\maven-plugin-tools-javadoc\target\surefire-reports\*.xml
[windows-jdk9] [withMaven] junitPublisher - Jenkins JUnit Attachments Plugin not found, can't publish test attachments.Recording test results
[windows-jdk9] None of the test reports contained any result
[windows-jdk9] [withMaven] junitPublisher - Archive test results for Maven artifact org.apache.maven.plugin-tools:maven-plugin-tools-model:3.5.1-SNAPSHOT generated by maven-surefire-plugin:test (default-test): m\maven-script\maven-plugin-tools-model\target\surefire-reports\*.xml
[windows-jdk9] [withMaven] junitPublisher - Jenkins JUnit Attachments Plugin not found, can't publish test attachments.Recording test results
[windows-jdk9] [withMaven] junitPublisher - Archive test results for Maven artifact org.apache.maven.plugin-tools:maven-plugin-tools-ant:3.5.1-SNAPSHOT generated by maven-surefire-plugin:test (default-test): m\maven-script\maven-plugin-tools-ant\target\surefire-reports\*.xml
[windows-jdk9] [withMaven] junitPublisher - Jenkins JUnit Attachments Plugin not found, can't publish test attachments.Recording test results
[windows-jdk9] [withMaven] junitPublisher - Archive test results for Maven artifact org.apache.maven.plugin-tools:maven-script-ant:3.5.1-SNAPSHOT generated by maven-surefire-plugin:test (default-test): m\maven-script\maven-script-ant\target\surefire-reports\*.xml
[windows-jdk9] [withMaven] junitPublisher - Jenkins JUnit Attachments Plugin not found, can't publish test attachments.Recording test results
[windows-jdk9] [withMaven] junitPublisher - Archive test results for Maven artifact org.apache.maven.plugin-tools:maven-plugin-tools-beanshell:3.5.1-SNAPSHOT generated by maven-surefire-plugin:test (default-test): m\maven-script\maven-plugin-tools-beanshell\target\surefire-reports\*.xml
[windows-jdk9] [withMaven] junitPublisher - Jenkins JUnit Attachments Plugin not found, can't publish test attachments.Recording test results
[windows-jdk9] None of the test reports contained any result
[windows-jdk9] [withMaven] junitPublisher - Archive test results for Maven artifact org.apache.maven.plugin-tools:maven-script-beanshell:3.5.1-SNAPSHOT generated by maven-surefire-plugin:test (default-test): m\maven-script\maven-script-beanshell\target\surefire-reports\*.xml
[windows-jdk9] [withMaven] junitPublisher - Jenkins JUnit Attachments Plugin not found, can't publish test attachments.Recording test results
[windows-jdk9] None of the test reports contained any result
[windows-jdk9] [withMaven] junitPublisher - Archive test results for Maven artifact org.apache.maven.plugins:maven-plugin-plugin:3.5.1-SNAPSHOT generated by maven-surefire-plugin:test (default-test): m\maven-plugin-plugin\target\surefire-reports\*.xml
[windows-jdk9] [withMaven] junitPublisher - Jenkins JUnit Attachments Plugin not found, can't publish test attachments.Recording test results
[windows-jdk9] None of the test reports contained any result
[windows-jdk9] [withMaven] openTasksPublisher - Scan Tasks for Maven artifact org.apache.maven.plugin-tools:maven-plugin-tools-api:3.5.1-SNAPSHOT in source directory m\maven-plugin-tools-api\src\main\java
[windows-jdk9] [withMaven] openTasksPublisher - Scan Tasks for Maven artifact org.apache.maven.plugin-tools:maven-plugin-tools-generators:3.5.1-SNAPSHOT in source directory m\maven-plugin-tools-generators\src\main\java
[windows-jdk9] [withMaven] openTasksPublisher - Scan Tasks for Maven artifact org.apache.maven.plugin-tools:maven-plugin-tools-java:3.5.1-SNAPSHOT in source directory m\maven-plugin-tools-java\src\main\java
[windows-jdk9] [withMaven] openTasksPublisher - Scan Tasks for Maven artifact org.apache.maven.plugin-tools:maven-plugin-annotations:3.5.1-SNAPSHOT in source directory m\maven-plugin-annotations\src\main\java
[windows-jdk9] [withMaven] openTasksPublisher - Scan Tasks for Maven artifact org.apache.maven.plugin-tools:maven-plugin-tools-annotations:3.5.1-SNAPSHOT in source directory m\maven-plugin-tools-annotations\src\main\java
[windows-jdk9] [withMaven] openTasksPublisher - Scan Tasks for Maven artifact org.apache.maven.plugin-tools:maven-plugin-tools-javadoc:3.5.1-SNAPSHOT in source directory m\maven-plugin-tools-javadoc\src\main\java
[windows-jdk9] [withMaven] openTasksPublisher - Scan Tasks for Maven artifact org.apache.maven.plugin-tools:maven-plugin-tools-model:3.5.1-SNAPSHOT in source directory m\maven-script\maven-plugin-tools-model\src\main\java
[windows-jdk9] [withMaven] openTasksPublisher - Scan Tasks for Maven artifact org.apache.maven.plugin-tools:maven-plugin-tools-ant:3.5.1-SNAPSHOT in source directory m\maven-script\maven-plugin-tools-ant\src\main\java
[windows-jdk9] [withMaven] openTasksPublisher - Scan Tasks for Maven artifact org.apache.maven.plugin-tools:maven-script-ant:3.5.1-SNAPSHOT in source directory m\maven-script\maven-script-ant\src\main\java
[windows-jdk9] [withMaven] openTasksPublisher - Scan Tasks for Maven artifact org.apache.maven.plugin-tools:maven-plugin-tools-beanshell:3.5.1-SNAPSHOT in source directory m\maven-script\maven-plugin-tools-beanshell\src\main\java
[windows-jdk9] [withMaven] openTasksPublisher - Scan Tasks for Maven artifact org.apache.maven.plugin-tools:maven-script-beanshell:3.5.1-SNAPSHOT in source directory m\maven-script\maven-script-beanshell\src\main\java
[windows-jdk9] [withMaven] openTasksPublisher - Scan Tasks for Maven artifact org.apache.maven.plugins:maven-plugin-plugin:3.5.1-SNAPSHOT in source directory m\maven-plugin-plugin\src\main\java
[windows-jdk9] [TASKS] Scanning folder 'f:\jenkins\jenkins-slave\workspace\plugin-tools_unstable-build-F7IS5RQOOI5GUPNSAK63UPHQT7SY6E4756WLWUVAGEDRDP2O7O3A@2' for files matching the pattern 'm\maven-plugin-tools-api\src\main\java\**\*,m\maven-plugin-tools-generators\src\main\java\**\*,m\maven-plugin-tools-java\src\main\java\**\*,m\maven-plugin-annotations\src\main\java\**\*,m\maven-plugin-tools-annotations\src\main\java\**\*,m\maven-plugin-tools-javadoc\src\main\java\**\*,m\maven-script\maven-plugin-tools-model\src\main\java\**\*,m\maven-script\maven-plugin-tools-ant\src\main\java\**\*,m\maven-script\maven-script-ant\src\main\java\**\*,m\maven-script\maven-plugin-tools-beanshell\src\main\java\**\*,m\maven-script\maven-script-beanshell\src\main\java\**\*,m\maven-plugin-plugin\src\main\java\**\*' - excludes: null
[windows-jdk9] [TASKS] Found 75 files to scan for tasks
[windows-jdk9] [TASKS] Found 11 open tasks.
[windows-jdk9] Skipping warnings blame since pipelines do not have an SCM link.%n
[Pipeline] [linux-jdk7] // node
[Pipeline] [linux-jdk8] // node
[Pipeline] [windows-jdk7] // node
[Pipeline] [windows-jdk8] // withMaven
[Pipeline] [windows-jdk9] // withMaven
[Pipeline] [linux-jdk7] }
[Pipeline] [linux-jdk8] }
[Pipeline] [windows-jdk7] }
[Pipeline] [windows-jdk8] }
[Pipeline] [windows-jdk9] }
[Pipeline] [windows-jdk8] // stage
[Pipeline] [windows-jdk9] // stage
[Pipeline] [windows-jdk8] }
[Pipeline] [windows-jdk9] }
[Pipeline] [windows-jdk8] // node
[Pipeline] [windows-jdk9] // node
[Pipeline] [windows-jdk8] }
[Pipeline] [windows-jdk9] }
[Pipeline] // parallel
[Pipeline] stage
[Pipeline] { (Notifications)
[Pipeline] echo
Build result: UNSTABLE
[Pipeline] jiraIssueSelector
[Pipeline] emailext