Build unstable in Jenkins: Maven TLP » maven-javadoc-plugin » master #80

classic Classic list List threaded Threaded
4 messages Options
Reply | Threaded
Open this post in threaded view
|

Build unstable in Jenkins: Maven TLP » maven-javadoc-plugin » master #80

Apache Jenkins Server-2
See https://builds.apache.org/job/maven-box/job/maven-javadoc-plugin/job/master/80/

Changes:

* add Maven 3.1.1
* plexus-java version as a property to ease testing

11 tests failed.
FAILED:  org.apache.maven.plugins.javadoc.JavadocUtilTest.linux-jdk8-m3.6.x_build / Build linux-jdk8-m3.6.x_build / testIsValidPackageList

Error Message:
Read timed out

Stack Trace:
java.net.SocketTimeoutException: Read timed out
        at org.apache.maven.plugins.javadoc.JavadocUtilTest.testIsValidPackageList(JavadocUtilTest.java:395)


FAILED:  org.apache.maven.plugins.javadoc.JavadocUtilTest.linux-jdk14-m3.6.x_build / Build linux-jdk14-m3.6.x_build / testIsValidPackageList

Error Message:
Read timed out

Stack Trace:
java.net.SocketTimeoutException: Read timed out
        at org.apache.maven.plugins.javadoc.JavadocUtilTest.testIsValidPackageList(JavadocUtilTest.java:326)


FAILED:  org.apache.maven.plugins.javadoc.AbstractJavadocMojoTest.windows-jdk8-m3.6.x_build / Build windows-jdk8-m3.6.x_build / testMJAVADOC527_DetectLinksRecursion

Error Message:
null

Stack Trace:
junit.framework.AssertionFailedError
        at org.apache.maven.plugins.javadoc.AbstractJavadocMojoTest.testMJAVADOC527_DetectLinksRecursion(AbstractJavadocMojoTest.java:88)


FAILED:  org.apache.maven.plugins.javadoc.JavadocUtilTest.windows-jdk8-m3.6.x_build / Build windows-jdk8-m3.6.x_build / testIsValidPackageList

Error Message:
Read timed out

Stack Trace:
java.net.SocketTimeoutException: Read timed out
        at org.apache.maven.plugins.javadoc.JavadocUtilTest.testIsValidPackageList(JavadocUtilTest.java:395)


FAILED:  org.apache.maven.plugins.javadoc.JavadocUtilTest.windows-jdk7-m3.2.x_build / Build windows-jdk7-m3.2.x_build / testIsValidPackageList

Error Message:
Read timed out

Stack Trace:
java.net.SocketTimeoutException: Read timed out
        at org.apache.maven.plugins.javadoc.JavadocUtilTest.testIsValidPackageList(JavadocUtilTest.java:395)


FAILED:  org.apache.maven.plugins.javadoc.JavadocUtilTest.linux-jdk7-m3.6.x_build / Build linux-jdk7-m3.6.x_build / testIsValidPackageList

Error Message:
Read timed out

Stack Trace:
java.net.SocketTimeoutException: Read timed out
        at org.apache.maven.plugins.javadoc.JavadocUtilTest.testIsValidPackageList(JavadocUtilTest.java:395)


FAILED:  org.apache.maven.plugins.javadoc.JavadocUtilTest.linux-jdk7-m3.3.x_build / Build linux-jdk7-m3.3.x_build / testIsValidPackageList

Error Message:
Read timed out

Stack Trace:
java.net.SocketTimeoutException: Read timed out
        at org.apache.maven.plugins.javadoc.JavadocUtilTest.testIsValidPackageList(JavadocUtilTest.java:302)


FAILED:  org.apache.maven.plugins.javadoc.JavadocUtilTest.linux-jdk7-m3.5.x_build / Build linux-jdk7-m3.5.x_build / testIsValidPackageList

Error Message:
Read timed out

Stack Trace:
java.net.SocketTimeoutException: Read timed out
        at org.apache.maven.plugins.javadoc.JavadocUtilTest.testIsValidPackageList(JavadocUtilTest.java:326)


FAILED:  org.apache.maven.plugins.javadoc.JavadocUtilTest.windows-jdk14-m3.6.x_build / Build windows-jdk14-m3.6.x_build / testIsValidPackageList

Error Message:
Read timed out

Stack Trace:
java.net.SocketTimeoutException: Read timed out
        at org.apache.maven.plugins.javadoc.JavadocUtilTest.testIsValidPackageList(JavadocUtilTest.java:395)


FAILED:  org.apache.maven.plugins.javadoc.AbstractJavadocMojoTest.windows-jdk11-m3.6.x_build / Build windows-jdk11-m3.6.x_build / testMJAVADOC527_DetectLinksRecursion

Error Message:
null

Stack Trace:
junit.framework.AssertionFailedError
        at org.apache.maven.plugins.javadoc.AbstractJavadocMojoTest.testMJAVADOC527_DetectLinksRecursion(AbstractJavadocMojoTest.java:88)


FAILED:  org.apache.maven.plugins.javadoc.JavadocUtilTest.windows-jdk11-m3.6.x_build / Build windows-jdk11-m3.6.x_build / testIsValidPackageList

Error Message:
Read timed out

Stack Trace:
java.net.SocketTimeoutException: Read timed out
        at org.apache.maven.plugins.javadoc.JavadocUtilTest.testIsValidPackageList(JavadocUtilTest.java:395)




Build log:
[...truncated 8911 lines...]
[INFO]           MJAVADOC-568_jar-mixed\pom.xml ................... SUCCESS (15.0 s)
[INFO] Building: MJAVADOC-568_manifest-splitpackage\pom.xml
[INFO] run post-build script verify.bsh
[INFO]           dependencySource-4/pom.xml ....................... SUCCESS (28.5 s)
[INFO] Building: MJAVADOC-137_jar/pom.xml
[INFO] run post-build script verify.groovy
[INFO]           MJAVADOC-613-aggregate-exclude\pom.xml ........... SUCCESS (16.0 s)
[INFO] Building: MJAVADOC-620_no-dot-in-version\pom.xml
[INFO] run post-build script verify.bsh
[INFO]           MJAVADOC-137_jar/pom.xml ......................... SUCCESS (12.2 s)
[INFO] Building: MJAVADOC-498_modulepath/pom.xml
[INFO]           MJAVADOC-498_modulepath/pom.xml .................. SKIPPED due to JRE version
[INFO]
[INFO] --- mrm-maven-plugin:1.1.0:stop (repository) @ maven-javadoc-plugin ---
[INFO] Stopping Mock Repository Manager on http://localhost:38467
[INFO] Stopped SocketConnector@0.0.0.0:38467
[INFO] Mock Repository Manager http://localhost:38467 is stopped.
[INFO]
[INFO] --- mrm-maven-plugin:1.1.0:stop (3rdparty) @ maven-javadoc-plugin ---
[INFO] Stopping Mock Repository Manager on http://localhost:35999
[INFO] Stopped SocketConnector@0.0.0.0:35999
[INFO] Mock Repository Manager http://localhost:35999 is stopped.
[INFO]
[INFO] --- maven-checkstyle-plugin:3.0.0:check (checkstyle-check) @ maven-javadoc-plugin ---
[INFO]           MJAVADOC-568_manifest-splitpackage\pom.xml ....... SUCCESS (20.6 s)
[INFO] Building: MJAVADOC-569_aggr-mixed\pom.xml
[INFO] There are 4 errors reported by Checkstyle 6.18 with config/maven_checks.xml ruleset.
[INFO] Ignored 4 errors, 0 violation remaining.
[INFO]
[INFO] --- maven-invoker-plugin:3.1.0:verify (integration-test) @ maven-javadoc-plugin ---
[INFO] -------------------------------------------------
[INFO] Build Summary:
[INFO]   Passed: 51, Failed: 0, Errors: 0, Skipped: 16
[INFO] -------------------------------------------------
[INFO] ------------------------------------------------------------------------
[INFO] BUILD SUCCESS
[INFO] ------------------------------------------------------------------------
[INFO] Total time: 19:53 min
[INFO] Finished at: 2020-02-14T03:18:54Z
[INFO] ------------------------------------------------------------------------
[INFO] [jenkins-event-spy] Generated /home/jenkins/jenkins-slave/workspace/_box_maven-javadoc-plugin_master@3@2@tmp/withMavenbc275e2b/maven-spy-20200214-025900-8568538644551914457987.log
[Pipeline] }
[Pipeline] // dir
[Pipeline] }
[withMaven] artifactsPublisher - Archive artifact linux-jdk7-m3.5.x_build/pom.xml under org/apache/maven/plugins/maven-javadoc-plugin/3.2.0-SNAPSHOT/maven-javadoc-plugin-3.2.0-SNAPSHOT.pom
[withMaven] artifactsPublisher - Archive artifact linux-jdk7-m3.5.x_build/target/maven-javadoc-plugin-3.2.0-SNAPSHOT.jar under org/apache/maven/plugins/maven-javadoc-plugin/3.2.0-SNAPSHOT/maven-javadoc-plugin-3.2.0-SNAPSHOT.jar
[Fast Archiver] Compressed 499.60 KB of artifacts by 44.8% relative to #79
[withMaven] junitPublisher - Archive test results for Maven artifact org.apache.maven.plugins:maven-javadoc-plugin:maven-plugin:3.2.0-SNAPSHOT generated by maven-surefire-plugin:test (default-test): linux-jdk7-m3.5.x_build/target/surefire-reports/*.xml
Recording test results
[INFO] run post-build script verify.bsh
[INFO]           MJAVADOC-620_no-dot-in-version\pom.xml ........... SUCCESS (13.5 s)
[INFO] Building: MJAVADOC-620_top-level-package\pom.xml
[withMaven] openTasksPublisher - Scan Tasks for Maven artifact org.apache.maven.plugins:maven-javadoc-plugin:maven-plugin:3.2.0-SNAPSHOT in source directory linux-jdk7-m3.5.x_build/src/main/java
[TASKS] Scanning folder '/home/jenkins/jenkins-slave/workspace/_box_maven-javadoc-plugin_master@3@2' for files matching the pattern 'linux-jdk7-m3.5.x_build/src/main/java/**/*' - excludes: null
[TASKS] Found 27 files to scan for tasks
[TASKS] Found 7 open tasks.
Skipping warnings blame since pipelines do not have an SCM link.%n
[TASKS] Computing warning deltas based on reference build #79
[withMaven] invokerPublisher - Archive invoker results for Maven artifact MavenArtifact{org.apache.maven.plugins:maven-javadoc-plugin:maven-plugin:3.2.0-SNAPSHOT(version: 3.2.0-SNAPSHOT, snapshot:false) } generated by PluginInvocation{org.apache.maven.plugins:maven-invoker-plugin:3.1.0@integration-test  integration-test}: linux-jdk7-m3.5.x_build/target/invoker-reports/*.xml
[withMaven] Publishers: Generated Artifacts Publisher: 154 ms, Junit Publisher: 266 ms, Open Task Scanner Publisher: 265 ms, Invoker Publisher: 58025 ms, Pipeline Graph Publisher: 2 ms
[Pipeline] // withMaven
[Pipeline] cleanWs
[WS-CLEANUP] Deleting project workspace...
[WS-CLEANUP] Deferred wipeout is used...
[WS-CLEANUP] done
[Pipeline] }
[Pipeline] // stage
[Pipeline] }
[Pipeline] // ws
[Pipeline] }
[Pipeline] // node
[Pipeline] }
[INFO]           MJAVADOC-569_aggr-mixed\pom.xml .................. SUCCESS (16.9 s)
[INFO] Building: MJAVADOC-575_source8-module-info\pom.xml
[INFO] run post-build script verify.bsh
[INFO]           MJAVADOC-620_top-level-package\pom.xml ........... SUCCESS (13.4 s)
[INFO] Building: site-failOnError\pom.xml
[INFO] run post-build script verify.groovy
[INFO]           MJAVADOC-575_source8-module-info\pom.xml ......... SUCCESS (9.7 s)
[INFO] Building: MJAVADOC-580_detectLinks\pom.xml
[INFO]           site-failOnError\pom.xml ......................... SUCCESS (8.4 s)
[INFO]
[INFO] --- mrm-maven-plugin:1.1.0:stop (repository) @ maven-javadoc-plugin ---
[INFO] Stopping Mock Repository Manager on http://localhost:56692
[INFO] Stopped SocketConnector@0.0.0.0:56692
[INFO] Mock Repository Manager http://localhost:56692 is stopped.
[INFO]
[INFO] --- mrm-maven-plugin:1.1.0:stop (3rdparty) @ maven-javadoc-plugin ---
[INFO] Stopping Mock Repository Manager on http://localhost:56693
[INFO] Stopped SocketConnector@0.0.0.0:56693
[INFO] Mock Repository Manager http://localhost:56693 is stopped.
[INFO]
[INFO] --- maven-checkstyle-plugin:3.0.0:check (checkstyle-check) @ maven-javadoc-plugin ---
[INFO] There are 4 errors reported by Checkstyle 6.18 with config/maven_checks.xml ruleset.
[INFO] Ignored 4 errors, 0 violation remaining.
[INFO]
[INFO] --- maven-invoker-plugin:3.1.0:verify (integration-test) @ maven-javadoc-plugin ---
[INFO] -------------------------------------------------
[INFO] Build Summary:
[INFO]   Passed: 63, Failed: 0, Errors: 0, Skipped: 4
[INFO] -------------------------------------------------
[INFO] ------------------------------------------------------------------------
[INFO] BUILD SUCCESS
[INFO] ------------------------------------------------------------------------
[INFO] Total time:  20:19 min
[INFO] Finished at: 2020-02-13T19:19:23-08:00
[INFO] ------------------------------------------------------------------------
[INFO] [jenkins-event-spy] Generated F:\jenkins\jenkins-slave\workspace\-box_maven-javadoc-plugin_master@2@tmp\withMaven35ab14f8\maven-spy-20200213-185903-6562436298178238850191.log
[Pipeline] }
[Pipeline] // dir
[Pipeline] }
[withMaven] artifactsPublisher - Archive artifact windows-jdk14-m3.6.x_build\pom.xml under org\apache\maven\plugins\maven-javadoc-plugin\3.2.0-SNAPSHOT\maven-javadoc-plugin-3.2.0-SNAPSHOT.pom
[withMaven] artifactsPublisher - Archive artifact windows-jdk14-m3.6.x_build\target\maven-javadoc-plugin-3.2.0-SNAPSHOT.jar under org\apache\maven\plugins\maven-javadoc-plugin\3.2.0-SNAPSHOT\maven-javadoc-plugin-3.2.0-SNAPSHOT.jar
[Fast Archiver] Compressed 503.50 KB of artifacts by 44.5% relative to #79
[withMaven] junitPublisher - Archive test results for Maven artifact org.apache.maven.plugins:maven-javadoc-plugin:maven-plugin:3.2.0-SNAPSHOT generated by maven-surefire-plugin:test (default-test): windows-jdk14-m3.6.x_build\target\surefire-reports\*.xml
Recording test results
[withMaven] openTasksPublisher - Scan Tasks for Maven artifact org.apache.maven.plugins:maven-javadoc-plugin:maven-plugin:3.2.0-SNAPSHOT in source directory windows-jdk14-m3.6.x_build\src\main\java
[TASKS] Scanning folder 'f:\jenkins\jenkins-slave\workspace\-box_maven-javadoc-plugin_master@2' for files matching the pattern 'windows-jdk14-m3.6.x_build\src\main\java\**\*' - excludes: null
[TASKS] Found 27 files to scan for tasks
[TASKS] Found 7 open tasks.
Skipping warnings blame since pipelines do not have an SCM link.%n
[TASKS] Computing warning deltas based on reference build #79
[withMaven] invokerPublisher - Archive invoker results for Maven artifact MavenArtifact{org.apache.maven.plugins:maven-javadoc-plugin:maven-plugin:3.2.0-SNAPSHOT(version: 3.2.0-SNAPSHOT, snapshot:false) } generated by PluginInvocation{org.apache.maven.plugins:maven-invoker-plugin:3.1.0@integration-test  integration-test}: windows-jdk14-m3.6.x_build\target\invoker-reports\*.xml
[INFO] run post-build script verify.groovy
[INFO]           MJAVADOC-580_detectLinks\pom.xml ................. SUCCESS (7.5 s)
[INFO] Building: MJAVADOC-591_release8\pom.xml
[INFO] artifact org.apache.maven.plugins:maven-resources-plugin: checking for updates from central
[INFO] artifact org.apache.maven.plugins:maven-install-plugin: checking for updates from central
[INFO] artifact org.apache.maven.plugins:maven-deploy-plugin: checking for updates from central
[INFO]           MJAVADOC-591_release8\pom.xml .................... SUCCESS (17.0 s)
[INFO] Building: MJAVADOC-599\pom.xml
[INFO] run post-build script verify.groovy
[INFO]           MJAVADOC-599\pom.xml ............................. SUCCESS (9.1 s)
[INFO] Building: MJAVADOC-613-aggregate-exclude\pom.xml
[withMaven] Publishers: Generated Artifacts Publisher: 1296 ms, Junit Publisher: 4943 ms, Open Task Scanner Publisher: 1514 ms, Dependencies Fingerprint Publisher: 1 ms, Invoker Publisher: 96320 ms, Pipeline Graph Publisher: 1 ms
[Pipeline] // withMaven
[Pipeline] cleanWs
[WS-CLEANUP] Deleting project workspace...
[WS-CLEANUP] Deferred wipeout is used...
[WS-CLEANUP] done
[Pipeline] }
[Pipeline] // stage
[Pipeline] }
[Pipeline] // ws
[Pipeline] }
[Pipeline] // node
[Pipeline] }
[INFO] run post-build script verify.groovy
[INFO]           MJAVADOC-613-aggregate-exclude\pom.xml ........... SUCCESS (15.3 s)
[INFO] Building: MJAVADOC-620_no-dot-in-version\pom.xml
[INFO] run post-build script verify.bsh
[INFO]           MJAVADOC-620_no-dot-in-version\pom.xml ........... SUCCESS (13.3 s)
[INFO] Building: MJAVADOC-620_top-level-package\pom.xml
[withMaven] Publishers: Generated Artifacts Publisher: 146 ms, Junit Publisher: 307 ms, Open Task Scanner Publisher: 219 ms, Dependencies Fingerprint Publisher: 1 ms, Invoker Publisher: 59892 ms, Pipeline Graph Publisher: 3 ms, Maven Linker Publisher: 7 ms
[Pipeline] // withMaven
[Pipeline] cleanWs
[WS-CLEANUP] Deleting project workspace...
[WS-CLEANUP] Deferred wipeout is used...
[WS-CLEANUP] done
[Pipeline] }
[Pipeline] // stage
[Pipeline] }
[Pipeline] // ws
[Pipeline] }
[Pipeline] // node
[Pipeline] }
[INFO] run post-build script verify.bsh
[INFO]           MJAVADOC-620_top-level-package\pom.xml ........... SUCCESS (12.7 s)
[INFO] Building: site-failOnError\pom.xml
[withMaven] Publishers: Generated Artifacts Publisher: 1298 ms, Junit Publisher: 4902 ms, Open Task Scanner Publisher: 1331 ms, Dependencies Fingerprint Publisher: 1 ms, Invoker Publisher: 95592 ms, Pipeline Graph Publisher: 1 ms
[Pipeline] // withMaven
[Pipeline] cleanWs
[WS-CLEANUP] Deleting project workspace...
[WS-CLEANUP] Deferred wipeout is used...
[WS-CLEANUP] done
[Pipeline] }
[Pipeline] // stage
[Pipeline] }
[Pipeline] // ws
[Pipeline] }
[Pipeline] // node
[Pipeline] }
[INFO]           site-failOnError\pom.xml ......................... SUCCESS (7.8 s)
[INFO]
[INFO] --- mrm-maven-plugin:1.1.0:stop (repository) @ maven-javadoc-plugin ---
[INFO] Stopping Mock Repository Manager on http://localhost:57981
[INFO] Stopped SocketConnector@0.0.0.0:57981
[INFO] Mock Repository Manager http://localhost:57981 is stopped.
[INFO]
[INFO] --- mrm-maven-plugin:1.1.0:stop (3rdparty) @ maven-javadoc-plugin ---
[INFO] Stopping Mock Repository Manager on http://localhost:57982
[INFO] Stopped SocketConnector@0.0.0.0:57982
[INFO] Mock Repository Manager http://localhost:57982 is stopped.
[INFO]
[INFO] --- maven-checkstyle-plugin:3.0.0:check (checkstyle-check) @ maven-javadoc-plugin ---
[INFO] There are 4 errors reported by Checkstyle 6.18 with config/maven_checks.xml ruleset.
[INFO] Ignored 4 errors, 0 violation remaining.
[INFO]
[INFO] --- maven-invoker-plugin:3.1.0:verify (integration-test) @ maven-javadoc-plugin ---
[INFO] -------------------------------------------------
[INFO] Build Summary:
[INFO]   Passed: 66, Failed: 0, Errors: 0, Skipped: 1
[INFO] -------------------------------------------------
[INFO] ------------------------------------------------------------------------
[INFO] BUILD SUCCESS
[INFO] ------------------------------------------------------------------------
[INFO] Total time:  21:46 min
[INFO] Finished at: 2020-02-13T19:20:47-08:00
[INFO] ------------------------------------------------------------------------
[INFO] [jenkins-event-spy] Generated F:\jenkins\jenkins-slave\workspace\-box_maven-javadoc-plugin_master@2@2@tmp\withMaven4fecbf97\maven-spy-20200213-185900-23617459318785727382007.log
[Pipeline] }
[Pipeline] // dir
[Pipeline] }
[withMaven] artifactsPublisher - Archive artifact windows-jdk11-m3.6.x_build\pom.xml under org\apache\maven\plugins\maven-javadoc-plugin\3.2.0-SNAPSHOT\maven-javadoc-plugin-3.2.0-SNAPSHOT.pom
[withMaven] artifactsPublisher - Archive artifact windows-jdk11-m3.6.x_build\target\maven-javadoc-plugin-3.2.0-SNAPSHOT.jar under org\apache\maven\plugins\maven-javadoc-plugin\3.2.0-SNAPSHOT\maven-javadoc-plugin-3.2.0-SNAPSHOT.jar
[Fast Archiver] Compressed 501.29 KB of artifacts by 38.3% relative to #79
[withMaven] junitPublisher - Archive test results for Maven artifact org.apache.maven.plugins:maven-javadoc-plugin:maven-plugin:3.2.0-SNAPSHOT generated by maven-surefire-plugin:test (default-test): windows-jdk11-m3.6.x_build\target\surefire-reports\*.xml
Recording test results
[withMaven] openTasksPublisher - Scan Tasks for Maven artifact org.apache.maven.plugins:maven-javadoc-plugin:maven-plugin:3.2.0-SNAPSHOT in source directory windows-jdk11-m3.6.x_build\src\main\java
[TASKS] Scanning folder 'f:\jenkins\jenkins-slave\workspace\-box_maven-javadoc-plugin_master@2@2' for files matching the pattern 'windows-jdk11-m3.6.x_build\src\main\java\**\*' - excludes: null
[TASKS] Found 27 files to scan for tasks
[TASKS] Found 7 open tasks.
Skipping warnings blame since pipelines do not have an SCM link.%n
[TASKS] Computing warning deltas based on reference build #79
[withMaven] invokerPublisher - Archive invoker results for Maven artifact MavenArtifact{org.apache.maven.plugins:maven-javadoc-plugin:maven-plugin:3.2.0-SNAPSHOT(version: 3.2.0-SNAPSHOT, snapshot:false) } generated by PluginInvocation{org.apache.maven.plugins:maven-invoker-plugin:3.1.0@integration-test  integration-test}: windows-jdk11-m3.6.x_build\target\invoker-reports\*.xml
[withMaven] Publishers: Generated Artifacts Publisher: 154 ms, Junit Publisher: 396 ms, Open Task Scanner Publisher: 227 ms, Dependencies Fingerprint Publisher: 24 ms, Invoker Publisher: 63181 ms, Pipeline Graph Publisher: 2 ms
[Pipeline] // withMaven
[Pipeline] cleanWs
[WS-CLEANUP] Deleting project workspace...
[WS-CLEANUP] Deferred wipeout is used...
[WS-CLEANUP] done
[Pipeline] }
[Pipeline] // stage
[Pipeline] }
[Pipeline] // ws
[Pipeline] }
[Pipeline] // node
[Pipeline] }
[Pipeline] // parallel
[Pipeline] stage
[Pipeline] { (Notifications)
[Pipeline] echo
Build result: UNSTABLE
[Pipeline] jiraIssueSelector
[Pipeline] echo
The authors of changes [tibordigana, olamy].
[Pipeline] echo
Sending email ...
[Pipeline] emailext
Reply | Threaded
Open this post in threaded view
|

Build failed in Jenkins: Maven TLP » maven-javadoc-plugin » master #81

Apache Jenkins Server-2
See https://builds.apache.org/job/maven-box/job/maven-javadoc-plugin/job/master/81/

Changes:

* remove duplicate property

5 tests failed.
FAILED:  org.apache.maven.plugins.javadoc.JavadocUtilTest.linux-jdk14-m3.6.x_build / Build linux-jdk14-m3.6.x_build / testIsValidPackageList

Error Message:
Read timed out

Stack Trace:
java.net.SocketTimeoutException: Read timed out
        at org.apache.maven.plugins.javadoc.JavadocUtilTest.testIsValidPackageList(JavadocUtilTest.java:395)


FAILED:  org.apache.maven.plugins.javadoc.JavadocUtilTest.linux-jdk8-m3.6.x_build / Build linux-jdk8-m3.6.x_build / testIsValidPackageList

Error Message:
Read timed out

Stack Trace:
java.net.SocketTimeoutException: Read timed out
        at org.apache.maven.plugins.javadoc.JavadocUtilTest.testIsValidPackageList(JavadocUtilTest.java:326)


FAILED:  org.apache.maven.plugins.javadoc.JavadocUtilTest.windows-jdk7-m3.5.x_build / Build windows-jdk7-m3.5.x_build / testIsValidPackageList

Error Message:
Read timed out

Stack Trace:
java.net.SocketTimeoutException: Read timed out
        at org.apache.maven.plugins.javadoc.JavadocUtilTest.testIsValidPackageList(JavadocUtilTest.java:395)


FAILED:  org.apache.maven.plugins.javadoc.JavadocUtilTest.windows-jdk7-m3.3.x_build / Build windows-jdk7-m3.3.x_build / testIsValidPackageList

Error Message:
Read timed out

Stack Trace:
java.net.SocketTimeoutException: Read timed out
        at org.apache.maven.plugins.javadoc.JavadocUtilTest.testIsValidPackageList(JavadocUtilTest.java:395)


FAILED:  org.apache.maven.plugins.javadoc.JavadocUtilTest.linux-jdk13-m3.6.x_build / Build linux-jdk13-m3.6.x_build / testIsValidPackageList

Error Message:
Read timed out

Stack Trace:
java.net.SocketTimeoutException: Read timed out
        at org.apache.maven.plugins.javadoc.JavadocUtilTest.testIsValidPackageList(JavadocUtilTest.java:395)




Build log:
[...truncated 8972 lines...]
[INFO]           MJAVADOC-569_aggr-mixed\pom.xml .................. SUCCESS (17.5 s)
[INFO] Building: MJAVADOC-575_source8-module-info\pom.xml
[INFO] run post-build script verify.groovy
[INFO]           MJAVADOC-613-aggregate-exclude\pom.xml ........... SUCCESS (16.5 s)
[INFO] Building: MJAVADOC-620_no-dot-in-version\pom.xml
[INFO]           MJAVADOC-562_release\pom.xml ..................... SUCCESS (9.6 s)
[INFO] Building: MJAVADOC-567_aggr-mixed\pom.xml
[INFO] run post-build script verify.groovy
[INFO]           MJAVADOC-575_source8-module-info\pom.xml ......... SUCCESS (9.3 s)
[INFO] Building: MJAVADOC-580_detectLinks\pom.xml
[INFO] run post-build script verify.groovy
[INFO]           MJAVADOC-567_aggr-mixed\pom.xml .................. SUCCESS (6.2 s)
[INFO] Building: MJAVADOC-568_export-to-testcase\pom.xml
[INFO] run post-build script verify.groovy
[INFO]           MJAVADOC-580_detectLinks\pom.xml ................. SUCCESS (7.7 s)
[INFO] Building: MJAVADOC-591_release8\pom.xml
[INFO] run post-build script verify.bsh
[INFO]           MJAVADOC-620_no-dot-in-version\pom.xml ........... SUCCESS (13.6 s)
[INFO] Building: MJAVADOC-620_top-level-package\pom.xml
[INFO] artifact org.apache.maven.plugins:maven-resources-plugin: checking for updates from central
[INFO] artifact org.apache.maven.plugins:maven-install-plugin: checking for updates from central
[INFO] artifact org.apache.maven.plugins:maven-deploy-plugin: checking for updates from central
[INFO] run post-build script verify.bsh
[INFO]           MJAVADOC-620_top-level-package\pom.xml ........... SUCCESS (13.3 s)
[INFO] Building: site-failOnError\pom.xml
[INFO]           MJAVADOC-591_release8\pom.xml .................... SUCCESS (18.0 s)
[INFO] Building: MJAVADOC-599\pom.xml
[INFO]           MJAVADOC-568_export-to-testcase\pom.xml .......... SUCCESS (21.0 s)
[INFO] Building: MJAVADOC-568_jar-mixed\pom.xml
[INFO]           site-failOnError\pom.xml ......................... SUCCESS (8.1 s)
[INFO]
[INFO] --- mrm-maven-plugin:1.1.0:stop (repository) @ maven-javadoc-plugin ---
[INFO] Stopping Mock Repository Manager on http://localhost:59281
[INFO] Stopped SocketConnector@0.0.0.0:59281
[INFO] Mock Repository Manager http://localhost:59281 is stopped.
[INFO]
[INFO] --- mrm-maven-plugin:1.1.0:stop (3rdparty) @ maven-javadoc-plugin ---
[INFO] Stopping Mock Repository Manager on http://localhost:59282
[INFO] Stopped SocketConnector@0.0.0.0:59282
[INFO] Mock Repository Manager http://localhost:59282 is stopped.
[INFO]
[INFO] --- maven-checkstyle-plugin:3.0.0:check (checkstyle-check) @ maven-javadoc-plugin ---
[INFO] There are 4 errors reported by Checkstyle 6.18 with config/maven_checks.xml ruleset.
[INFO] Ignored 4 errors, 0 violation remaining.
[INFO]
[INFO] --- maven-invoker-plugin:3.1.0:verify (integration-test) @ maven-javadoc-plugin ---
[INFO] -------------------------------------------------
[INFO] Build Summary:
[INFO]   Passed: 63, Failed: 0, Errors: 0, Skipped: 4
[INFO] -------------------------------------------------
[INFO] ------------------------------------------------------------------------
[INFO] BUILD SUCCESS
[INFO] ------------------------------------------------------------------------
[INFO] Total time:  17:39 min
[INFO] Finished at: 2020-02-13T19:31:35-08:00
[INFO] ------------------------------------------------------------------------
[INFO] [jenkins-event-spy] Generated F:\jenkins\jenkins-slave\workspace\-box_maven-javadoc-plugin_master@3@2@tmp\withMavend301b51f\maven-spy-20200213-191355-5518308039354406738389.log
[Pipeline] }
[Pipeline] // dir
[Pipeline] }
[withMaven] artifactsPublisher - Archive artifact windows-jdk13-m3.6.x_build\pom.xml under org\apache\maven\plugins\maven-javadoc-plugin\3.2.0-SNAPSHOT\maven-javadoc-plugin-3.2.0-SNAPSHOT.pom
[withMaven] artifactsPublisher - Archive artifact windows-jdk13-m3.6.x_build\target\maven-javadoc-plugin-3.2.0-SNAPSHOT.jar under org\apache\maven\plugins\maven-javadoc-plugin\3.2.0-SNAPSHOT\maven-javadoc-plugin-3.2.0-SNAPSHOT.jar
[Fast Archiver] Compressed 503.45 KB of artifacts by 44.5% relative to #80
[withMaven] junitPublisher - Archive test results for Maven artifact org.apache.maven.plugins:maven-javadoc-plugin:maven-plugin:3.2.0-SNAPSHOT generated by maven-surefire-plugin:test (default-test): windows-jdk13-m3.6.x_build\target\surefire-reports\*.xml
Recording test results
[withMaven] openTasksPublisher - Scan Tasks for Maven artifact org.apache.maven.plugins:maven-javadoc-plugin:maven-plugin:3.2.0-SNAPSHOT in source directory windows-jdk13-m3.6.x_build\src\main\java
[TASKS] Scanning folder 'f:\jenkins\jenkins-slave\workspace\-box_maven-javadoc-plugin_master@3@2' for files matching the pattern 'windows-jdk13-m3.6.x_build\src\main\java\**\*' - excludes: null
[TASKS] Found 27 files to scan for tasks
[TASKS] Found 7 open tasks.
Skipping warnings blame since pipelines do not have an SCM link.%n
[TASKS] Computing warning deltas based on reference build #80
[withMaven] invokerPublisher - Archive invoker results for Maven artifact MavenArtifact{org.apache.maven.plugins:maven-javadoc-plugin:maven-plugin:3.2.0-SNAPSHOT(version: 3.2.0-SNAPSHOT, snapshot:false) } generated by PluginInvocation{org.apache.maven.plugins:maven-invoker-plugin:3.1.0@integration-test  integration-test}: windows-jdk13-m3.6.x_build\target\invoker-reports\*.xml
[INFO] run post-build script verify.groovy
[INFO]           MJAVADOC-599\pom.xml ............................. SUCCESS (9.9 s)
[INFO] Building: MJAVADOC-613-aggregate-exclude\pom.xml
[INFO]           MJAVADOC-568_jar-mixed\pom.xml ................... SUCCESS (15.1 s)
[INFO] Building: MJAVADOC-568_manifest-splitpackage\pom.xml
[INFO] run post-build script verify.groovy
[INFO]           MJAVADOC-613-aggregate-exclude\pom.xml ........... SUCCESS (15.3 s)
[INFO] Building: MJAVADOC-620_no-dot-in-version\pom.xml
[INFO]           MJAVADOC-568_manifest-splitpackage\pom.xml ....... SUCCESS (20.2 s)
[INFO] Building: MJAVADOC-569_aggr-mixed\pom.xml
[INFO] run post-build script verify.bsh
[INFO]           MJAVADOC-620_no-dot-in-version\pom.xml ........... SUCCESS (13.0 s)
[INFO] Building: MJAVADOC-620_top-level-package\pom.xml
[INFO] run post-build script verify.bsh
[INFO]           MJAVADOC-620_top-level-package\pom.xml ........... SUCCESS (13.0 s)
[INFO] Building: site-failOnError\pom.xml
[INFO]           MJAVADOC-569_aggr-mixed\pom.xml .................. SUCCESS (16.9 s)
[INFO] Building: MJAVADOC-575_source8-module-info\pom.xml
[INFO]           site-failOnError\pom.xml ......................... SUCCESS (8.7 s)
[INFO]
[INFO] --- mrm-maven-plugin:1.1.0:stop (repository) @ maven-javadoc-plugin ---
[INFO] Stopping Mock Repository Manager on http://localhost:51945
[INFO] Stopped SocketConnector@0.0.0.0:51945
[INFO] Mock Repository Manager http://localhost:51945 is stopped.
[INFO]
[INFO] --- mrm-maven-plugin:1.1.0:stop (3rdparty) @ maven-javadoc-plugin ---
[INFO] Stopping Mock Repository Manager on http://localhost:51946
[INFO] Stopped SocketConnector@0.0.0.0:51946
[INFO] Mock Repository Manager http://localhost:51946 is stopped.
[INFO]
[INFO] --- maven-checkstyle-plugin:3.0.0:check (checkstyle-check) @ maven-javadoc-plugin ---
[INFO] run post-build script verify.groovy
[INFO]           MJAVADOC-575_source8-module-info\pom.xml ......... SUCCESS (9.3 s)
[INFO] Building: MJAVADOC-580_detectLinks\pom.xml
[INFO] There are 4 errors reported by Checkstyle 6.18 with config/maven_checks.xml ruleset.
[INFO] Ignored 4 errors, 0 violation remaining.
[INFO]
[INFO] --- maven-invoker-plugin:3.1.0:verify (integration-test) @ maven-javadoc-plugin ---
[INFO] -------------------------------------------------
[INFO] Build Summary:
[INFO]   Passed: 66, Failed: 0, Errors: 0, Skipped: 1
[INFO] -------------------------------------------------
[INFO] ------------------------------------------------------------------------
[INFO] BUILD SUCCESS
[INFO] ------------------------------------------------------------------------
[INFO] Total time:  18:59 min
[INFO] Finished at: 2020-02-13T19:32:30-08:00
[INFO] ------------------------------------------------------------------------
[INFO] [jenkins-event-spy] Generated F:\jenkins\jenkins-slave\workspace\-box_maven-javadoc-plugin_master@2@2@tmp\withMavenc65a6e0c\maven-spy-20200213-191331-518083902039317434536.log
[Pipeline] }
[Pipeline] // dir
[Pipeline] }
[withMaven] artifactsPublisher - Archive artifact windows-jdk11-m3.6.x_build\pom.xml under org\apache\maven\plugins\maven-javadoc-plugin\3.2.0-SNAPSHOT\maven-javadoc-plugin-3.2.0-SNAPSHOT.pom
[withMaven] artifactsPublisher - Archive artifact windows-jdk11-m3.6.x_build\target\maven-javadoc-plugin-3.2.0-SNAPSHOT.jar under org\apache\maven\plugins\maven-javadoc-plugin\3.2.0-SNAPSHOT\maven-javadoc-plugin-3.2.0-SNAPSHOT.jar
[Fast Archiver] Compressed 501.24 KB of artifacts by 51.1% relative to #80
[withMaven] junitPublisher - Archive test results for Maven artifact org.apache.maven.plugins:maven-javadoc-plugin:maven-plugin:3.2.0-SNAPSHOT generated by maven-surefire-plugin:test (default-test): windows-jdk11-m3.6.x_build\target\surefire-reports\*.xml
Recording test results
[withMaven] openTasksPublisher - Scan Tasks for Maven artifact org.apache.maven.plugins:maven-javadoc-plugin:maven-plugin:3.2.0-SNAPSHOT in source directory windows-jdk11-m3.6.x_build\src\main\java
[TASKS] Scanning folder 'f:\jenkins\jenkins-slave\workspace\-box_maven-javadoc-plugin_master@2@2' for files matching the pattern 'windows-jdk11-m3.6.x_build\src\main\java\**\*' - excludes: null
[TASKS] Found 27 files to scan for tasks
[TASKS] Found 7 open tasks.
Skipping warnings blame since pipelines do not have an SCM link.%n
[TASKS] Computing warning deltas based on reference build #80
[withMaven] invokerPublisher - Archive invoker results for Maven artifact MavenArtifact{org.apache.maven.plugins:maven-javadoc-plugin:maven-plugin:3.2.0-SNAPSHOT(version: 3.2.0-SNAPSHOT, snapshot:false) } generated by PluginInvocation{org.apache.maven.plugins:maven-invoker-plugin:3.1.0@integration-test  integration-test}: windows-jdk11-m3.6.x_build\target\invoker-reports\*.xml
[withMaven] Publishers: Generated Artifacts Publisher: 147 ms, Junit Publisher: 280 ms, Open Task Scanner Publisher: 226 ms, Dependencies Fingerprint Publisher: 1 ms, Invoker Publisher: 60078 ms, Pipeline Graph Publisher: 3 ms
[Pipeline] // withMaven
[Pipeline] cleanWs
[WS-CLEANUP] Deleting project workspace...
[WS-CLEANUP] Deferred wipeout is used...
[WS-CLEANUP] done
[Pipeline] }
[Pipeline] // stage
[Pipeline] }
[Pipeline] // ws
[Pipeline] }
[Pipeline] // node
[Pipeline] }
[INFO] run post-build script verify.groovy
[INFO]           MJAVADOC-580_detectLinks\pom.xml ................. SUCCESS (7.3 s)
[INFO] Building: MJAVADOC-591_release8\pom.xml
[INFO] artifact org.apache.maven.plugins:maven-resources-plugin: checking for updates from central
[INFO] artifact org.apache.maven.plugins:maven-install-plugin: checking for updates from central
[INFO] artifact org.apache.maven.plugins:maven-deploy-plugin: checking for updates from central
[INFO]           MJAVADOC-591_release8\pom.xml .................... SUCCESS (18.6 s)
[INFO] Building: MJAVADOC-599\pom.xml
[INFO] run post-build script verify.groovy
[INFO]           MJAVADOC-599\pom.xml ............................. SUCCESS (10.0 s)
[INFO] Building: MJAVADOC-613-aggregate-exclude\pom.xml
[INFO] run post-build script verify.groovy
[INFO]           MJAVADOC-613-aggregate-exclude\pom.xml ........... SUCCESS (16.1 s)
[INFO] Building: MJAVADOC-620_no-dot-in-version\pom.xml
[withMaven] Publishers: Generated Artifacts Publisher: 132 ms, Junit Publisher: 269 ms, Open Task Scanner Publisher: 261 ms, Dependencies Fingerprint Publisher: 1 ms, Invoker Publisher: 60044 ms, Pipeline Graph Publisher: 3 ms
[Pipeline] // withMaven
[Pipeline] cleanWs
[WS-CLEANUP] Deleting project workspace...
[WS-CLEANUP] Deferred wipeout is used...
[WS-CLEANUP] done
[Pipeline] }
[Pipeline] // stage
[Pipeline] }
[Pipeline] // ws
[Pipeline] }
[Pipeline] // node
[Pipeline] }
[INFO] run post-build script verify.bsh
[INFO]           MJAVADOC-620_no-dot-in-version\pom.xml ........... SUCCESS (14.0 s)
[INFO] Building: MJAVADOC-620_top-level-package\pom.xml
[INFO] run post-build script verify.bsh
[INFO]           MJAVADOC-620_top-level-package\pom.xml ........... SUCCESS (13.7 s)
[INFO] Building: site-failOnError\pom.xml
[INFO]           site-failOnError\pom.xml ......................... SUCCESS (8.8 s)
[INFO]
[INFO] --- mrm-maven-plugin:1.1.0:stop (repository) @ maven-javadoc-plugin ---
[INFO] Stopping Mock Repository Manager on http://localhost:64882
[INFO] Stopped SocketConnector@0.0.0.0:64882
[INFO] Mock Repository Manager http://localhost:64882 is stopped.
[INFO]
[INFO] --- mrm-maven-plugin:1.1.0:stop (3rdparty) @ maven-javadoc-plugin ---
[INFO] Stopping Mock Repository Manager on http://localhost:64883
[INFO] Stopped SocketConnector@0.0.0.0:64883
[INFO] Mock Repository Manager http://localhost:64883 is stopped.
[INFO]
[INFO] --- maven-checkstyle-plugin:3.0.0:check (checkstyle-check) @ maven-javadoc-plugin ---
[INFO] There are 4 errors reported by Checkstyle 6.18 with config/maven_checks.xml ruleset.
[INFO] Ignored 4 errors, 0 violation remaining.
[INFO]
[INFO] --- maven-invoker-plugin:3.1.0:verify (integration-test) @ maven-javadoc-plugin ---
[INFO] -------------------------------------------------
[INFO] Build Summary:
[INFO]   Passed: 63, Failed: 0, Errors: 0, Skipped: 4
[INFO] -------------------------------------------------
[INFO] ------------------------------------------------------------------------
[INFO] BUILD SUCCESS
[INFO] ------------------------------------------------------------------------
[INFO] Total time:  18:15 min
[INFO] Finished at: 2020-02-13T19:34:00-08:00
[INFO] ------------------------------------------------------------------------
[INFO] [jenkins-event-spy] Generated F:\jenkins\jenkins-slave\workspace\-box_maven-javadoc-plugin_master@2@tmp\withMaven74425265\maven-spy-20200213-191545-56113602210047407326854.log
[Pipeline] }
[Pipeline] // dir
[Pipeline] }
[withMaven] artifactsPublisher - Archive artifact windows-jdk14-m3.6.x_build\pom.xml under org\apache\maven\plugins\maven-javadoc-plugin\3.2.0-SNAPSHOT\maven-javadoc-plugin-3.2.0-SNAPSHOT.pom
[withMaven] artifactsPublisher - Archive artifact windows-jdk14-m3.6.x_build\target\maven-javadoc-plugin-3.2.0-SNAPSHOT.jar under org\apache\maven\plugins\maven-javadoc-plugin\3.2.0-SNAPSHOT\maven-javadoc-plugin-3.2.0-SNAPSHOT.jar
[Fast Archiver] Compressed 503.45 KB of artifacts by 44.5% relative to #80
[withMaven] junitPublisher - Archive test results for Maven artifact org.apache.maven.plugins:maven-javadoc-plugin:maven-plugin:3.2.0-SNAPSHOT generated by maven-surefire-plugin:test (default-test): windows-jdk14-m3.6.x_build\target\surefire-reports\*.xml
Recording test results
[withMaven] openTasksPublisher - Scan Tasks for Maven artifact org.apache.maven.plugins:maven-javadoc-plugin:maven-plugin:3.2.0-SNAPSHOT in source directory windows-jdk14-m3.6.x_build\src\main\java
[TASKS] Scanning folder 'f:\jenkins\jenkins-slave\workspace\-box_maven-javadoc-plugin_master@2' for files matching the pattern 'windows-jdk14-m3.6.x_build\src\main\java\**\*' - excludes: null
[TASKS] Found 27 files to scan for tasks
[TASKS] Found 7 open tasks.
Skipping warnings blame since pipelines do not have an SCM link.%n
[TASKS] Computing warning deltas based on reference build #80
[withMaven] invokerPublisher - Archive invoker results for Maven artifact MavenArtifact{org.apache.maven.plugins:maven-javadoc-plugin:maven-plugin:3.2.0-SNAPSHOT(version: 3.2.0-SNAPSHOT, snapshot:false) } generated by PluginInvocation{org.apache.maven.plugins:maven-invoker-plugin:3.1.0@integration-test  integration-test}: windows-jdk14-m3.6.x_build\target\invoker-reports\*.xml
[withMaven] Publishers: Generated Artifacts Publisher: 189 ms, Junit Publisher: 498 ms, Open Task Scanner Publisher: 982 ms, Dependencies Fingerprint Publisher: 1 ms, Invoker Publisher: 61867 ms, Pipeline Graph Publisher: 2 ms
[Pipeline] // withMaven
[Pipeline] cleanWs
[WS-CLEANUP] Deleting project workspace...
[WS-CLEANUP] Deferred wipeout is used...
[WS-CLEANUP] done
[Pipeline] }
[Pipeline] // stage
[Pipeline] }
[Pipeline] // ws
[Pipeline] }
[Pipeline] // node
[Pipeline] }
[Pipeline] // parallel
[Pipeline] stage
[Pipeline] { (Notifications)
[Pipeline] echo
Build result: FAILURE
[Pipeline] jiraIssueSelector
[Pipeline] echo
The authors of changes [olamy].
[Pipeline] echo
Sending email ...
[Pipeline] emailext
Reply | Threaded
Open this post in threaded view
|

Build unstable in Jenkins: Maven TLP » maven-javadoc-plugin » master #82

Apache Jenkins Server-2
See https://builds.apache.org/job/maven-box/job/maven-javadoc-plugin/job/master/82/

Changes:

* [MJAVADOC-636] exclude some modules from aggregated javadoc
* [MJAVADOC-636] exclude some modules from aggregated javadoc

9 tests failed.
FAILED:  org.apache.maven.plugins.javadoc.AbstractJavadocMojoTest.linux-jdk8-m3.6.x_build / Build linux-jdk8-m3.6.x_build / testMJAVADOC527_DetectLinksRecursion

Error Message:
null

Stack Trace:
junit.framework.AssertionFailedError
        at org.apache.maven.plugins.javadoc.AbstractJavadocMojoTest.testMJAVADOC527_DetectLinksRecursion(AbstractJavadocMojoTest.java:88)


FAILED:  org.apache.maven.plugins.javadoc.JavadocUtilTest.linux-jdk8-m3.6.x_build / Build linux-jdk8-m3.6.x_build / testIsValidPackageList

Error Message:
Read timed out

Stack Trace:
java.net.SocketTimeoutException: Read timed out
        at org.apache.maven.plugins.javadoc.JavadocUtilTest.testIsValidPackageList(JavadocUtilTest.java:302)


FAILED:  org.apache.maven.plugins.javadoc.AbstractJavadocMojoTest.linux-jdk14-m3.6.x_build / Build linux-jdk14-m3.6.x_build / testMJAVADOC527_DetectLinksRecursion

Error Message:
null

Stack Trace:
junit.framework.AssertionFailedError
        at org.apache.maven.plugins.javadoc.AbstractJavadocMojoTest.testMJAVADOC527_DetectLinksRecursion(AbstractJavadocMojoTest.java:88)


FAILED:  org.apache.maven.plugins.javadoc.AbstractJavadocMojoTest.linux-jdk7-m3.3.x_build / Build linux-jdk7-m3.3.x_build / testMJAVADOC527_DetectLinksRecursion

Error Message:
null

Stack Trace:
junit.framework.AssertionFailedError
        at org.apache.maven.plugins.javadoc.AbstractJavadocMojoTest.testMJAVADOC527_DetectLinksRecursion(AbstractJavadocMojoTest.java:88)


FAILED:  org.apache.maven.plugins.javadoc.JavadocUtilTest.windows-jdk7-m3.2.x_build / Build windows-jdk7-m3.2.x_build / testIsValidPackageList

Error Message:
Read timed out

Stack Trace:
java.net.SocketTimeoutException: Read timed out
        at org.apache.maven.plugins.javadoc.JavadocUtilTest.testIsValidPackageList(JavadocUtilTest.java:395)


FAILED:  org.apache.maven.plugins.javadoc.JavadocUtilTest.linux-jdk7-m3.2.x_build / Build linux-jdk7-m3.2.x_build / testIsValidPackageList

Error Message:
Read timed out

Stack Trace:
java.net.SocketTimeoutException: Read timed out
        at org.apache.maven.plugins.javadoc.JavadocUtilTest.testIsValidPackageList(JavadocUtilTest.java:395)


FAILED:  org.apache.maven.plugins.javadoc.JavadocUtilTest.windows-jdk14-m3.6.x_build / Build windows-jdk14-m3.6.x_build / testIsValidPackageList

Error Message:
Read timed out

Stack Trace:
java.net.SocketTimeoutException: Read timed out
        at org.apache.maven.plugins.javadoc.JavadocUtilTest.testIsValidPackageList(JavadocUtilTest.java:395)


FAILED:  org.apache.maven.plugins.javadoc.JavadocUtilTest.windows-jdk13-m3.6.x_build / Build windows-jdk13-m3.6.x_build / testIsValidPackageList

Error Message:
Read timed out

Stack Trace:
java.net.SocketTimeoutException: Read timed out
        at org.apache.maven.plugins.javadoc.JavadocUtilTest.testIsValidPackageList(JavadocUtilTest.java:395)


FAILED:  org.apache.maven.plugins.javadoc.JavadocUtilTest.windows-jdk11-m3.6.x_build / Build windows-jdk11-m3.6.x_build / testIsValidPackageList

Error Message:
Read timed out

Stack Trace:
java.net.SocketTimeoutException: Read timed out
        at org.apache.maven.plugins.javadoc.JavadocUtilTest.testIsValidPackageList(JavadocUtilTest.java:395)




Build log:
[...truncated 8880 lines...]
Skipping warnings blame since pipelines do not have an SCM link.%n
[TASKS] Computing warning deltas based on reference build #80
[withMaven] invokerPublisher - Archive invoker results for Maven artifact MavenArtifact{org.apache.maven.plugins:maven-javadoc-plugin:maven-plugin:3.2.0-SNAPSHOT(version: 3.2.0-SNAPSHOT, snapshot:false) } generated by PluginInvocation{org.apache.maven.plugins:maven-invoker-plugin:3.1.0@integration-test  integration-test}: windows-jdk11-m3.6.x_build\target\invoker-reports\*.xml
[withMaven] Publishers: Generated Artifacts Publisher: 213 ms, Junit Publisher: 279 ms, Open Task Scanner Publisher: 214 ms, Dependencies Fingerprint Publisher: 1 ms, Invoker Publisher: 60851 ms, Pipeline Graph Publisher: 28 ms
[Pipeline] // withMaven
[Pipeline] cleanWs
[WS-CLEANUP] Deleting project workspace...
[WS-CLEANUP] Deferred wipeout is used...
[WS-CLEANUP] done
[Pipeline] }
[Pipeline] // stage
[Pipeline] }
[Pipeline] // ws
[Pipeline] }
[Pipeline] // node
[Pipeline] }
[INFO] run post-build script verify.groovy
[INFO]           MJAVADOC-134_multiaggregate/pom.xml .............. SUCCESS (30.7 s)
[INFO] Building: MJAVADOC-508/pom.xml
[withMaven] Publishers: Generated Artifacts Publisher: 1477 ms, Junit Publisher: 5106 ms, Open Task Scanner Publisher: 1490 ms, Dependencies Fingerprint Publisher: 1 ms, Invoker Publisher: 96675 ms, Pipeline Graph Publisher: 2 ms
[Pipeline] // withMaven
[Pipeline] cleanWs
[WS-CLEANUP] Deleting project workspace...
[WS-CLEANUP] Deferred wipeout is used...
[WS-CLEANUP] done
[Pipeline] }
[Pipeline] // stage
[Pipeline] }
[Pipeline] // ws
[Pipeline] }
[Pipeline] // node
[Pipeline] }
[INFO]           MJAVADOC-508/pom.xml ............................. SUCCESS (9.5 s)
[INFO] Building: dependencySource-4/pom.xml
[INFO] run post-build script verify.groovy
[INFO]           MJAVADOC-134_multiaggregate/pom.xml .............. SUCCESS (32.1 s)
[INFO] Building: MJAVADOC-508/pom.xml
[withMaven] Publishers: Generated Artifacts Publisher: 227 ms, Junit Publisher: 290 ms, Open Task Scanner Publisher: 241 ms, Dependencies Fingerprint Publisher: 1 ms, Invoker Publisher: 64694 ms, Pipeline Graph Publisher: 1 ms
[Pipeline] // withMaven
[Pipeline] cleanWs
[WS-CLEANUP] Deleting project workspace...
[WS-CLEANUP] Deferred wipeout is used...
[WS-CLEANUP] done
[Pipeline] }
[Pipeline] // stage
[Pipeline] }
[Pipeline] // ws
[Pipeline] }
[Pipeline] // node
[Pipeline] }
[INFO]           MJAVADOC-508/pom.xml ............................. SUCCESS (9.6 s)
[INFO] Building: dependencySource-4/pom.xml
[INFO] run post-build script verify.bsh
[INFO]           dependencySource-4/pom.xml ....................... SUCCESS (27.2 s)
[INFO] Building: MJAVADOC-568_export-to-testcase/pom.xml
[INFO]           MJAVADOC-568_export-to-testcase/pom.xml .......... SKIPPED due to JRE version
[INFO] Building: MJAVADOC-538/pom.xml
[INFO]           MJAVADOC-538/pom.xml ............................. SUCCESS (8.9 s)
[INFO] Building: MJAVADOC-444/pom.xml
[INFO] run post-build script verify.bsh
[INFO]           dependencySource-4/pom.xml ....................... SUCCESS (27.7 s)
[INFO] Building: MJAVADOC-568_export-to-testcase/pom.xml
[INFO]           MJAVADOC-568_export-to-testcase/pom.xml .......... SKIPPED due to JRE version
[INFO] Building: MJAVADOC-538/pom.xml
[withMaven] Publishers: Generated Artifacts Publisher: 223 ms, Junit Publisher: 345 ms, Open Task Scanner Publisher: 232 ms, Dependencies Fingerprint Publisher: 1 ms, Invoker Publisher: 75718 ms, Pipeline Graph Publisher: 1 ms
[Pipeline] // withMaven
[Pipeline] cleanWs
[WS-CLEANUP] Deleting project workspace...
[WS-CLEANUP] Deferred wipeout is used...
[WS-CLEANUP] done
[Pipeline] }
[Pipeline] // stage
[Pipeline] }
[Pipeline] // ws
[Pipeline] }
[Pipeline] // node
[Pipeline] }
[INFO]           MJAVADOC-538/pom.xml ............................. SUCCESS (9.5 s)
[INFO] Building: MJAVADOC-444/pom.xml
[INFO] run post-build script verify.bsh
[INFO]           MJAVADOC-444/pom.xml ............................. SUCCESS (26.2 s)
[INFO] Building: MJAVADOC-275/pom.xml
[INFO]           MJAVADOC-275/pom.xml ............................. SUCCESS (16.6 s)
[INFO] Building: MJAVADOC-420_fixparam/pom.xml
[INFO] run post-build script verify.bsh
[INFO]           MJAVADOC-444/pom.xml ............................. SUCCESS (27.5 s)
[INFO] Building: MJAVADOC-275/pom.xml
[INFO]           MJAVADOC-275/pom.xml ............................. SUCCESS (16.5 s)
[INFO] Building: MJAVADOC-420_fixparam/pom.xml
[INFO] run post-build script verify.groovy
[INFO]           MJAVADOC-420_fixparam/pom.xml .................... SUCCESS (16.9 s)
[INFO] Building: MJAVADOC-599/pom.xml
[INFO] run post-build script verify.groovy
[INFO]           MJAVADOC-599/pom.xml ............................. SUCCESS (12.5 s)
[INFO] Building: MJAVADOC-620_no-dot-in-version/pom.xml
[INFO] run post-build script verify.groovy
[INFO]           MJAVADOC-420_fixparam/pom.xml .................... SUCCESS (17.5 s)
[INFO] Building: MJAVADOC-599/pom.xml
[INFO] run post-build script verify.groovy
[INFO]           MJAVADOC-599/pom.xml ............................. SUCCESS (13.1 s)
[INFO] Building: MJAVADOC-620_no-dot-in-version/pom.xml
[INFO] run post-build script verify.bsh
[INFO]           MJAVADOC-620_no-dot-in-version/pom.xml ........... SUCCESS (19.1 s)
[INFO] Building: MJAVADOC-569_aggr-mixed/pom.xml
[INFO]           MJAVADOC-569_aggr-mixed/pom.xml .................. SKIPPED due to JRE version
[INFO] Building: MJAVADOC-365/pom.xml
[INFO] run post-build script verify.bsh
[INFO]           MJAVADOC-365/pom.xml ............................. SUCCESS (9.0 s)
[INFO] Building: MJAVADOC-575_source8-module-info/pom.xml
[INFO]           MJAVADOC-575_source8-module-info/pom.xml ......... SKIPPED due to JRE version
[INFO] Building: MJAVADOC-262/pom.xml
[INFO] run post-build script verify.bsh
[INFO]           MJAVADOC-620_no-dot-in-version/pom.xml ........... SUCCESS (19.3 s)
[INFO] Building: MJAVADOC-569_aggr-mixed/pom.xml
[INFO]           MJAVADOC-569_aggr-mixed/pom.xml .................. SKIPPED due to JRE version
[INFO] Building: MJAVADOC-365/pom.xml
[INFO] run post-build script verify.bsh
[INFO]           MJAVADOC-262/pom.xml ............................. SUCCESS (9.6 s)
[INFO] Building: MJAVADOC-498_modulepath/pom.xml
[INFO]           MJAVADOC-498_modulepath/pom.xml .................. SKIPPED due to JRE version
[INFO]
[INFO] --- mrm-maven-plugin:1.1.0:stop (repository) @ maven-javadoc-plugin ---
[INFO] Stopping Mock Repository Manager on http://localhost:33097
[INFO] Stopped SocketConnector@0.0.0.0:33097
[INFO] Mock Repository Manager http://localhost:33097 is stopped.
[INFO]
[INFO] --- mrm-maven-plugin:1.1.0:stop (3rdparty) @ maven-javadoc-plugin ---
[INFO] Stopping Mock Repository Manager on http://localhost:33239
[INFO] Stopped SocketConnector@0.0.0.0:33239
[INFO] Mock Repository Manager http://localhost:33239 is stopped.
[INFO]
[INFO] --- maven-checkstyle-plugin:3.0.0:check (checkstyle-check) @ maven-javadoc-plugin ---
[INFO] There are 4 errors reported by Checkstyle 6.18 with config/maven_checks.xml ruleset.
[INFO] Ignored 4 errors, 0 violation remaining.
[INFO]
[INFO] --- maven-invoker-plugin:3.1.0:verify (integration-test) @ maven-javadoc-plugin ---
[INFO] -------------------------------------------------
[INFO] Build Summary:
[INFO]   Passed: 52, Failed: 0, Errors: 0, Skipped: 16
[INFO] -------------------------------------------------
[INFO] ------------------------------------------------------------------------
[INFO] BUILD SUCCESS
[INFO] ------------------------------------------------------------------------
[INFO] Total time:  23:49 min
[INFO] Finished at: 2020-02-14T08:54:34Z
[INFO] ------------------------------------------------------------------------
[INFO] [jenkins-event-spy] Generated /home/jenkins/jenkins-slave/workspace/_box_maven-javadoc-plugin_master@3@2@tmp/withMavenb27544b0/maven-spy-20200214-083044-5878284697814566929194.log
[Pipeline] }
[Pipeline] // dir
[Pipeline] }
[withMaven] artifactsPublisher - Archive artifact linux-jdk7-m3.6.x_build/pom.xml under org/apache/maven/plugins/maven-javadoc-plugin/3.2.0-SNAPSHOT/maven-javadoc-plugin-3.2.0-SNAPSHOT.pom
[INFO] run post-build script verify.bsh
[INFO]           MJAVADOC-365/pom.xml ............................. SUCCESS (9.4 s)
[INFO] Building: MJAVADOC-575_source8-module-info/pom.xml
[INFO]           MJAVADOC-575_source8-module-info/pom.xml ......... SKIPPED due to JRE version
[INFO] Building: MJAVADOC-262/pom.xml
[withMaven] artifactsPublisher - Archive artifact linux-jdk7-m3.6.x_build/target/maven-javadoc-plugin-3.2.0-SNAPSHOT.jar under org/apache/maven/plugins/maven-javadoc-plugin/3.2.0-SNAPSHOT/maven-javadoc-plugin-3.2.0-SNAPSHOT.jar
[withMaven] junitPublisher - Archive test results for Maven artifact org.apache.maven.plugins:maven-javadoc-plugin:maven-plugin:3.2.0-SNAPSHOT generated by maven-surefire-plugin:test (default-test): linux-jdk7-m3.6.x_build/target/surefire-reports/*.xml
Recording test results
[INFO] run post-build script verify.bsh
[INFO]           MJAVADOC-262/pom.xml ............................. SUCCESS (9.7 s)
[INFO] Building: MJAVADOC-498_modulepath/pom.xml
[INFO]           MJAVADOC-498_modulepath/pom.xml .................. SKIPPED due to JRE version
[INFO]
[INFO] --- mrm-maven-plugin:1.1.0:stop (repository) @ maven-javadoc-plugin ---
[INFO] Stopping Mock Repository Manager on http://localhost:40343
[INFO] Stopped SocketConnector@0.0.0.0:40343
[INFO] Mock Repository Manager http://localhost:40343 is stopped.
[INFO]
[INFO] --- mrm-maven-plugin:1.1.0:stop (3rdparty) @ maven-javadoc-plugin ---
[INFO] Stopping Mock Repository Manager on http://localhost:44177
[INFO] Stopped SocketConnector@0.0.0.0:44177
[INFO] Mock Repository Manager http://localhost:44177 is stopped.
[INFO]
[INFO] --- maven-checkstyle-plugin:3.0.0:check (checkstyle-check) @ maven-javadoc-plugin ---
[withMaven] openTasksPublisher - Scan Tasks for Maven artifact org.apache.maven.plugins:maven-javadoc-plugin:maven-plugin:3.2.0-SNAPSHOT in source directory linux-jdk7-m3.6.x_build/src/main/java
[TASKS] Scanning folder '/home/jenkins/jenkins-slave/workspace/_box_maven-javadoc-plugin_master@3@2' for files matching the pattern 'linux-jdk7-m3.6.x_build/src/main/java/**/*' - excludes: null
[TASKS] Found 27 files to scan for tasks
[TASKS] Found 7 open tasks.
Skipping warnings blame since pipelines do not have an SCM link.%n
[TASKS] Computing warning deltas based on reference build #80
[INFO] There are 4 errors reported by Checkstyle 6.18 with config/maven_checks.xml ruleset.
[INFO] Ignored 4 errors, 0 violation remaining.
[INFO]
[INFO] --- maven-invoker-plugin:3.1.0:verify (integration-test) @ maven-javadoc-plugin ---
[INFO] -------------------------------------------------
[INFO] Build Summary:
[INFO]   Passed: 52, Failed: 0, Errors: 0, Skipped: 16
[INFO] -------------------------------------------------
[INFO] ------------------------------------------------------------------------
[INFO] BUILD SUCCESS
[INFO] ------------------------------------------------------------------------
[INFO] Total time: 24:12 min
[INFO] Finished at: 2020-02-14T08:54:51Z
[INFO] ------------------------------------------------------------------------
[INFO] [jenkins-event-spy] Generated /home/jenkins/jenkins-slave/workspace/_box_maven-javadoc-plugin_master@2@tmp/withMavene990d329/maven-spy-20200214-083039-3414237212175801174219.log
[withMaven] invokerPublisher - Archive invoker results for Maven artifact MavenArtifact{org.apache.maven.plugins:maven-javadoc-plugin:maven-plugin:3.2.0-SNAPSHOT(version: 3.2.0-SNAPSHOT, snapshot:false) } generated by PluginInvocation{org.apache.maven.plugins:maven-invoker-plugin:3.1.0@integration-test  integration-test}: linux-jdk7-m3.6.x_build/target/invoker-reports/*.xml
[Pipeline] }
[Pipeline] // dir
[Pipeline] }
[withMaven] artifactsPublisher - Archive artifact linux-jdk7-m3.5.x_build/pom.xml under org/apache/maven/plugins/maven-javadoc-plugin/3.2.0-SNAPSHOT/maven-javadoc-plugin-3.2.0-SNAPSHOT.pom
[withMaven] artifactsPublisher - Archive artifact linux-jdk7-m3.5.x_build/target/maven-javadoc-plugin-3.2.0-SNAPSHOT.jar under org/apache/maven/plugins/maven-javadoc-plugin/3.2.0-SNAPSHOT/maven-javadoc-plugin-3.2.0-SNAPSHOT.jar
[withMaven] junitPublisher - Archive test results for Maven artifact org.apache.maven.plugins:maven-javadoc-plugin:maven-plugin:3.2.0-SNAPSHOT generated by maven-surefire-plugin:test (default-test): linux-jdk7-m3.5.x_build/target/surefire-reports/*.xml
Recording test results
[withMaven] openTasksPublisher - Scan Tasks for Maven artifact org.apache.maven.plugins:maven-javadoc-plugin:maven-plugin:3.2.0-SNAPSHOT in source directory linux-jdk7-m3.5.x_build/src/main/java
[TASKS] Scanning folder '/home/jenkins/jenkins-slave/workspace/_box_maven-javadoc-plugin_master@2' for files matching the pattern 'linux-jdk7-m3.5.x_build/src/main/java/**/*' - excludes: null
[TASKS] Found 27 files to scan for tasks
[TASKS] Found 7 open tasks.
Skipping warnings blame since pipelines do not have an SCM link.%n
[TASKS] Computing warning deltas based on reference build #80
[withMaven] invokerPublisher - Archive invoker results for Maven artifact MavenArtifact{org.apache.maven.plugins:maven-javadoc-plugin:maven-plugin:3.2.0-SNAPSHOT(version: 3.2.0-SNAPSHOT, snapshot:false) } generated by PluginInvocation{org.apache.maven.plugins:maven-invoker-plugin:3.1.0@integration-test  integration-test}: linux-jdk7-m3.5.x_build/target/invoker-reports/*.xml
[withMaven] Publishers: Generated Artifacts Publisher: 1940 ms, Junit Publisher: 8871 ms, Open Task Scanner Publisher: 3106 ms, Dependencies Fingerprint Publisher: 1 ms, Invoker Publisher: 135713 ms, Pipeline Graph Publisher: 27 ms
[Pipeline] // withMaven
[Pipeline] cleanWs
[WS-CLEANUP] Deleting project workspace...
[WS-CLEANUP] Deferred wipeout is used...
[WS-CLEANUP] done
[Pipeline] }
[Pipeline] // stage
[Pipeline] }
[Pipeline] // ws
[Pipeline] }
[Pipeline] // node
[Pipeline] }
[withMaven] Publishers: Generated Artifacts Publisher: 2199 ms, Junit Publisher: 10140 ms, Open Task Scanner Publisher: 2142 ms, Dependencies Fingerprint Publisher: 1 ms, Invoker Publisher: 137185 ms, Pipeline Graph Publisher: 1 ms
[Pipeline] // withMaven
[Pipeline] cleanWs
[WS-CLEANUP] Deleting project workspace...
[WS-CLEANUP] Deferred wipeout is used...
[WS-CLEANUP] done
[Pipeline] }
[Pipeline] // stage
[Pipeline] }
[Pipeline] // ws
[Pipeline] }
[Pipeline] // node
[Pipeline] }
[Pipeline] // parallel
[Pipeline] stage
[Pipeline] { (Notifications)
[Pipeline] echo
Build result: UNSTABLE
[Pipeline] jiraIssueSelector
[Pipeline] jiraComment
[Pipeline] echo
The authors of changes [olamy].
[Pipeline] echo
Sending email ...
[Pipeline] emailext
Reply | Threaded
Open this post in threaded view
|

Build unstable in Jenkins: Maven TLP » maven-javadoc-plugin » master #83

Apache Jenkins Server-2
See https://builds.apache.org/job/maven-box/job/maven-javadoc-plugin/job/master/83/

Changes:

* [MJAVADOC-637] make build Reproducible

1 tests failed.
FAILED:  org.apache.maven.plugins.javadoc.JavadocUtilTest.linux-jdk7-m3.2.x_build / Build linux-jdk7-m3.2.x_build / testIsValidPackageList

Error Message:
Read timed out

Stack Trace:
java.net.SocketTimeoutException: Read timed out
        at org.apache.maven.plugins.javadoc.JavadocUtilTest.testIsValidPackageList(JavadocUtilTest.java:395)




Build log:
[...truncated 8661 lines...]
[INFO] run post-build script verify.bsh
[INFO]           MJAVADOC-110/pom.xml ............................. SUCCESS (6.0 s)
[INFO] Building: MJAVADOC-194/pom.xml
[withMaven] invokerPublisher - Archive invoker results for Maven artifact MavenArtifact{org.apache.maven.plugins:maven-javadoc-plugin:maven-plugin:3.2.0-SNAPSHOT(version: 3.2.0-SNAPSHOT, snapshot:false) } generated by PluginInvocation{org.apache.maven.plugins:maven-invoker-plugin:3.2.1@integration-test  integration-test}: linux-jdk13-m3.6.x_build/target/invoker-reports/*.xml
[INFO] run post-build script verify.bsh
[INFO]           MJAVADOC-194/pom.xml ............................. SUCCESS (6.4 s)
[INFO] Building: MJAVADOC-538/pom.xml
[withMaven] Publishers: Generated Artifacts Publisher: 1409 ms, Junit Publisher: 5187 ms, Open Task Scanner Publisher: 1278 ms, Dependencies Fingerprint Publisher: 1 ms, Invoker Publisher: 100104 ms, Pipeline Graph Publisher: 2 ms
[INFO] run post-build script verify.bsh
[INFO]           MJAVADOC-180/pom.xml ............................. SUCCESS (7.5 s)
[INFO]
[INFO] --- mrm-maven-plugin:1.1.0:stop (repository) @ maven-javadoc-plugin ---
[INFO] Stopping Mock Repository Manager on http://localhost:40953
[INFO] Stopped SocketConnector@0.0.0.0:40953
[INFO] Mock Repository Manager http://localhost:40953 is stopped.
[INFO]
[INFO] --- mrm-maven-plugin:1.1.0:stop (3rdparty) @ maven-javadoc-plugin ---
[INFO] Stopping Mock Repository Manager on http://localhost:37759
[INFO] Stopped SocketConnector@0.0.0.0:37759
[INFO] Mock Repository Manager http://localhost:37759 is stopped.
[INFO]
[INFO] --- maven-checkstyle-plugin:3.0.0:check (checkstyle-check) @ maven-javadoc-plugin ---
[Pipeline] // withMaven
[Pipeline] cleanWs
[WS-CLEANUP] Deleting project workspace...
[WS-CLEANUP] Deferred wipeout is used...
[WS-CLEANUP] done
[Pipeline] }
[Pipeline] // stage
[Pipeline] }
[Pipeline] // ws
[Pipeline] }
[Pipeline] // node
[Pipeline] }
[INFO] There are 4 errors reported by Checkstyle 6.18 with config/maven_checks.xml ruleset.
[INFO] Ignored 4 errors, 0 violation remaining.
[INFO]
[INFO] --- maven-invoker-plugin:3.2.1:verify (integration-test) @ maven-javadoc-plugin ---
[INFO] -------------------------------------------------
[INFO] Build Summary:
[INFO]   Passed: 66, Failed: 0, Errors: 0, Skipped: 2
[INFO] -------------------------------------------------
[INFO] ------------------------------------------------------------------------
[INFO] BUILD SUCCESS
[INFO] ------------------------------------------------------------------------
[INFO] Total time:  13:23 min
[INFO] Finished at: 2020-02-14T23:31:07Z
[INFO] ------------------------------------------------------------------------
[INFO] [jenkins-event-spy] Generated /home/jenkins/jenkins-slave/workspace/_box_maven-javadoc-plugin_master@2@tmp/withMaven96fdba48/maven-spy-20200214-231744-56513314441882692204500.log
[Pipeline] }
[Pipeline] // dir
[Pipeline] }
[INFO]           MJAVADOC-538/pom.xml ............................. SUCCESS (4.6 s)
[INFO] Building: MJAVADOC-569_aggr-mixed/pom.xml
[withMaven] artifactsPublisher - Archive artifact linux-jdk11-m3.6.x_build/pom.xml under org/apache/maven/plugins/maven-javadoc-plugin/3.2.0-SNAPSHOT/maven-javadoc-plugin-3.2.0-SNAPSHOT.pom
[withMaven] artifactsPublisher - Archive artifact linux-jdk11-m3.6.x_build/target/maven-javadoc-plugin-3.2.0-SNAPSHOT.jar under org/apache/maven/plugins/maven-javadoc-plugin/3.2.0-SNAPSHOT/maven-javadoc-plugin-3.2.0-SNAPSHOT.jar
[Fast Archiver] Compressed 498.92 KB of artifacts by 44.9% relative to #82
[withMaven] junitPublisher - Archive test results for Maven artifact org.apache.maven.plugins:maven-javadoc-plugin:maven-plugin:3.2.0-SNAPSHOT generated by maven-surefire-plugin:test (default-test): linux-jdk11-m3.6.x_build/target/surefire-reports/*.xml
Recording test results
[withMaven] openTasksPublisher - Scan Tasks for Maven artifact org.apache.maven.plugins:maven-javadoc-plugin:maven-plugin:3.2.0-SNAPSHOT in source directory linux-jdk11-m3.6.x_build/src/main/java
[TASKS] Scanning folder '/home/jenkins/jenkins-slave/workspace/_box_maven-javadoc-plugin_master@2' for files matching the pattern 'linux-jdk11-m3.6.x_build/src/main/java/**/*' - excludes: null
[TASKS] Found 27 files to scan for tasks
[TASKS] Found 7 open tasks.
Skipping warnings blame since pipelines do not have an SCM link.%n
[TASKS] Computing warning deltas based on reference build #82
[withMaven] invokerPublisher - Archive invoker results for Maven artifact MavenArtifact{org.apache.maven.plugins:maven-javadoc-plugin:maven-plugin:3.2.0-SNAPSHOT(version: 3.2.0-SNAPSHOT, snapshot:false) } generated by PluginInvocation{org.apache.maven.plugins:maven-invoker-plugin:3.2.1@integration-test  integration-test}: linux-jdk11-m3.6.x_build/target/invoker-reports/*.xml
[INFO]           MJAVADOC-569_aggr-mixed/pom.xml .................. SUCCESS (10.4 s)
[INFO] Building: MJAVADOC-275/pom.xml
[INFO]           MJAVADOC-275/pom.xml ............................. SUCCESS (9.7 s)
[INFO] Building: MJAVADOC-172/pom.xml
[INFO] run post-build script verify.bsh
[INFO]           MJAVADOC-172/pom.xml ............................. SUCCESS (9.8 s)
[INFO] Building: MJAVADOC-497/pom.xml
[INFO] run post-build script verify.bsh
[INFO]           MJAVADOC-497/pom.xml ............................. SUCCESS (5.7 s)
[INFO] Building: MJAVADOC-444/pom.xml
[INFO] run post-build script verify.bsh
[INFO]           MJAVADOC-444/pom.xml ............................. SUCCESS (17.3 s)
[INFO] Building: MJAVADOC-599/pom.xml
[INFO] run post-build script verify.groovy
[INFO]           MJAVADOC-599/pom.xml ............................. SUCCESS (6.5 s)
[INFO] Building: dependencySource-4/pom.xml
[INFO] run post-build script verify.bsh
[INFO]           dependencySource-4/pom.xml ....................... SUCCESS (14.3 s)
[INFO] Building: MJAVADOC-414/pom.xml
[withMaven] Publishers: Generated Artifacts Publisher: 1312 ms, Junit Publisher: 4927 ms, Open Task Scanner Publisher: 1244 ms, Dependencies Fingerprint Publisher: 1 ms, Invoker Publisher: 88498 ms, Pipeline Graph Publisher: 1 ms
[Pipeline] // withMaven
[Pipeline] cleanWs
[WS-CLEANUP] Deleting project workspace...
[WS-CLEANUP] Deferred wipeout is used...
[WS-CLEANUP] done
[Pipeline] }
[Pipeline] // stage
[Pipeline] }
[Pipeline] // ws
[Pipeline] }
[Pipeline] // node
[Pipeline] }
[INFO] run post-build script verify.bsh
[INFO]           MJAVADOC-414/pom.xml ............................. SUCCESS (5.7 s)
[INFO] Building: MJAVADOC-506_excl-module-info/pom.xml
[INFO] run post-build script verify.groovy
[INFO]           MJAVADOC-506_excl-module-info/pom.xml ............ SUCCESS (6.1 s)
[INFO] Building: MJAVADOC-407/pom.xml
[INFO] run post-build script verify.bsh
[INFO]           MJAVADOC-407/pom.xml ............................. SUCCESS (7.7 s)
[INFO] Building: dependencySource-3/pom.xml
[withMaven] Publishers: Generated Artifacts Publisher: 1277 ms, Junit Publisher: 4884 ms, Open Task Scanner Publisher: 1260 ms, Dependencies Fingerprint Publisher: 2 ms, Invoker Publisher: 86351 ms, Pipeline Graph Publisher: 1 ms
[Pipeline] // withMaven
[Pipeline] cleanWs
[WS-CLEANUP] Deleting project workspace...
[WS-CLEANUP] Deferred wipeout is used...
[WS-CLEANUP] done
[Pipeline] }
[Pipeline] // stage
[Pipeline] }
[Pipeline] // ws
[Pipeline] }
[Pipeline] // node
[Pipeline] }
[INFO] run post-build script verify.bsh
[INFO]           dependencySource-3/pom.xml ....................... SUCCESS (15.9 s)
[INFO] Building: MJAVADOC-555_link-automatic-modules/pom.xml
[INFO] run post-build script verify.groovy
[INFO]           MJAVADOC-555_link-automatic-modules/pom.xml ...... SUCCESS (8.4 s)
[INFO] Building: MJAVADOC-338_downloadSources/pom.xml
[INFO] artifact org.apache.maven.plugins.javadoc.its.mjavadoc338-direct:1.0: checking for updates from central
[INFO] run post-build script verify.groovy
[INFO]           MJAVADOC-338_downloadSources/pom.xml ............. SUCCESS (8.8 s)
[INFO] Building: MJAVADOC-452_fix-duplicateparams/pom.xml
[INFO] run post-build script verify.groovy
[INFO]           MJAVADOC-452_fix-duplicateparams/pom.xml ......... SUCCESS (5.8 s)
[INFO] Building: MJAVADOC-613-aggregate-exclude/pom.xml
[INFO] run post-build script verify.groovy
[INFO]           MJAVADOC-613-aggregate-exclude/pom.xml ........... SUCCESS (9.1 s)
[INFO] Building: MJAVADOC-552_fix-author/pom.xml
[INFO] run post-build script verify.groovy
[INFO]           MJAVADOC-552_fix-author/pom.xml .................. SUCCESS (5.8 s)
[INFO] Building: MJAVADOC-558_fix-unknownthrows/pom.xml
[INFO] run post-build script verify.groovy
[INFO]           MJAVADOC-558_fix-unknownthrows/pom.xml ........... SUCCESS (5.8 s)
[INFO] Building: MJAVADOC-498_mm_modulepath/pom.xml
[INFO]           MJAVADOC-498_mm_modulepath/pom.xml ............... SUCCESS (7.9 s)
[INFO] Building: MJAVADOC-575_source8-module-info/pom.xml
[INFO] run post-build script verify.groovy
[INFO]           MJAVADOC-575_source8-module-info/pom.xml ......... SUCCESS (6.0 s)
[INFO] Building: MJAVADOC-562_release/pom.xml
[INFO]           MJAVADOC-562_release/pom.xml ..................... SUCCESS (7.2 s)
[INFO] Building: MJAVADOC-568_jar-mixed/pom.xml
[INFO]           MJAVADOC-568_jar-mixed/pom.xml ................... SUCCESS (8.2 s)
[INFO] Building: MJAVADOC-580_detectLinks/pom.xml
[INFO] run post-build script verify.groovy
[INFO]           MJAVADOC-580_detectLinks/pom.xml ................. SUCCESS (4.6 s)
[INFO] Building: MJAVADOC-137_jar/pom.xml
[INFO] run post-build script verify.bsh
[INFO]           MJAVADOC-137_jar/pom.xml ......................... SUCCESS (6.5 s)
[INFO] Building: MJAVADOC-250/pom.xml
[INFO] run post-build script verify.bsh
[INFO]           MJAVADOC-250/pom.xml ............................. SUCCESS (7.8 s)
[INFO] Building: MJAVADOC-567_aggr-mixed/pom.xml
[INFO] run post-build script verify.groovy
[INFO]           MJAVADOC-567_aggr-mixed/pom.xml .................. SUCCESS (4.6 s)
[INFO] Building: MJAVADOC-514_3rdparty-doclettags/pom.xml
[INFO]           MJAVADOC-514_3rdparty-doclettags/pom.xml ......... SKIPPED due to JRE version
[INFO] Building: MJAVADOC-494_aggregate-repositories/pom.xml
[INFO] artifact org.apache.maven.plugins.javadoc.its.lib:1.0: checking for updates from central
[INFO]           MJAVADOC-494_aggregate-repositories/pom.xml ...... SUCCESS (6.3 s)
[INFO] Building: MJAVADOC-369/pom.xml
[INFO] run post-build script verify.bsh
[INFO]           MJAVADOC-369/pom.xml ............................. SUCCESS (9.2 s)
[INFO] Building: MJAVADOC-126/pom.xml
[INFO] run post-build script verify.bsh
[INFO]           MJAVADOC-126/pom.xml ............................. SUCCESS (6.3 s)
[INFO] Building: MJAVADOC-620_top-level-package/pom.xml
[INFO] run post-build script verify.bsh
[INFO]           MJAVADOC-620_top-level-package/pom.xml ........... SUCCESS (9.3 s)
[INFO] Building: MJAVADOC-180/pom.xml
[INFO] run post-build script verify.bsh
[INFO]           MJAVADOC-180/pom.xml ............................. SUCCESS (6.5 s)
[INFO] Building: MJAVADOC-384/pom.xml
[INFO] run post-build script verify.bsh
[INFO]           MJAVADOC-384/pom.xml ............................. SUCCESS (4.6 s)
[INFO]
[INFO] --- mrm-maven-plugin:1.1.0:stop (repository) @ maven-javadoc-plugin ---
[INFO] Stopping Mock Repository Manager on http://localhost:44107
[INFO] Stopped SocketConnector@0.0.0.0:44107
[INFO] Mock Repository Manager http://localhost:44107 is stopped.
[INFO]
[INFO] --- mrm-maven-plugin:1.1.0:stop (3rdparty) @ maven-javadoc-plugin ---
[INFO] Stopping Mock Repository Manager on http://localhost:33487
[INFO] Stopped SocketConnector@0.0.0.0:33487
[INFO] Mock Repository Manager http://localhost:33487 is stopped.
[INFO]
[INFO] --- maven-checkstyle-plugin:3.0.0:check (checkstyle-check) @ maven-javadoc-plugin ---
[INFO] There are 4 errors reported by Checkstyle 6.18 with config/maven_checks.xml ruleset.
[INFO] Ignored 4 errors, 0 violation remaining.
[INFO]
[INFO] --- maven-invoker-plugin:3.2.1:verify (integration-test) @ maven-javadoc-plugin ---
[INFO] -------------------------------------------------
[INFO] Build Summary:
[INFO]   Passed: 64, Failed: 0, Errors: 0, Skipped: 4
[INFO] -------------------------------------------------
[INFO] ------------------------------------------------------------------------
[INFO] BUILD SUCCESS
[INFO] ------------------------------------------------------------------------
[INFO] Total time:  10:49 min
[INFO] Finished at: 2020-02-14T23:33:55Z
[INFO] ------------------------------------------------------------------------
[INFO] [jenkins-event-spy] Generated /home/jenkins/jenkins-slave/workspace/_box_maven-javadoc-plugin_master@2@tmp/withMavene7839258/maven-spy-20200214-232305-9661774547894941907722.log
[Pipeline] }
[Pipeline] // dir
[Pipeline] }
[withMaven] artifactsPublisher - Archive artifact linux-jdk14-m3.6.x_build/pom.xml under org/apache/maven/plugins/maven-javadoc-plugin/3.2.0-SNAPSHOT/maven-javadoc-plugin-3.2.0-SNAPSHOT.pom
[withMaven] artifactsPublisher - Archive artifact linux-jdk14-m3.6.x_build/target/maven-javadoc-plugin-3.2.0-SNAPSHOT.jar under org/apache/maven/plugins/maven-javadoc-plugin/3.2.0-SNAPSHOT/maven-javadoc-plugin-3.2.0-SNAPSHOT.jar
[Fast Archiver] Compressed 501.14 KB of artifacts by 44.7% relative to #82
[withMaven] junitPublisher - Archive test results for Maven artifact org.apache.maven.plugins:maven-javadoc-plugin:maven-plugin:3.2.0-SNAPSHOT generated by maven-surefire-plugin:test (default-test): linux-jdk14-m3.6.x_build/target/surefire-reports/*.xml
Recording test results
[withMaven] openTasksPublisher - Scan Tasks for Maven artifact org.apache.maven.plugins:maven-javadoc-plugin:maven-plugin:3.2.0-SNAPSHOT in source directory linux-jdk14-m3.6.x_build/src/main/java
[TASKS] Scanning folder '/home/jenkins/jenkins-slave/workspace/_box_maven-javadoc-plugin_master@2' for files matching the pattern 'linux-jdk14-m3.6.x_build/src/main/java/**/*' - excludes: null
[TASKS] Found 27 files to scan for tasks
[TASKS] Found 7 open tasks.
Skipping warnings blame since pipelines do not have an SCM link.%n
[TASKS] Computing warning deltas based on reference build #82
[withMaven] invokerPublisher - Archive invoker results for Maven artifact MavenArtifact{org.apache.maven.plugins:maven-javadoc-plugin:maven-plugin:3.2.0-SNAPSHOT(version: 3.2.0-SNAPSHOT, snapshot:false) } generated by PluginInvocation{org.apache.maven.plugins:maven-invoker-plugin:3.2.1@integration-test  integration-test}: linux-jdk14-m3.6.x_build/target/invoker-reports/*.xml
[withMaven] Publishers: Generated Artifacts Publisher: 1319 ms, Junit Publisher: 5068 ms, Open Task Scanner Publisher: 1298 ms, Invoker Publisher: 87936 ms, Pipeline Graph Publisher: 2 ms
[Pipeline] // withMaven
[Pipeline] cleanWs
[WS-CLEANUP] Deleting project workspace...
[WS-CLEANUP] Deferred wipeout is used...
[WS-CLEANUP] done
[Pipeline] }
[Pipeline] // stage
[Pipeline] }
[Pipeline] // ws
[Pipeline] }
[Pipeline] // node
[Pipeline] }
[Pipeline] // parallel
[Pipeline] stage
[Pipeline] { (Notifications)
[Pipeline] echo
Build result: UNSTABLE
[Pipeline] jiraIssueSelector
[Pipeline] jiraComment
[Pipeline] echo
The authors of changes [hboutemy].
[Pipeline] echo
Sending email ...
[Pipeline] emailext