Build unstable in Jenkins: Maven TLP » maven-javadoc-plugin » master #60

classic Classic list List threaded Threaded
3 messages Options
Reply | Threaded
Open this post in threaded view
|

Build unstable in Jenkins: Maven TLP » maven-javadoc-plugin » master #60

Apache Jenkins Server-2
See https://builds.apache.org/job/maven-box/job/maven-javadoc-plugin/job/master/60/

No changes.

1 tests failed.
FAILED:  org.apache.maven.plugins.javadoc.JavadocUtilTest.linux-jdk11-m3.6.x_build / Build linux-jdk11-m3.6.x_build / testIsValidPackageList

Error Message:
Read timed out

Stack Trace:
java.net.SocketTimeoutException: Read timed out
        at org.apache.maven.plugins.javadoc.JavadocUtilTest.testIsValidPackageList(JavadocUtilTest.java:395)




Build log:
[...truncated 8710 lines...]
[INFO] artifact org.apache.maven.plugins:maven-resources-plugin: checking for updates from central
[INFO] artifact org.apache.maven.plugins:maven-install-plugin: checking for updates from central
[INFO] artifact org.apache.maven.plugins:maven-deploy-plugin: checking for updates from central
[INFO] run post-build script verify.bsh
[INFO]           MJAVADOC-278\pom.xml ............................. SUCCESS (7.8 s)
[INFO] Building: MJAVADOC-320\pom.xml
[INFO]           MJAVADOC-591_release8\pom.xml .................... SUCCESS (18.8 s)
[INFO] Building: MJAVADOC-599\pom.xml
[INFO] run post-build script verify.groovy
[INFO]           MJAVADOC-599\pom.xml ............................. SUCCESS (10.1 s)
[INFO] Building: site-failOnError\pom.xml
[INFO] run post-build script verify.bsh
[INFO]           MJAVADOC-320\pom.xml ............................. SUCCESS (15.1 s)
[INFO] Building: MJAVADOC-338_downloadSources\pom.xml
[INFO]           site-failOnError\pom.xml ......................... SUCCESS (8.8 s)
[INFO]
[INFO] --- mrm-maven-plugin:1.1.0:stop (repository) @ maven-javadoc-plugin ---
[INFO] Stopping Mock Repository Manager on http://localhost:64087
[INFO] Stopped SocketConnector@0.0.0.0:64087
[INFO] Mock Repository Manager http://localhost:64087 is stopped.
[INFO]
[INFO] --- mrm-maven-plugin:1.1.0:stop (3rdparty) @ maven-javadoc-plugin ---
[INFO] Stopping Mock Repository Manager on http://localhost:64088
[INFO] Stopped SocketConnector@0.0.0.0:64088
[INFO] Mock Repository Manager http://localhost:64088 is stopped.
[INFO]
[INFO] --- maven-checkstyle-plugin:3.0.0:check (checkstyle-check) @ maven-javadoc-plugin ---
[INFO] There are 4 errors reported by Checkstyle 6.18 with config/maven_checks.xml ruleset.
[INFO] Ignored 4 errors, 0 violation remaining.
[INFO]
[INFO] --- maven-invoker-plugin:3.1.0:verify (integration-test) @ maven-javadoc-plugin ---
[INFO] -------------------------------------------------
[INFO] Build Summary:
[INFO]   Passed: 60, Failed: 0, Errors: 0, Skipped: 4
[INFO] -------------------------------------------------
[INFO] ------------------------------------------------------------------------
[INFO] BUILD SUCCESS
[INFO] ------------------------------------------------------------------------
[INFO] Total time:  17:21 min
[INFO] Finished at: 2019-10-25T23:29:02-07:00
[INFO] ------------------------------------------------------------------------
[INFO] [jenkins-event-spy] Generated F:\jenkins\jenkins-slave\workspace\-box_maven-javadoc-plugin_master@2@tmp\withMaven52838dc1\maven-spy-20191025-231140-4214396728060476134703.log
[Pipeline] }
[Pipeline] // dir
[Pipeline] }
[withMaven] artifactsPublisher - Archive artifact windows-jdk13-m3.6.x_build\pom.xml under org\apache\maven\plugins\maven-javadoc-plugin\3.1.2-SNAPSHOT\maven-javadoc-plugin-3.1.2-SNAPSHOT.pom
[withMaven] artifactsPublisher - Archive artifact windows-jdk13-m3.6.x_build\target\maven-javadoc-plugin-3.1.2-SNAPSHOT.jar under org\apache\maven\plugins\maven-javadoc-plugin\3.1.2-SNAPSHOT\maven-javadoc-plugin-3.1.2-SNAPSHOT.jar
[Fast Archiver] Compressed 493.24 KB of artifacts by 45.4% relative to #59
[withMaven] junitPublisher - Archive test results for Maven artifact org.apache.maven.plugins:maven-javadoc-plugin:maven-plugin:3.1.2-SNAPSHOT generated by maven-surefire-plugin:test (default-test): windows-jdk13-m3.6.x_build\target\surefire-reports\*.xml
Recording test results
[withMaven] openTasksPublisher - Scan Tasks for Maven artifact org.apache.maven.plugins:maven-javadoc-plugin:maven-plugin:3.1.2-SNAPSHOT in source directory windows-jdk13-m3.6.x_build\src\main\java
[TASKS] Scanning folder 'f:\jenkins\jenkins-slave\workspace\-box_maven-javadoc-plugin_master@2' for files matching the pattern 'windows-jdk13-m3.6.x_build\src\main\java\**\*' - excludes: null
[TASKS] Found 26 files to scan for tasks
[TASKS] Found 7 open tasks.
Skipping warnings blame since pipelines do not have an SCM link.%n
[TASKS] Computing warning deltas based on reference build #59
[withMaven] invokerPublisher - Archive invoker results for Maven artifact MavenArtifact{org.apache.maven.plugins:maven-javadoc-plugin:maven-plugin:3.1.2-SNAPSHOT(version: 3.1.2-SNAPSHOT, snapshot:false) } generated by PluginInvocation{org.apache.maven.plugins:maven-invoker-plugin:3.1.0@integration-test  integration-test}: windows-jdk13-m3.6.x_build\target\invoker-reports\*.xml
[INFO] run post-build script verify.groovy
[INFO]           MJAVADOC-338_downloadSources\pom.xml ............. SUCCESS (14.3 s)
[INFO] Building: MJAVADOC-365\pom.xml
[INFO] run post-build script verify.bsh
[INFO]           MJAVADOC-365\pom.xml ............................. SUCCESS (6.5 s)
[INFO] Building: MJAVADOC-369\pom.xml
[INFO] run post-build script verify.bsh
[INFO]           MJAVADOC-369\pom.xml ............................. SUCCESS (15.7 s)
[INFO] Building: MJAVADOC-384\pom.xml
[INFO] run post-build script verify.bsh
[INFO]           MJAVADOC-384\pom.xml ............................. SUCCESS (8.1 s)
[INFO] Building: MJAVADOC-407\pom.xml
[INFO] run post-build script verify.bsh
[INFO]           MJAVADOC-407\pom.xml ............................. SUCCESS (9.2 s)
[INFO] Building: MJAVADOC-414\pom.xml
[INFO] run post-build script verify.bsh
[INFO]           MJAVADOC-414\pom.xml ............................. SUCCESS (8.4 s)
[INFO] Building: MJAVADOC-420_fixparam\pom.xml
[INFO] run post-build script verify.groovy
[INFO]           MJAVADOC-420_fixparam\pom.xml .................... SUCCESS (10.2 s)
[INFO] Building: MJAVADOC-427\pom.xml
[INFO] run post-build script verify.groovy
[INFO]           MJAVADOC-427\pom.xml ............................. SUCCESS (9.0 s)
[INFO] Building: MJAVADOC-434_fixcompile\pom.xml
[withMaven] Publishers: Generated Artifacts Publisher: 152 ms, Junit Publisher: 258 ms, Open Task Scanner Publisher: 167 ms, Invoker Publisher: 72216 ms, Pipeline Graph Publisher: 1 ms
[Pipeline] // withMaven
[Pipeline] cleanWs
[WS-CLEANUP] Deleting project workspace...
[WS-CLEANUP] Deferred wipeout is used...
[WS-CLEANUP] done
[Pipeline] }
[Pipeline] // stage
[Pipeline] }
[Pipeline] // ws
[Pipeline] }
[Pipeline] // node
[Pipeline] }
[INFO]           MJAVADOC-434_fixcompile\pom.xml .................. SUCCESS (16.2 s)
[INFO] Building: MJAVADOC-437\pom.xml
[INFO] run post-build script verify.bsh
[INFO]           MJAVADOC-437\pom.xml ............................. SUCCESS (10.5 s)
[INFO] Building: MJAVADOC-444\pom.xml
[INFO] run post-build script verify.bsh
[INFO]           MJAVADOC-444\pom.xml ............................. SUCCESS (31.5 s)
[INFO] Building: MJAVADOC-449_aggr_modulepath\pom.xml
[INFO] artifact org.apache.maven:plugins: checking for updates from central
[INFO] artifact org.codehaus:mojo: checking for updates from central
[INFO] run post-build script verify.groovy
[INFO]           MJAVADOC-449_aggr_modulepath\pom.xml ............. SUCCESS (10.1 s)
[INFO] Building: MJAVADOC-452_fix-duplicateparams\pom.xml
[INFO] run post-build script verify.groovy
[INFO]           MJAVADOC-452_fix-duplicateparams\pom.xml ......... SUCCESS (8.9 s)
[INFO] Building: MJAVADOC-494_aggregate-repositories\pom.xml
[INFO]           MJAVADOC-494_aggregate-repositories\pom.xml ...... SUCCESS (8.9 s)
[INFO] Building: MJAVADOC-495_offline-filescheme\pom.xml
[INFO] run post-build script verify.groovy
[INFO]           MJAVADOC-495_offline-filescheme\pom.xml .......... SUCCESS (17.5 s)
[INFO] Building: MJAVADOC-497\pom.xml
[INFO] run post-build script verify.bsh
[INFO]           MJAVADOC-497\pom.xml ............................. SUCCESS (8.4 s)
[INFO] Building: MJAVADOC-498_aggr_modulepath\pom.xml
[INFO]           MJAVADOC-498_aggr_modulepath\pom.xml ............. SUCCESS (24.7 s)
[INFO] Building: MJAVADOC-498_mm_modulepath\pom.xml
[INFO]           MJAVADOC-498_mm_modulepath\pom.xml ............... SUCCESS (12.1 s)
[INFO] Building: MJAVADOC-498_modulepath\pom.xml
[INFO] run post-build script verify.groovy
[INFO]           MJAVADOC-498_modulepath\pom.xml .................. SUCCESS (14.2 s)
[INFO] Building: MJAVADOC-506_excl-module-info\pom.xml
[INFO] run post-build script verify.groovy
[INFO]           MJAVADOC-506_excl-module-info\pom.xml ............ SUCCESS (8.7 s)
[INFO] Building: MJAVADOC-508\pom.xml
[INFO]           MJAVADOC-508\pom.xml ............................. SUCCESS (7.3 s)
[INFO] Building: MJAVADOC-514_3rdparty-doclettags\pom.xml
[INFO]           MJAVADOC-514_3rdparty-doclettags\pom.xml ......... SKIPPED due to JRE version
[INFO] Building: MJAVADOC-526_aggr-managedDeps\pom.xml
[INFO]           MJAVADOC-526_aggr-managedDeps\pom.xml ............ SUCCESS (9.7 s)
[INFO] Building: MJAVADOC-528\pom.xml
[INFO] run post-build script verify.groovy
[INFO]           MJAVADOC-528\pom.xml ............................. SUCCESS (8.6 s)
[INFO] Building: MJAVADOC-538\pom.xml
[INFO]           MJAVADOC-538\pom.xml ............................. SUCCESS (6.4 s)
[INFO] Building: MJAVADOC-551 spaces\pom.xml
[INFO]           MJAVADOC-551 spaces\pom.xml ...................... SUCCESS (5.0 s)
[INFO] Building: MJAVADOC-552_fix-author\pom.xml
[INFO] run post-build script verify.groovy
[INFO]           MJAVADOC-552_fix-author\pom.xml .................. SUCCESS (9.5 s)
[INFO] Building: MJAVADOC-555_aggr_mixed\pom.xml
[INFO] run post-build script verify.groovy
[INFO]           MJAVADOC-555_aggr_mixed\pom.xml .................. SUCCESS (12.6 s)
[INFO] Building: MJAVADOC-555_link-automatic-modules\pom.xml
[INFO] run post-build script verify.groovy
[INFO]           MJAVADOC-555_link-automatic-modules\pom.xml ...... SUCCESS (13.3 s)
[INFO] Building: MJAVADOC-556_hide-non-exported-packages\pom.xml
[INFO]           MJAVADOC-556_hide-non-exported-packages\pom.xml .. SUCCESS (9.6 s)
[INFO] Building: MJAVADOC-558_fix-unknownthrows\pom.xml
[INFO] run post-build script verify.groovy
[INFO]           MJAVADOC-558_fix-unknownthrows\pom.xml ........... SUCCESS (7.7 s)
[INFO] Building: MJAVADOC-562_release\pom.xml
[INFO]           MJAVADOC-562_release\pom.xml ..................... SUCCESS (10.1 s)
[INFO] Building: MJAVADOC-567_aggr-mixed\pom.xml
[INFO] run post-build script verify.groovy
[INFO]           MJAVADOC-567_aggr-mixed\pom.xml .................. SUCCESS (6.4 s)
[INFO] Building: MJAVADOC-568_export-to-testcase\pom.xml
[INFO]           MJAVADOC-568_export-to-testcase\pom.xml .......... SUCCESS (20.5 s)
[INFO] Building: MJAVADOC-568_jar-mixed\pom.xml
[INFO]           MJAVADOC-568_jar-mixed\pom.xml ................... SUCCESS (17.4 s)
[INFO] Building: MJAVADOC-568_manifest-splitpackage\pom.xml
[INFO]           MJAVADOC-568_manifest-splitpackage\pom.xml ....... SUCCESS (24.2 s)
[INFO] Building: MJAVADOC-569_aggr-mixed\pom.xml
[INFO]           MJAVADOC-569_aggr-mixed\pom.xml .................. SUCCESS (20.0 s)
[INFO] Building: MJAVADOC-575_source8-module-info\pom.xml
[INFO] run post-build script verify.groovy
[INFO]           MJAVADOC-575_source8-module-info\pom.xml ......... SUCCESS (11.0 s)
[INFO] Building: MJAVADOC-580_detectLinks\pom.xml
[INFO] run post-build script verify.groovy
[INFO]           MJAVADOC-580_detectLinks\pom.xml ................. SUCCESS (5.8 s)
[INFO] Building: MJAVADOC-591_release8\pom.xml
[INFO] artifact org.apache.maven.plugins:maven-resources-plugin: checking for updates from central
[INFO] artifact org.apache.maven.plugins:maven-install-plugin: checking for updates from central
[INFO] artifact org.apache.maven.plugins:maven-deploy-plugin: checking for updates from central
[INFO]           MJAVADOC-591_release8\pom.xml .................... SUCCESS (19.6 s)
[INFO] Building: MJAVADOC-599\pom.xml
[INFO] run post-build script verify.groovy
[INFO]           MJAVADOC-599\pom.xml ............................. SUCCESS (9.5 s)
[INFO] Building: site-failOnError\pom.xml
[INFO]           site-failOnError\pom.xml ......................... SUCCESS (8.0 s)
[INFO]
[INFO] --- mrm-maven-plugin:1.1.0:stop (repository) @ maven-javadoc-plugin ---
[INFO] Stopping Mock Repository Manager on http://localhost:64665
[INFO] Stopped SocketConnector@0.0.0.0:64665
[INFO] Mock Repository Manager http://localhost:64665 is stopped.
[INFO]
[INFO] --- mrm-maven-plugin:1.1.0:stop (3rdparty) @ maven-javadoc-plugin ---
[INFO] Stopping Mock Repository Manager on http://localhost:64666
[INFO] Stopped SocketConnector@0.0.0.0:64666
[INFO] Mock Repository Manager http://localhost:64666 is stopped.
[INFO]
[INFO] --- maven-checkstyle-plugin:3.0.0:check (checkstyle-check) @ maven-javadoc-plugin ---
[INFO] There are 4 errors reported by Checkstyle 6.18 with config/maven_checks.xml ruleset.
[INFO] Ignored 4 errors, 0 violation remaining.
[INFO]
[INFO] --- maven-invoker-plugin:3.1.0:verify (integration-test) @ maven-javadoc-plugin ---
[INFO] -------------------------------------------------
[INFO] Build Summary:
[INFO]   Passed: 60, Failed: 0, Errors: 0, Skipped: 4
[INFO] -------------------------------------------------
[INFO] ------------------------------------------------------------------------
[INFO] BUILD SUCCESS
[INFO] ------------------------------------------------------------------------
[INFO] Total time:  16:41 min
[INFO] Finished at: 2019-10-25T23:37:11-07:00
[INFO] ------------------------------------------------------------------------
[INFO] [jenkins-event-spy] Generated F:\jenkins\jenkins-slave\workspace\-box_maven-javadoc-plugin_master@3@2@tmp\withMaven3c8d8ea6\maven-spy-20191025-232030-23515720411054567306491.log
[Pipeline] }
[Pipeline] // dir
[Pipeline] }
[withMaven] artifactsPublisher - Archive artifact windows-jdk14-m3.6.x_build\pom.xml under org\apache\maven\plugins\maven-javadoc-plugin\3.1.2-SNAPSHOT\maven-javadoc-plugin-3.1.2-SNAPSHOT.pom
[withMaven] artifactsPublisher - Archive artifact windows-jdk14-m3.6.x_build\target\maven-javadoc-plugin-3.1.2-SNAPSHOT.jar under org\apache\maven\plugins\maven-javadoc-plugin\3.1.2-SNAPSHOT\maven-javadoc-plugin-3.1.2-SNAPSHOT.jar
[Fast Archiver] Compressed 493.24 KB of artifacts by 45.4% relative to #59
[withMaven] junitPublisher - Archive test results for Maven artifact org.apache.maven.plugins:maven-javadoc-plugin:maven-plugin:3.1.2-SNAPSHOT generated by maven-surefire-plugin:test (default-test): windows-jdk14-m3.6.x_build\target\surefire-reports\*.xml
Recording test results
[withMaven] openTasksPublisher - Scan Tasks for Maven artifact org.apache.maven.plugins:maven-javadoc-plugin:maven-plugin:3.1.2-SNAPSHOT in source directory windows-jdk14-m3.6.x_build\src\main\java
[TASKS] Scanning folder 'f:\jenkins\jenkins-slave\workspace\-box_maven-javadoc-plugin_master@3@2' for files matching the pattern 'windows-jdk14-m3.6.x_build\src\main\java\**\*' - excludes: null
[TASKS] Found 26 files to scan for tasks
[TASKS] Found 7 open tasks.
Skipping warnings blame since pipelines do not have an SCM link.%n
[TASKS] Computing warning deltas based on reference build #59
[withMaven] invokerPublisher - Archive invoker results for Maven artifact MavenArtifact{org.apache.maven.plugins:maven-javadoc-plugin:maven-plugin:3.1.2-SNAPSHOT(version: 3.1.2-SNAPSHOT, snapshot:false) } generated by PluginInvocation{org.apache.maven.plugins:maven-invoker-plugin:3.1.0@integration-test  integration-test}: windows-jdk14-m3.6.x_build\target\invoker-reports\*.xml
[withMaven] Publishers: Generated Artifacts Publisher: 166 ms, Junit Publisher: 294 ms, Open Task Scanner Publisher: 180 ms, Dependencies Fingerprint Publisher: 1 ms, Invoker Publisher: 56679 ms, Pipeline Graph Publisher: 18 ms
[Pipeline] // withMaven
[Pipeline] cleanWs
[WS-CLEANUP] Deleting project workspace...
[WS-CLEANUP] Deferred wipeout is used...
[WS-CLEANUP] done
[Pipeline] }
[Pipeline] // stage
[Pipeline] }
[Pipeline] // ws
[Pipeline] }
[Pipeline] // node
[Pipeline] }
[Pipeline] // parallel
[Pipeline] stage
[Pipeline] { (Notifications)
[Pipeline] echo
Build result: UNSTABLE
[Pipeline] jiraIssueSelector
[Pipeline] echo
The authors of changes [].
[Pipeline] echo
Sending email ...
[Pipeline] emailext
Reply | Threaded
Open this post in threaded view
|

Build unstable in Jenkins: Maven TLP » maven-javadoc-plugin » master #61

Apache Jenkins Server-2
See https://builds.apache.org/job/maven-box/job/maven-javadoc-plugin/job/master/61/

Changes:

* echo NODE_NAME

1 tests failed.
FAILED:  org.apache.maven.plugins.javadoc.JavadocUtilTest.linux-jdk7-m3.2.x_build / Build linux-jdk7-m3.2.x_build / testIsValidPackageList

Error Message:
Read timed out

Stack Trace:
java.net.SocketTimeoutException: Read timed out
        at org.apache.maven.plugins.javadoc.JavadocUtilTest.testIsValidPackageList(JavadocUtilTest.java:395)




Build log:
[...truncated 8808 lines...]
[INFO]           MJAVADOC-580_detectLinks\pom.xml ................. SUCCESS (7.9 s)
[INFO] Building: MJAVADOC-591_release8\pom.xml
[INFO] artifact org.apache.maven.plugins:maven-resources-plugin: checking for updates from central
[INFO] artifact org.apache.maven.plugins:maven-install-plugin: checking for updates from central
[INFO] artifact org.apache.maven.plugins:maven-deploy-plugin: checking for updates from central
[INFO] artifact org.apache.maven.plugins:maven-resources-plugin: checking for updates from central
[INFO]           MJAVADOC-591_release8/pom.xml .................... SUCCESS (14.6 s)
[INFO] Building: site-failOnError/pom.xml
[INFO] artifact org.apache.maven.plugins:maven-install-plugin: checking for updates from central
[INFO] artifact org.apache.maven.plugins:maven-deploy-plugin: checking for updates from central
[INFO]           MJAVADOC-568_export-to-testcase\pom.xml .......... SUCCESS (19.9 s)
[INFO] Building: MJAVADOC-568_jar-mixed\pom.xml
[INFO]           MJAVADOC-591_release8\pom.xml .................... SUCCESS (16.4 s)
[INFO] Building: MJAVADOC-599\pom.xml
[INFO]           site-failOnError/pom.xml ......................... SUCCESS (15.3 s)
[INFO] Building: MJAVADOC-568_jar-mixed/pom.xml
[INFO] run post-build script verify.groovy
[INFO]           MJAVADOC-599\pom.xml ............................. SUCCESS (9.7 s)
[INFO] Building: site-failOnError\pom.xml
[INFO]           MJAVADOC-568_jar-mixed\pom.xml ................... SUCCESS (14.4 s)
[INFO] Building: MJAVADOC-568_manifest-splitpackage\pom.xml
[INFO]           site-failOnError\pom.xml ......................... SUCCESS (8.2 s)
[INFO]
[INFO] --- mrm-maven-plugin:1.1.0:stop (repository) @ maven-javadoc-plugin ---
[INFO] Stopping Mock Repository Manager on http://localhost:56595
[INFO] Stopped SocketConnector@0.0.0.0:56595
[INFO] Mock Repository Manager http://localhost:56595 is stopped.
[INFO]
[INFO] --- mrm-maven-plugin:1.1.0:stop (3rdparty) @ maven-javadoc-plugin ---
[INFO] Stopping Mock Repository Manager on http://localhost:56596
[INFO] Stopped SocketConnector@0.0.0.0:56596
[INFO] Mock Repository Manager http://localhost:56596 is stopped.
[INFO]
[INFO] --- maven-checkstyle-plugin:3.0.0:check (checkstyle-check) @ maven-javadoc-plugin ---
[INFO] There are 4 errors reported by Checkstyle 6.18 with config/maven_checks.xml ruleset.
[INFO] Ignored 4 errors, 0 violation remaining.
[INFO]
[INFO] --- maven-invoker-plugin:3.1.0:verify (integration-test) @ maven-javadoc-plugin ---
[INFO] -------------------------------------------------
[INFO] Build Summary:
[INFO]   Passed: 63, Failed: 0, Errors: 0, Skipped: 1
[INFO] -------------------------------------------------
[INFO] ------------------------------------------------------------------------
[INFO] BUILD SUCCESS
[INFO] ------------------------------------------------------------------------
[INFO] Total time:  17:47 min
[INFO] Finished at: 2019-10-28T00:38:51-07:00
[INFO] ------------------------------------------------------------------------
[INFO] [jenkins-event-spy] Generated F:\jenkins\jenkins-slave\workspace\-box_maven-javadoc-plugin_master@2@tmp\withMavenf723837e\maven-spy-20191028-002103-9094939221349713790393.log
[Pipeline] }
[Pipeline] // dir
[Pipeline] }
[withMaven] artifactsPublisher - Archive artifact windows-jdk11-m3.6.x_build\pom.xml under org\apache\maven\plugins\maven-javadoc-plugin\3.1.2-SNAPSHOT\maven-javadoc-plugin-3.1.2-SNAPSHOT.pom
[withMaven] artifactsPublisher - Archive artifact windows-jdk11-m3.6.x_build\target\maven-javadoc-plugin-3.1.2-SNAPSHOT.jar under org\apache\maven\plugins\maven-javadoc-plugin\3.1.2-SNAPSHOT\maven-javadoc-plugin-3.1.2-SNAPSHOT.jar
[Fast Archiver] Compressed 491.10 KB of artifacts by 39.1% relative to #60
[withMaven] junitPublisher - Archive test results for Maven artifact org.apache.maven.plugins:maven-javadoc-plugin:maven-plugin:3.1.2-SNAPSHOT generated by maven-surefire-plugin:test (default-test): windows-jdk11-m3.6.x_build\target\surefire-reports\*.xml
Recording test results
[withMaven] openTasksPublisher - Scan Tasks for Maven artifact org.apache.maven.plugins:maven-javadoc-plugin:maven-plugin:3.1.2-SNAPSHOT in source directory windows-jdk11-m3.6.x_build\src\main\java
[TASKS] Scanning folder 'f:\jenkins\jenkins-slave\workspace\-box_maven-javadoc-plugin_master@2' for files matching the pattern 'windows-jdk11-m3.6.x_build\src\main\java\**\*' - excludes: null
[TASKS] Found 26 files to scan for tasks
[TASKS] Found 7 open tasks.
Skipping warnings blame since pipelines do not have an SCM link.%n
[TASKS] Computing warning deltas based on reference build #60
[withMaven] invokerPublisher - Archive invoker results for Maven artifact MavenArtifact{org.apache.maven.plugins:maven-javadoc-plugin:maven-plugin:3.1.2-SNAPSHOT(version: 3.1.2-SNAPSHOT, snapshot:false) } generated by PluginInvocation{org.apache.maven.plugins:maven-invoker-plugin:3.1.0@integration-test  integration-test}: windows-jdk11-m3.6.x_build\target\invoker-reports\*.xml
[INFO]           MJAVADOC-568_jar-mixed/pom.xml ................... SUCCESS (15.7 s)
[INFO] Building: MJAVADOC-134_multiaggregate/pom.xml
[withMaven] Publishers: Generated Artifacts Publisher: 1279 ms, Junit Publisher: 4845 ms, Open Task Scanner Publisher: 1769 ms, Invoker Publisher: 86396 ms, Pipeline Graph Publisher: 1 ms
[Pipeline] // withMaven
[Pipeline] cleanWs
[WS-CLEANUP] Deleting project workspace...
[WS-CLEANUP] Deferred wipeout is used...
[WS-CLEANUP] done
[Pipeline] }
[Pipeline] // stage
[Pipeline] }
[Pipeline] // ws
[Pipeline] }
[Pipeline] // node
[Pipeline] }
[INFO]           MJAVADOC-568_manifest-splitpackage\pom.xml ....... SUCCESS (20.4 s)
[INFO] Building: MJAVADOC-569_aggr-mixed\pom.xml
[INFO]           MJAVADOC-569_aggr-mixed\pom.xml .................. SUCCESS (16.6 s)
[INFO] Building: MJAVADOC-575_source8-module-info\pom.xml
[INFO] run post-build script verify.groovy
[INFO]           MJAVADOC-575_source8-module-info\pom.xml ......... SUCCESS (8.8 s)
[INFO] Building: MJAVADOC-580_detectLinks\pom.xml
[INFO] run post-build script verify.groovy
[INFO]           MJAVADOC-580_detectLinks\pom.xml ................. SUCCESS (6.8 s)
[INFO] Building: MJAVADOC-591_release8\pom.xml
[INFO] run post-build script verify.groovy
[INFO]           MJAVADOC-134_multiaggregate/pom.xml .............. SUCCESS (44.5 s)
[INFO] Building: MJAVADOC-449_aggr_modulepath/pom.xml
[INFO] artifact org.apache.maven:plugins: checking for updates from central
[INFO] artifact org.codehaus:mojo: checking for updates from central
[withMaven] Publishers: Generated Artifacts Publisher: 157 ms, Junit Publisher: 266 ms, Open Task Scanner Publisher: 221 ms, Invoker Publisher: 52947 ms, Pipeline Graph Publisher: 19 ms
[Pipeline] // withMaven
[Pipeline] cleanWs
[WS-CLEANUP] Deleting project workspace...
[WS-CLEANUP] Deferred wipeout is used...
[WS-CLEANUP] done
[Pipeline] }
[Pipeline] // stage
[Pipeline] }
[Pipeline] // ws
[Pipeline] }
[Pipeline] // node
[Pipeline] }
[INFO] artifact org.apache.maven.plugins:maven-resources-plugin: checking for updates from central
[INFO] artifact org.apache.maven.plugins:maven-install-plugin: checking for updates from central
[INFO] artifact org.apache.maven.plugins:maven-deploy-plugin: checking for updates from central
[INFO] run post-build script verify.groovy
[INFO]           MJAVADOC-449_aggr_modulepath/pom.xml ............. SUCCESS (11.8 s)
[INFO] Building: MJAVADOC-278/pom.xml
[INFO]           MJAVADOC-591_release8\pom.xml .................... SUCCESS (16.1 s)
[INFO] Building: MJAVADOC-599\pom.xml
[INFO] run post-build script verify.bsh
[INFO]           MJAVADOC-278/pom.xml ............................. SUCCESS (11.1 s)
[INFO] Building: MJAVADOC-338_downloadSources/pom.xml
[INFO] run post-build script verify.groovy
[INFO]           MJAVADOC-599\pom.xml ............................. SUCCESS (10.9 s)
[INFO] Building: site-failOnError\pom.xml
[INFO] artifact org.apache.maven.plugins.javadoc.its.mjavadoc338-direct:1.0: checking for updates from central
[INFO]           site-failOnError\pom.xml ......................... SUCCESS (8.5 s)
[INFO]
[INFO] --- mrm-maven-plugin:1.1.0:stop (repository) @ maven-javadoc-plugin ---
[INFO] Stopping Mock Repository Manager on http://localhost:53697
[INFO] Stopped SocketConnector@0.0.0.0:53697
[INFO] Mock Repository Manager http://localhost:53697 is stopped.
[INFO]
[INFO] --- mrm-maven-plugin:1.1.0:stop (3rdparty) @ maven-javadoc-plugin ---
[INFO] Stopping Mock Repository Manager on http://localhost:53698
[INFO] Stopped SocketConnector@0.0.0.0:53698
[INFO] Mock Repository Manager http://localhost:53698 is stopped.
[INFO]
[INFO] --- maven-checkstyle-plugin:3.0.0:check (checkstyle-check) @ maven-javadoc-plugin ---
[INFO] There are 4 errors reported by Checkstyle 6.18 with config/maven_checks.xml ruleset.
[INFO] Ignored 4 errors, 0 violation remaining.
[INFO]
[INFO] --- maven-invoker-plugin:3.1.0:verify (integration-test) @ maven-javadoc-plugin ---
[INFO] -------------------------------------------------
[INFO] Build Summary:
[INFO]   Passed: 60, Failed: 0, Errors: 0, Skipped: 4
[INFO] -------------------------------------------------
[INFO] ------------------------------------------------------------------------
[INFO] BUILD SUCCESS
[INFO] ------------------------------------------------------------------------
[INFO] Total time:  16:21 min
[INFO] Finished at: 2019-10-28T00:40:14-07:00
[INFO] ------------------------------------------------------------------------
[INFO] [jenkins-event-spy] Generated F:\jenkins\jenkins-slave\workspace\-box_maven-javadoc-plugin_master@2@tmp\withMaven410a8547\maven-spy-20191028-002352-75355338382857998094.log
[Pipeline] }
[Pipeline] // dir
[Pipeline] }
[withMaven] artifactsPublisher - Archive artifact windows-jdk14-m3.6.x_build\pom.xml under org\apache\maven\plugins\maven-javadoc-plugin\3.1.2-SNAPSHOT\maven-javadoc-plugin-3.1.2-SNAPSHOT.pom
[withMaven] artifactsPublisher - Archive artifact windows-jdk14-m3.6.x_build\target\maven-javadoc-plugin-3.1.2-SNAPSHOT.jar under org\apache\maven\plugins\maven-javadoc-plugin\3.1.2-SNAPSHOT\maven-javadoc-plugin-3.1.2-SNAPSHOT.jar
[Fast Archiver] Compressed 493.24 KB of artifacts by 38.9% relative to #60
[withMaven] junitPublisher - Archive test results for Maven artifact org.apache.maven.plugins:maven-javadoc-plugin:maven-plugin:3.1.2-SNAPSHOT generated by maven-surefire-plugin:test (default-test): windows-jdk14-m3.6.x_build\target\surefire-reports\*.xml
Recording test results
[withMaven] openTasksPublisher - Scan Tasks for Maven artifact org.apache.maven.plugins:maven-javadoc-plugin:maven-plugin:3.1.2-SNAPSHOT in source directory windows-jdk14-m3.6.x_build\src\main\java
[TASKS] Scanning folder 'f:\jenkins\jenkins-slave\workspace\-box_maven-javadoc-plugin_master@2' for files matching the pattern 'windows-jdk14-m3.6.x_build\src\main\java\**\*' - excludes: null
[TASKS] Found 26 files to scan for tasks
[TASKS] Found 7 open tasks.
Skipping warnings blame since pipelines do not have an SCM link.%n
[TASKS] Computing warning deltas based on reference build #60
[withMaven] invokerPublisher - Archive invoker results for Maven artifact MavenArtifact{org.apache.maven.plugins:maven-javadoc-plugin:maven-plugin:3.1.2-SNAPSHOT(version: 3.1.2-SNAPSHOT, snapshot:false) } generated by PluginInvocation{org.apache.maven.plugins:maven-invoker-plugin:3.1.0@integration-test  integration-test}: windows-jdk14-m3.6.x_build\target\invoker-reports\*.xml
[INFO] run post-build script verify.groovy
[INFO]           MJAVADOC-338_downloadSources/pom.xml ............. SUCCESS (19.6 s)
[INFO] Building: MJAVADOC-575_source8-module-info/pom.xml
[INFO] run post-build script verify.groovy
[INFO]           MJAVADOC-575_source8-module-info/pom.xml ......... SUCCESS (10.4 s)
[INFO]
[INFO] --- mrm-maven-plugin:1.1.0:stop (repository) @ maven-javadoc-plugin ---
[INFO] Stopping Mock Repository Manager on http://localhost:34577
[INFO] Stopped SocketConnector@0.0.0.0:34577
[INFO] Mock Repository Manager http://localhost:34577 is stopped.
[INFO]
[INFO] --- mrm-maven-plugin:1.1.0:stop (3rdparty) @ maven-javadoc-plugin ---
[INFO] Stopping Mock Repository Manager on http://localhost:42749
[INFO] Stopped SocketConnector@0.0.0.0:42749
[INFO] Mock Repository Manager http://localhost:42749 is stopped.
[INFO]
[INFO] --- maven-checkstyle-plugin:3.0.0:check (checkstyle-check) @ maven-javadoc-plugin ---
[INFO] There are 4 errors reported by Checkstyle 6.18 with config/maven_checks.xml ruleset.
[INFO] Ignored 4 errors, 0 violation remaining.
[INFO]
[INFO] --- maven-invoker-plugin:3.1.0:verify (integration-test) @ maven-javadoc-plugin ---
[INFO] -------------------------------------------------
[INFO] Build Summary:
[INFO]   Passed: 62, Failed: 0, Errors: 0, Skipped: 2
[INFO] -------------------------------------------------
[INFO] ------------------------------------------------------------------------
[INFO] BUILD SUCCESS
[INFO] ------------------------------------------------------------------------
[INFO] Total time:  19:42 min
[INFO] Finished at: 2019-10-28T07:40:36Z
[INFO] ------------------------------------------------------------------------
[INFO] [jenkins-event-spy] Generated /home/jenkins/jenkins-slave/workspace/_box_maven-javadoc-plugin_master@2@tmp/withMaven40d4214a/maven-spy-20191028-072053-7121166697837882200921.log
[Pipeline] }
[Pipeline] // dir
[Pipeline] }
[withMaven] artifactsPublisher - Archive artifact linux-jdk11-m3.6.x_build/pom.xml under org/apache/maven/plugins/maven-javadoc-plugin/3.1.2-SNAPSHOT/maven-javadoc-plugin-3.1.2-SNAPSHOT.pom
[withMaven] artifactsPublisher - Archive artifact linux-jdk11-m3.6.x_build/target/maven-javadoc-plugin-3.1.2-SNAPSHOT.jar under org/apache/maven/plugins/maven-javadoc-plugin/3.1.2-SNAPSHOT/maven-javadoc-plugin-3.1.2-SNAPSHOT.jar
[Fast Archiver] Compressed 488.09 KB of artifacts by 45.9% relative to #60
[withMaven] junitPublisher - Archive test results for Maven artifact org.apache.maven.plugins:maven-javadoc-plugin:maven-plugin:3.1.2-SNAPSHOT generated by maven-surefire-plugin:test (default-test): linux-jdk11-m3.6.x_build/target/surefire-reports/*.xml
Recording test results
[withMaven] openTasksPublisher - Scan Tasks for Maven artifact org.apache.maven.plugins:maven-javadoc-plugin:maven-plugin:3.1.2-SNAPSHOT in source directory linux-jdk11-m3.6.x_build/src/main/java
[TASKS] Scanning folder '/home/jenkins/jenkins-slave/workspace/_box_maven-javadoc-plugin_master@2' for files matching the pattern 'linux-jdk11-m3.6.x_build/src/main/java/**/*' - excludes: null
[TASKS] Found 26 files to scan for tasks
[TASKS] Found 7 open tasks.
Skipping warnings blame since pipelines do not have an SCM link.%n
[TASKS] Computing warning deltas based on reference build #60
[withMaven] invokerPublisher - Archive invoker results for Maven artifact MavenArtifact{org.apache.maven.plugins:maven-javadoc-plugin:maven-plugin:3.1.2-SNAPSHOT(version: 3.1.2-SNAPSHOT, snapshot:false) } generated by PluginInvocation{org.apache.maven.plugins:maven-invoker-plugin:3.1.0@integration-test  integration-test}: linux-jdk11-m3.6.x_build/target/invoker-reports/*.xml
[withMaven] Publishers: Generated Artifacts Publisher: 152 ms, Junit Publisher: 256 ms, Open Task Scanner Publisher: 213 ms, Invoker Publisher: 53566 ms, Pipeline Graph Publisher: 1 ms
[Pipeline] // withMaven
[Pipeline] cleanWs
[WS-CLEANUP] Deleting project workspace...
[WS-CLEANUP] Deferred wipeout is used...
[WS-CLEANUP] done
[Pipeline] }
[Pipeline] // stage
[Pipeline] }
[Pipeline] // ws
[Pipeline] }
[Pipeline] // node
[Pipeline] }
[withMaven] Publishers: Generated Artifacts Publisher: 1257 ms, Junit Publisher: 4912 ms, Open Task Scanner Publisher: 1872 ms, Invoker Publisher: 97560 ms, Pipeline Graph Publisher: 1 ms
[Pipeline] // withMaven
[Pipeline] cleanWs
[WS-CLEANUP] Deleting project workspace...
[WS-CLEANUP] Deferred wipeout is used...
[WS-CLEANUP] done
[Pipeline] }
[Pipeline] // stage
[Pipeline] }
[Pipeline] // ws
[Pipeline] }
[Pipeline] // node
[Pipeline] }
[Pipeline] // parallel
[Pipeline] stage
[Pipeline] { (Notifications)
[Pipeline] echo
Build result: UNSTABLE
[Pipeline] jiraIssueSelector
[Pipeline] echo
The authors of changes [hboutemy].
[Pipeline] echo
Sending email ...
[Pipeline] emailext
Reply | Threaded
Open this post in threaded view
|

Build succeeded in Jenkins: Maven TLP » maven-javadoc-plugin » master #62

Apache Jenkins Server-2