Build unstable in Jenkins: Maven TLP » maven-javadoc-plugin » MJAVADOC-613-exclude_skipped_modules_from_aggregate #6

classic Classic list List threaded Threaded
1 message Options
Reply | Threaded
Open this post in threaded view
|

Build unstable in Jenkins: Maven TLP » maven-javadoc-plugin » MJAVADOC-613-exclude_skipped_modules_from_aggregate #6

Apache Jenkins Server-2
See https://builds.apache.org/job/maven-box/job/maven-javadoc-plugin/job/MJAVADOC-613-exclude_skipped_modules_from_aggregate/6/

Changes:

* upgrade plexus-java 1.0.4

5 tests failed.
FAILED:  org.apache.maven.plugins.javadoc.JavadocUtilTest.windows-jdk8-m3.6.x_build / Build windows-jdk8-m3.6.x_build / testIsValidPackageList

Error Message:
Read timed out

Stack Trace:
java.net.SocketTimeoutException: Read timed out
        at org.apache.maven.plugins.javadoc.JavadocUtilTest.testIsValidPackageList(JavadocUtilTest.java:395)


FAILED:  org.apache.maven.plugins.javadoc.AbstractJavadocMojoTest.linux-jdk14-m3.6.x_build / Build linux-jdk14-m3.6.x_build / testMJAVADOC527_DetectLinksRecursion

Error Message:
null

Stack Trace:
junit.framework.AssertionFailedError
        at org.apache.maven.plugins.javadoc.AbstractJavadocMojoTest.testMJAVADOC527_DetectLinksRecursion(AbstractJavadocMojoTest.java:88)


FAILED:  org.apache.maven.plugins.javadoc.JavadocUtilTest.windows-jdk7-m3.6.x_build / Build windows-jdk7-m3.6.x_build / testIsValidPackageList

Error Message:
Read timed out

Stack Trace:
java.net.SocketTimeoutException: Read timed out
        at org.apache.maven.plugins.javadoc.JavadocUtilTest.testIsValidPackageList(JavadocUtilTest.java:326)


FAILED:  org.apache.maven.plugins.javadoc.JavadocUtilTest.windows-jdk13-m3.6.x_build / Build windows-jdk13-m3.6.x_build / testIsValidPackageList

Error Message:
Read timed out

Stack Trace:
java.net.SocketTimeoutException: Read timed out
        at org.apache.maven.plugins.javadoc.JavadocUtilTest.testIsValidPackageList(JavadocUtilTest.java:302)


FAILED:  org.apache.maven.plugins.javadoc.JavadocUtilTest.windows-jdk11-m3.6.x_build / Build windows-jdk11-m3.6.x_build / testIsValidPackageList

Error Message:
Read timed out

Stack Trace:
java.net.SocketTimeoutException: Read timed out
        at org.apache.maven.plugins.javadoc.JavadocUtilTest.testIsValidPackageList(JavadocUtilTest.java:302)




Build log:
[...truncated 8763 lines...]
[INFO] Ignored 4 errors, 0 violation remaining.
[INFO]
[INFO] --- maven-invoker-plugin:3.1.0:verify (integration-test) @ maven-javadoc-plugin ---
[INFO] -------------------------------------------------
[INFO] Build Summary:
[INFO]   Passed: 51, Failed: 0, Errors: 0, Skipped: 16
[INFO] -------------------------------------------------
[INFO] ------------------------------------------------------------------------
[INFO] BUILD SUCCESS
[INFO] ------------------------------------------------------------------------
[INFO] Total time:  17:21 min
[INFO] Finished at: 2020-02-09T07:06:14Z
[INFO] ------------------------------------------------------------------------
[INFO] [jenkins-event-spy] Generated /home/jenkins/jenkins-slave/workspace/e_skipped_modules_from_aggregate@3@2@tmp/withMaven38dc5475/maven-spy-20200209-064852-6779170524045449316241.log
[Pipeline] }
[Pipeline] // dir
[Pipeline] }
[INFO] There are 4 errors reported by Checkstyle 6.18 with config/maven_checks.xml ruleset.
[INFO] Ignored 4 errors, 0 violation remaining.
[INFO]
[INFO] --- maven-invoker-plugin:3.1.0:verify (integration-test) @ maven-javadoc-plugin ---
[INFO] -------------------------------------------------
[INFO] Build Summary:
[INFO]   Passed: 51, Failed: 0, Errors: 0, Skipped: 16
[INFO] -------------------------------------------------
[INFO] ------------------------------------------------------------------------
[INFO] BUILD SUCCESS
[INFO] ------------------------------------------------------------------------
[INFO] Total time: 17:29 min
[INFO] Finished at: 2020-02-09T07:06:15Z
[INFO] ------------------------------------------------------------------------
[INFO] [jenkins-event-spy] Generated /home/jenkins/jenkins-slave/workspace/e_skipped_modules_from_aggregate@2@tmp/withMavenf2032354/maven-spy-20200209-064846-1434418459370899298755.log
[Pipeline] }
[Pipeline] // dir
[Pipeline] }
[withMaven] artifactsPublisher - Archive artifact linux-jdk7-m3.6.x_build/pom.xml under org/apache/maven/plugins/maven-javadoc-plugin/3.2.0-SNAPSHOT/maven-javadoc-plugin-3.2.0-SNAPSHOT.pom
[withMaven] artifactsPublisher - Archive artifact linux-jdk7-m3.6.x_build/target/maven-javadoc-plugin-3.2.0-SNAPSHOT.jar under org/apache/maven/plugins/maven-javadoc-plugin/3.2.0-SNAPSHOT/maven-javadoc-plugin-3.2.0-SNAPSHOT.jar
[withMaven] artifactsPublisher - Archive artifact linux-jdk7-m3.5.x_build/pom.xml under org/apache/maven/plugins/maven-javadoc-plugin/3.2.0-SNAPSHOT/maven-javadoc-plugin-3.2.0-SNAPSHOT.pom
[Fast Archiver] Compressed 499.55 KB of artifacts by 44.8% relative to #5
[withMaven] artifactsPublisher - Archive artifact linux-jdk7-m3.5.x_build/target/maven-javadoc-plugin-3.2.0-SNAPSHOT.jar under org/apache/maven/plugins/maven-javadoc-plugin/3.2.0-SNAPSHOT/maven-javadoc-plugin-3.2.0-SNAPSHOT.jar
[withMaven] junitPublisher - Archive test results for Maven artifact org.apache.maven.plugins:maven-javadoc-plugin:maven-plugin:3.2.0-SNAPSHOT generated by maven-surefire-plugin:test (default-test): linux-jdk7-m3.6.x_build/target/surefire-reports/*.xml
Recording test results
[Fast Archiver] Compressed 499.55 KB of artifacts by 44.8% relative to #5
[withMaven] junitPublisher - Archive test results for Maven artifact org.apache.maven.plugins:maven-javadoc-plugin:maven-plugin:3.2.0-SNAPSHOT generated by maven-surefire-plugin:test (default-test): linux-jdk7-m3.5.x_build/target/surefire-reports/*.xml
Recording test results
[INFO]           MJAVADOC-569_aggr-mixed\pom.xml .................. SUCCESS (17.7 s)
[INFO] Building: MJAVADOC-575_source8-module-info\pom.xml
[withMaven] openTasksPublisher - Scan Tasks for Maven artifact org.apache.maven.plugins:maven-javadoc-plugin:maven-plugin:3.2.0-SNAPSHOT in source directory linux-jdk7-m3.6.x_build/src/main/java
[TASKS] Scanning folder '/home/jenkins/jenkins-slave/workspace/e_skipped_modules_from_aggregate@3@2' for files matching the pattern 'linux-jdk7-m3.6.x_build/src/main/java/**/*' - excludes: null
[TASKS] Found 27 files to scan for tasks
[TASKS] Found 7 open tasks.
Skipping warnings blame since pipelines do not have an SCM link.%n
[TASKS] Computing warning deltas based on reference build #5
[INFO] run post-build script verify.bsh
[INFO]           MJAVADOC-620_no-dot-in-version\pom.xml ........... SUCCESS (14.9 s)
[INFO] Building: MJAVADOC-620_top-level-package\pom.xml
[withMaven] invokerPublisher - Archive invoker results for Maven artifact MavenArtifact{org.apache.maven.plugins:maven-javadoc-plugin:maven-plugin:3.2.0-SNAPSHOT(version: 3.2.0-SNAPSHOT, snapshot:false) } generated by PluginInvocation{org.apache.maven.plugins:maven-invoker-plugin:3.1.0@integration-test  integration-test}: linux-jdk7-m3.6.x_build/target/invoker-reports/*.xml
[INFO] run post-build script verify.groovy
[INFO]           MJAVADOC-575_source8-module-info\pom.xml ......... SUCCESS (11.0 s)
[INFO] Building: MJAVADOC-580_detectLinks\pom.xml
[withMaven] openTasksPublisher - Scan Tasks for Maven artifact org.apache.maven.plugins:maven-javadoc-plugin:maven-plugin:3.2.0-SNAPSHOT in source directory linux-jdk7-m3.5.x_build/src/main/java
[TASKS] Scanning folder '/home/jenkins/jenkins-slave/workspace/e_skipped_modules_from_aggregate@2' for files matching the pattern 'linux-jdk7-m3.5.x_build/src/main/java/**/*' - excludes: null
[TASKS] Found 27 files to scan for tasks
[TASKS] Found 7 open tasks.
Skipping warnings blame since pipelines do not have an SCM link.%n
[TASKS] Computing warning deltas based on reference build #5
[INFO] run post-build script verify.groovy
[INFO]           MJAVADOC-580_detectLinks\pom.xml ................. SUCCESS (7.7 s)
[INFO] Building: MJAVADOC-591_release8\pom.xml
[withMaven] invokerPublisher - Archive invoker results for Maven artifact MavenArtifact{org.apache.maven.plugins:maven-javadoc-plugin:maven-plugin:3.2.0-SNAPSHOT(version: 3.2.0-SNAPSHOT, snapshot:false) } generated by PluginInvocation{org.apache.maven.plugins:maven-invoker-plugin:3.1.0@integration-test  integration-test}: linux-jdk7-m3.5.x_build/target/invoker-reports/*.xml
[INFO] run post-build script verify.bsh
[INFO]           MJAVADOC-620_top-level-package\pom.xml ........... SUCCESS (14.9 s)
[INFO] Building: site-failOnError\pom.xml
[INFO]           site-failOnError\pom.xml ......................... SUCCESS (9.5 s)
[INFO]
[INFO] --- mrm-maven-plugin:1.1.0:stop (repository) @ maven-javadoc-plugin ---
[INFO] Stopping Mock Repository Manager on http://localhost:63443
[INFO] Stopped SocketConnector@0.0.0.0:63443
[INFO] Mock Repository Manager http://localhost:63443 is stopped.
[INFO]
[INFO] --- mrm-maven-plugin:1.1.0:stop (3rdparty) @ maven-javadoc-plugin ---
[INFO] Stopping Mock Repository Manager on http://localhost:63444
[INFO] Stopped SocketConnector@0.0.0.0:63444
[INFO] Mock Repository Manager http://localhost:63444 is stopped.
[INFO]
[INFO] --- maven-checkstyle-plugin:3.0.0:check (checkstyle-check) @ maven-javadoc-plugin ---
[INFO] There are 4 errors reported by Checkstyle 6.18 with config/maven_checks.xml ruleset.
[INFO] Ignored 4 errors, 0 violation remaining.
[INFO]
[INFO] --- maven-invoker-plugin:3.1.0:verify (integration-test) @ maven-javadoc-plugin ---
[INFO] -------------------------------------------------
[INFO] Build Summary:
[INFO]   Passed: 63, Failed: 0, Errors: 0, Skipped: 4
[INFO] -------------------------------------------------
[INFO] ------------------------------------------------------------------------
[INFO] BUILD SUCCESS
[INFO] ------------------------------------------------------------------------
[INFO] Total time:  18:06 min
[INFO] Finished at: 2020-02-08T23:06:56-08:00
[INFO] ------------------------------------------------------------------------
[INFO] [jenkins-event-spy] Generated F:\jenkins\jenkins-slave\workspace\e_skipped_modules_from_aggregate@2@2@tmp\withMaven0a6ed529\maven-spy-20200208-224849-6305646361584551999713.log
[Pipeline] }
[Pipeline] // dir
[Pipeline] }
[withMaven] artifactsPublisher - Archive artifact windows-jdk13-m3.6.x_build\pom.xml under org\apache\maven\plugins\maven-javadoc-plugin\3.2.0-SNAPSHOT\maven-javadoc-plugin-3.2.0-SNAPSHOT.pom
[withMaven] artifactsPublisher - Archive artifact windows-jdk13-m3.6.x_build\target\maven-javadoc-plugin-3.2.0-SNAPSHOT.jar under org\apache\maven\plugins\maven-javadoc-plugin\3.2.0-SNAPSHOT\maven-javadoc-plugin-3.2.0-SNAPSHOT.jar
[Fast Archiver] Compressed 503.45 KB of artifacts by 44.5% relative to #5
[withMaven] junitPublisher - Archive test results for Maven artifact org.apache.maven.plugins:maven-javadoc-plugin:maven-plugin:3.2.0-SNAPSHOT generated by maven-surefire-plugin:test (default-test): windows-jdk13-m3.6.x_build\target\surefire-reports\*.xml
Recording test results
[withMaven] openTasksPublisher - Scan Tasks for Maven artifact org.apache.maven.plugins:maven-javadoc-plugin:maven-plugin:3.2.0-SNAPSHOT in source directory windows-jdk13-m3.6.x_build\src\main\java
[TASKS] Scanning folder 'f:\jenkins\jenkins-slave\workspace\e_skipped_modules_from_aggregate@2@2' for files matching the pattern 'windows-jdk13-m3.6.x_build\src\main\java\**\*' - excludes: null
[TASKS] Found 27 files to scan for tasks
[TASKS] Found 7 open tasks.
Skipping warnings blame since pipelines do not have an SCM link.%n
[TASKS] Computing warning deltas based on reference build #5
[withMaven] invokerPublisher - Archive invoker results for Maven artifact MavenArtifact{org.apache.maven.plugins:maven-javadoc-plugin:maven-plugin:3.2.0-SNAPSHOT(version: 3.2.0-SNAPSHOT, snapshot:false) } generated by PluginInvocation{org.apache.maven.plugins:maven-invoker-plugin:3.1.0@integration-test  integration-test}: windows-jdk13-m3.6.x_build\target\invoker-reports\*.xml
[withMaven] Publishers: Generated Artifacts Publisher: 1294 ms, Junit Publisher: 4902 ms, Open Task Scanner Publisher: 1279 ms, Invoker Publisher: 96418 ms, Pipeline Graph Publisher: 1 ms
[Pipeline] // withMaven
[Pipeline] cleanWs
[WS-CLEANUP] Deleting project workspace...
[WS-CLEANUP] Deferred wipeout is used...
[INFO]           MJAVADOC-591_release8\pom.xml .................... SUCCESS (18.0 s)
[INFO] Building: MJAVADOC-599\pom.xml
[WS-CLEANUP] done
[Pipeline] }
[Pipeline] // stage
[Pipeline] }
[Pipeline] // ws
[Pipeline] }
[Pipeline] // node
[Pipeline] }
[INFO] run post-build script verify.groovy
[INFO]           MJAVADOC-599\pom.xml ............................. SUCCESS (10.1 s)
[INFO] Building: MJAVADOC-613-aggregate-exclude\pom.xml
[INFO] run post-build script verify.groovy
[INFO]           MJAVADOC-613-aggregate-exclude\pom.xml ........... SUCCESS (16.1 s)
[INFO] Building: MJAVADOC-620_no-dot-in-version\pom.xml
[INFO] run post-build script verify.bsh
[INFO]           MJAVADOC-620_no-dot-in-version\pom.xml ........... SUCCESS (12.1 s)
[INFO] Building: MJAVADOC-620_top-level-package\pom.xml
[INFO] run post-build script verify.bsh
[INFO]           MJAVADOC-620_top-level-package\pom.xml ........... SUCCESS (13.1 s)
[INFO] Building: site-failOnError\pom.xml
[INFO]           site-failOnError\pom.xml ......................... SUCCESS (9.1 s)
[INFO]
[INFO] --- mrm-maven-plugin:1.1.0:stop (repository) @ maven-javadoc-plugin ---
[INFO] Stopping Mock Repository Manager on http://localhost:61305
[INFO] Stopped SocketConnector@0.0.0.0:61305
[INFO] Mock Repository Manager http://localhost:61305 is stopped.
[INFO]
[INFO] --- mrm-maven-plugin:1.1.0:stop (3rdparty) @ maven-javadoc-plugin ---
[INFO] Stopping Mock Repository Manager on http://localhost:61306
[INFO] Stopped SocketConnector@0.0.0.0:61306
[INFO] Mock Repository Manager http://localhost:61306 is stopped.
[INFO]
[INFO] --- maven-checkstyle-plugin:3.0.0:check (checkstyle-check) @ maven-javadoc-plugin ---
[INFO] There are 4 errors reported by Checkstyle 6.18 with config/maven_checks.xml ruleset.
[INFO] Ignored 4 errors, 0 violation remaining.
[INFO]
[INFO] --- maven-invoker-plugin:3.1.0:verify (integration-test) @ maven-javadoc-plugin ---
[INFO] -------------------------------------------------
[INFO] Build Summary:
[INFO]   Passed: 66, Failed: 0, Errors: 0, Skipped: 1
[INFO] -------------------------------------------------
[INFO] ------------------------------------------------------------------------
[INFO] BUILD SUCCESS
[INFO] ------------------------------------------------------------------------
[INFO] Total time:  19:12 min
[INFO] Finished at: 2020-02-08T23:08:02-08:00
[INFO] ------------------------------------------------------------------------
[INFO] [jenkins-event-spy] Generated F:\jenkins\jenkins-slave\workspace\e_skipped_modules_from_aggregate@2@2@tmp\withMaven68182023\maven-spy-20200208-224849-6232968130014802121853.log
[Pipeline] }
[Pipeline] // dir
[Pipeline] }
[withMaven] artifactsPublisher - Archive artifact windows-jdk11-m3.6.x_build\pom.xml under org\apache\maven\plugins\maven-javadoc-plugin\3.2.0-SNAPSHOT\maven-javadoc-plugin-3.2.0-SNAPSHOT.pom
[withMaven] artifactsPublisher - Archive artifact windows-jdk11-m3.6.x_build\target\maven-javadoc-plugin-3.2.0-SNAPSHOT.jar under org\apache\maven\plugins\maven-javadoc-plugin\3.2.0-SNAPSHOT\maven-javadoc-plugin-3.2.0-SNAPSHOT.jar
[Fast Archiver] Compressed 501.24 KB of artifacts by 51.1% relative to #5
[withMaven] junitPublisher - Archive test results for Maven artifact org.apache.maven.plugins:maven-javadoc-plugin:maven-plugin:3.2.0-SNAPSHOT generated by maven-surefire-plugin:test (default-test): windows-jdk11-m3.6.x_build\target\surefire-reports\*.xml
Recording test results
[withMaven] openTasksPublisher - Scan Tasks for Maven artifact org.apache.maven.plugins:maven-javadoc-plugin:maven-plugin:3.2.0-SNAPSHOT in source directory windows-jdk11-m3.6.x_build\src\main\java
[TASKS] Scanning folder 'f:\jenkins\jenkins-slave\workspace\e_skipped_modules_from_aggregate@2@2' for files matching the pattern 'windows-jdk11-m3.6.x_build\src\main\java\**\*' - excludes: null
[TASKS] Found 27 files to scan for tasks
[TASKS] Found 7 open tasks.
Skipping warnings blame since pipelines do not have an SCM link.%n
[TASKS] Computing warning deltas based on reference build #5
[withMaven] invokerPublisher - Archive invoker results for Maven artifact MavenArtifact{org.apache.maven.plugins:maven-javadoc-plugin:maven-plugin:3.2.0-SNAPSHOT(version: 3.2.0-SNAPSHOT, snapshot:false) } generated by PluginInvocation{org.apache.maven.plugins:maven-invoker-plugin:3.1.0@integration-test  integration-test}: windows-jdk11-m3.6.x_build\target\invoker-reports\*.xml
[withMaven] Publishers: Generated Artifacts Publisher: 147 ms, Junit Publisher: 311 ms, Open Task Scanner Publisher: 238 ms, Invoker Publisher: 66642 ms
[Pipeline] // withMaven
[Pipeline] cleanWs
[WS-CLEANUP] Deleting project workspace...
[WS-CLEANUP] Deferred wipeout is used...
[WS-CLEANUP] done
[Pipeline] }
[Pipeline] // stage
[Pipeline] }
[Pipeline] // ws
[Pipeline] }
[Pipeline] // node
[Pipeline] }
[withMaven] Publishers: Generated Artifacts Publisher: 1988 ms, Junit Publisher: 9110 ms, Open Task Scanner Publisher: 2290 ms, Invoker Publisher: 133943 ms, Pipeline Graph Publisher: 1 ms
[Pipeline] // withMaven
[Pipeline] cleanWs
[WS-CLEANUP] Deleting project workspace...
[WS-CLEANUP] Deferred wipeout is used...
[WS-CLEANUP] done
[Pipeline] }
[Pipeline] // stage
[Pipeline] }
[Pipeline] // ws
[Pipeline] }
[Pipeline] // node
[Pipeline] }
[withMaven] Publishers: Generated Artifacts Publisher: 1979 ms, Junit Publisher: 17123 ms, Open Task Scanner Publisher: 2048 ms, Dependencies Fingerprint Publisher: 1 ms, Invoker Publisher: 134443 ms, Pipeline Graph Publisher: 1 ms
[Pipeline] // withMaven
[Pipeline] cleanWs
[WS-CLEANUP] Deleting project workspace...
[WS-CLEANUP] Deferred wipeout is used...
[WS-CLEANUP] done
[Pipeline] }
[Pipeline] // stage
[Pipeline] }
[Pipeline] // ws
[Pipeline] }
[Pipeline] // node
[Pipeline] }
[withMaven] Publishers: Generated Artifacts Publisher: 142 ms, Junit Publisher: 1220 ms, Open Task Scanner Publisher: 281 ms, Dependencies Fingerprint Publisher: 1 ms, Invoker Publisher: 71774 ms, Pipeline Graph Publisher: 1 ms
[Pipeline] // withMaven
[Pipeline] cleanWs
[WS-CLEANUP] Deleting project workspace...
[WS-CLEANUP] Deferred wipeout is used...
[WS-CLEANUP] done
[Pipeline] }
[Pipeline] // stage
[Pipeline] }
[Pipeline] // ws
[Pipeline] }
[Pipeline] // node
[Pipeline] }
[Pipeline] // parallel
[Pipeline] stage
[Pipeline] { (Notifications)
[Pipeline] echo
Build result: UNSTABLE
[Pipeline] jiraIssueSelector
[Pipeline] echo
The authors of changes [olamy].
[Pipeline] echo
Sending email ...
[Pipeline] emailext