Build unstable in Jenkins: Maven TLP » maven-javadoc-plugin » MJAVADOC-607 #3

classic Classic list List threaded Threaded
4 messages Options
Reply | Threaded
Open this post in threaded view
|

Build unstable in Jenkins: Maven TLP » maven-javadoc-plugin » MJAVADOC-607 #3

Apache Jenkins Server-2
See https://builds.apache.org/job/maven-box/job/maven-javadoc-plugin/job/MJAVADOC-607/3/

Changes:

* [INFRA-18734] Jenkins builds fail on email notifications due to unknown
* Scripts not permitted to use staticMethod
* excluded message body from the log message
* NotSerializableException: hudson.plugins.git.GitChangeSetList
* investigating permissions to the call 'ChangeSetList.author'
* NotSerializableException: hudson.plugins.git.GitChangeSetList
* [INFRA-18734] Jenkins builds fail on email notifications due to unknown
* Prevent Caused: java.io.NotSerializableException: hudson.model.User
* [INFRA-18734] Jenkins builds fail on email notifications due to unknown
* last() cannot be called on []
* [improvement] currentBuild.changeSets can be referenced as changes
* moved the fix of INFRA-18734 to jenkinsNotify
* ${env.EXECUTOR_NUMBER} returns null
* inline env.BRANCH_NAME directly in IF statement
* used env.EXECUTOR_NUMBER
* moved "def localRepo ..." to the stage execution block

1 tests failed.
FAILED:  org.apache.maven.plugins.javadoc.JavadocUtilTest.linux-jdk7-m3.6.x_build / Build linux-jdk7-m3.6.x_build / testIsValidPackageList

Error Message:
Read timed out

Stack Trace:
java.net.SocketTimeoutException: Read timed out
        at org.apache.maven.plugins.javadoc.JavadocUtilTest.testIsValidPackageList(JavadocUtilTest.java:395)




Build log:
[...truncated 11604 lines...]
[withMaven] invokerPublisher - Archive invoker results for Maven artifact MavenArtifact{org.apache.maven.plugins:maven-javadoc-plugin:maven-plugin:3.1.2-SNAPSHOT(version: 3.1.2-SNAPSHOT, snapshot:false) } generated by PluginInvocation{org.apache.maven.plugins:maven-invoker-plugin:3.1.0@integration-test  integration-test}: windows-jdk11-m3.6.x_build\target\invoker-reports\*.xml
[INFO]           MJAVADOC-551 spaces\pom.xml ...................... SUCCESS (4.7 s)
[INFO] Building: MJAVADOC-552_fix-author\pom.xml
[INFO] run post-build script verify.groovy
[INFO]           MJAVADOC-552_fix-author\pom.xml .................. SUCCESS (7.1 s)
[INFO] Building: MJAVADOC-555_aggr_mixed\pom.xml
[INFO] run post-build script verify.groovy
[INFO]           MJAVADOC-495_offline-filescheme\pom.xml .......... SUCCESS (13.5 s)
[INFO] Building: MJAVADOC-497\pom.xml
[INFO] run post-build script verify.bsh
[INFO]           MJAVADOC-497\pom.xml ............................. SUCCESS (8.4 s)
[INFO] Building: MJAVADOC-498_aggr_modulepath\pom.xml
[INFO] run post-build script verify.groovy
[INFO]           MJAVADOC-555_aggr_mixed\pom.xml .................. SUCCESS (10.3 s)
[INFO] Building: MJAVADOC-555_link-automatic-modules\pom.xml
[INFO] run post-build script verify.groovy
[INFO]           MJAVADOC-555_link-automatic-modules\pom.xml ...... SUCCESS (10.0 s)
[INFO] Building: MJAVADOC-556_hide-non-exported-packages\pom.xml
[INFO]           MJAVADOC-556_hide-non-exported-packages\pom.xml .. SUCCESS (7.0 s)
[INFO] Building: MJAVADOC-558_fix-unknownthrows\pom.xml
[INFO]           MJAVADOC-498_aggr_modulepath\pom.xml ............. SUCCESS (22.4 s)
[INFO] Building: MJAVADOC-498_mm_modulepath\pom.xml
[INFO] run post-build script verify.groovy
[INFO]           MJAVADOC-558_fix-unknownthrows\pom.xml ........... SUCCESS (6.1 s)
[INFO] Building: MJAVADOC-562_release\pom.xml
[INFO]           MJAVADOC-562_release\pom.xml ..................... SUCCESS (8.3 s)
[INFO] Building: MJAVADOC-567_aggr-mixed\pom.xml
[INFO]           MJAVADOC-498_mm_modulepath\pom.xml ............... SUCCESS (11.2 s)
[INFO] Building: MJAVADOC-498_modulepath\pom.xml
[INFO] run post-build script verify.groovy
[INFO]           MJAVADOC-567_aggr-mixed\pom.xml .................. SUCCESS (5.1 s)
[INFO] Building: MJAVADOC-568_export-to-testcase\pom.xml
[withMaven] Publishers: Generated Artifacts Publisher: 149 ms, Junit Publisher: 321 ms, Open Task Scanner Publisher: 242 ms, Dependencies Fingerprint Publisher: 1 ms, Invoker Publisher: 60881 ms, Pipeline Graph Publisher: 1 ms
[Pipeline] // withMaven
[Pipeline] cleanWs
[WS-CLEANUP] Deleting project workspace...
[WS-CLEANUP] Deferred wipeout is used...
[WS-CLEANUP] done
[Pipeline] }
[Pipeline] // stage
[Pipeline] }
[Pipeline] // ws
[Pipeline] }
[Pipeline] // node
[Pipeline] }
[INFO] run post-build script verify.groovy
[INFO]           MJAVADOC-498_modulepath\pom.xml .................. SUCCESS (11.9 s)
[INFO] Building: MJAVADOC-506_excl-module-info\pom.xml
[INFO] run post-build script verify.groovy
[INFO]           MJAVADOC-506_excl-module-info\pom.xml ............ SUCCESS (7.6 s)
[INFO] Building: MJAVADOC-508\pom.xml
[INFO]           MJAVADOC-568_export-to-testcase\pom.xml .......... SUCCESS (16.8 s)
[INFO] Building: MJAVADOC-568_jar-mixed\pom.xml
[INFO]           MJAVADOC-508\pom.xml ............................. SUCCESS (6.6 s)
[INFO] Building: MJAVADOC-514_3rdparty-doclettags\pom.xml
[INFO]           MJAVADOC-514_3rdparty-doclettags\pom.xml ......... SUCCESS (5.5 s)
[INFO] Building: MJAVADOC-526_aggr-managedDeps\pom.xml
[INFO]           MJAVADOC-568_jar-mixed\pom.xml ................... SUCCESS (12.0 s)
[INFO] Building: MJAVADOC-568_manifest-splitpackage\pom.xml
[INFO]           MJAVADOC-526_aggr-managedDeps\pom.xml ............ SUCCESS (10.3 s)
[INFO] Building: MJAVADOC-528\pom.xml
[INFO] run post-build script verify.groovy
[INFO]           MJAVADOC-528\pom.xml ............................. SUCCESS (8.5 s)
[INFO] Building: MJAVADOC-538\pom.xml
[INFO]           MJAVADOC-568_manifest-splitpackage\pom.xml ....... SUCCESS (16.4 s)
[INFO] Building: MJAVADOC-569_aggr-mixed\pom.xml
[INFO]           MJAVADOC-538\pom.xml ............................. SUCCESS (6.4 s)
[INFO] Building: MJAVADOC-551 spaces\pom.xml
[INFO]           MJAVADOC-551 spaces\pom.xml ...................... SUCCESS (4.9 s)
[INFO] Building: MJAVADOC-552_fix-author\pom.xml
[INFO]           MJAVADOC-569_aggr-mixed\pom.xml .................. SUCCESS (13.8 s)
[INFO] Building: MJAVADOC-575_source8-module-info\pom.xml
[INFO] run post-build script verify.groovy
[INFO]           MJAVADOC-552_fix-author\pom.xml .................. SUCCESS (7.9 s)
[INFO] Building: MJAVADOC-555_aggr_mixed\pom.xml
[INFO] run post-build script verify.groovy
[INFO]           MJAVADOC-575_source8-module-info\pom.xml ......... SUCCESS (6.8 s)
[INFO] Building: MJAVADOC-580_detectLinks\pom.xml
[INFO] run post-build script verify.groovy
[INFO]           MJAVADOC-580_detectLinks\pom.xml ................. SUCCESS (5.2 s)
[INFO] Building: MJAVADOC-591_release8\pom.xml
[INFO] run post-build script verify.groovy
[INFO]           MJAVADOC-555_aggr_mixed\pom.xml .................. SUCCESS (10.7 s)
[INFO] Building: MJAVADOC-555_link-automatic-modules\pom.xml
[INFO] artifact org.apache.maven.plugins:maven-resources-plugin: checking for updates from central
[INFO] artifact org.apache.maven.plugins:maven-install-plugin: checking for updates from central
[INFO] artifact org.apache.maven.plugins:maven-deploy-plugin: checking for updates from central
[INFO]           MJAVADOC-591_release8\pom.xml .................... SUCCESS (16.0 s)
[INFO] Building: MJAVADOC-599\pom.xml
[INFO] run post-build script verify.groovy
[INFO]           MJAVADOC-555_link-automatic-modules\pom.xml ...... SUCCESS (11.4 s)
[INFO] Building: MJAVADOC-556_hide-non-exported-packages\pom.xml
[INFO]           MJAVADOC-556_hide-non-exported-packages\pom.xml .. SUCCESS (7.4 s)
[INFO] Building: MJAVADOC-558_fix-unknownthrows\pom.xml
[INFO] run post-build script verify.groovy
[INFO]           MJAVADOC-599\pom.xml ............................. SUCCESS (8.3 s)
[INFO] Building: site-failOnError\pom.xml
[INFO] run post-build script verify.groovy
[INFO]           MJAVADOC-558_fix-unknownthrows\pom.xml ........... SUCCESS (8.5 s)
[INFO] Building: MJAVADOC-562_release\pom.xml
[INFO]           site-failOnError\pom.xml ......................... SUCCESS (7.6 s)
[INFO]
[INFO] --- mrm-maven-plugin:1.1.0:stop (repository) @ maven-javadoc-plugin ---
[INFO] Stopping Mock Repository Manager on http://localhost:51420
[INFO] Stopped SocketConnector@0.0.0.0:51420
[INFO] Mock Repository Manager http://localhost:51420 is stopped.
[INFO]
[INFO] --- mrm-maven-plugin:1.1.0:stop (3rdparty) @ maven-javadoc-plugin ---
[INFO] Stopping Mock Repository Manager on http://localhost:51421
[INFO] Stopped SocketConnector@0.0.0.0:51421
[INFO] Mock Repository Manager http://localhost:51421 is stopped.
[INFO]
[INFO] --- maven-checkstyle-plugin:3.0.0:check (checkstyle-check) @ maven-javadoc-plugin ---
[INFO] There are 4 errors reported by Checkstyle 6.18 with config/maven_checks.xml ruleset.
[INFO] Ignored 4 errors, 0 violation remaining.
[INFO]
[INFO] --- maven-invoker-plugin:3.1.0:verify (integration-test) @ maven-javadoc-plugin ---
[INFO] -------------------------------------------------
[INFO] Build Summary:
[INFO]   Passed: 60, Failed: 0, Errors: 0, Skipped: 5
[INFO] -------------------------------------------------
[INFO] ------------------------------------------------------------------------
[INFO] BUILD SUCCESS
[INFO] ------------------------------------------------------------------------
[INFO] Total time:  13:19 min
[INFO] Finished at: 2019-08-28T04:15:28-07:00
[INFO] ------------------------------------------------------------------------
[INFO] [jenkins-event-spy] Generated F:\jenkins\jenkins-slave\workspace\aven-javadoc-plugin_MJAVADOC-607@2@tmp\withMaven6775f8f3\maven-spy-20190828-040208-77314082835103153215618.log
[Pipeline] }
[Pipeline] // dir
[Pipeline] }
[withMaven] artifactsPublisher - Archive artifact windows-jdk13-m3.6.x_build\pom.xml under org\apache\maven\plugins\maven-javadoc-plugin\3.1.2-SNAPSHOT\maven-javadoc-plugin-3.1.2-SNAPSHOT.pom
[withMaven] artifactsPublisher - Archive artifact windows-jdk13-m3.6.x_build\target\maven-javadoc-plugin-3.1.2-SNAPSHOT.jar under org\apache\maven\plugins\maven-javadoc-plugin\3.1.2-SNAPSHOT\maven-javadoc-plugin-3.1.2-SNAPSHOT.jar
[Fast Archiver] Compressed 491.66 KB of artifacts by 45.6% relative to #2
[withMaven] junitPublisher - Archive test results for Maven artifact org.apache.maven.plugins:maven-javadoc-plugin:maven-plugin:3.1.2-SNAPSHOT generated by maven-surefire-plugin:test (default-test): windows-jdk13-m3.6.x_build\target\surefire-reports\*.xml
Recording test results
[withMaven] openTasksPublisher - Scan Tasks for Maven artifact org.apache.maven.plugins:maven-javadoc-plugin:maven-plugin:3.1.2-SNAPSHOT in source directory windows-jdk13-m3.6.x_build\src\main\java
[TASKS] Scanning folder 'f:\jenkins\jenkins-slave\workspace\aven-javadoc-plugin_MJAVADOC-607@2' for files matching the pattern 'windows-jdk13-m3.6.x_build\src\main\java\**\*' - excludes: null
[TASKS] Found 26 files to scan for tasks
[TASKS] Found 7 open tasks.
Skipping warnings blame since pipelines do not have an SCM link.%n
[TASKS] Computing warning deltas based on reference build #2
[withMaven] invokerPublisher - Archive invoker results for Maven artifact MavenArtifact{org.apache.maven.plugins:maven-javadoc-plugin:maven-plugin:3.1.2-SNAPSHOT(version: 3.1.2-SNAPSHOT, snapshot:false) } generated by PluginInvocation{org.apache.maven.plugins:maven-invoker-plugin:3.1.0@integration-test  integration-test}: windows-jdk13-m3.6.x_build\target\invoker-reports\*.xml
[INFO]           MJAVADOC-562_release\pom.xml ..................... SUCCESS (8.4 s)
[INFO] Building: MJAVADOC-567_aggr-mixed\pom.xml
[INFO] run post-build script verify.groovy
[INFO]           MJAVADOC-567_aggr-mixed\pom.xml .................. SUCCESS (5.3 s)
[INFO] Building: MJAVADOC-568_export-to-testcase\pom.xml
[INFO]           MJAVADOC-568_export-to-testcase\pom.xml .......... SUCCESS (17.9 s)
[INFO] Building: MJAVADOC-568_jar-mixed\pom.xml
[withMaven] Publishers: Generated Artifacts Publisher: 125 ms, Junit Publisher: 248 ms, Open Task Scanner Publisher: 160 ms, Invoker Publisher: 36597 ms, Pipeline Graph Publisher: 1 ms
[Pipeline] // withMaven
[Pipeline] cleanWs
[WS-CLEANUP] Deleting project workspace...
[WS-CLEANUP] Deferred wipeout is used...
[WS-CLEANUP] done
[Pipeline] }
[Pipeline] // stage
[Pipeline] }
[Pipeline] // ws
[Pipeline] }
[Pipeline] // node
[Pipeline] }
[INFO]           MJAVADOC-568_jar-mixed\pom.xml ................... SUCCESS (13.9 s)
[INFO] Building: MJAVADOC-568_manifest-splitpackage\pom.xml
[INFO]           MJAVADOC-568_manifest-splitpackage\pom.xml ....... SUCCESS (18.1 s)
[INFO] Building: MJAVADOC-569_aggr-mixed\pom.xml
[INFO]           MJAVADOC-569_aggr-mixed\pom.xml .................. SUCCESS (15.7 s)
[INFO] Building: MJAVADOC-575_source8-module-info\pom.xml
[INFO]           MJAVADOC-575_source8-module-info\pom.xml ......... SKIPPED due to JRE version
[INFO] Building: MJAVADOC-580_detectLinks\pom.xml
[INFO] run post-build script verify.groovy
[INFO]           MJAVADOC-580_detectLinks\pom.xml ................. SUCCESS (7.0 s)
[INFO] Building: MJAVADOC-591_release8\pom.xml
[INFO] artifact org.apache.maven.plugins:maven-resources-plugin: checking for updates from central
[INFO] artifact org.apache.maven.plugins:maven-install-plugin: checking for updates from central
[INFO] artifact org.apache.maven.plugins:maven-deploy-plugin: checking for updates from central
[INFO]           MJAVADOC-591_release8\pom.xml .................... SUCCESS (15.6 s)
[INFO] Building: MJAVADOC-599\pom.xml
[INFO] run post-build script verify.groovy
[INFO]           MJAVADOC-599\pom.xml ............................. SUCCESS (8.3 s)
[INFO] Building: site-failOnError\pom.xml
[INFO]           site-failOnError\pom.xml ......................... SUCCESS (7.6 s)
[INFO]
[INFO] --- mrm-maven-plugin:1.1.0:stop (repository) @ maven-javadoc-plugin ---
[INFO] Stopping Mock Repository Manager on http://localhost:52083
[INFO] Stopped SocketConnector@0.0.0.0:52083
[INFO] Mock Repository Manager http://localhost:52083 is stopped.
[INFO]
[INFO] --- mrm-maven-plugin:1.1.0:stop (3rdparty) @ maven-javadoc-plugin ---
[INFO] Stopping Mock Repository Manager on http://localhost:52084
[INFO] Stopped SocketConnector@0.0.0.0:52084
[INFO] Mock Repository Manager http://localhost:52084 is stopped.
[INFO]
[INFO] --- maven-checkstyle-plugin:3.0.0:check (checkstyle-check) @ maven-javadoc-plugin ---
[INFO] There are 4 errors reported by Checkstyle 6.18 with config/maven_checks.xml ruleset.
[INFO] Ignored 4 errors, 0 violation remaining.
[INFO]
[INFO] --- maven-invoker-plugin:3.1.0:verify (integration-test) @ maven-javadoc-plugin ---
[INFO] -------------------------------------------------
[INFO] Build Summary:
[INFO]   Passed: 62, Failed: 0, Errors: 0, Skipped: 3
[INFO] -------------------------------------------------
[INFO] ------------------------------------------------------------------------
[INFO] BUILD SUCCESS
[INFO] ------------------------------------------------------------------------
[INFO] Total time:  15:45 min
[INFO] Finished at: 2019-08-28T04:17:25-07:00
[INFO] ------------------------------------------------------------------------
[INFO] [jenkins-event-spy] Generated F:\jenkins\jenkins-slave\workspace\aven-javadoc-plugin_MJAVADOC-607@2@tmp\withMaven18a28065\maven-spy-20190828-040139-57014779331694063969674.log
[Pipeline] }
[Pipeline] // dir
[Pipeline] }
[withMaven] artifactsPublisher - Archive artifact windows-jdk12-m3.6.x_build\pom.xml under org\apache\maven\plugins\maven-javadoc-plugin\3.1.2-SNAPSHOT\maven-javadoc-plugin-3.1.2-SNAPSHOT.pom
[withMaven] artifactsPublisher - Archive artifact windows-jdk12-m3.6.x_build\target\maven-javadoc-plugin-3.1.2-SNAPSHOT.jar under org\apache\maven\plugins\maven-javadoc-plugin\3.1.2-SNAPSHOT\maven-javadoc-plugin-3.1.2-SNAPSHOT.jar
[Fast Archiver] Compressed 489.51 KB of artifacts by 45.8% relative to #2
[withMaven] junitPublisher - Archive test results for Maven artifact org.apache.maven.plugins:maven-javadoc-plugin:maven-plugin:3.1.2-SNAPSHOT generated by maven-surefire-plugin:test (default-test): windows-jdk12-m3.6.x_build\target\surefire-reports\*.xml
Recording test results
[withMaven] openTasksPublisher - Scan Tasks for Maven artifact org.apache.maven.plugins:maven-javadoc-plugin:maven-plugin:3.1.2-SNAPSHOT in source directory windows-jdk12-m3.6.x_build\src\main\java
[TASKS] Scanning folder 'f:\jenkins\jenkins-slave\workspace\aven-javadoc-plugin_MJAVADOC-607@2' for files matching the pattern 'windows-jdk12-m3.6.x_build\src\main\java\**\*' - excludes: null
[TASKS] Found 26 files to scan for tasks
[TASKS] Found 7 open tasks.
Skipping warnings blame since pipelines do not have an SCM link.%n
[TASKS] Computing warning deltas based on reference build #2
[withMaven] invokerPublisher - Archive invoker results for Maven artifact MavenArtifact{org.apache.maven.plugins:maven-javadoc-plugin:maven-plugin:3.1.2-SNAPSHOT(version: 3.1.2-SNAPSHOT, snapshot:false) } generated by PluginInvocation{org.apache.maven.plugins:maven-invoker-plugin:3.1.0@integration-test  integration-test}: windows-jdk12-m3.6.x_build\target\invoker-reports\*.xml
[withMaven] Publishers: Generated Artifacts Publisher: 100 ms, Junit Publisher: 247 ms, Open Task Scanner Publisher: 132 ms, Invoker Publisher: 40704 ms, Pipeline Graph Publisher: 4 ms
[Pipeline] // withMaven
[Pipeline] cleanWs
[WS-CLEANUP] Deleting project workspace...
[WS-CLEANUP] Deferred wipeout is used...
[WS-CLEANUP] done
[Pipeline] }
[Pipeline] // stage
[Pipeline] }
[Pipeline] // ws
[Pipeline] }
[Pipeline] // node
[Pipeline] }
[Pipeline] // parallel
[Pipeline] stage
[Pipeline] { (Notifications)
[Pipeline] echo
Build result: UNSTABLE
[Pipeline] jiraIssueSelector
[Pipeline] echo
The authors of changes [tibordigana, rfscholte].
[Pipeline] echo
Sending email ...
[Pipeline] emailext
Reply | Threaded
Open this post in threaded view
|

Build failed in Jenkins: Maven TLP » maven-javadoc-plugin » MJAVADOC-607 #4

Apache Jenkins Server-2
See https://builds.apache.org/job/maven-box/job/maven-javadoc-plugin/job/MJAVADOC-607/4/

Changes:

* Log unique commits
* Other attempt due to 'Scripts not permitted to use staticMethod
* Revert "Log unique commits"

2 tests failed.
FAILED:  org.apache.maven.plugins.javadoc.JavadocReportTest.linux-jdk13-m3.6.x_build / Build linux-jdk13-m3.6.x_build / testDefaultConfiguration

Error Message:
https://docs.oracle.com/en/java/javase/13/docs/api/ available, but def/configuration/App.html is missing link to java.lang.Object
Expected: (a string containing "/docs/api/java/lang/Object.html" or a string containing "/docs/api/java.base/java/lang/Object.html")
     but: was "<!DOCTYPE HTML>\n<!-- NewPage -->\n<html lang=\"en\">\n<head>\n<!-- Generated by javadoc (13) on Mon Sep 23 01:59:11 UTC 2019 -->\n<title>App (Maven Javadoc Plugin Default configuration Test 1.0-SNAPSHOT API)</title>\n<meta http-equiv=\"Content-Type\" content=\"text/html; charset=UTF-8\">\n<meta name=\"dc.created\" content=\"2019-09-23\">\n<meta name=\"description\" content=\"declaration: package: def.configuration, class: App\">\n<meta name=\"generator\" content=\"javadoc/ClassWriterImpl\">\n<link rel=\"stylesheet\" type=\"text/css\" href=\"../../stylesheet.css\" title=\"Style\">\n<link rel=\"stylesheet\" type=\"text/css\" href=\"../../script-dir/jquery-ui.css\" title=\"Style\">\n<script type=\"text/javascript\" src=\"../../script.js\"></script>\n<script type=\"text/javascript\" src=\"../../script-dir/jszip/dist/jszip.min.js\"></script>\n<script type=\"text/javascript\" src=\"../../script-dir/jszip-utils/dist/jszip-utils.min.js\"></script>\n<!--[if IE]>\n<script type=\"text/javascript\" src=\"../../script-dir/jszip-utils/dist/jszip-utils-ie.min.js\"></script>\n<![endif]-->\n<script type=\"text/javascript\" src=\"../../script-dir/jquery-3.4.1.js\"></script>\n<script type=\"text/javascript\" src=\"../../script-dir/jquery-ui.js\"></script>\n</head>\n<body class=\"class-declaration\">\n<script type=\"text/javascript\">var data = {\"i0\":9,\"i1\":10};\nvar tabs = {65535:[\"t0\",\"All Methods\"],1:[\"t1\",\"Static Methods\"],2:[\"t2\",\"Instance Methods\"],8:[\"t4\",\"Concrete Methods\"]};\nvar altColor = \"altColor\";\nvar rowColor = \"rowColor\";\nvar tableTab = \"tableTab\";\nvar activeTableTab = \"activeTableTab\";\nvar pathtoroot = \"../../\";\nloadScripts(document, 'script');</script>\n<noscript>\n<div>JavaScript is disabled on your browser.</div>\n</noscript>\n<header role=\"banner\">\n<nav role=\"navigation\">\n<div class=\"fixedNav\">\n<!-- ========= START OF TOP NAVBAR ======= -->\n<div class=\"topNav\"><a id=\"navbar.top\">\n<!--   -->\n</a>\n<div class=\"skipNav\"><a href=\"#skip.navbar.top\" title=\"Skip navigation links\">Skip navigation links</a></div>\n<a id=\"navbar.top.firstrow\">\n<!--   -->\n</a>\n<ul class=\"navList\" title=\"Navigation\">\n<li><a href=\"package-summary.html\">Package</a></li>\n<li class=\"navBarCell1Rev\">Class</li>\n<li><a href=\"class-use/App.html\">Use</a></li>\n<li><a href=\"package-tree.html\">Tree</a></li>\n<li><a href=\"../../deprecated-list.html\">Deprecated</a></li>\n<li><a href=\"../../index-all.html\">Index</a></li>\n<li><a href=\"../../help-doc.html\">Help</a></li>\n</ul>\n</div>\n<div class=\"subNav\">\n<div>\n<ul class=\"subNavList\">\n<li>Summary:&nbsp;</li>\n<li>Nested&nbsp;|&nbsp;</li>\n<li>Field&nbsp;|&nbsp;</li>\n<li><a href=\"#constructor.summary\">Constr</a>&nbsp;|&nbsp;</li>\n<li><a href=\"#method.summary\">Method</a></li>\n</ul>\n<ul class=\"subNavList\">\n<li>Detail:&nbsp;</li>\n<li>Field&nbsp;|&nbsp;</li>\n<li><a href=\"#constructor.detail\">Constr</a>&nbsp;|&nbsp;</li>\n<li><a href=\"#method.detail\">Method</a></li>\n</ul>\n</div>\n<div class=\"navListSearch\"><label for=\"search\">SEARCH:</label>\n<input type=\"text\" id=\"search\" value=\"search\" disabled=\"disabled\">\n<input type=\"reset\" id=\"reset\" value=\"reset\" disabled=\"disabled\">\n</div>\n</div>\n<a id=\"skip.navbar.top\">\n<!--   -->\n</a>\n<!-- ========= END OF TOP NAVBAR ========= -->\n</div>\n<div class=\"navPadding\">&nbsp;</div>\n<script type=\"text/javascript\"><!--\n$('.navPadding').css('padding-top', $('.fixedNav').css(\"height\"));\n//-->\n</script>\n</nav>\n</header>\n<!-- ======== START OF CLASS DATA ======== -->\n<main role=\"main\">\n<div class=\"header\">\n<div class=\"subTitle\"><span class=\"packageLabelInType\">Package</span>&nbsp;<a href=\"package-summary.html\">def.configuration</a></div>\n<h1 title=\"Class App\" class=\"title\">Class App</h1>\n</div>\n<div class=\"contentContainer\">\n<div class=\"inheritance\" title=\"Inheritance Tree\">java.lang.Object\n<div class=\"inheritance\">def.configuration.App</div>\n</div>\n<section class=\"description\">\n<hr>\n<pre>public class <span class=\"typeNameLabel\">App</span>\nextends java.lang.Object</pre>\n</section>\n<section class=\"summary\">\n<ul class=\"blockList\">\n<!-- ======== CONSTRUCTOR SUMMARY ======== -->\n<li class=\"blockList\">\n<section class=\"constructorSummary\"><a id=\"constructor.summary\">\n<!--   -->\n</a>\n<h2>Constructor Summary</h2>\n<div class=\"memberSummary\">\n<table>\n<caption><span>Constructors</span><span class=\"tabEnd\">&nbsp;</span></caption>\n<thead>\n<tr>\n<th class=\"colFirst\" scope=\"col\">Constructor</th>\n<th class=\"colLast\" scope=\"col\">Description</th>\n</tr>\n</thead>\n<tbody>\n<tr class=\"altColor\">\n<th class=\"colConstructorName\" scope=\"row\"><code><span class=\"memberNameLink\"><a href=\"#%3Cinit%3E()\">App</a></span>()</code></th>\n<td class=\"colLast\">&nbsp;</td>\n</tr>\n</tbody>\n</table>\n</div>\n</section>\n</li>\n<!-- ========== METHOD SUMMARY =========== -->\n<li class=\"blockList\">\n<section class=\"methodSummary\"><a id=\"method.summary\">\n<!--   -->\n</a>\n<h2>Method Summary</h2>\n<div class=\"memberSummary\">\n<div role=\"tablist\" aria-orientation=\"horizontal\"><button role=\"tab\" aria-selected=\"true\" aria-controls=\"memberSummary_tabpanel\" tabindex=\"0\" onkeydown=\"switchTab(event)\" id=\"t0\" class=\"activeTableTab\">All Methods</button><button role=\"tab\" aria-selected=\"false\" aria-controls=\"memberSummary_tabpanel\" tabindex=\"-1\" onkeydown=\"switchTab(event)\" id=\"t1\" class=\"tableTab\" onclick=\"show(1);\">Static Methods</button><button role=\"tab\" aria-selected=\"false\" aria-controls=\"memberSummary_tabpanel\" tabindex=\"-1\" onkeydown=\"switchTab(event)\" id=\"t2\" class=\"tableTab\" onclick=\"show(2);\">Instance Methods</button><button role=\"tab\" aria-selected=\"false\" aria-controls=\"memberSummary_tabpanel\" tabindex=\"-1\" onkeydown=\"switchTab(event)\" id=\"t4\" class=\"tableTab\" onclick=\"show(8);\">Concrete Methods</button></div>\n<div id=\"memberSummary_tabpanel\" role=\"tabpanel\">\n<table aria-labelledby=\"t0\">\n<thead>\n<tr>\n<th class=\"colFirst\" scope=\"col\">Modifier and Type</th>\n<th class=\"colSecond\" scope=\"col\">Method</th>\n<th class=\"colLast\" scope=\"col\">Description</th>\n</tr>\n</thead>\n<tbody>\n<tr class=\"altColor\" id=\"i0\">\n<td class=\"colFirst\"><code>static void</code></td>\n<th class=\"colSecond\" scope=\"row\"><code><span class=\"memberNameLink\"><a href=\"#main(java.lang.String%5B%5D)\">main</a></span>&#8203;(java.lang.String[]&nbsp;args)</code></th>\n<td class=\"colLast\">&nbsp;</td>\n</tr>\n<tr class=\"rowColor\" id=\"i1\">\n<td class=\"colFirst\"><code>protected void</code></td>\n<th class=\"colSecond\" scope=\"row\"><code><span class=\"memberNameLink\"><a href=\"#sampleMethod(java.lang.String)\">sampleMethod</a></span>&#8203;(java.lang.String&nbsp;str)</code></th>\n<td class=\"colLast\">&nbsp;</td>\n</tr>\n</tbody>\n</table>\n</div>\n</div>\n<div class=\"inheritedList\">\n<h3>Methods inherited from class&nbsp;java.lang.Object</h3>\n<a id=\"methods.inherited.from.class.java.lang.Object\">\n<!--   -->\n</a><code>clone, equals, finalize, getClass, hashCode, notify, notifyAll, toString, wait, wait, wait</code></div>\n</section>\n</li>\n</ul>\n</section>\n<section class=\"details\">\n<ul class=\"blockList\">\n<!-- ========= CONSTRUCTOR DETAIL ======== -->\n<li class=\"blockList\">\n<section class=\"constructorDetails\"><a id=\"constructor.detail\">\n<!--   -->\n</a>\n<h2>Constructor Details</h2>\n<ul class=\"blockList\">\n<li class=\"blockList\">\n<section class=\"detail\">\n<h3><a id=\"&lt;init&gt;()\">App</a></h3>\n<div class=\"memberSignature\"><span class=\"modifiers\">public</span>&nbsp;<span class=\"memberName\">App</span>()</div>\n</section>\n</li>\n</ul>\n</section>\n</li>\n<!-- ============ METHOD DETAIL ========== -->\n<li class=\"blockList\">\n<section class=\"methodDetails\"><a id=\"method.detail\">\n<!--   -->\n</a>\n<h2>Method Details</h2>\n<ul class=\"blockList\">\n<li class=\"blockList\">\n<section class=\"detail\">\n<h3><a id=\"main(java.lang.String[])\">main</a></h3>\n<div class=\"memberSignature\"><span class=\"modifiers\">public static</span>&nbsp;<span class=\"returnType\">void</span>&nbsp;<span class=\"memberName\">main</span>&#8203;(<span class=\"arguments\">java.lang.String[]&nbsp;args)</span></div>\n</section>\n</li>\n<li class=\"blockList\">\n<section class=\"detail\">\n<h3><a id=\"sampleMethod(java.lang.String)\">sampleMethod</a></h3>\n<div class=\"memberSignature\"><span class=\"modifiers\">protected</span>&nbsp;<span class=\"returnType\">void</span>&nbsp;<span class=\"memberName\">sampleMethod</span>&#8203;(<span class=\"arguments\">java.lang.String&nbsp;str)</span></div>\n</section>\n</li>\n</ul>\n</section>\n</li>\n</ul>\n</section>\n</div>\n</main>\n<!-- ========= END OF CLASS DATA ========= -->\n<footer role=\"contentinfo\">\n<nav role=\"navigation\">\n<!-- ======= START OF BOTTOM NAVBAR ====== -->\n<div class=\"bottomNav\"><a id=\"navbar.bottom\">\n<!--   -->\n</a>\n<div class=\"skipNav\"><a href=\"#skip.navbar.bottom\" title=\"Skip navigation links\">Skip navigation links</a></div>\n<a id=\"navbar.bottom.firstrow\">\n<!--   -->\n</a>\n<ul class=\"navList\" title=\"Navigation\">\n<li><a href=\"package-summary.html\">Package</a></li>\n<li class=\"navBarCell1Rev\">Class</li>\n<li><a href=\"class-use/App.html\">Use</a></li>\n<li><a href=\"package-tree.html\">Tree</a></li>\n<li><a href=\"../../deprecated-list.html\">Deprecated</a></li>\n<li><a href=\"../../index-all.html\">Index</a></li>\n<li><a href=\"../../help-doc.html\">Help</a></li>\n</ul>\n</div>\n<div class=\"subNav\">\n<div>\n<ul class=\"subNavList\">\n<li>Summary:&nbsp;</li>\n<li>Nested&nbsp;|&nbsp;</li>\n<li>Field&nbsp;|&nbsp;</li>\n<li><a href=\"#constructor.summary\">Constr</a>&nbsp;|&nbsp;</li>\n<li><a href=\"#method.summary\">Method</a></li>\n</ul>\n<ul class=\"subNavList\">\n<li>Detail:&nbsp;</li>\n<li>Field&nbsp;|&nbsp;</li>\n<li><a href=\"#constructor.detail\">Constr</a>&nbsp;|&nbsp;</li>\n<li><a href=\"#method.detail\">Method</a></li>\n</ul>\n</div>\n</div>\n<a id=\"skip.navbar.bottom\">\n<!--   -->\n</a>\n<!-- ======== END OF BOTTOM NAVBAR ======= -->\n</nav>\n</footer>\n</body>\n</html>\n"

Stack Trace:
java.lang.AssertionError:
https://docs.oracle.com/en/java/javase/13/docs/api/ available, but def/configuration/App.html is missing link to java.lang.Object
Expected: (a string containing "/docs/api/java/lang/Object.html" or a string containing "/docs/api/java.base/java/lang/Object.html")
     but: was "<!DOCTYPE HTML>\n<!-- NewPage -->\n<html lang=\"en\">\n<head>\n<!-- Generated by javadoc (13) on Mon Sep 23 01:59:11 UTC 2019 -->\n<title>App (Maven Javadoc Plugin Default configuration Test 1.0-SNAPSHOT API)</title>\n<meta http-equiv=\"Content-Type\" content=\"text/html; charset=UTF-8\">\n<meta name=\"dc.created\" content=\"2019-09-23\">\n<meta name=\"description\" content=\"declaration: package: def.configuration, class: App\">\n<meta name=\"generator\" content=\"javadoc/ClassWriterImpl\">\n<link rel=\"stylesheet\" type=\"text/css\" href=\"../../stylesheet.css\" title=\"Style\">\n<link rel=\"stylesheet\" type=\"text/css\" href=\"../../script-dir/jquery-ui.css\" title=\"Style\">\n<script type=\"text/javascript\" src=\"../../script.js\"></script>\n<script type=\"text/javascript\" src=\"../../script-dir/jszip/dist/jszip.min.js\"></script>\n<script type=\"text/javascript\" src=\"../../script-dir/jszip-utils/dist/jszip-utils.min.js\"></script>\n<!--[if IE]>\n<script type=\"text/javascript\" src=\"../../script-dir/jszip-utils/dist/jszip-utils-ie.min.js\"></script>\n<![endif]-->\n<script type=\"text/javascript\" src=\"../../script-dir/jquery-3.4.1.js\"></script>\n<script type=\"text/javascript\" src=\"../../script-dir/jquery-ui.js\"></script>\n</head>\n<body class=\"class-declaration\">\n<script type=\"text/javascript\">var data = {\"i0\":9,\"i1\":10};\nvar tabs = {65535:[\"t0\",\"All Methods\"],1:[\"t1\",\"Static Methods\"],2:[\"t2\",\"Instance Methods\"],8:[\"t4\",\"Concrete Methods\"]};\nvar altColor = \"altColor\";\nvar rowColor = \"rowColor\";\nvar tableTab = \"tableTab\";\nvar activeTableTab = \"activeTableTab\";\nvar pathtoroot = \"../../\";\nloadScripts(document, 'script');</script>\n<noscript>\n<div>JavaScript is disabled on your browser.</div>\n</noscript>\n<header role=\"banner\">\n<nav role=\"navigation\">\n<div class=\"fixedNav\">\n<!-- ========= START OF TOP NAVBAR ======= -->\n<div class=\"topNav\"><a id=\"navbar.top\">\n<!--   -->\n</a>\n<div class=\"skipNav\"><a href=\"#skip.navbar.top\" title=\"Skip navigation links\">Skip navigation links</a></div>\n<a id=\"navbar.top.firstrow\">\n<!--   -->\n</a>\n<ul class=\"navList\" title=\"Navigation\">\n<li><a href=\"package-summary.html\">Package</a></li>\n<li class=\"navBarCell1Rev\">Class</li>\n<li><a href=\"class-use/App.html\">Use</a></li>\n<li><a href=\"package-tree.html\">Tree</a></li>\n<li><a href=\"../../deprecated-list.html\">Deprecated</a></li>\n<li><a href=\"../../index-all.html\">Index</a></li>\n<li><a href=\"../../help-doc.html\">Help</a></li>\n</ul>\n</div>\n<div class=\"subNav\">\n<div>\n<ul class=\"subNavList\">\n<li>Summary:&nbsp;</li>\n<li>Nested&nbsp;|&nbsp;</li>\n<li>Field&nbsp;|&nbsp;</li>\n<li><a href=\"#constructor.summary\">Constr</a>&nbsp;|&nbsp;</li>\n<li><a href=\"#method.summary\">Method</a></li>\n</ul>\n<ul class=\"subNavList\">\n<li>Detail:&nbsp;</li>\n<li>Field&nbsp;|&nbsp;</li>\n<li><a href=\"#constructor.detail\">Constr</a>&nbsp;|&nbsp;</li>\n<li><a href=\"#method.detail\">Method</a></li>\n</ul>\n</div>\n<div class=\"navListSearch\"><label for=\"search\">SEARCH:</label>\n<input type=\"text\" id=\"search\" value=\"search\" disabled=\"disabled\">\n<input type=\"reset\" id=\"reset\" value=\"reset\" disabled=\"disabled\">\n</div>\n</div>\n<a id=\"skip.navbar.top\">\n<!--   -->\n</a>\n<!-- ========= END OF TOP NAVBAR ========= -->\n</div>\n<div class=\"navPadding\">&nbsp;</div>\n<script type=\"text/javascript\"><!--\n$('.navPadding').css('padding-top', $('.fixedNav').css(\"height\"));\n//-->\n</script>\n</nav>\n</header>\n<!-- ======== START OF CLASS DATA ======== -->\n<main role=\"main\">\n<div class=\"header\">\n<div class=\"subTitle\"><span class=\"packageLabelInType\">Package</span>&nbsp;<a href=\"package-summary.html\">def.configuration</a></div>\n<h1 title=\"Class App\" class=\"title\">Class App</h1>\n</div>\n<div class=\"contentContainer\">\n<div class=\"inheritance\" title=\"Inheritance Tree\">java.lang.Object\n<div class=\"inheritance\">def.configuration.App</div>\n</div>\n<section class=\"description\">\n<hr>\n<pre>public class <span class=\"typeNameLabel\">App</span>\nextends java.lang.Object</pre>\n</section>\n<section class=\"summary\">\n<ul class=\"blockList\">\n<!-- ======== CONSTRUCTOR SUMMARY ======== -->\n<li class=\"blockList\">\n<section class=\"constructorSummary\"><a id=\"constructor.summary\">\n<!--   -->\n</a>\n<h2>Constructor Summary</h2>\n<div class=\"memberSummary\">\n<table>\n<caption><span>Constructors</span><span class=\"tabEnd\">&nbsp;</span></caption>\n<thead>\n<tr>\n<th class=\"colFirst\" scope=\"col\">Constructor</th>\n<th class=\"colLast\" scope=\"col\">Description</th>\n</tr>\n</thead>\n<tbody>\n<tr class=\"altColor\">\n<th class=\"colConstructorName\" scope=\"row\"><code><span class=\"memberNameLink\"><a href=\"#%3Cinit%3E()\">App</a></span>()</code></th>\n<td class=\"colLast\">&nbsp;</td>\n</tr>\n</tbody>\n</table>\n</div>\n</section>\n</li>\n<!-- ========== METHOD SUMMARY =========== -->\n<li class=\"blockList\">\n<section class=\"methodSummary\"><a id=\"method.summary\">\n<!--   -->\n</a>\n<h2>Method Summary</h2>\n<div class=\"memberSummary\">\n<div role=\"tablist\" aria-orientation=\"horizontal\"><button role=\"tab\" aria-selected=\"true\" aria-controls=\"memberSummary_tabpanel\" tabindex=\"0\" onkeydown=\"switchTab(event)\" id=\"t0\" class=\"activeTableTab\">All Methods</button><button role=\"tab\" aria-selected=\"false\" aria-controls=\"memberSummary_tabpanel\" tabindex=\"-1\" onkeydown=\"switchTab(event)\" id=\"t1\" class=\"tableTab\" onclick=\"show(1);\">Static Methods</button><button role=\"tab\" aria-selected=\"false\" aria-controls=\"memberSummary_tabpanel\" tabindex=\"-1\" onkeydown=\"switchTab(event)\" id=\"t2\" class=\"tableTab\" onclick=\"show(2);\">Instance Methods</button><button role=\"tab\" aria-selected=\"false\" aria-controls=\"memberSummary_tabpanel\" tabindex=\"-1\" onkeydown=\"switchTab(event)\" id=\"t4\" class=\"tableTab\" onclick=\"show(8);\">Concrete Methods</button></div>\n<div id=\"memberSummary_tabpanel\" role=\"tabpanel\">\n<table aria-labelledby=\"t0\">\n<thead>\n<tr>\n<th class=\"colFirst\" scope=\"col\">Modifier and Type</th>\n<th class=\"colSecond\" scope=\"col\">Method</th>\n<th class=\"colLast\" scope=\"col\">Description</th>\n</tr>\n</thead>\n<tbody>\n<tr class=\"altColor\" id=\"i0\">\n<td class=\"colFirst\"><code>static void</code></td>\n<th class=\"colSecond\" scope=\"row\"><code><span class=\"memberNameLink\"><a href=\"#main(java.lang.String%5B%5D)\">main</a></span>&#8203;(java.lang.String[]&nbsp;args)</code></th>\n<td class=\"colLast\">&nbsp;</td>\n</tr>\n<tr class=\"rowColor\" id=\"i1\">\n<td class=\"colFirst\"><code>protected void</code></td>\n<th class=\"colSecond\" scope=\"row\"><code><span class=\"memberNameLink\"><a href=\"#sampleMethod(java.lang.String)\">sampleMethod</a></span>&#8203;(java.lang.String&nbsp;str)</code></th>\n<td class=\"colLast\">&nbsp;</td>\n</tr>\n</tbody>\n</table>\n</div>\n</div>\n<div class=\"inheritedList\">\n<h3>Methods inherited from class&nbsp;java.lang.Object</h3>\n<a id=\"methods.inherited.from.class.java.lang.Object\">\n<!--   -->\n</a><code>clone, equals, finalize, getClass, hashCode, notify, notifyAll, toString, wait, wait, wait</code></div>\n</section>\n</li>\n</ul>\n</section>\n<section class=\"details\">\n<ul class=\"blockList\">\n<!-- ========= CONSTRUCTOR DETAIL ======== -->\n<li class=\"blockList\">\n<section class=\"constructorDetails\"><a id=\"constructor.detail\">\n<!--   -->\n</a>\n<h2>Constructor Details</h2>\n<ul class=\"blockList\">\n<li class=\"blockList\">\n<section class=\"detail\">\n<h3><a id=\"&lt;init&gt;()\">App</a></h3>\n<div class=\"memberSignature\"><span class=\"modifiers\">public</span>&nbsp;<span class=\"memberName\">App</span>()</div>\n</section>\n</li>\n</ul>\n</section>\n</li>\n<!-- ============ METHOD DETAIL ========== -->\n<li class=\"blockList\">\n<section class=\"methodDetails\"><a id=\"method.detail\">\n<!--   -->\n</a>\n<h2>Method Details</h2>\n<ul class=\"blockList\">\n<li class=\"blockList\">\n<section class=\"detail\">\n<h3><a id=\"main(java.lang.String[])\">main</a></h3>\n<div class=\"memberSignature\"><span class=\"modifiers\">public static</span>&nbsp;<span class=\"returnType\">void</span>&nbsp;<span class=\"memberName\">main</span>&#8203;(<span class=\"arguments\">java.lang.String[]&nbsp;args)</span></div>\n</section>\n</li>\n<li class=\"blockList\">\n<section class=\"detail\">\n<h3><a id=\"sampleMethod(java.lang.String)\">sampleMethod</a></h3>\n<div class=\"memberSignature\"><span class=\"modifiers\">protected</span>&nbsp;<span class=\"returnType\">void</span>&nbsp;<span class=\"memberName\">sampleMethod</span>&#8203;(<span class=\"arguments\">java.lang.String&nbsp;str)</span></div>\n</section>\n</li>\n</ul>\n</section>\n</li>\n</ul>\n</section>\n</div>\n</main>\n<!-- ========= END OF CLASS DATA ========= -->\n<footer role=\"contentinfo\">\n<nav role=\"navigation\">\n<!-- ======= START OF BOTTOM NAVBAR ====== -->\n<div class=\"bottomNav\"><a id=\"navbar.bottom\">\n<!--   -->\n</a>\n<div class=\"skipNav\"><a href=\"#skip.navbar.bottom\" title=\"Skip navigation links\">Skip navigation links</a></div>\n<a id=\"navbar.bottom.firstrow\">\n<!--   -->\n</a>\n<ul class=\"navList\" title=\"Navigation\">\n<li><a href=\"package-summary.html\">Package</a></li>\n<li class=\"navBarCell1Rev\">Class</li>\n<li><a href=\"class-use/App.html\">Use</a></li>\n<li><a href=\"package-tree.html\">Tree</a></li>\n<li><a href=\"../../deprecated-list.html\">Deprecated</a></li>\n<li><a href=\"../../index-all.html\">Index</a></li>\n<li><a href=\"../../help-doc.html\">Help</a></li>\n</ul>\n</div>\n<div class=\"subNav\">\n<div>\n<ul class=\"subNavList\">\n<li>Summary:&nbsp;</li>\n<li>Nested&nbsp;|&nbsp;</li>\n<li>Field&nbsp;|&nbsp;</li>\n<li><a href=\"#constructor.summary\">Constr</a>&nbsp;|&nbsp;</li>\n<li><a href=\"#method.summary\">Method</a></li>\n</ul>\n<ul class=\"subNavList\">\n<li>Detail:&nbsp;</li>\n<li>Field&nbsp;|&nbsp;</li>\n<li><a href=\"#constructor.detail\">Constr</a>&nbsp;|&nbsp;</li>\n<li><a href=\"#method.detail\">Method</a></li>\n</ul>\n</div>\n</div>\n<a id=\"skip.navbar.bottom\">\n<!--   -->\n</a>\n<!-- ======== END OF BOTTOM NAVBAR ======= -->\n</nav>\n</footer>\n</body>\n</html>\n"
        at org.apache.maven.plugins.javadoc.JavadocReportTest.testDefaultConfiguration(JavadocReportTest.java:263)


FAILED:  org.apache.maven.plugins.javadoc.JavadocReportTest.windows-jdk13-m3.6.x_build / Build windows-jdk13-m3.6.x_build / testDefaultConfiguration

Error Message:
https://docs.oracle.com/en/java/javase/13/docs/api/ available, but def/configuration/App.html is missing link to java.lang.Object
Expected: (a string containing "/docs/api/java/lang/Object.html" or a string containing "/docs/api/java.base/java/lang/Object.html")
     but: was "<!DOCTYPE HTML>\r\n<!-- NewPage -->\r\n<html lang=\"en\">\r\n<head>\r\n<!-- Generated by javadoc (13-ea) on Sun Sep 22 19:36:11 PDT 2019 -->\r\n<title>App (Maven Javadoc Plugin Default configuration Test 1.0-SNAPSHOT API)</title>\r\n<meta http-equiv=\"Content-Type\" content=\"text/html; charset=UTF-8\">\r\n<meta name=\"dc.created\" content=\"2019-09-22\">\r\n<meta name=\"description\" content=\"declaration: package: def.configuration, class: App\">\r\n<meta name=\"generator\" content=\"javadoc/ClassWriterImpl\">\r\n<link rel=\"stylesheet\" type=\"text/css\" href=\"../../stylesheet.css\" title=\"Style\">\r\n<link rel=\"stylesheet\" type=\"text/css\" href=\"../../script-dir/jquery-ui.css\" title=\"Style\">\r\n<script type=\"text/javascript\" src=\"../../script.js\"></script>\r\n<script type=\"text/javascript\" src=\"../../script-dir/jszip/dist/jszip.min.js\"></script>\r\n<script type=\"text/javascript\" src=\"../../script-dir/jszip-utils/dist/jszip-utils.min.js\"></script>\r\n<!--[if IE]>\r\n<script type=\"text/javascript\" src=\"../../script-dir/jszip-utils/dist/jszip-utils-ie.min.js\"></script>\r\n<![endif]-->\r\n<script type=\"text/javascript\" src=\"../../script-dir/jquery-3.4.1.js\"></script>\r\n<script type=\"text/javascript\" src=\"../../script-dir/jquery-ui.js\"></script>\r\n</head>\r\n<body class=\"class-declaration\">\r\n<script type=\"text/javascript\">var data = {\"i0\":9,\"i1\":10};\r\nvar tabs = {65535:[\"t0\",\"All Methods\"],1:[\"t1\",\"Static Methods\"],2:[\"t2\",\"Instance Methods\"],8:[\"t4\",\"Concrete Methods\"]};\r\nvar altColor = \"altColor\";\r\nvar rowColor = \"rowColor\";\r\nvar tableTab = \"tableTab\";\r\nvar activeTableTab = \"activeTableTab\";\r\nvar pathtoroot = \"../../\";\r\nloadScripts(document, 'script');</script>\r\n<noscript>\r\n<div>JavaScript is disabled on your browser.</div>\r\n</noscript>\r\n<header role=\"banner\">\r\n<nav role=\"navigation\">\r\n<div class=\"fixedNav\">\r\n<!-- ========= START OF TOP NAVBAR ======= -->\r\n<div class=\"topNav\"><a id=\"navbar.top\">\r\n<!--   -->\r\n</a>\r\n<div class=\"skipNav\"><a href=\"#skip.navbar.top\" title=\"Skip navigation links\">Skip navigation links</a></div>\r\n<a id=\"navbar.top.firstrow\">\r\n<!--   -->\r\n</a>\r\n<ul class=\"navList\" title=\"Navigation\">\r\n<li><a href=\"package-summary.html\">Package</a></li>\r\n<li class=\"navBarCell1Rev\">Class</li>\r\n<li><a href=\"class-use/App.html\">Use</a></li>\r\n<li><a href=\"package-tree.html\">Tree</a></li>\r\n<li><a href=\"../../deprecated-list.html\">Deprecated</a></li>\r\n<li><a href=\"../../index-all.html\">Index</a></li>\r\n<li><a href=\"../../help-doc.html\">Help</a></li>\r\n</ul>\r\n</div>\r\n<div class=\"subNav\">\r\n<div>\r\n<ul class=\"subNavList\">\r\n<li>Summary:&nbsp;</li>\r\n<li>Nested&nbsp;|&nbsp;</li>\r\n<li>Field&nbsp;|&nbsp;</li>\r\n<li><a href=\"#constructor.summary\">Constr</a>&nbsp;|&nbsp;</li>\r\n<li><a href=\"#method.summary\">Method</a></li>\r\n</ul>\r\n<ul class=\"subNavList\">\r\n<li>Detail:&nbsp;</li>\r\n<li>Field&nbsp;|&nbsp;</li>\r\n<li><a href=\"#constructor.detail\">Constr</a>&nbsp;|&nbsp;</li>\r\n<li><a href=\"#method.detail\">Method</a></li>\r\n</ul>\r\n</div>\r\n<div class=\"navListSearch\"><label for=\"search\">SEARCH:</label>\r\n<input type=\"text\" id=\"search\" value=\"search\" disabled=\"disabled\">\r\n<input type=\"reset\" id=\"reset\" value=\"reset\" disabled=\"disabled\">\r\n</div>\r\n</div>\r\n<a id=\"skip.navbar.top\">\r\n<!--   -->\r\n</a>\r\n<!-- ========= END OF TOP NAVBAR ========= -->\r\n</div>\r\n<div class=\"navPadding\">&nbsp;</div>\r\n<script type=\"text/javascript\"><!--\r\n$('.navPadding').css('padding-top', $('.fixedNav').css(\"height\"));\r\n//-->\r\n</script>\r\n</nav>\r\n</header>\r\n<!-- ======== START OF CLASS DATA ======== -->\r\n<main role=\"main\">\r\n<div class=\"header\">\r\n<div class=\"subTitle\"><span class=\"packageLabelInType\">Package</span>&nbsp;<a href=\"package-summary.html\">def.configuration</a></div>\r\n<h1 title=\"Class App\" class=\"title\">Class App</h1>\r\n</div>\r\n<div class=\"contentContainer\">\r\n<div class=\"inheritance\" title=\"Inheritance Tree\">java.lang.Object\r\n<div class=\"inheritance\">def.configuration.App</div>\r\n</div>\r\n<section class=\"description\">\r\n<hr>\r\n<pre>public class <span class=\"typeNameLabel\">App</span>\r\nextends java.lang.Object</pre>\r\n</section>\r\n<section class=\"summary\">\r\n<ul class=\"blockList\">\r\n<!-- ======== CONSTRUCTOR SUMMARY ======== -->\r\n<li class=\"blockList\">\r\n<section class=\"constructorSummary\"><a id=\"constructor.summary\">\r\n<!--   -->\r\n</a>\r\n<h2>Constructor Summary</h2>\r\n<div class=\"memberSummary\">\r\n<table>\r\n<caption><span>Constructors</span><span class=\"tabEnd\">&nbsp;</span></caption>\r\n<thead>\r\n<tr>\r\n<th class=\"colFirst\" scope=\"col\">Constructor</th>\r\n<th class=\"colLast\" scope=\"col\">Description</th>\r\n</tr>\r\n</thead>\r\n<tbody>\r\n<tr class=\"altColor\">\r\n<th class=\"colConstructorName\" scope=\"row\"><code><span class=\"memberNameLink\"><a href=\"#%3Cinit%3E()\">App</a></span>()</code></th>\r\n<td class=\"colLast\">&nbsp;</td>\r\n</tr>\r\n</tbody>\r\n</table>\r\n</div>\r\n</section>\r\n</li>\r\n<!-- ========== METHOD SUMMARY =========== -->\r\n<li class=\"blockList\">\r\n<section class=\"methodSummary\"><a id=\"method.summary\">\r\n<!--   -->\r\n</a>\r\n<h2>Method Summary</h2>\r\n<div class=\"memberSummary\">\r\n<div role=\"tablist\" aria-orientation=\"horizontal\"><button role=\"tab\" aria-selected=\"true\" aria-controls=\"memberSummary_tabpanel\" tabindex=\"0\" onkeydown=\"switchTab(event)\" id=\"t0\" class=\"activeTableTab\">All Methods</button><button role=\"tab\" aria-selected=\"false\" aria-controls=\"memberSummary_tabpanel\" tabindex=\"-1\" onkeydown=\"switchTab(event)\" id=\"t1\" class=\"tableTab\" onclick=\"show(1);\">Static Methods</button><button role=\"tab\" aria-selected=\"false\" aria-controls=\"memberSummary_tabpanel\" tabindex=\"-1\" onkeydown=\"switchTab(event)\" id=\"t2\" class=\"tableTab\" onclick=\"show(2);\">Instance Methods</button><button role=\"tab\" aria-selected=\"false\" aria-controls=\"memberSummary_tabpanel\" tabindex=\"-1\" onkeydown=\"switchTab(event)\" id=\"t4\" class=\"tableTab\" onclick=\"show(8);\">Concrete Methods</button></div>\r\n<div id=\"memberSummary_tabpanel\" role=\"tabpanel\">\r\n<table aria-labelledby=\"t0\">\r\n<thead>\r\n<tr>\r\n<th class=\"colFirst\" scope=\"col\">Modifier and Type</th>\r\n<th class=\"colSecond\" scope=\"col\">Method</th>\r\n<th class=\"colLast\" scope=\"col\">Description</th>\r\n</tr>\r\n</thead>\r\n<tbody>\r\n<tr class=\"altColor\" id=\"i0\">\r\n<td class=\"colFirst\"><code>static void</code></td>\r\n<th class=\"colSecond\" scope=\"row\"><code><span class=\"memberNameLink\"><a href=\"#main(java.lang.String%5B%5D)\">main</a></span>&#8203;(java.lang.String[]&nbsp;args)</code></th>\r\n<td class=\"colLast\">&nbsp;</td>\r\n</tr>\r\n<tr class=\"rowColor\" id=\"i1\">\r\n<td class=\"colFirst\"><code>protected void</code></td>\r\n<th class=\"colSecond\" scope=\"row\"><code><span class=\"memberNameLink\"><a href=\"#sampleMethod(java.lang.String)\">sampleMethod</a></span>&#8203;(java.lang.String&nbsp;str)</code></th>\r\n<td class=\"colLast\">&nbsp;</td>\r\n</tr>\r\n</tbody>\r\n</table>\r\n</div>\r\n</div>\r\n<div class=\"inheritedList\">\r\n<h3>Methods inherited from class&nbsp;java.lang.Object</h3>\r\n<a id=\"methods.inherited.from.class.java.lang.Object\">\r\n<!--   -->\r\n</a><code>clone, equals, finalize, getClass, hashCode, notify, notifyAll, toString, wait, wait, wait</code></div>\r\n</section>\r\n</li>\r\n</ul>\r\n</section>\r\n<section class=\"details\">\r\n<ul class=\"blockList\">\r\n<!-- ========= CONSTRUCTOR DETAIL ======== -->\r\n<li class=\"blockList\">\r\n<section class=\"constructorDetails\"><a id=\"constructor.detail\">\r\n<!--   -->\r\n</a>\r\n<h2>Constructor Details</h2>\r\n<ul class=\"blockList\">\r\n<li class=\"blockList\">\r\n<section class=\"detail\">\r\n<h3><a id=\"&lt;init&gt;()\">App</a></h3>\r\n<div class=\"memberSignature\"><span class=\"modifiers\">public</span>&nbsp;<span class=\"memberName\">App</span>()</div>\r\n</section>\r\n</li>\r\n</ul>\r\n</section>\r\n</li>\r\n<!-- ============ METHOD DETAIL ========== -->\r\n<li class=\"blockList\">\r\n<section class=\"methodDetails\"><a id=\"method.detail\">\r\n<!--   -->\r\n</a>\r\n<h2>Method Details</h2>\r\n<ul class=\"blockList\">\r\n<li class=\"blockList\">\r\n<section class=\"detail\">\r\n<h3><a id=\"main(java.lang.String[])\">main</a></h3>\r\n<div class=\"memberSignature\"><span class=\"modifiers\">public static</span>&nbsp;<span class=\"returnType\">void</span>&nbsp;<span class=\"memberName\">main</span>&#8203;(<span class=\"arguments\">java.lang.String[]&nbsp;args)</span></div>\r\n</section>\r\n</li>\r\n<li class=\"blockList\">\r\n<section class=\"detail\">\r\n<h3><a id=\"sampleMethod(java.lang.String)\">sampleMethod</a></h3>\r\n<div class=\"memberSignature\"><span class=\"modifiers\">protected</span>&nbsp;<span class=\"returnType\">void</span>&nbsp;<span class=\"memberName\">sampleMethod</span>&#8203;(<span class=\"arguments\">java.lang.String&nbsp;str)</span></div>\r\n</section>\r\n</li>\r\n</ul>\r\n</section>\r\n</li>\r\n</ul>\r\n</section>\r\n</div>\r\n</main>\r\n<!-- ========= END OF CLASS DATA ========= -->\r\n<footer role=\"contentinfo\">\r\n<nav role=\"navigation\">\r\n<!-- ======= START OF BOTTOM NAVBAR ====== -->\r\n<div class=\"bottomNav\"><a id=\"navbar.bottom\">\r\n<!--   -->\r\n</a>\r\n<div class=\"skipNav\"><a href=\"#skip.navbar.bottom\" title=\"Skip navigation links\">Skip navigation links</a></div>\r\n<a id=\"navbar.bottom.firstrow\">\r\n<!--   -->\r\n</a>\r\n<ul class=\"navList\" title=\"Navigation\">\r\n<li><a href=\"package-summary.html\">Package</a></li>\r\n<li class=\"navBarCell1Rev\">Class</li>\r\n<li><a href=\"class-use/App.html\">Use</a></li>\r\n<li><a href=\"package-tree.html\">Tree</a></li>\r\n<li><a href=\"../../deprecated-list.html\">Deprecated</a></li>\r\n<li><a href=\"../../index-all.html\">Index</a></li>\r\n<li><a href=\"../../help-doc.html\">Help</a></li>\r\n</ul>\r\n</div>\r\n<div class=\"subNav\">\r\n<div>\r\n<ul class=\"subNavList\">\r\n<li>Summary:&nbsp;</li>\r\n<li>Nested&nbsp;|&nbsp;</li>\r\n<li>Field&nbsp;|&nbsp;</li>\r\n<li><a href=\"#constructor.summary\">Constr</a>&nbsp;|&nbsp;</li>\r\n<li><a href=\"#method.summary\">Method</a></li>\r\n</ul>\r\n<ul class=\"subNavList\">\r\n<li>Detail:&nbsp;</li>\r\n<li>Field&nbsp;|&nbsp;</li>\r\n<li><a href=\"#constructor.detail\">Constr</a>&nbsp;|&nbsp;</li>\r\n<li><a href=\"#method.detail\">Method</a></li>\r\n</ul>\r\n</div>\r\n</div>\r\n<a id=\"skip.navbar.bottom\">\r\n<!--   -->\r\n</a>\r\n<!-- ======== END OF BOTTOM NAVBAR ======= -->\r\n</nav>\r\n</footer>\r\n</body>\r\n</html>\r\n"

Stack Trace:
java.lang.AssertionError:
https://docs.oracle.com/en/java/javase/13/docs/api/ available, but def/configuration/App.html is missing link to java.lang.Object
Expected: (a string containing "/docs/api/java/lang/Object.html" or a string containing "/docs/api/java.base/java/lang/Object.html")
     but: was "<!DOCTYPE HTML>\r\n<!-- NewPage -->\r\n<html lang=\"en\">\r\n<head>\r\n<!-- Generated by javadoc (13-ea) on Sun Sep 22 19:36:11 PDT 2019 -->\r\n<title>App (Maven Javadoc Plugin Default configuration Test 1.0-SNAPSHOT API)</title>\r\n<meta http-equiv=\"Content-Type\" content=\"text/html; charset=UTF-8\">\r\n<meta name=\"dc.created\" content=\"2019-09-22\">\r\n<meta name=\"description\" content=\"declaration: package: def.configuration, class: App\">\r\n<meta name=\"generator\" content=\"javadoc/ClassWriterImpl\">\r\n<link rel=\"stylesheet\" type=\"text/css\" href=\"../../stylesheet.css\" title=\"Style\">\r\n<link rel=\"stylesheet\" type=\"text/css\" href=\"../../script-dir/jquery-ui.css\" title=\"Style\">\r\n<script type=\"text/javascript\" src=\"../../script.js\"></script>\r\n<script type=\"text/javascript\" src=\"../../script-dir/jszip/dist/jszip.min.js\"></script>\r\n<script type=\"text/javascript\" src=\"../../script-dir/jszip-utils/dist/jszip-utils.min.js\"></script>\r\n<!--[if IE]>\r\n<script type=\"text/javascript\" src=\"../../script-dir/jszip-utils/dist/jszip-utils-ie.min.js\"></script>\r\n<![endif]-->\r\n<script type=\"text/javascript\" src=\"../../script-dir/jquery-3.4.1.js\"></script>\r\n<script type=\"text/javascript\" src=\"../../script-dir/jquery-ui.js\"></script>\r\n</head>\r\n<body class=\"class-declaration\">\r\n<script type=\"text/javascript\">var data = {\"i0\":9,\"i1\":10};\r\nvar tabs = {65535:[\"t0\",\"All Methods\"],1:[\"t1\",\"Static Methods\"],2:[\"t2\",\"Instance Methods\"],8:[\"t4\",\"Concrete Methods\"]};\r\nvar altColor = \"altColor\";\r\nvar rowColor = \"rowColor\";\r\nvar tableTab = \"tableTab\";\r\nvar activeTableTab = \"activeTableTab\";\r\nvar pathtoroot = \"../../\";\r\nloadScripts(document, 'script');</script>\r\n<noscript>\r\n<div>JavaScript is disabled on your browser.</div>\r\n</noscript>\r\n<header role=\"banner\">\r\n<nav role=\"navigation\">\r\n<div class=\"fixedNav\">\r\n<!-- ========= START OF TOP NAVBAR ======= -->\r\n<div class=\"topNav\"><a id=\"navbar.top\">\r\n<!--   -->\r\n</a>\r\n<div class=\"skipNav\"><a href=\"#skip.navbar.top\" title=\"Skip navigation links\">Skip navigation links</a></div>\r\n<a id=\"navbar.top.firstrow\">\r\n<!--   -->\r\n</a>\r\n<ul class=\"navList\" title=\"Navigation\">\r\n<li><a href=\"package-summary.html\">Package</a></li>\r\n<li class=\"navBarCell1Rev\">Class</li>\r\n<li><a href=\"class-use/App.html\">Use</a></li>\r\n<li><a href=\"package-tree.html\">Tree</a></li>\r\n<li><a href=\"../../deprecated-list.html\">Deprecated</a></li>\r\n<li><a href=\"../../index-all.html\">Index</a></li>\r\n<li><a href=\"../../help-doc.html\">Help</a></li>\r\n</ul>\r\n</div>\r\n<div class=\"subNav\">\r\n<div>\r\n<ul class=\"subNavList\">\r\n<li>Summary:&nbsp;</li>\r\n<li>Nested&nbsp;|&nbsp;</li>\r\n<li>Field&nbsp;|&nbsp;</li>\r\n<li><a href=\"#constructor.summary\">Constr</a>&nbsp;|&nbsp;</li>\r\n<li><a href=\"#method.summary\">Method</a></li>\r\n</ul>\r\n<ul class=\"subNavList\">\r\n<li>Detail:&nbsp;</li>\r\n<li>Field&nbsp;|&nbsp;</li>\r\n<li><a href=\"#constructor.detail\">Constr</a>&nbsp;|&nbsp;</li>\r\n<li><a href=\"#method.detail\">Method</a></li>\r\n</ul>\r\n</div>\r\n<div class=\"navListSearch\"><label for=\"search\">SEARCH:</label>\r\n<input type=\"text\" id=\"search\" value=\"search\" disabled=\"disabled\">\r\n<input type=\"reset\" id=\"reset\" value=\"reset\" disabled=\"disabled\">\r\n</div>\r\n</div>\r\n<a id=\"skip.navbar.top\">\r\n<!--   -->\r\n</a>\r\n<!-- ========= END OF TOP NAVBAR ========= -->\r\n</div>\r\n<div class=\"navPadding\">&nbsp;</div>\r\n<script type=\"text/javascript\"><!--\r\n$('.navPadding').css('padding-top', $('.fixedNav').css(\"height\"));\r\n//-->\r\n</script>\r\n</nav>\r\n</header>\r\n<!-- ======== START OF CLASS DATA ======== -->\r\n<main role=\"main\">\r\n<div class=\"header\">\r\n<div class=\"subTitle\"><span class=\"packageLabelInType\">Package</span>&nbsp;<a href=\"package-summary.html\">def.configuration</a></div>\r\n<h1 title=\"Class App\" class=\"title\">Class App</h1>\r\n</div>\r\n<div class=\"contentContainer\">\r\n<div class=\"inheritance\" title=\"Inheritance Tree\">java.lang.Object\r\n<div class=\"inheritance\">def.configuration.App</div>\r\n</div>\r\n<section class=\"description\">\r\n<hr>\r\n<pre>public class <span class=\"typeNameLabel\">App</span>\r\nextends java.lang.Object</pre>\r\n</section>\r\n<section class=\"summary\">\r\n<ul class=\"blockList\">\r\n<!-- ======== CONSTRUCTOR SUMMARY ======== -->\r\n<li class=\"blockList\">\r\n<section class=\"constructorSummary\"><a id=\"constructor.summary\">\r\n<!--   -->\r\n</a>\r\n<h2>Constructor Summary</h2>\r\n<div class=\"memberSummary\">\r\n<table>\r\n<caption><span>Constructors</span><span class=\"tabEnd\">&nbsp;</span></caption>\r\n<thead>\r\n<tr>\r\n<th class=\"colFirst\" scope=\"col\">Constructor</th>\r\n<th class=\"colLast\" scope=\"col\">Description</th>\r\n</tr>\r\n</thead>\r\n<tbody>\r\n<tr class=\"altColor\">\r\n<th class=\"colConstructorName\" scope=\"row\"><code><span class=\"memberNameLink\"><a href=\"#%3Cinit%3E()\">App</a></span>()</code></th>\r\n<td class=\"colLast\">&nbsp;</td>\r\n</tr>\r\n</tbody>\r\n</table>\r\n</div>\r\n</section>\r\n</li>\r\n<!-- ========== METHOD SUMMARY =========== -->\r\n<li class=\"blockList\">\r\n<section class=\"methodSummary\"><a id=\"method.summary\">\r\n<!--   -->\r\n</a>\r\n<h2>Method Summary</h2>\r\n<div class=\"memberSummary\">\r\n<div role=\"tablist\" aria-orientation=\"horizontal\"><button role=\"tab\" aria-selected=\"true\" aria-controls=\"memberSummary_tabpanel\" tabindex=\"0\" onkeydown=\"switchTab(event)\" id=\"t0\" class=\"activeTableTab\">All Methods</button><button role=\"tab\" aria-selected=\"false\" aria-controls=\"memberSummary_tabpanel\" tabindex=\"-1\" onkeydown=\"switchTab(event)\" id=\"t1\" class=\"tableTab\" onclick=\"show(1);\">Static Methods</button><button role=\"tab\" aria-selected=\"false\" aria-controls=\"memberSummary_tabpanel\" tabindex=\"-1\" onkeydown=\"switchTab(event)\" id=\"t2\" class=\"tableTab\" onclick=\"show(2);\">Instance Methods</button><button role=\"tab\" aria-selected=\"false\" aria-controls=\"memberSummary_tabpanel\" tabindex=\"-1\" onkeydown=\"switchTab(event)\" id=\"t4\" class=\"tableTab\" onclick=\"show(8);\">Concrete Methods</button></div>\r\n<div id=\"memberSummary_tabpanel\" role=\"tabpanel\">\r\n<table aria-labelledby=\"t0\">\r\n<thead>\r\n<tr>\r\n<th class=\"colFirst\" scope=\"col\">Modifier and Type</th>\r\n<th class=\"colSecond\" scope=\"col\">Method</th>\r\n<th class=\"colLast\" scope=\"col\">Description</th>\r\n</tr>\r\n</thead>\r\n<tbody>\r\n<tr class=\"altColor\" id=\"i0\">\r\n<td class=\"colFirst\"><code>static void</code></td>\r\n<th class=\"colSecond\" scope=\"row\"><code><span class=\"memberNameLink\"><a href=\"#main(java.lang.String%5B%5D)\">main</a></span>&#8203;(java.lang.String[]&nbsp;args)</code></th>\r\n<td class=\"colLast\">&nbsp;</td>\r\n</tr>\r\n<tr class=\"rowColor\" id=\"i1\">\r\n<td class=\"colFirst\"><code>protected void</code></td>\r\n<th class=\"colSecond\" scope=\"row\"><code><span class=\"memberNameLink\"><a href=\"#sampleMethod(java.lang.String)\">sampleMethod</a></span>&#8203;(java.lang.String&nbsp;str)</code></th>\r\n<td class=\"colLast\">&nbsp;</td>\r\n</tr>\r\n</tbody>\r\n</table>\r\n</div>\r\n</div>\r\n<div class=\"inheritedList\">\r\n<h3>Methods inherited from class&nbsp;java.lang.Object</h3>\r\n<a id=\"methods.inherited.from.class.java.lang.Object\">\r\n<!--   -->\r\n</a><code>clone, equals, finalize, getClass, hashCode, notify, notifyAll, toString, wait, wait, wait</code></div>\r\n</section>\r\n</li>\r\n</ul>\r\n</section>\r\n<section class=\"details\">\r\n<ul class=\"blockList\">\r\n<!-- ========= CONSTRUCTOR DETAIL ======== -->\r\n<li class=\"blockList\">\r\n<section class=\"constructorDetails\"><a id=\"constructor.detail\">\r\n<!--   -->\r\n</a>\r\n<h2>Constructor Details</h2>\r\n<ul class=\"blockList\">\r\n<li class=\"blockList\">\r\n<section class=\"detail\">\r\n<h3><a id=\"&lt;init&gt;()\">App</a></h3>\r\n<div class=\"memberSignature\"><span class=\"modifiers\">public</span>&nbsp;<span class=\"memberName\">App</span>()</div>\r\n</section>\r\n</li>\r\n</ul>\r\n</section>\r\n</li>\r\n<!-- ============ METHOD DETAIL ========== -->\r\n<li class=\"blockList\">\r\n<section class=\"methodDetails\"><a id=\"method.detail\">\r\n<!--   -->\r\n</a>\r\n<h2>Method Details</h2>\r\n<ul class=\"blockList\">\r\n<li class=\"blockList\">\r\n<section class=\"detail\">\r\n<h3><a id=\"main(java.lang.String[])\">main</a></h3>\r\n<div class=\"memberSignature\"><span class=\"modifiers\">public static</span>&nbsp;<span class=\"returnType\">void</span>&nbsp;<span class=\"memberName\">main</span>&#8203;(<span class=\"arguments\">java.lang.String[]&nbsp;args)</span></div>\r\n</section>\r\n</li>\r\n<li class=\"blockList\">\r\n<section class=\"detail\">\r\n<h3><a id=\"sampleMethod(java.lang.String)\">sampleMethod</a></h3>\r\n<div class=\"memberSignature\"><span class=\"modifiers\">protected</span>&nbsp;<span class=\"returnType\">void</span>&nbsp;<span class=\"memberName\">sampleMethod</span>&#8203;(<span class=\"arguments\">java.lang.String&nbsp;str)</span></div>\r\n</section>\r\n</li>\r\n</ul>\r\n</section>\r\n</li>\r\n</ul>\r\n</section>\r\n</div>\r\n</main>\r\n<!-- ========= END OF CLASS DATA ========= -->\r\n<footer role=\"contentinfo\">\r\n<nav role=\"navigation\">\r\n<!-- ======= START OF BOTTOM NAVBAR ====== -->\r\n<div class=\"bottomNav\"><a id=\"navbar.bottom\">\r\n<!--   -->\r\n</a>\r\n<div class=\"skipNav\"><a href=\"#skip.navbar.bottom\" title=\"Skip navigation links\">Skip navigation links</a></div>\r\n<a id=\"navbar.bottom.firstrow\">\r\n<!--   -->\r\n</a>\r\n<ul class=\"navList\" title=\"Navigation\">\r\n<li><a href=\"package-summary.html\">Package</a></li>\r\n<li class=\"navBarCell1Rev\">Class</li>\r\n<li><a href=\"class-use/App.html\">Use</a></li>\r\n<li><a href=\"package-tree.html\">Tree</a></li>\r\n<li><a href=\"../../deprecated-list.html\">Deprecated</a></li>\r\n<li><a href=\"../../index-all.html\">Index</a></li>\r\n<li><a href=\"../../help-doc.html\">Help</a></li>\r\n</ul>\r\n</div>\r\n<div class=\"subNav\">\r\n<div>\r\n<ul class=\"subNavList\">\r\n<li>Summary:&nbsp;</li>\r\n<li>Nested&nbsp;|&nbsp;</li>\r\n<li>Field&nbsp;|&nbsp;</li>\r\n<li><a href=\"#constructor.summary\">Constr</a>&nbsp;|&nbsp;</li>\r\n<li><a href=\"#method.summary\">Method</a></li>\r\n</ul>\r\n<ul class=\"subNavList\">\r\n<li>Detail:&nbsp;</li>\r\n<li>Field&nbsp;|&nbsp;</li>\r\n<li><a href=\"#constructor.detail\">Constr</a>&nbsp;|&nbsp;</li>\r\n<li><a href=\"#method.detail\">Method</a></li>\r\n</ul>\r\n</div>\r\n</div>\r\n<a id=\"skip.navbar.bottom\">\r\n<!--   -->\r\n</a>\r\n<!-- ======== END OF BOTTOM NAVBAR ======= -->\r\n</nav>\r\n</footer>\r\n</body>\r\n</html>\r\n"
        at org.apache.maven.plugins.javadoc.JavadocReportTest.testDefaultConfiguration(JavadocReportTest.java:263)




Build log:
[...truncated 8550 lines...]
[INFO] run post-build script verify.groovy
[INFO]           MJAVADOC-495_offline-filescheme\pom.xml .......... SUCCESS (13.0 s)
[INFO] Building: MJAVADOC-497\pom.xml
[INFO] run post-build script verify.groovy
[INFO]           MJAVADOC-506_excl-module-info\pom.xml ............ SUCCESS (9.8 s)
[INFO] Building: MJAVADOC-508\pom.xml
[INFO] run post-build script verify.bsh
[INFO]           MJAVADOC-497\pom.xml ............................. SUCCESS (8.6 s)
[INFO] Building: MJAVADOC-498_aggr_modulepath\pom.xml
[INFO]           MJAVADOC-508\pom.xml ............................. SUCCESS (8.0 s)
[INFO] Building: MJAVADOC-514_3rdparty-doclettags\pom.xml
[INFO]           MJAVADOC-514_3rdparty-doclettags\pom.xml ......... SUCCESS (6.5 s)
[INFO] Building: MJAVADOC-526_aggr-managedDeps\pom.xml
[INFO]           MJAVADOC-526_aggr-managedDeps\pom.xml ............ SUCCESS (11.0 s)
[INFO] Building: MJAVADOC-528\pom.xml
[INFO]           MJAVADOC-498_aggr_modulepath\pom.xml ............. SUCCESS (25.6 s)
[INFO] Building: MJAVADOC-498_mm_modulepath\pom.xml
[INFO] run post-build script verify.groovy
[INFO]           MJAVADOC-528\pom.xml ............................. SUCCESS (9.2 s)
[INFO] Building: MJAVADOC-538\pom.xml
[INFO]           MJAVADOC-538\pom.xml ............................. SUCCESS (6.9 s)
[INFO] Building: MJAVADOC-551 spaces\pom.xml
[INFO]           MJAVADOC-498_mm_modulepath\pom.xml ............... SUCCESS (13.4 s)
[INFO] Building: MJAVADOC-498_modulepath\pom.xml
[INFO]           MJAVADOC-551 spaces\pom.xml ...................... SUCCESS (5.4 s)
[INFO] Building: MJAVADOC-552_fix-author\pom.xml
[INFO] run post-build script verify.groovy
[INFO]           MJAVADOC-552_fix-author\pom.xml .................. SUCCESS (9.0 s)
[INFO] Building: MJAVADOC-555_aggr_mixed\pom.xml
[INFO] run post-build script verify.groovy
[INFO]           MJAVADOC-498_modulepath\pom.xml .................. SUCCESS (15.1 s)
[INFO] Building: MJAVADOC-506_excl-module-info\pom.xml
[INFO] run post-build script verify.groovy
[INFO]           MJAVADOC-555_aggr_mixed\pom.xml .................. SUCCESS (11.6 s)
[INFO] Building: MJAVADOC-555_link-automatic-modules\pom.xml
[INFO] run post-build script verify.groovy
[INFO]           MJAVADOC-506_excl-module-info\pom.xml ............ SUCCESS (8.8 s)
[INFO] Building: MJAVADOC-508\pom.xml
[INFO]           MJAVADOC-508\pom.xml ............................. SUCCESS (7.3 s)
[INFO] Building: MJAVADOC-514_3rdparty-doclettags\pom.xml
[INFO]           MJAVADOC-514_3rdparty-doclettags\pom.xml ......... SKIPPED due to JRE version
[INFO] Building: MJAVADOC-526_aggr-managedDeps\pom.xml
[INFO] run post-build script verify.groovy
[INFO]           MJAVADOC-555_link-automatic-modules\pom.xml ...... SUCCESS (13.0 s)
[INFO] Building: MJAVADOC-556_hide-non-exported-packages\pom.xml
[INFO]           MJAVADOC-526_aggr-managedDeps\pom.xml ............ SUCCESS (11.0 s)
[INFO] Building: MJAVADOC-528\pom.xml
[INFO]           MJAVADOC-556_hide-non-exported-packages\pom.xml .. SUCCESS (9.9 s)
[INFO] Building: MJAVADOC-558_fix-unknownthrows\pom.xml
[INFO] run post-build script verify.groovy
[INFO]           MJAVADOC-528\pom.xml ............................. SUCCESS (9.3 s)
[INFO] Building: MJAVADOC-538\pom.xml
[INFO] run post-build script verify.groovy
[INFO]           MJAVADOC-558_fix-unknownthrows\pom.xml ........... SUCCESS (8.5 s)
[INFO] Building: MJAVADOC-562_release\pom.xml
[INFO]           MJAVADOC-538\pom.xml ............................. SUCCESS (6.8 s)
[INFO] Building: MJAVADOC-551 spaces\pom.xml
[INFO]           MJAVADOC-562_release\pom.xml ..................... SUCCESS (9.0 s)
[INFO] Building: MJAVADOC-567_aggr-mixed\pom.xml
[INFO]           MJAVADOC-551 spaces\pom.xml ...................... SUCCESS (6.0 s)
[INFO] Building: MJAVADOC-552_fix-author\pom.xml
[INFO] run post-build script verify.groovy
[INFO]           MJAVADOC-567_aggr-mixed\pom.xml .................. SUCCESS (6.0 s)
[INFO] Building: MJAVADOC-568_export-to-testcase\pom.xml
[INFO] run post-build script verify.groovy
[INFO]           MJAVADOC-552_fix-author\pom.xml .................. SUCCESS (8.6 s)
[INFO] Building: MJAVADOC-555_aggr_mixed\pom.xml
[INFO] run post-build script verify.groovy
[INFO]           MJAVADOC-555_aggr_mixed\pom.xml .................. SUCCESS (11.7 s)
[INFO] Building: MJAVADOC-555_link-automatic-modules\pom.xml
[INFO]           MJAVADOC-568_export-to-testcase\pom.xml .......... SUCCESS (21.5 s)
[INFO] Building: MJAVADOC-568_jar-mixed\pom.xml
[INFO] run post-build script verify.groovy
[INFO]           MJAVADOC-555_link-automatic-modules\pom.xml ...... SUCCESS (13.4 s)
[INFO] Building: MJAVADOC-556_hide-non-exported-packages\pom.xml
[INFO]           MJAVADOC-556_hide-non-exported-packages\pom.xml .. SUCCESS (8.5 s)
[INFO] Building: MJAVADOC-558_fix-unknownthrows\pom.xml
[INFO]           MJAVADOC-568_jar-mixed\pom.xml ................... SUCCESS (15.7 s)
[INFO] Building: MJAVADOC-568_manifest-splitpackage\pom.xml
[INFO] run post-build script verify.groovy
[INFO]           MJAVADOC-558_fix-unknownthrows\pom.xml ........... SUCCESS (7.8 s)
[INFO] Building: MJAVADOC-562_release\pom.xml
[INFO]           MJAVADOC-562_release\pom.xml ..................... SUCCESS (10.1 s)
[INFO] Building: MJAVADOC-567_aggr-mixed\pom.xml
[INFO]           MJAVADOC-568_manifest-splitpackage\pom.xml ....... SUCCESS (20.6 s)
[INFO] Building: MJAVADOC-569_aggr-mixed\pom.xml
[INFO] run post-build script verify.groovy
[INFO]           MJAVADOC-567_aggr-mixed\pom.xml .................. SUCCESS (5.3 s)
[INFO] Building: MJAVADOC-568_export-to-testcase\pom.xml
[INFO]           MJAVADOC-569_aggr-mixed\pom.xml .................. SUCCESS (17.6 s)
[INFO] Building: MJAVADOC-575_source8-module-info\pom.xml
[INFO]           MJAVADOC-575_source8-module-info\pom.xml ......... SKIPPED due to JRE version
[INFO] Building: MJAVADOC-580_detectLinks\pom.xml
[INFO] run post-build script verify.groovy
[INFO]           MJAVADOC-580_detectLinks\pom.xml ................. SUCCESS (8.0 s)
[INFO] Building: MJAVADOC-591_release8\pom.xml
[INFO]           MJAVADOC-568_export-to-testcase\pom.xml .......... SUCCESS (20.9 s)
[INFO] Building: MJAVADOC-568_jar-mixed\pom.xml
[INFO] artifact org.apache.maven.plugins:maven-resources-plugin: checking for updates from central
[INFO] artifact org.apache.maven.plugins:maven-install-plugin: checking for updates from central
[INFO] artifact org.apache.maven.plugins:maven-deploy-plugin: checking for updates from central
[INFO]           MJAVADOC-568_jar-mixed\pom.xml ................... SUCCESS (15.4 s)
[INFO] Building: MJAVADOC-568_manifest-splitpackage\pom.xml
[INFO]           MJAVADOC-591_release8\pom.xml .................... SUCCESS (19.3 s)
[INFO] Building: MJAVADOC-599\pom.xml
[INFO] run post-build script verify.groovy
[INFO]           MJAVADOC-599\pom.xml ............................. SUCCESS (9.9 s)
[INFO] Building: site-failOnError\pom.xml
[INFO]           MJAVADOC-568_manifest-splitpackage\pom.xml ....... SUCCESS (20.4 s)
[INFO] Building: MJAVADOC-569_aggr-mixed\pom.xml
[INFO]           site-failOnError\pom.xml ......................... SUCCESS (9.2 s)
[INFO]
[INFO] --- mrm-maven-plugin:1.1.0:stop (repository) @ maven-javadoc-plugin ---
[INFO] Stopping Mock Repository Manager on http://localhost:58225
[INFO] Stopped SocketConnector@0.0.0.0:58225
[INFO] Mock Repository Manager http://localhost:58225 is stopped.
[INFO]
[INFO] --- mrm-maven-plugin:1.1.0:stop (3rdparty) @ maven-javadoc-plugin ---
[INFO] Stopping Mock Repository Manager on http://localhost:58226
[INFO] Stopped SocketConnector@0.0.0.0:58226
[INFO] Mock Repository Manager http://localhost:58226 is stopped.
[INFO]
[INFO] --- maven-checkstyle-plugin:3.0.0:check (checkstyle-check) @ maven-javadoc-plugin ---
[INFO] There are 4 errors reported by Checkstyle 6.18 with config/maven_checks.xml ruleset.
[INFO] Ignored 4 errors, 0 violation remaining.
[INFO]
[INFO] --- maven-invoker-plugin:3.1.0:verify (integration-test) @ maven-javadoc-plugin ---
[INFO] -------------------------------------------------
[INFO] Build Summary:
[INFO]   Passed: 62, Failed: 0, Errors: 0, Skipped: 3
[INFO] -------------------------------------------------
[INFO] ------------------------------------------------------------------------
[INFO] BUILD SUCCESS
[INFO] ------------------------------------------------------------------------
[INFO] Total time:  18:07 min
[INFO] Finished at: 2019-09-22T19:49:57-07:00
[INFO] ------------------------------------------------------------------------
[INFO] [jenkins-event-spy] Generated F:\jenkins\jenkins-slave\workspace\aven-javadoc-plugin_MJAVADOC-607@2@tmp\withMaven7ae67986\maven-spy-20190922-193149-8239435226287993011031.log
[Pipeline] }
[Pipeline] // dir
[Pipeline] }
[withMaven] artifactsPublisher - Archive artifact windows-jdk12-m3.6.x_build\pom.xml under org\apache\maven\plugins\maven-javadoc-plugin\3.1.2-SNAPSHOT\maven-javadoc-plugin-3.1.2-SNAPSHOT.pom
[withMaven] artifactsPublisher - Archive artifact windows-jdk12-m3.6.x_build\target\maven-javadoc-plugin-3.1.2-SNAPSHOT.jar under org\apache\maven\plugins\maven-javadoc-plugin\3.1.2-SNAPSHOT\maven-javadoc-plugin-3.1.2-SNAPSHOT.jar
[Fast Archiver] Compressed 489.51 KB of artifacts by 52.3% relative to #3
[withMaven] junitPublisher - Archive test results for Maven artifact org.apache.maven.plugins:maven-javadoc-plugin:maven-plugin:3.1.2-SNAPSHOT generated by maven-surefire-plugin:test (default-test): windows-jdk12-m3.6.x_build\target\surefire-reports\*.xml
Recording test results
[withMaven] openTasksPublisher - Scan Tasks for Maven artifact org.apache.maven.plugins:maven-javadoc-plugin:maven-plugin:3.1.2-SNAPSHOT in source directory windows-jdk12-m3.6.x_build\src\main\java
[TASKS] Scanning folder 'f:\jenkins\jenkins-slave\workspace\aven-javadoc-plugin_MJAVADOC-607@2' for files matching the pattern 'windows-jdk12-m3.6.x_build\src\main\java\**\*' - excludes: null
[TASKS] Found 26 files to scan for tasks
[TASKS] Found 7 open tasks.
Skipping warnings blame since pipelines do not have an SCM link.%n
[TASKS] Computing warning deltas based on reference build #3
[withMaven] invokerPublisher - Archive invoker results for Maven artifact MavenArtifact{org.apache.maven.plugins:maven-javadoc-plugin:maven-plugin:3.1.2-SNAPSHOT(version: 3.1.2-SNAPSHOT, snapshot:false) } generated by PluginInvocation{org.apache.maven.plugins:maven-invoker-plugin:3.1.0@integration-test  integration-test}: windows-jdk12-m3.6.x_build\target\invoker-reports\*.xml
[INFO]           MJAVADOC-569_aggr-mixed\pom.xml .................. SUCCESS (18.6 s)
[INFO] Building: MJAVADOC-575_source8-module-info\pom.xml
[INFO] run post-build script verify.groovy
[INFO]           MJAVADOC-575_source8-module-info\pom.xml ......... SUCCESS (9.2 s)
[INFO] Building: MJAVADOC-580_detectLinks\pom.xml
[INFO] run post-build script verify.groovy
[INFO]           MJAVADOC-580_detectLinks\pom.xml ................. SUCCESS (6.9 s)
[INFO] Building: MJAVADOC-591_release8\pom.xml
[INFO] artifact org.apache.maven.plugins:maven-resources-plugin: checking for updates from central
[INFO] artifact org.apache.maven.plugins:maven-install-plugin: checking for updates from central
[INFO] artifact org.apache.maven.plugins:maven-deploy-plugin: checking for updates from central
[INFO]           MJAVADOC-591_release8\pom.xml .................... SUCCESS (20.8 s)
[INFO] Building: MJAVADOC-599\pom.xml
[withMaven] Publishers: Generated Artifacts Publisher: 146 ms, Junit Publisher: 273 ms, Open Task Scanner Publisher: 247 ms, Dependencies Fingerprint Publisher: 1 ms, Invoker Publisher: 54575 ms, Pipeline Graph Publisher: 2 ms
[Pipeline] // withMaven
[Pipeline] cleanWs
[WS-CLEANUP] Deleting project workspace...
[WS-CLEANUP] Deferred wipeout is used...
[WS-CLEANUP] done
[Pipeline] }
[Pipeline] // stage
[Pipeline] }
[Pipeline] // ws
[Pipeline] }
[Pipeline] // node
[Pipeline] }
[INFO] run post-build script verify.groovy
[INFO]           MJAVADOC-599\pom.xml ............................. SUCCESS (9.9 s)
[INFO] Building: site-failOnError\pom.xml
[INFO]           site-failOnError\pom.xml ......................... SUCCESS (8.8 s)
[INFO]
[INFO] --- mrm-maven-plugin:1.1.0:stop (repository) @ maven-javadoc-plugin ---
[INFO] Stopping Mock Repository Manager on http://localhost:63432
[INFO] Stopped SocketConnector@0.0.0.0:63432
[INFO] Mock Repository Manager http://localhost:63432 is stopped.
[INFO]
[INFO] --- mrm-maven-plugin:1.1.0:stop (3rdparty) @ maven-javadoc-plugin ---
[INFO] Stopping Mock Repository Manager on http://localhost:63433
[INFO] Stopped SocketConnector@0.0.0.0:63433
[INFO] Mock Repository Manager http://localhost:63433 is stopped.
[INFO]
[INFO] --- maven-checkstyle-plugin:3.0.0:check (checkstyle-check) @ maven-javadoc-plugin ---
[INFO] There are 4 errors reported by Checkstyle 6.18 with config/maven_checks.xml ruleset.
[INFO] Ignored 4 errors, 0 violation remaining.
[INFO]
[INFO] --- maven-invoker-plugin:3.1.0:verify (integration-test) @ maven-javadoc-plugin ---
[INFO] -------------------------------------------------
[INFO] Build Summary:
[INFO]   Passed: 60, Failed: 0, Errors: 0, Skipped: 5
[INFO] -------------------------------------------------
[INFO] ------------------------------------------------------------------------
[INFO] BUILD SUCCESS
[INFO] ------------------------------------------------------------------------
[INFO] Total time:  16:56 min
[INFO] Finished at: 2019-09-22T19:51:07-07:00
[INFO] ------------------------------------------------------------------------
[INFO] [jenkins-event-spy] Generated F:\jenkins\jenkins-slave\workspace\aven-javadoc-plugin_MJAVADOC-607@2@tmp\withMaven436bed2a\maven-spy-20190922-193410-61613764005502733977691.log
[Pipeline] }
[Pipeline] // dir
[Pipeline] }
[withMaven] artifactsPublisher - Archive artifact windows-jdk13-m3.6.x_build\pom.xml under org\apache\maven\plugins\maven-javadoc-plugin\3.1.2-SNAPSHOT\maven-javadoc-plugin-3.1.2-SNAPSHOT.pom
[withMaven] artifactsPublisher - Archive artifact windows-jdk13-m3.6.x_build\target\maven-javadoc-plugin-3.1.2-SNAPSHOT.jar under org\apache\maven\plugins\maven-javadoc-plugin\3.1.2-SNAPSHOT\maven-javadoc-plugin-3.1.2-SNAPSHOT.jar
[Fast Archiver] Compressed 491.66 KB of artifacts by 45.6% relative to #3
[withMaven] junitPublisher - Archive test results for Maven artifact org.apache.maven.plugins:maven-javadoc-plugin:maven-plugin:3.1.2-SNAPSHOT generated by maven-surefire-plugin:test (default-test): windows-jdk13-m3.6.x_build\target\surefire-reports\*.xml
Recording test results
[withMaven] openTasksPublisher - Scan Tasks for Maven artifact org.apache.maven.plugins:maven-javadoc-plugin:maven-plugin:3.1.2-SNAPSHOT in source directory windows-jdk13-m3.6.x_build\src\main\java
[TASKS] Scanning folder 'f:\jenkins\jenkins-slave\workspace\aven-javadoc-plugin_MJAVADOC-607@2' for files matching the pattern 'windows-jdk13-m3.6.x_build\src\main\java\**\*' - excludes: null
[TASKS] Found 26 files to scan for tasks
[TASKS] Found 7 open tasks.
Skipping warnings blame since pipelines do not have an SCM link.%n
[TASKS] Computing warning deltas based on reference build #3
[withMaven] invokerPublisher - Archive invoker results for Maven artifact MavenArtifact{org.apache.maven.plugins:maven-javadoc-plugin:maven-plugin:3.1.2-SNAPSHOT(version: 3.1.2-SNAPSHOT, snapshot:false) } generated by PluginInvocation{org.apache.maven.plugins:maven-invoker-plugin:3.1.0@integration-test  integration-test}: windows-jdk13-m3.6.x_build\target\invoker-reports\*.xml
[withMaven] Publishers: Generated Artifacts Publisher: 154 ms, Junit Publisher: 409 ms, Open Task Scanner Publisher: 264 ms, Dependencies Fingerprint Publisher: 1 ms, Invoker Publisher: 60794 ms, Pipeline Graph Publisher: 1 ms
[Pipeline] // withMaven
[Pipeline] cleanWs
[WS-CLEANUP] Deleting project workspace...
[WS-CLEANUP] Deferred wipeout is used...
[WS-CLEANUP] done
[Pipeline] }
[Pipeline] // stage
[Pipeline] }
[Pipeline] // ws
[Pipeline] }
[Pipeline] // node
[Pipeline] }
[Pipeline] // parallel
[Pipeline] stage
[Pipeline] { (Notifications)
[Pipeline] echo
Build result: FAILURE
[Pipeline] jiraIssueSelector
[Pipeline] echo
The authors of changes [rfscholte].
[Pipeline] echo
Sending email ...
[Pipeline] emailext
Reply | Threaded
Open this post in threaded view
|

Build failed in Jenkins: Maven TLP » maven-javadoc-plugin » MJAVADOC-607 #5

Apache Jenkins Server-2
See https://builds.apache.org/job/maven-box/job/maven-javadoc-plugin/job/MJAVADOC-607/5/

Changes:

* Apply Maven 3.6.2
* H29 has checkout issues...
* Issues with H28 too
* Seems like Maven 3.6.2 is not available on all Linux nodes yet
* Java 13 released: drop 12 + include 14 (-ea)

4 tests failed.
FAILED:  org.apache.maven.plugins.javadoc.JavadocReportTest.linux-jdk14-m3.6.x_build / Build linux-jdk14-m3.6.x_build / testJavadocResources

Error Message:
null

Stack Trace:
junit.framework.AssertionFailedError
        at org.apache.maven.plugins.javadoc.JavadocReportTest.testJavadocResources(JavadocReportTest.java:788)


FAILED:  org.apache.maven.plugins.javadoc.JavadocReportTest.windows-jdk14-m3.6.x_build / Build windows-jdk14-m3.6.x_build / testJavadocResources

Error Message:
null

Stack Trace:
junit.framework.AssertionFailedError
        at org.apache.maven.plugins.javadoc.JavadocReportTest.testJavadocResources(JavadocReportTest.java:788)


FAILED:  org.apache.maven.plugins.javadoc.JavadocReportTest.linux-jdk13-m3.6.x_build / Build linux-jdk13-m3.6.x_build / testDefaultConfiguration

Error Message:
https://docs.oracle.com/en/java/javase/13/docs/api/ available, but def/configuration/App.html is missing link to java.lang.Object
Expected: (a string containing "/docs/api/java/lang/Object.html" or a string containing "/docs/api/java.base/java/lang/Object.html")
     but: was "<!DOCTYPE HTML>\n<!-- NewPage -->\n<html lang=\"en\">\n<head>\n<!-- Generated by javadoc (13) on Tue Oct 01 06:20:47 UTC 2019 -->\n<title>App (Maven Javadoc Plugin Default configuration Test 1.0-SNAPSHOT API)</title>\n<meta http-equiv=\"Content-Type\" content=\"text/html; charset=UTF-8\">\n<meta name=\"dc.created\" content=\"2019-10-01\">\n<meta name=\"description\" content=\"declaration: package: def.configuration, class: App\">\n<meta name=\"generator\" content=\"javadoc/ClassWriterImpl\">\n<link rel=\"stylesheet\" type=\"text/css\" href=\"../../stylesheet.css\" title=\"Style\">\n<link rel=\"stylesheet\" type=\"text/css\" href=\"../../script-dir/jquery-ui.css\" title=\"Style\">\n<script type=\"text/javascript\" src=\"../../script.js\"></script>\n<script type=\"text/javascript\" src=\"../../script-dir/jszip/dist/jszip.min.js\"></script>\n<script type=\"text/javascript\" src=\"../../script-dir/jszip-utils/dist/jszip-utils.min.js\"></script>\n<!--[if IE]>\n<script type=\"text/javascript\" src=\"../../script-dir/jszip-utils/dist/jszip-utils-ie.min.js\"></script>\n<![endif]-->\n<script type=\"text/javascript\" src=\"../../script-dir/jquery-3.4.1.js\"></script>\n<script type=\"text/javascript\" src=\"../../script-dir/jquery-ui.js\"></script>\n</head>\n<body class=\"class-declaration\">\n<script type=\"text/javascript\">var data = {\"i0\":9,\"i1\":10};\nvar tabs = {65535:[\"t0\",\"All Methods\"],1:[\"t1\",\"Static Methods\"],2:[\"t2\",\"Instance Methods\"],8:[\"t4\",\"Concrete Methods\"]};\nvar altColor = \"altColor\";\nvar rowColor = \"rowColor\";\nvar tableTab = \"tableTab\";\nvar activeTableTab = \"activeTableTab\";\nvar pathtoroot = \"../../\";\nloadScripts(document, 'script');</script>\n<noscript>\n<div>JavaScript is disabled on your browser.</div>\n</noscript>\n<header role=\"banner\">\n<nav role=\"navigation\">\n<div class=\"fixedNav\">\n<!-- ========= START OF TOP NAVBAR ======= -->\n<div class=\"topNav\"><a id=\"navbar.top\">\n<!--   -->\n</a>\n<div class=\"skipNav\"><a href=\"#skip.navbar.top\" title=\"Skip navigation links\">Skip navigation links</a></div>\n<a id=\"navbar.top.firstrow\">\n<!--   -->\n</a>\n<ul class=\"navList\" title=\"Navigation\">\n<li><a href=\"package-summary.html\">Package</a></li>\n<li class=\"navBarCell1Rev\">Class</li>\n<li><a href=\"class-use/App.html\">Use</a></li>\n<li><a href=\"package-tree.html\">Tree</a></li>\n<li><a href=\"../../deprecated-list.html\">Deprecated</a></li>\n<li><a href=\"../../index-all.html\">Index</a></li>\n<li><a href=\"../../help-doc.html\">Help</a></li>\n</ul>\n</div>\n<div class=\"subNav\">\n<div>\n<ul class=\"subNavList\">\n<li>Summary:&nbsp;</li>\n<li>Nested&nbsp;|&nbsp;</li>\n<li>Field&nbsp;|&nbsp;</li>\n<li><a href=\"#constructor.summary\">Constr</a>&nbsp;|&nbsp;</li>\n<li><a href=\"#method.summary\">Method</a></li>\n</ul>\n<ul class=\"subNavList\">\n<li>Detail:&nbsp;</li>\n<li>Field&nbsp;|&nbsp;</li>\n<li><a href=\"#constructor.detail\">Constr</a>&nbsp;|&nbsp;</li>\n<li><a href=\"#method.detail\">Method</a></li>\n</ul>\n</div>\n<div class=\"navListSearch\"><label for=\"search\">SEARCH:</label>\n<input type=\"text\" id=\"search\" value=\"search\" disabled=\"disabled\">\n<input type=\"reset\" id=\"reset\" value=\"reset\" disabled=\"disabled\">\n</div>\n</div>\n<a id=\"skip.navbar.top\">\n<!--   -->\n</a>\n<!-- ========= END OF TOP NAVBAR ========= -->\n</div>\n<div class=\"navPadding\">&nbsp;</div>\n<script type=\"text/javascript\"><!--\n$('.navPadding').css('padding-top', $('.fixedNav').css(\"height\"));\n//-->\n</script>\n</nav>\n</header>\n<!-- ======== START OF CLASS DATA ======== -->\n<main role=\"main\">\n<div class=\"header\">\n<div class=\"subTitle\"><span class=\"packageLabelInType\">Package</span>&nbsp;<a href=\"package-summary.html\">def.configuration</a></div>\n<h1 title=\"Class App\" class=\"title\">Class App</h1>\n</div>\n<div class=\"contentContainer\">\n<div class=\"inheritance\" title=\"Inheritance Tree\">java.lang.Object\n<div class=\"inheritance\">def.configuration.App</div>\n</div>\n<section class=\"description\">\n<hr>\n<pre>public class <span class=\"typeNameLabel\">App</span>\nextends java.lang.Object</pre>\n</section>\n<section class=\"summary\">\n<ul class=\"blockList\">\n<!-- ======== CONSTRUCTOR SUMMARY ======== -->\n<li class=\"blockList\">\n<section class=\"constructorSummary\"><a id=\"constructor.summary\">\n<!--   -->\n</a>\n<h2>Constructor Summary</h2>\n<div class=\"memberSummary\">\n<table>\n<caption><span>Constructors</span><span class=\"tabEnd\">&nbsp;</span></caption>\n<thead>\n<tr>\n<th class=\"colFirst\" scope=\"col\">Constructor</th>\n<th class=\"colLast\" scope=\"col\">Description</th>\n</tr>\n</thead>\n<tbody>\n<tr class=\"altColor\">\n<th class=\"colConstructorName\" scope=\"row\"><code><span class=\"memberNameLink\"><a href=\"#%3Cinit%3E()\">App</a></span>()</code></th>\n<td class=\"colLast\">&nbsp;</td>\n</tr>\n</tbody>\n</table>\n</div>\n</section>\n</li>\n<!-- ========== METHOD SUMMARY =========== -->\n<li class=\"blockList\">\n<section class=\"methodSummary\"><a id=\"method.summary\">\n<!--   -->\n</a>\n<h2>Method Summary</h2>\n<div class=\"memberSummary\">\n<div role=\"tablist\" aria-orientation=\"horizontal\"><button role=\"tab\" aria-selected=\"true\" aria-controls=\"memberSummary_tabpanel\" tabindex=\"0\" onkeydown=\"switchTab(event)\" id=\"t0\" class=\"activeTableTab\">All Methods</button><button role=\"tab\" aria-selected=\"false\" aria-controls=\"memberSummary_tabpanel\" tabindex=\"-1\" onkeydown=\"switchTab(event)\" id=\"t1\" class=\"tableTab\" onclick=\"show(1);\">Static Methods</button><button role=\"tab\" aria-selected=\"false\" aria-controls=\"memberSummary_tabpanel\" tabindex=\"-1\" onkeydown=\"switchTab(event)\" id=\"t2\" class=\"tableTab\" onclick=\"show(2);\">Instance Methods</button><button role=\"tab\" aria-selected=\"false\" aria-controls=\"memberSummary_tabpanel\" tabindex=\"-1\" onkeydown=\"switchTab(event)\" id=\"t4\" class=\"tableTab\" onclick=\"show(8);\">Concrete Methods</button></div>\n<div id=\"memberSummary_tabpanel\" role=\"tabpanel\">\n<table aria-labelledby=\"t0\">\n<thead>\n<tr>\n<th class=\"colFirst\" scope=\"col\">Modifier and Type</th>\n<th class=\"colSecond\" scope=\"col\">Method</th>\n<th class=\"colLast\" scope=\"col\">Description</th>\n</tr>\n</thead>\n<tbody>\n<tr class=\"altColor\" id=\"i0\">\n<td class=\"colFirst\"><code>static void</code></td>\n<th class=\"colSecond\" scope=\"row\"><code><span class=\"memberNameLink\"><a href=\"#main(java.lang.String%5B%5D)\">main</a></span>&#8203;(java.lang.String[]&nbsp;args)</code></th>\n<td class=\"colLast\">&nbsp;</td>\n</tr>\n<tr class=\"rowColor\" id=\"i1\">\n<td class=\"colFirst\"><code>protected void</code></td>\n<th class=\"colSecond\" scope=\"row\"><code><span class=\"memberNameLink\"><a href=\"#sampleMethod(java.lang.String)\">sampleMethod</a></span>&#8203;(java.lang.String&nbsp;str)</code></th>\n<td class=\"colLast\">&nbsp;</td>\n</tr>\n</tbody>\n</table>\n</div>\n</div>\n<div class=\"inheritedList\">\n<h3>Methods inherited from class&nbsp;java.lang.Object</h3>\n<a id=\"methods.inherited.from.class.java.lang.Object\">\n<!--   -->\n</a><code>clone, equals, finalize, getClass, hashCode, notify, notifyAll, toString, wait, wait, wait</code></div>\n</section>\n</li>\n</ul>\n</section>\n<section class=\"details\">\n<ul class=\"blockList\">\n<!-- ========= CONSTRUCTOR DETAIL ======== -->\n<li class=\"blockList\">\n<section class=\"constructorDetails\"><a id=\"constructor.detail\">\n<!--   -->\n</a>\n<h2>Constructor Details</h2>\n<ul class=\"blockList\">\n<li class=\"blockList\">\n<section class=\"detail\">\n<h3><a id=\"&lt;init&gt;()\">App</a></h3>\n<div class=\"memberSignature\"><span class=\"modifiers\">public</span>&nbsp;<span class=\"memberName\">App</span>()</div>\n</section>\n</li>\n</ul>\n</section>\n</li>\n<!-- ============ METHOD DETAIL ========== -->\n<li class=\"blockList\">\n<section class=\"methodDetails\"><a id=\"method.detail\">\n<!--   -->\n</a>\n<h2>Method Details</h2>\n<ul class=\"blockList\">\n<li class=\"blockList\">\n<section class=\"detail\">\n<h3><a id=\"main(java.lang.String[])\">main</a></h3>\n<div class=\"memberSignature\"><span class=\"modifiers\">public static</span>&nbsp;<span class=\"returnType\">void</span>&nbsp;<span class=\"memberName\">main</span>&#8203;(<span class=\"arguments\">java.lang.String[]&nbsp;args)</span></div>\n</section>\n</li>\n<li class=\"blockList\">\n<section class=\"detail\">\n<h3><a id=\"sampleMethod(java.lang.String)\">sampleMethod</a></h3>\n<div class=\"memberSignature\"><span class=\"modifiers\">protected</span>&nbsp;<span class=\"returnType\">void</span>&nbsp;<span class=\"memberName\">sampleMethod</span>&#8203;(<span class=\"arguments\">java.lang.String&nbsp;str)</span></div>\n</section>\n</li>\n</ul>\n</section>\n</li>\n</ul>\n</section>\n</div>\n</main>\n<!-- ========= END OF CLASS DATA ========= -->\n<footer role=\"contentinfo\">\n<nav role=\"navigation\">\n<!-- ======= START OF BOTTOM NAVBAR ====== -->\n<div class=\"bottomNav\"><a id=\"navbar.bottom\">\n<!--   -->\n</a>\n<div class=\"skipNav\"><a href=\"#skip.navbar.bottom\" title=\"Skip navigation links\">Skip navigation links</a></div>\n<a id=\"navbar.bottom.firstrow\">\n<!--   -->\n</a>\n<ul class=\"navList\" title=\"Navigation\">\n<li><a href=\"package-summary.html\">Package</a></li>\n<li class=\"navBarCell1Rev\">Class</li>\n<li><a href=\"class-use/App.html\">Use</a></li>\n<li><a href=\"package-tree.html\">Tree</a></li>\n<li><a href=\"../../deprecated-list.html\">Deprecated</a></li>\n<li><a href=\"../../index-all.html\">Index</a></li>\n<li><a href=\"../../help-doc.html\">Help</a></li>\n</ul>\n</div>\n<div class=\"subNav\">\n<div>\n<ul class=\"subNavList\">\n<li>Summary:&nbsp;</li>\n<li>Nested&nbsp;|&nbsp;</li>\n<li>Field&nbsp;|&nbsp;</li>\n<li><a href=\"#constructor.summary\">Constr</a>&nbsp;|&nbsp;</li>\n<li><a href=\"#method.summary\">Method</a></li>\n</ul>\n<ul class=\"subNavList\">\n<li>Detail:&nbsp;</li>\n<li>Field&nbsp;|&nbsp;</li>\n<li><a href=\"#constructor.detail\">Constr</a>&nbsp;|&nbsp;</li>\n<li><a href=\"#method.detail\">Method</a></li>\n</ul>\n</div>\n</div>\n<a id=\"skip.navbar.bottom\">\n<!--   -->\n</a>\n<!-- ======== END OF BOTTOM NAVBAR ======= -->\n</nav>\n</footer>\n</body>\n</html>\n"

Stack Trace:
java.lang.AssertionError:
https://docs.oracle.com/en/java/javase/13/docs/api/ available, but def/configuration/App.html is missing link to java.lang.Object
Expected: (a string containing "/docs/api/java/lang/Object.html" or a string containing "/docs/api/java.base/java/lang/Object.html")
     but: was "<!DOCTYPE HTML>\n<!-- NewPage -->\n<html lang=\"en\">\n<head>\n<!-- Generated by javadoc (13) on Tue Oct 01 06:20:47 UTC 2019 -->\n<title>App (Maven Javadoc Plugin Default configuration Test 1.0-SNAPSHOT API)</title>\n<meta http-equiv=\"Content-Type\" content=\"text/html; charset=UTF-8\">\n<meta name=\"dc.created\" content=\"2019-10-01\">\n<meta name=\"description\" content=\"declaration: package: def.configuration, class: App\">\n<meta name=\"generator\" content=\"javadoc/ClassWriterImpl\">\n<link rel=\"stylesheet\" type=\"text/css\" href=\"../../stylesheet.css\" title=\"Style\">\n<link rel=\"stylesheet\" type=\"text/css\" href=\"../../script-dir/jquery-ui.css\" title=\"Style\">\n<script type=\"text/javascript\" src=\"../../script.js\"></script>\n<script type=\"text/javascript\" src=\"../../script-dir/jszip/dist/jszip.min.js\"></script>\n<script type=\"text/javascript\" src=\"../../script-dir/jszip-utils/dist/jszip-utils.min.js\"></script>\n<!--[if IE]>\n<script type=\"text/javascript\" src=\"../../script-dir/jszip-utils/dist/jszip-utils-ie.min.js\"></script>\n<![endif]-->\n<script type=\"text/javascript\" src=\"../../script-dir/jquery-3.4.1.js\"></script>\n<script type=\"text/javascript\" src=\"../../script-dir/jquery-ui.js\"></script>\n</head>\n<body class=\"class-declaration\">\n<script type=\"text/javascript\">var data = {\"i0\":9,\"i1\":10};\nvar tabs = {65535:[\"t0\",\"All Methods\"],1:[\"t1\",\"Static Methods\"],2:[\"t2\",\"Instance Methods\"],8:[\"t4\",\"Concrete Methods\"]};\nvar altColor = \"altColor\";\nvar rowColor = \"rowColor\";\nvar tableTab = \"tableTab\";\nvar activeTableTab = \"activeTableTab\";\nvar pathtoroot = \"../../\";\nloadScripts(document, 'script');</script>\n<noscript>\n<div>JavaScript is disabled on your browser.</div>\n</noscript>\n<header role=\"banner\">\n<nav role=\"navigation\">\n<div class=\"fixedNav\">\n<!-- ========= START OF TOP NAVBAR ======= -->\n<div class=\"topNav\"><a id=\"navbar.top\">\n<!--   -->\n</a>\n<div class=\"skipNav\"><a href=\"#skip.navbar.top\" title=\"Skip navigation links\">Skip navigation links</a></div>\n<a id=\"navbar.top.firstrow\">\n<!--   -->\n</a>\n<ul class=\"navList\" title=\"Navigation\">\n<li><a href=\"package-summary.html\">Package</a></li>\n<li class=\"navBarCell1Rev\">Class</li>\n<li><a href=\"class-use/App.html\">Use</a></li>\n<li><a href=\"package-tree.html\">Tree</a></li>\n<li><a href=\"../../deprecated-list.html\">Deprecated</a></li>\n<li><a href=\"../../index-all.html\">Index</a></li>\n<li><a href=\"../../help-doc.html\">Help</a></li>\n</ul>\n</div>\n<div class=\"subNav\">\n<div>\n<ul class=\"subNavList\">\n<li>Summary:&nbsp;</li>\n<li>Nested&nbsp;|&nbsp;</li>\n<li>Field&nbsp;|&nbsp;</li>\n<li><a href=\"#constructor.summary\">Constr</a>&nbsp;|&nbsp;</li>\n<li><a href=\"#method.summary\">Method</a></li>\n</ul>\n<ul class=\"subNavList\">\n<li>Detail:&nbsp;</li>\n<li>Field&nbsp;|&nbsp;</li>\n<li><a href=\"#constructor.detail\">Constr</a>&nbsp;|&nbsp;</li>\n<li><a href=\"#method.detail\">Method</a></li>\n</ul>\n</div>\n<div class=\"navListSearch\"><label for=\"search\">SEARCH:</label>\n<input type=\"text\" id=\"search\" value=\"search\" disabled=\"disabled\">\n<input type=\"reset\" id=\"reset\" value=\"reset\" disabled=\"disabled\">\n</div>\n</div>\n<a id=\"skip.navbar.top\">\n<!--   -->\n</a>\n<!-- ========= END OF TOP NAVBAR ========= -->\n</div>\n<div class=\"navPadding\">&nbsp;</div>\n<script type=\"text/javascript\"><!--\n$('.navPadding').css('padding-top', $('.fixedNav').css(\"height\"));\n//-->\n</script>\n</nav>\n</header>\n<!-- ======== START OF CLASS DATA ======== -->\n<main role=\"main\">\n<div class=\"header\">\n<div class=\"subTitle\"><span class=\"packageLabelInType\">Package</span>&nbsp;<a href=\"package-summary.html\">def.configuration</a></div>\n<h1 title=\"Class App\" class=\"title\">Class App</h1>\n</div>\n<div class=\"contentContainer\">\n<div class=\"inheritance\" title=\"Inheritance Tree\">java.lang.Object\n<div class=\"inheritance\">def.configuration.App</div>\n</div>\n<section class=\"description\">\n<hr>\n<pre>public class <span class=\"typeNameLabel\">App</span>\nextends java.lang.Object</pre>\n</section>\n<section class=\"summary\">\n<ul class=\"blockList\">\n<!-- ======== CONSTRUCTOR SUMMARY ======== -->\n<li class=\"blockList\">\n<section class=\"constructorSummary\"><a id=\"constructor.summary\">\n<!--   -->\n</a>\n<h2>Constructor Summary</h2>\n<div class=\"memberSummary\">\n<table>\n<caption><span>Constructors</span><span class=\"tabEnd\">&nbsp;</span></caption>\n<thead>\n<tr>\n<th class=\"colFirst\" scope=\"col\">Constructor</th>\n<th class=\"colLast\" scope=\"col\">Description</th>\n</tr>\n</thead>\n<tbody>\n<tr class=\"altColor\">\n<th class=\"colConstructorName\" scope=\"row\"><code><span class=\"memberNameLink\"><a href=\"#%3Cinit%3E()\">App</a></span>()</code></th>\n<td class=\"colLast\">&nbsp;</td>\n</tr>\n</tbody>\n</table>\n</div>\n</section>\n</li>\n<!-- ========== METHOD SUMMARY =========== -->\n<li class=\"blockList\">\n<section class=\"methodSummary\"><a id=\"method.summary\">\n<!--   -->\n</a>\n<h2>Method Summary</h2>\n<div class=\"memberSummary\">\n<div role=\"tablist\" aria-orientation=\"horizontal\"><button role=\"tab\" aria-selected=\"true\" aria-controls=\"memberSummary_tabpanel\" tabindex=\"0\" onkeydown=\"switchTab(event)\" id=\"t0\" class=\"activeTableTab\">All Methods</button><button role=\"tab\" aria-selected=\"false\" aria-controls=\"memberSummary_tabpanel\" tabindex=\"-1\" onkeydown=\"switchTab(event)\" id=\"t1\" class=\"tableTab\" onclick=\"show(1);\">Static Methods</button><button role=\"tab\" aria-selected=\"false\" aria-controls=\"memberSummary_tabpanel\" tabindex=\"-1\" onkeydown=\"switchTab(event)\" id=\"t2\" class=\"tableTab\" onclick=\"show(2);\">Instance Methods</button><button role=\"tab\" aria-selected=\"false\" aria-controls=\"memberSummary_tabpanel\" tabindex=\"-1\" onkeydown=\"switchTab(event)\" id=\"t4\" class=\"tableTab\" onclick=\"show(8);\">Concrete Methods</button></div>\n<div id=\"memberSummary_tabpanel\" role=\"tabpanel\">\n<table aria-labelledby=\"t0\">\n<thead>\n<tr>\n<th class=\"colFirst\" scope=\"col\">Modifier and Type</th>\n<th class=\"colSecond\" scope=\"col\">Method</th>\n<th class=\"colLast\" scope=\"col\">Description</th>\n</tr>\n</thead>\n<tbody>\n<tr class=\"altColor\" id=\"i0\">\n<td class=\"colFirst\"><code>static void</code></td>\n<th class=\"colSecond\" scope=\"row\"><code><span class=\"memberNameLink\"><a href=\"#main(java.lang.String%5B%5D)\">main</a></span>&#8203;(java.lang.String[]&nbsp;args)</code></th>\n<td class=\"colLast\">&nbsp;</td>\n</tr>\n<tr class=\"rowColor\" id=\"i1\">\n<td class=\"colFirst\"><code>protected void</code></td>\n<th class=\"colSecond\" scope=\"row\"><code><span class=\"memberNameLink\"><a href=\"#sampleMethod(java.lang.String)\">sampleMethod</a></span>&#8203;(java.lang.String&nbsp;str)</code></th>\n<td class=\"colLast\">&nbsp;</td>\n</tr>\n</tbody>\n</table>\n</div>\n</div>\n<div class=\"inheritedList\">\n<h3>Methods inherited from class&nbsp;java.lang.Object</h3>\n<a id=\"methods.inherited.from.class.java.lang.Object\">\n<!--   -->\n</a><code>clone, equals, finalize, getClass, hashCode, notify, notifyAll, toString, wait, wait, wait</code></div>\n</section>\n</li>\n</ul>\n</section>\n<section class=\"details\">\n<ul class=\"blockList\">\n<!-- ========= CONSTRUCTOR DETAIL ======== -->\n<li class=\"blockList\">\n<section class=\"constructorDetails\"><a id=\"constructor.detail\">\n<!--   -->\n</a>\n<h2>Constructor Details</h2>\n<ul class=\"blockList\">\n<li class=\"blockList\">\n<section class=\"detail\">\n<h3><a id=\"&lt;init&gt;()\">App</a></h3>\n<div class=\"memberSignature\"><span class=\"modifiers\">public</span>&nbsp;<span class=\"memberName\">App</span>()</div>\n</section>\n</li>\n</ul>\n</section>\n</li>\n<!-- ============ METHOD DETAIL ========== -->\n<li class=\"blockList\">\n<section class=\"methodDetails\"><a id=\"method.detail\">\n<!--   -->\n</a>\n<h2>Method Details</h2>\n<ul class=\"blockList\">\n<li class=\"blockList\">\n<section class=\"detail\">\n<h3><a id=\"main(java.lang.String[])\">main</a></h3>\n<div class=\"memberSignature\"><span class=\"modifiers\">public static</span>&nbsp;<span class=\"returnType\">void</span>&nbsp;<span class=\"memberName\">main</span>&#8203;(<span class=\"arguments\">java.lang.String[]&nbsp;args)</span></div>\n</section>\n</li>\n<li class=\"blockList\">\n<section class=\"detail\">\n<h3><a id=\"sampleMethod(java.lang.String)\">sampleMethod</a></h3>\n<div class=\"memberSignature\"><span class=\"modifiers\">protected</span>&nbsp;<span class=\"returnType\">void</span>&nbsp;<span class=\"memberName\">sampleMethod</span>&#8203;(<span class=\"arguments\">java.lang.String&nbsp;str)</span></div>\n</section>\n</li>\n</ul>\n</section>\n</li>\n</ul>\n</section>\n</div>\n</main>\n<!-- ========= END OF CLASS DATA ========= -->\n<footer role=\"contentinfo\">\n<nav role=\"navigation\">\n<!-- ======= START OF BOTTOM NAVBAR ====== -->\n<div class=\"bottomNav\"><a id=\"navbar.bottom\">\n<!--   -->\n</a>\n<div class=\"skipNav\"><a href=\"#skip.navbar.bottom\" title=\"Skip navigation links\">Skip navigation links</a></div>\n<a id=\"navbar.bottom.firstrow\">\n<!--   -->\n</a>\n<ul class=\"navList\" title=\"Navigation\">\n<li><a href=\"package-summary.html\">Package</a></li>\n<li class=\"navBarCell1Rev\">Class</li>\n<li><a href=\"class-use/App.html\">Use</a></li>\n<li><a href=\"package-tree.html\">Tree</a></li>\n<li><a href=\"../../deprecated-list.html\">Deprecated</a></li>\n<li><a href=\"../../index-all.html\">Index</a></li>\n<li><a href=\"../../help-doc.html\">Help</a></li>\n</ul>\n</div>\n<div class=\"subNav\">\n<div>\n<ul class=\"subNavList\">\n<li>Summary:&nbsp;</li>\n<li>Nested&nbsp;|&nbsp;</li>\n<li>Field&nbsp;|&nbsp;</li>\n<li><a href=\"#constructor.summary\">Constr</a>&nbsp;|&nbsp;</li>\n<li><a href=\"#method.summary\">Method</a></li>\n</ul>\n<ul class=\"subNavList\">\n<li>Detail:&nbsp;</li>\n<li>Field&nbsp;|&nbsp;</li>\n<li><a href=\"#constructor.detail\">Constr</a>&nbsp;|&nbsp;</li>\n<li><a href=\"#method.detail\">Method</a></li>\n</ul>\n</div>\n</div>\n<a id=\"skip.navbar.bottom\">\n<!--   -->\n</a>\n<!-- ======== END OF BOTTOM NAVBAR ======= -->\n</nav>\n</footer>\n</body>\n</html>\n"
        at org.apache.maven.plugins.javadoc.JavadocReportTest.testDefaultConfiguration(JavadocReportTest.java:263)


FAILED:  org.apache.maven.plugins.javadoc.JavadocReportTest.windows-jdk13-m3.6.x_build / Build windows-jdk13-m3.6.x_build / testDefaultConfiguration

Error Message:
https://docs.oracle.com/en/java/javase/13/docs/api/ available, but def/configuration/App.html is missing link to java.lang.Object
Expected: (a string containing "/docs/api/java/lang/Object.html" or a string containing "/docs/api/java.base/java/lang/Object.html")
     but: was "<!DOCTYPE HTML>\r\n<!-- NewPage -->\r\n<html lang=\"en\">\r\n<head>\r\n<!-- Generated by javadoc (13-ea) on Tue Oct 01 04:11:20 PDT 2019 -->\r\n<title>App (Maven Javadoc Plugin Default configuration Test 1.0-SNAPSHOT API)</title>\r\n<meta http-equiv=\"Content-Type\" content=\"text/html; charset=UTF-8\">\r\n<meta name=\"dc.created\" content=\"2019-10-01\">\r\n<meta name=\"description\" content=\"declaration: package: def.configuration, class: App\">\r\n<meta name=\"generator\" content=\"javadoc/ClassWriterImpl\">\r\n<link rel=\"stylesheet\" type=\"text/css\" href=\"../../stylesheet.css\" title=\"Style\">\r\n<link rel=\"stylesheet\" type=\"text/css\" href=\"../../script-dir/jquery-ui.css\" title=\"Style\">\r\n<script type=\"text/javascript\" src=\"../../script.js\"></script>\r\n<script type=\"text/javascript\" src=\"../../script-dir/jszip/dist/jszip.min.js\"></script>\r\n<script type=\"text/javascript\" src=\"../../script-dir/jszip-utils/dist/jszip-utils.min.js\"></script>\r\n<!--[if IE]>\r\n<script type=\"text/javascript\" src=\"../../script-dir/jszip-utils/dist/jszip-utils-ie.min.js\"></script>\r\n<![endif]-->\r\n<script type=\"text/javascript\" src=\"../../script-dir/jquery-3.4.1.js\"></script>\r\n<script type=\"text/javascript\" src=\"../../script-dir/jquery-ui.js\"></script>\r\n</head>\r\n<body class=\"class-declaration\">\r\n<script type=\"text/javascript\">var data = {\"i0\":9,\"i1\":10};\r\nvar tabs = {65535:[\"t0\",\"All Methods\"],1:[\"t1\",\"Static Methods\"],2:[\"t2\",\"Instance Methods\"],8:[\"t4\",\"Concrete Methods\"]};\r\nvar altColor = \"altColor\";\r\nvar rowColor = \"rowColor\";\r\nvar tableTab = \"tableTab\";\r\nvar activeTableTab = \"activeTableTab\";\r\nvar pathtoroot = \"../../\";\r\nloadScripts(document, 'script');</script>\r\n<noscript>\r\n<div>JavaScript is disabled on your browser.</div>\r\n</noscript>\r\n<header role=\"banner\">\r\n<nav role=\"navigation\">\r\n<div class=\"fixedNav\">\r\n<!-- ========= START OF TOP NAVBAR ======= -->\r\n<div class=\"topNav\"><a id=\"navbar.top\">\r\n<!--   -->\r\n</a>\r\n<div class=\"skipNav\"><a href=\"#skip.navbar.top\" title=\"Skip navigation links\">Skip navigation links</a></div>\r\n<a id=\"navbar.top.firstrow\">\r\n<!--   -->\r\n</a>\r\n<ul class=\"navList\" title=\"Navigation\">\r\n<li><a href=\"package-summary.html\">Package</a></li>\r\n<li class=\"navBarCell1Rev\">Class</li>\r\n<li><a href=\"class-use/App.html\">Use</a></li>\r\n<li><a href=\"package-tree.html\">Tree</a></li>\r\n<li><a href=\"../../deprecated-list.html\">Deprecated</a></li>\r\n<li><a href=\"../../index-all.html\">Index</a></li>\r\n<li><a href=\"../../help-doc.html\">Help</a></li>\r\n</ul>\r\n</div>\r\n<div class=\"subNav\">\r\n<div>\r\n<ul class=\"subNavList\">\r\n<li>Summary:&nbsp;</li>\r\n<li>Nested&nbsp;|&nbsp;</li>\r\n<li>Field&nbsp;|&nbsp;</li>\r\n<li><a href=\"#constructor.summary\">Constr</a>&nbsp;|&nbsp;</li>\r\n<li><a href=\"#method.summary\">Method</a></li>\r\n</ul>\r\n<ul class=\"subNavList\">\r\n<li>Detail:&nbsp;</li>\r\n<li>Field&nbsp;|&nbsp;</li>\r\n<li><a href=\"#constructor.detail\">Constr</a>&nbsp;|&nbsp;</li>\r\n<li><a href=\"#method.detail\">Method</a></li>\r\n</ul>\r\n</div>\r\n<div class=\"navListSearch\"><label for=\"search\">SEARCH:</label>\r\n<input type=\"text\" id=\"search\" value=\"search\" disabled=\"disabled\">\r\n<input type=\"reset\" id=\"reset\" value=\"reset\" disabled=\"disabled\">\r\n</div>\r\n</div>\r\n<a id=\"skip.navbar.top\">\r\n<!--   -->\r\n</a>\r\n<!-- ========= END OF TOP NAVBAR ========= -->\r\n</div>\r\n<div class=\"navPadding\">&nbsp;</div>\r\n<script type=\"text/javascript\"><!--\r\n$('.navPadding').css('padding-top', $('.fixedNav').css(\"height\"));\r\n//-->\r\n</script>\r\n</nav>\r\n</header>\r\n<!-- ======== START OF CLASS DATA ======== -->\r\n<main role=\"main\">\r\n<div class=\"header\">\r\n<div class=\"subTitle\"><span class=\"packageLabelInType\">Package</span>&nbsp;<a href=\"package-summary.html\">def.configuration</a></div>\r\n<h1 title=\"Class App\" class=\"title\">Class App</h1>\r\n</div>\r\n<div class=\"contentContainer\">\r\n<div class=\"inheritance\" title=\"Inheritance Tree\">java.lang.Object\r\n<div class=\"inheritance\">def.configuration.App</div>\r\n</div>\r\n<section class=\"description\">\r\n<hr>\r\n<pre>public class <span class=\"typeNameLabel\">App</span>\r\nextends java.lang.Object</pre>\r\n</section>\r\n<section class=\"summary\">\r\n<ul class=\"blockList\">\r\n<!-- ======== CONSTRUCTOR SUMMARY ======== -->\r\n<li class=\"blockList\">\r\n<section class=\"constructorSummary\"><a id=\"constructor.summary\">\r\n<!--   -->\r\n</a>\r\n<h2>Constructor Summary</h2>\r\n<div class=\"memberSummary\">\r\n<table>\r\n<caption><span>Constructors</span><span class=\"tabEnd\">&nbsp;</span></caption>\r\n<thead>\r\n<tr>\r\n<th class=\"colFirst\" scope=\"col\">Constructor</th>\r\n<th class=\"colLast\" scope=\"col\">Description</th>\r\n</tr>\r\n</thead>\r\n<tbody>\r\n<tr class=\"altColor\">\r\n<th class=\"colConstructorName\" scope=\"row\"><code><span class=\"memberNameLink\"><a href=\"#%3Cinit%3E()\">App</a></span>()</code></th>\r\n<td class=\"colLast\">&nbsp;</td>\r\n</tr>\r\n</tbody>\r\n</table>\r\n</div>\r\n</section>\r\n</li>\r\n<!-- ========== METHOD SUMMARY =========== -->\r\n<li class=\"blockList\">\r\n<section class=\"methodSummary\"><a id=\"method.summary\">\r\n<!--   -->\r\n</a>\r\n<h2>Method Summary</h2>\r\n<div class=\"memberSummary\">\r\n<div role=\"tablist\" aria-orientation=\"horizontal\"><button role=\"tab\" aria-selected=\"true\" aria-controls=\"memberSummary_tabpanel\" tabindex=\"0\" onkeydown=\"switchTab(event)\" id=\"t0\" class=\"activeTableTab\">All Methods</button><button role=\"tab\" aria-selected=\"false\" aria-controls=\"memberSummary_tabpanel\" tabindex=\"-1\" onkeydown=\"switchTab(event)\" id=\"t1\" class=\"tableTab\" onclick=\"show(1);\">Static Methods</button><button role=\"tab\" aria-selected=\"false\" aria-controls=\"memberSummary_tabpanel\" tabindex=\"-1\" onkeydown=\"switchTab(event)\" id=\"t2\" class=\"tableTab\" onclick=\"show(2);\">Instance Methods</button><button role=\"tab\" aria-selected=\"false\" aria-controls=\"memberSummary_tabpanel\" tabindex=\"-1\" onkeydown=\"switchTab(event)\" id=\"t4\" class=\"tableTab\" onclick=\"show(8);\">Concrete Methods</button></div>\r\n<div id=\"memberSummary_tabpanel\" role=\"tabpanel\">\r\n<table aria-labelledby=\"t0\">\r\n<thead>\r\n<tr>\r\n<th class=\"colFirst\" scope=\"col\">Modifier and Type</th>\r\n<th class=\"colSecond\" scope=\"col\">Method</th>\r\n<th class=\"colLast\" scope=\"col\">Description</th>\r\n</tr>\r\n</thead>\r\n<tbody>\r\n<tr class=\"altColor\" id=\"i0\">\r\n<td class=\"colFirst\"><code>static void</code></td>\r\n<th class=\"colSecond\" scope=\"row\"><code><span class=\"memberNameLink\"><a href=\"#main(java.lang.String%5B%5D)\">main</a></span>&#8203;(java.lang.String[]&nbsp;args)</code></th>\r\n<td class=\"colLast\">&nbsp;</td>\r\n</tr>\r\n<tr class=\"rowColor\" id=\"i1\">\r\n<td class=\"colFirst\"><code>protected void</code></td>\r\n<th class=\"colSecond\" scope=\"row\"><code><span class=\"memberNameLink\"><a href=\"#sampleMethod(java.lang.String)\">sampleMethod</a></span>&#8203;(java.lang.String&nbsp;str)</code></th>\r\n<td class=\"colLast\">&nbsp;</td>\r\n</tr>\r\n</tbody>\r\n</table>\r\n</div>\r\n</div>\r\n<div class=\"inheritedList\">\r\n<h3>Methods inherited from class&nbsp;java.lang.Object</h3>\r\n<a id=\"methods.inherited.from.class.java.lang.Object\">\r\n<!--   -->\r\n</a><code>clone, equals, finalize, getClass, hashCode, notify, notifyAll, toString, wait, wait, wait</code></div>\r\n</section>\r\n</li>\r\n</ul>\r\n</section>\r\n<section class=\"details\">\r\n<ul class=\"blockList\">\r\n<!-- ========= CONSTRUCTOR DETAIL ======== -->\r\n<li class=\"blockList\">\r\n<section class=\"constructorDetails\"><a id=\"constructor.detail\">\r\n<!--   -->\r\n</a>\r\n<h2>Constructor Details</h2>\r\n<ul class=\"blockList\">\r\n<li class=\"blockList\">\r\n<section class=\"detail\">\r\n<h3><a id=\"&lt;init&gt;()\">App</a></h3>\r\n<div class=\"memberSignature\"><span class=\"modifiers\">public</span>&nbsp;<span class=\"memberName\">App</span>()</div>\r\n</section>\r\n</li>\r\n</ul>\r\n</section>\r\n</li>\r\n<!-- ============ METHOD DETAIL ========== -->\r\n<li class=\"blockList\">\r\n<section class=\"methodDetails\"><a id=\"method.detail\">\r\n<!--   -->\r\n</a>\r\n<h2>Method Details</h2>\r\n<ul class=\"blockList\">\r\n<li class=\"blockList\">\r\n<section class=\"detail\">\r\n<h3><a id=\"main(java.lang.String[])\">main</a></h3>\r\n<div class=\"memberSignature\"><span class=\"modifiers\">public static</span>&nbsp;<span class=\"returnType\">void</span>&nbsp;<span class=\"memberName\">main</span>&#8203;(<span class=\"arguments\">java.lang.String[]&nbsp;args)</span></div>\r\n</section>\r\n</li>\r\n<li class=\"blockList\">\r\n<section class=\"detail\">\r\n<h3><a id=\"sampleMethod(java.lang.String)\">sampleMethod</a></h3>\r\n<div class=\"memberSignature\"><span class=\"modifiers\">protected</span>&nbsp;<span class=\"returnType\">void</span>&nbsp;<span class=\"memberName\">sampleMethod</span>&#8203;(<span class=\"arguments\">java.lang.String&nbsp;str)</span></div>\r\n</section>\r\n</li>\r\n</ul>\r\n</section>\r\n</li>\r\n</ul>\r\n</section>\r\n</div>\r\n</main>\r\n<!-- ========= END OF CLASS DATA ========= -->\r\n<footer role=\"contentinfo\">\r\n<nav role=\"navigation\">\r\n<!-- ======= START OF BOTTOM NAVBAR ====== -->\r\n<div class=\"bottomNav\"><a id=\"navbar.bottom\">\r\n<!--   -->\r\n</a>\r\n<div class=\"skipNav\"><a href=\"#skip.navbar.bottom\" title=\"Skip navigation links\">Skip navigation links</a></div>\r\n<a id=\"navbar.bottom.firstrow\">\r\n<!--   -->\r\n</a>\r\n<ul class=\"navList\" title=\"Navigation\">\r\n<li><a href=\"package-summary.html\">Package</a></li>\r\n<li class=\"navBarCell1Rev\">Class</li>\r\n<li><a href=\"class-use/App.html\">Use</a></li>\r\n<li><a href=\"package-tree.html\">Tree</a></li>\r\n<li><a href=\"../../deprecated-list.html\">Deprecated</a></li>\r\n<li><a href=\"../../index-all.html\">Index</a></li>\r\n<li><a href=\"../../help-doc.html\">Help</a></li>\r\n</ul>\r\n</div>\r\n<div class=\"subNav\">\r\n<div>\r\n<ul class=\"subNavList\">\r\n<li>Summary:&nbsp;</li>\r\n<li>Nested&nbsp;|&nbsp;</li>\r\n<li>Field&nbsp;|&nbsp;</li>\r\n<li><a href=\"#constructor.summary\">Constr</a>&nbsp;|&nbsp;</li>\r\n<li><a href=\"#method.summary\">Method</a></li>\r\n</ul>\r\n<ul class=\"subNavList\">\r\n<li>Detail:&nbsp;</li>\r\n<li>Field&nbsp;|&nbsp;</li>\r\n<li><a href=\"#constructor.detail\">Constr</a>&nbsp;|&nbsp;</li>\r\n<li><a href=\"#method.detail\">Method</a></li>\r\n</ul>\r\n</div>\r\n</div>\r\n<a id=\"skip.navbar.bottom\">\r\n<!--   -->\r\n</a>\r\n<!-- ======== END OF BOTTOM NAVBAR ======= -->\r\n</nav>\r\n</footer>\r\n</body>\r\n</html>\r\n"

Stack Trace:
java.lang.AssertionError:
https://docs.oracle.com/en/java/javase/13/docs/api/ available, but def/configuration/App.html is missing link to java.lang.Object
Expected: (a string containing "/docs/api/java/lang/Object.html" or a string containing "/docs/api/java.base/java/lang/Object.html")
     but: was "<!DOCTYPE HTML>\r\n<!-- NewPage -->\r\n<html lang=\"en\">\r\n<head>\r\n<!-- Generated by javadoc (13-ea) on Tue Oct 01 04:11:20 PDT 2019 -->\r\n<title>App (Maven Javadoc Plugin Default configuration Test 1.0-SNAPSHOT API)</title>\r\n<meta http-equiv=\"Content-Type\" content=\"text/html; charset=UTF-8\">\r\n<meta name=\"dc.created\" content=\"2019-10-01\">\r\n<meta name=\"description\" content=\"declaration: package: def.configuration, class: App\">\r\n<meta name=\"generator\" content=\"javadoc/ClassWriterImpl\">\r\n<link rel=\"stylesheet\" type=\"text/css\" href=\"../../stylesheet.css\" title=\"Style\">\r\n<link rel=\"stylesheet\" type=\"text/css\" href=\"../../script-dir/jquery-ui.css\" title=\"Style\">\r\n<script type=\"text/javascript\" src=\"../../script.js\"></script>\r\n<script type=\"text/javascript\" src=\"../../script-dir/jszip/dist/jszip.min.js\"></script>\r\n<script type=\"text/javascript\" src=\"../../script-dir/jszip-utils/dist/jszip-utils.min.js\"></script>\r\n<!--[if IE]>\r\n<script type=\"text/javascript\" src=\"../../script-dir/jszip-utils/dist/jszip-utils-ie.min.js\"></script>\r\n<![endif]-->\r\n<script type=\"text/javascript\" src=\"../../script-dir/jquery-3.4.1.js\"></script>\r\n<script type=\"text/javascript\" src=\"../../script-dir/jquery-ui.js\"></script>\r\n</head>\r\n<body class=\"class-declaration\">\r\n<script type=\"text/javascript\">var data = {\"i0\":9,\"i1\":10};\r\nvar tabs = {65535:[\"t0\",\"All Methods\"],1:[\"t1\",\"Static Methods\"],2:[\"t2\",\"Instance Methods\"],8:[\"t4\",\"Concrete Methods\"]};\r\nvar altColor = \"altColor\";\r\nvar rowColor = \"rowColor\";\r\nvar tableTab = \"tableTab\";\r\nvar activeTableTab = \"activeTableTab\";\r\nvar pathtoroot = \"../../\";\r\nloadScripts(document, 'script');</script>\r\n<noscript>\r\n<div>JavaScript is disabled on your browser.</div>\r\n</noscript>\r\n<header role=\"banner\">\r\n<nav role=\"navigation\">\r\n<div class=\"fixedNav\">\r\n<!-- ========= START OF TOP NAVBAR ======= -->\r\n<div class=\"topNav\"><a id=\"navbar.top\">\r\n<!--   -->\r\n</a>\r\n<div class=\"skipNav\"><a href=\"#skip.navbar.top\" title=\"Skip navigation links\">Skip navigation links</a></div>\r\n<a id=\"navbar.top.firstrow\">\r\n<!--   -->\r\n</a>\r\n<ul class=\"navList\" title=\"Navigation\">\r\n<li><a href=\"package-summary.html\">Package</a></li>\r\n<li class=\"navBarCell1Rev\">Class</li>\r\n<li><a href=\"class-use/App.html\">Use</a></li>\r\n<li><a href=\"package-tree.html\">Tree</a></li>\r\n<li><a href=\"../../deprecated-list.html\">Deprecated</a></li>\r\n<li><a href=\"../../index-all.html\">Index</a></li>\r\n<li><a href=\"../../help-doc.html\">Help</a></li>\r\n</ul>\r\n</div>\r\n<div class=\"subNav\">\r\n<div>\r\n<ul class=\"subNavList\">\r\n<li>Summary:&nbsp;</li>\r\n<li>Nested&nbsp;|&nbsp;</li>\r\n<li>Field&nbsp;|&nbsp;</li>\r\n<li><a href=\"#constructor.summary\">Constr</a>&nbsp;|&nbsp;</li>\r\n<li><a href=\"#method.summary\">Method</a></li>\r\n</ul>\r\n<ul class=\"subNavList\">\r\n<li>Detail:&nbsp;</li>\r\n<li>Field&nbsp;|&nbsp;</li>\r\n<li><a href=\"#constructor.detail\">Constr</a>&nbsp;|&nbsp;</li>\r\n<li><a href=\"#method.detail\">Method</a></li>\r\n</ul>\r\n</div>\r\n<div class=\"navListSearch\"><label for=\"search\">SEARCH:</label>\r\n<input type=\"text\" id=\"search\" value=\"search\" disabled=\"disabled\">\r\n<input type=\"reset\" id=\"reset\" value=\"reset\" disabled=\"disabled\">\r\n</div>\r\n</div>\r\n<a id=\"skip.navbar.top\">\r\n<!--   -->\r\n</a>\r\n<!-- ========= END OF TOP NAVBAR ========= -->\r\n</div>\r\n<div class=\"navPadding\">&nbsp;</div>\r\n<script type=\"text/javascript\"><!--\r\n$('.navPadding').css('padding-top', $('.fixedNav').css(\"height\"));\r\n//-->\r\n</script>\r\n</nav>\r\n</header>\r\n<!-- ======== START OF CLASS DATA ======== -->\r\n<main role=\"main\">\r\n<div class=\"header\">\r\n<div class=\"subTitle\"><span class=\"packageLabelInType\">Package</span>&nbsp;<a href=\"package-summary.html\">def.configuration</a></div>\r\n<h1 title=\"Class App\" class=\"title\">Class App</h1>\r\n</div>\r\n<div class=\"contentContainer\">\r\n<div class=\"inheritance\" title=\"Inheritance Tree\">java.lang.Object\r\n<div class=\"inheritance\">def.configuration.App</div>\r\n</div>\r\n<section class=\"description\">\r\n<hr>\r\n<pre>public class <span class=\"typeNameLabel\">App</span>\r\nextends java.lang.Object</pre>\r\n</section>\r\n<section class=\"summary\">\r\n<ul class=\"blockList\">\r\n<!-- ======== CONSTRUCTOR SUMMARY ======== -->\r\n<li class=\"blockList\">\r\n<section class=\"constructorSummary\"><a id=\"constructor.summary\">\r\n<!--   -->\r\n</a>\r\n<h2>Constructor Summary</h2>\r\n<div class=\"memberSummary\">\r\n<table>\r\n<caption><span>Constructors</span><span class=\"tabEnd\">&nbsp;</span></caption>\r\n<thead>\r\n<tr>\r\n<th class=\"colFirst\" scope=\"col\">Constructor</th>\r\n<th class=\"colLast\" scope=\"col\">Description</th>\r\n</tr>\r\n</thead>\r\n<tbody>\r\n<tr class=\"altColor\">\r\n<th class=\"colConstructorName\" scope=\"row\"><code><span class=\"memberNameLink\"><a href=\"#%3Cinit%3E()\">App</a></span>()</code></th>\r\n<td class=\"colLast\">&nbsp;</td>\r\n</tr>\r\n</tbody>\r\n</table>\r\n</div>\r\n</section>\r\n</li>\r\n<!-- ========== METHOD SUMMARY =========== -->\r\n<li class=\"blockList\">\r\n<section class=\"methodSummary\"><a id=\"method.summary\">\r\n<!--   -->\r\n</a>\r\n<h2>Method Summary</h2>\r\n<div class=\"memberSummary\">\r\n<div role=\"tablist\" aria-orientation=\"horizontal\"><button role=\"tab\" aria-selected=\"true\" aria-controls=\"memberSummary_tabpanel\" tabindex=\"0\" onkeydown=\"switchTab(event)\" id=\"t0\" class=\"activeTableTab\">All Methods</button><button role=\"tab\" aria-selected=\"false\" aria-controls=\"memberSummary_tabpanel\" tabindex=\"-1\" onkeydown=\"switchTab(event)\" id=\"t1\" class=\"tableTab\" onclick=\"show(1);\">Static Methods</button><button role=\"tab\" aria-selected=\"false\" aria-controls=\"memberSummary_tabpanel\" tabindex=\"-1\" onkeydown=\"switchTab(event)\" id=\"t2\" class=\"tableTab\" onclick=\"show(2);\">Instance Methods</button><button role=\"tab\" aria-selected=\"false\" aria-controls=\"memberSummary_tabpanel\" tabindex=\"-1\" onkeydown=\"switchTab(event)\" id=\"t4\" class=\"tableTab\" onclick=\"show(8);\">Concrete Methods</button></div>\r\n<div id=\"memberSummary_tabpanel\" role=\"tabpanel\">\r\n<table aria-labelledby=\"t0\">\r\n<thead>\r\n<tr>\r\n<th class=\"colFirst\" scope=\"col\">Modifier and Type</th>\r\n<th class=\"colSecond\" scope=\"col\">Method</th>\r\n<th class=\"colLast\" scope=\"col\">Description</th>\r\n</tr>\r\n</thead>\r\n<tbody>\r\n<tr class=\"altColor\" id=\"i0\">\r\n<td class=\"colFirst\"><code>static void</code></td>\r\n<th class=\"colSecond\" scope=\"row\"><code><span class=\"memberNameLink\"><a href=\"#main(java.lang.String%5B%5D)\">main</a></span>&#8203;(java.lang.String[]&nbsp;args)</code></th>\r\n<td class=\"colLast\">&nbsp;</td>\r\n</tr>\r\n<tr class=\"rowColor\" id=\"i1\">\r\n<td class=\"colFirst\"><code>protected void</code></td>\r\n<th class=\"colSecond\" scope=\"row\"><code><span class=\"memberNameLink\"><a href=\"#sampleMethod(java.lang.String)\">sampleMethod</a></span>&#8203;(java.lang.String&nbsp;str)</code></th>\r\n<td class=\"colLast\">&nbsp;</td>\r\n</tr>\r\n</tbody>\r\n</table>\r\n</div>\r\n</div>\r\n<div class=\"inheritedList\">\r\n<h3>Methods inherited from class&nbsp;java.lang.Object</h3>\r\n<a id=\"methods.inherited.from.class.java.lang.Object\">\r\n<!--   -->\r\n</a><code>clone, equals, finalize, getClass, hashCode, notify, notifyAll, toString, wait, wait, wait</code></div>\r\n</section>\r\n</li>\r\n</ul>\r\n</section>\r\n<section class=\"details\">\r\n<ul class=\"blockList\">\r\n<!-- ========= CONSTRUCTOR DETAIL ======== -->\r\n<li class=\"blockList\">\r\n<section class=\"constructorDetails\"><a id=\"constructor.detail\">\r\n<!--   -->\r\n</a>\r\n<h2>Constructor Details</h2>\r\n<ul class=\"blockList\">\r\n<li class=\"blockList\">\r\n<section class=\"detail\">\r\n<h3><a id=\"&lt;init&gt;()\">App</a></h3>\r\n<div class=\"memberSignature\"><span class=\"modifiers\">public</span>&nbsp;<span class=\"memberName\">App</span>()</div>\r\n</section>\r\n</li>\r\n</ul>\r\n</section>\r\n</li>\r\n<!-- ============ METHOD DETAIL ========== -->\r\n<li class=\"blockList\">\r\n<section class=\"methodDetails\"><a id=\"method.detail\">\r\n<!--   -->\r\n</a>\r\n<h2>Method Details</h2>\r\n<ul class=\"blockList\">\r\n<li class=\"blockList\">\r\n<section class=\"detail\">\r\n<h3><a id=\"main(java.lang.String[])\">main</a></h3>\r\n<div class=\"memberSignature\"><span class=\"modifiers\">public static</span>&nbsp;<span class=\"returnType\">void</span>&nbsp;<span class=\"memberName\">main</span>&#8203;(<span class=\"arguments\">java.lang.String[]&nbsp;args)</span></div>\r\n</section>\r\n</li>\r\n<li class=\"blockList\">\r\n<section class=\"detail\">\r\n<h3><a id=\"sampleMethod(java.lang.String)\">sampleMethod</a></h3>\r\n<div class=\"memberSignature\"><span class=\"modifiers\">protected</span>&nbsp;<span class=\"returnType\">void</span>&nbsp;<span class=\"memberName\">sampleMethod</span>&#8203;(<span class=\"arguments\">java.lang.String&nbsp;str)</span></div>\r\n</section>\r\n</li>\r\n</ul>\r\n</section>\r\n</li>\r\n</ul>\r\n</section>\r\n</div>\r\n</main>\r\n<!-- ========= END OF CLASS DATA ========= -->\r\n<footer role=\"contentinfo\">\r\n<nav role=\"navigation\">\r\n<!-- ======= START OF BOTTOM NAVBAR ====== -->\r\n<div class=\"bottomNav\"><a id=\"navbar.bottom\">\r\n<!--   -->\r\n</a>\r\n<div class=\"skipNav\"><a href=\"#skip.navbar.bottom\" title=\"Skip navigation links\">Skip navigation links</a></div>\r\n<a id=\"navbar.bottom.firstrow\">\r\n<!--   -->\r\n</a>\r\n<ul class=\"navList\" title=\"Navigation\">\r\n<li><a href=\"package-summary.html\">Package</a></li>\r\n<li class=\"navBarCell1Rev\">Class</li>\r\n<li><a href=\"class-use/App.html\">Use</a></li>\r\n<li><a href=\"package-tree.html\">Tree</a></li>\r\n<li><a href=\"../../deprecated-list.html\">Deprecated</a></li>\r\n<li><a href=\"../../index-all.html\">Index</a></li>\r\n<li><a href=\"../../help-doc.html\">Help</a></li>\r\n</ul>\r\n</div>\r\n<div class=\"subNav\">\r\n<div>\r\n<ul class=\"subNavList\">\r\n<li>Summary:&nbsp;</li>\r\n<li>Nested&nbsp;|&nbsp;</li>\r\n<li>Field&nbsp;|&nbsp;</li>\r\n<li><a href=\"#constructor.summary\">Constr</a>&nbsp;|&nbsp;</li>\r\n<li><a href=\"#method.summary\">Method</a></li>\r\n</ul>\r\n<ul class=\"subNavList\">\r\n<li>Detail:&nbsp;</li>\r\n<li>Field&nbsp;|&nbsp;</li>\r\n<li><a href=\"#constructor.detail\">Constr</a>&nbsp;|&nbsp;</li>\r\n<li><a href=\"#method.detail\">Method</a></li>\r\n</ul>\r\n</div>\r\n</div>\r\n<a id=\"skip.navbar.bottom\">\r\n<!--   -->\r\n</a>\r\n<!-- ======== END OF BOTTOM NAVBAR ======= -->\r\n</nav>\r\n</footer>\r\n</body>\r\n</html>\r\n"
        at org.apache.maven.plugins.javadoc.JavadocReportTest.testDefaultConfiguration(JavadocReportTest.java:263)




Build log:
[...truncated 8810 lines...]
[INFO]           MJAVADOC-591_release8\pom.xml .................... SUCCESS (16.9 s)
[INFO] Building: MJAVADOC-599\pom.xml
[INFO] run post-build script verify.groovy
[INFO]           MJAVADOC-580_detectLinks\pom.xml ................. SUCCESS (6.7 s)
[INFO] Building: MJAVADOC-591_release8\pom.xml
[INFO] run post-build script verify.groovy
[INFO]           MJAVADOC-599\pom.xml ............................. SUCCESS (9.0 s)
[INFO] Building: site-failOnError\pom.xml
[INFO] run post-build script verify.groovy
[INFO]           MJAVADOC-506_excl-module-info\pom.xml ............ SUCCESS (9.3 s)
[INFO] Building: MJAVADOC-508\pom.xml
[INFO] artifact org.apache.maven.plugins:maven-resources-plugin: checking for updates from central
[INFO] artifact org.apache.maven.plugins:maven-install-plugin: checking for updates from central
[INFO] artifact org.apache.maven.plugins:maven-deploy-plugin: checking for updates from central
[INFO]           MJAVADOC-508\pom.xml ............................. SUCCESS (6.7 s)
[INFO] Building: MJAVADOC-514_3rdparty-doclettags\pom.xml
[INFO]           MJAVADOC-514_3rdparty-doclettags\pom.xml ......... SKIPPED due to JRE version
[INFO] Building: MJAVADOC-526_aggr-managedDeps\pom.xml
[INFO]           site-failOnError\pom.xml ......................... SUCCESS (8.4 s)
[INFO]
[INFO] --- mrm-maven-plugin:1.1.0:stop (repository) @ maven-javadoc-plugin ---
[INFO] Stopping Mock Repository Manager on http://localhost:59046
[INFO] Stopped SocketConnector@0.0.0.0:59046
[INFO] Mock Repository Manager http://localhost:59046 is stopped.
[INFO]
[INFO] --- mrm-maven-plugin:1.1.0:stop (3rdparty) @ maven-javadoc-plugin ---
[INFO] Stopping Mock Repository Manager on http://localhost:59047
[INFO] Stopped SocketConnector@0.0.0.0:59047
[INFO] Mock Repository Manager http://localhost:59047 is stopped.
[INFO]
[INFO] --- maven-checkstyle-plugin:3.0.0:check (checkstyle-check) @ maven-javadoc-plugin ---
[INFO] There are 4 errors reported by Checkstyle 6.18 with config/maven_checks.xml ruleset.
[INFO] Ignored 4 errors, 0 violation remaining.
[INFO]
[INFO] --- maven-invoker-plugin:3.1.0:verify (integration-test) @ maven-javadoc-plugin ---
[INFO] -------------------------------------------------
[INFO] Build Summary:
[INFO]   Passed: 63, Failed: 0, Errors: 0, Skipped: 2
[INFO] -------------------------------------------------
[INFO] ------------------------------------------------------------------------
[INFO] BUILD SUCCESS
[INFO] ------------------------------------------------------------------------
[INFO] Total time:  18:30 min
[INFO] Finished at: 2019-10-01T04:26:20-07:00
[INFO] ------------------------------------------------------------------------
[INFO] [jenkins-event-spy] Generated F:\jenkins\jenkins-slave\workspace\aven-javadoc-plugin_MJAVADOC-607@2@tmp\withMavena544bbb6\maven-spy-20191001-040750-462210428389264008523.log
[Pipeline] }
[Pipeline] // dir
[Pipeline] }
[withMaven] artifactsPublisher - Archive artifact windows-jdk11-m3.6.x_build\pom.xml under org\apache\maven\plugins\maven-javadoc-plugin\3.1.2-SNAPSHOT\maven-javadoc-plugin-3.1.2-SNAPSHOT.pom
[withMaven] artifactsPublisher - Archive artifact windows-jdk11-m3.6.x_build\target\maven-javadoc-plugin-3.1.2-SNAPSHOT.jar under org\apache\maven\plugins\maven-javadoc-plugin\3.1.2-SNAPSHOT\maven-javadoc-plugin-3.1.2-SNAPSHOT.jar
[Fast Archiver] Compressed 489.51 KB of artifacts by 52.3% relative to #3
[withMaven] junitPublisher - Archive test results for Maven artifact org.apache.maven.plugins:maven-javadoc-plugin:maven-plugin:3.1.2-SNAPSHOT generated by maven-surefire-plugin:test (default-test): windows-jdk11-m3.6.x_build\target\surefire-reports\*.xml
Recording test results
[withMaven] openTasksPublisher - Scan Tasks for Maven artifact org.apache.maven.plugins:maven-javadoc-plugin:maven-plugin:3.1.2-SNAPSHOT in source directory windows-jdk11-m3.6.x_build\src\main\java
[TASKS] Scanning folder 'f:\jenkins\jenkins-slave\workspace\aven-javadoc-plugin_MJAVADOC-607@2' for files matching the pattern 'windows-jdk11-m3.6.x_build\src\main\java\**\*' - excludes: null
[TASKS] Found 26 files to scan for tasks
[TASKS] Found 7 open tasks.
Skipping warnings blame since pipelines do not have an SCM link.%n
[TASKS] Computing warning deltas based on reference build #3
[withMaven] invokerPublisher - Archive invoker results for Maven artifact MavenArtifact{org.apache.maven.plugins:maven-javadoc-plugin:maven-plugin:3.1.2-SNAPSHOT(version: 3.1.2-SNAPSHOT, snapshot:false) } generated by PluginInvocation{org.apache.maven.plugins:maven-invoker-plugin:3.1.0@integration-test  integration-test}: windows-jdk11-m3.6.x_build\target\invoker-reports\*.xml
[INFO]           MJAVADOC-591_release8\pom.xml .................... SUCCESS (17.8 s)
[INFO] Building: MJAVADOC-599\pom.xml
[INFO]           MJAVADOC-526_aggr-managedDeps\pom.xml ............ SUCCESS (10.9 s)
[INFO] Building: MJAVADOC-528\pom.xml
[INFO] run post-build script verify.groovy
[INFO]           MJAVADOC-599\pom.xml ............................. SUCCESS (10.3 s)
[INFO] Building: site-failOnError\pom.xml
[INFO] run post-build script verify.groovy
[INFO]           MJAVADOC-528\pom.xml ............................. SUCCESS (8.9 s)
[INFO] Building: MJAVADOC-538\pom.xml
[INFO]           site-failOnError\pom.xml ......................... SUCCESS (8.4 s)
[INFO]
[INFO] --- mrm-maven-plugin:1.1.0:stop (repository) @ maven-javadoc-plugin ---
[INFO] Stopping Mock Repository Manager on http://localhost:62224
[INFO] Stopped SocketConnector@0.0.0.0:62224
[INFO] Mock Repository Manager http://localhost:62224 is stopped.
[INFO]
[INFO] --- mrm-maven-plugin:1.1.0:stop (3rdparty) @ maven-javadoc-plugin ---
[INFO] Stopping Mock Repository Manager on http://localhost:62225
[INFO] Stopped SocketConnector@0.0.0.0:62225
[INFO] Mock Repository Manager http://localhost:62225 is stopped.
[INFO]
[INFO] --- maven-checkstyle-plugin:3.0.0:check (checkstyle-check) @ maven-javadoc-plugin ---
[INFO]           MJAVADOC-538\pom.xml ............................. SUCCESS (6.4 s)
[INFO] Building: MJAVADOC-551 spaces\pom.xml
[INFO] There are 4 errors reported by Checkstyle 6.18 with config/maven_checks.xml ruleset.
[INFO] Ignored 4 errors, 0 violation remaining.
[INFO]
[INFO] --- maven-invoker-plugin:3.1.0:verify (integration-test) @ maven-javadoc-plugin ---
[INFO] -------------------------------------------------
[INFO] Build Summary:
[INFO]   Passed: 60, Failed: 0, Errors: 0, Skipped: 5
[INFO] -------------------------------------------------
[INFO] ------------------------------------------------------------------------
[INFO] BUILD SUCCESS
[INFO] ------------------------------------------------------------------------
[INFO] Total time:  17:30 min
[INFO] Finished at: 2019-10-01T04:26:43-07:00
[INFO] ------------------------------------------------------------------------
[INFO] [jenkins-event-spy] Generated F:\jenkins\jenkins-slave\workspace\aven-javadoc-plugin_MJAVADOC-607@2@tmp\withMavenb16face5\maven-spy-20191001-040912-2888505390879936932637.log
[Pipeline] }
[Pipeline] // dir
[Pipeline] }
[withMaven] artifactsPublisher - Archive artifact windows-jdk13-m3.6.x_build\pom.xml under org\apache\maven\plugins\maven-javadoc-plugin\3.1.2-SNAPSHOT\maven-javadoc-plugin-3.1.2-SNAPSHOT.pom
[withMaven] artifactsPublisher - Archive artifact windows-jdk13-m3.6.x_build\target\maven-javadoc-plugin-3.1.2-SNAPSHOT.jar under org\apache\maven\plugins\maven-javadoc-plugin\3.1.2-SNAPSHOT\maven-javadoc-plugin-3.1.2-SNAPSHOT.jar
[Fast Archiver] Compressed 491.66 KB of artifacts by 45.6% relative to #3
[withMaven] junitPublisher - Archive test results for Maven artifact org.apache.maven.plugins:maven-javadoc-plugin:maven-plugin:3.1.2-SNAPSHOT generated by maven-surefire-plugin:test (default-test): windows-jdk13-m3.6.x_build\target\surefire-reports\*.xml
Recording test results
[withMaven] openTasksPublisher - Scan Tasks for Maven artifact org.apache.maven.plugins:maven-javadoc-plugin:maven-plugin:3.1.2-SNAPSHOT in source directory windows-jdk13-m3.6.x_build\src\main\java
[TASKS] Scanning folder 'f:\jenkins\jenkins-slave\workspace\aven-javadoc-plugin_MJAVADOC-607@2' for files matching the pattern 'windows-jdk13-m3.6.x_build\src\main\java\**\*' - excludes: null
[TASKS] Found 26 files to scan for tasks
[TASKS] Found 7 open tasks.
Skipping warnings blame since pipelines do not have an SCM link.%n
[TASKS] Computing warning deltas based on reference build #3
[withMaven] invokerPublisher - Archive invoker results for Maven artifact MavenArtifact{org.apache.maven.plugins:maven-javadoc-plugin:maven-plugin:3.1.2-SNAPSHOT(version: 3.1.2-SNAPSHOT, snapshot:false) } generated by PluginInvocation{org.apache.maven.plugins:maven-invoker-plugin:3.1.0@integration-test  integration-test}: windows-jdk13-m3.6.x_build\target\invoker-reports\*.xml
[INFO]           MJAVADOC-551 spaces\pom.xml ...................... SUCCESS (5.3 s)
[INFO] Building: MJAVADOC-552_fix-author\pom.xml
[INFO] run post-build script verify.groovy
[INFO]           MJAVADOC-552_fix-author\pom.xml .................. SUCCESS (7.9 s)
[INFO] Building: MJAVADOC-555_aggr_mixed\pom.xml
[INFO] run post-build script verify.groovy
[INFO]           MJAVADOC-555_aggr_mixed\pom.xml .................. SUCCESS (11.6 s)
[INFO] Building: MJAVADOC-555_link-automatic-modules\pom.xml
[INFO] run post-build script verify.groovy
[INFO]           MJAVADOC-555_link-automatic-modules\pom.xml ...... SUCCESS (12.7 s)
[INFO] Building: MJAVADOC-556_hide-non-exported-packages\pom.xml
[withMaven] Publishers: Generated Artifacts Publisher: 153 ms, Junit Publisher: 287 ms, Open Task Scanner Publisher: 195 ms, Dependencies Fingerprint Publisher: 1 ms, Invoker Publisher: 60615 ms, Pipeline Graph Publisher: 2 ms
[Pipeline] // withMaven
[Pipeline] cleanWs
[WS-CLEANUP] Deleting project workspace...
[WS-CLEANUP] Deferred wipeout is used...
[WS-CLEANUP] done
[Pipeline] }
[Pipeline] // stage
[Pipeline] }
[Pipeline] // ws
[Pipeline] }
[Pipeline] // node
[Pipeline] }
[INFO]           MJAVADOC-556_hide-non-exported-packages\pom.xml .. SUCCESS (8.3 s)
[INFO] Building: MJAVADOC-558_fix-unknownthrows\pom.xml
[INFO] run post-build script verify.groovy
[INFO]           MJAVADOC-558_fix-unknownthrows\pom.xml ........... SUCCESS (8.7 s)
[INFO] Building: MJAVADOC-562_release\pom.xml
[INFO]           MJAVADOC-562_release\pom.xml ..................... SUCCESS (10.9 s)
[INFO] Building: MJAVADOC-567_aggr-mixed\pom.xml
[withMaven] Publishers: Generated Artifacts Publisher: 152 ms, Junit Publisher: 312 ms, Open Task Scanner Publisher: 238 ms, Dependencies Fingerprint Publisher: 1 ms, Invoker Publisher: 66248 ms, Pipeline Graph Publisher: 1 ms
[Pipeline] // withMaven
[Pipeline] cleanWs
[WS-CLEANUP] Deleting project workspace...
[WS-CLEANUP] Deferred wipeout is used...
[WS-CLEANUP] done
[Pipeline] }
[Pipeline] // stage
[Pipeline] }
[Pipeline] // ws
[Pipeline] }
[Pipeline] // node
[Pipeline] }
[INFO] run post-build script verify.groovy
[INFO]           MJAVADOC-567_aggr-mixed\pom.xml .................. SUCCESS (7.3 s)
[INFO] Building: MJAVADOC-568_export-to-testcase\pom.xml
[INFO]           MJAVADOC-568_export-to-testcase\pom.xml .......... SUCCESS (22.5 s)
[INFO] Building: MJAVADOC-568_jar-mixed\pom.xml
[INFO]           MJAVADOC-568_jar-mixed\pom.xml ................... SUCCESS (15.1 s)
[INFO] Building: MJAVADOC-568_manifest-splitpackage\pom.xml
[INFO]           MJAVADOC-568_manifest-splitpackage\pom.xml ....... SUCCESS (19.5 s)
[INFO] Building: MJAVADOC-569_aggr-mixed\pom.xml
[INFO]           MJAVADOC-569_aggr-mixed\pom.xml .................. SUCCESS (18.1 s)
[INFO] Building: MJAVADOC-575_source8-module-info\pom.xml
[INFO] run post-build script verify.groovy
[INFO]           MJAVADOC-575_source8-module-info\pom.xml ......... SUCCESS (8.3 s)
[INFO] Building: MJAVADOC-580_detectLinks\pom.xml
[INFO] run post-build script verify.groovy
[INFO]           MJAVADOC-580_detectLinks\pom.xml ................. SUCCESS (8.6 s)
[INFO] Building: MJAVADOC-591_release8\pom.xml
[INFO]           MJAVADOC-591_release8\pom.xml .................... SUCCESS (21.1 s)
[INFO] Building: MJAVADOC-599\pom.xml
[INFO] run post-build script verify.groovy
[INFO]           MJAVADOC-599\pom.xml ............................. SUCCESS (10.9 s)
[INFO] Building: site-failOnError\pom.xml
[INFO]           site-failOnError\pom.xml ......................... SUCCESS (8.9 s)
[INFO]
[INFO] --- mrm-maven-plugin:1.1.0:stop (repository) @ maven-javadoc-plugin ---
[INFO] Stopping Mock Repository Manager on http://localhost:62508
[INFO] Stopped SocketConnector@0.0.0.0:62508
[INFO] Mock Repository Manager http://localhost:62508 is stopped.
[INFO]
[INFO] --- mrm-maven-plugin:1.1.0:stop (3rdparty) @ maven-javadoc-plugin ---
[INFO] Stopping Mock Repository Manager on http://localhost:62509
[INFO] Stopped SocketConnector@0.0.0.0:62509
[INFO] Mock Repository Manager http://localhost:62509 is stopped.
[INFO]
[INFO] --- maven-checkstyle-plugin:3.0.0:check (checkstyle-check) @ maven-javadoc-plugin ---
[INFO] There are 4 errors reported by Checkstyle 6.18 with config/maven_checks.xml ruleset.
[INFO] Ignored 4 errors, 0 violation remaining.
[INFO]
[INFO] --- maven-invoker-plugin:3.1.0:verify (integration-test) @ maven-javadoc-plugin ---
[INFO] -------------------------------------------------
[INFO] Build Summary:
[INFO]   Passed: 60, Failed: 0, Errors: 0, Skipped: 5
[INFO] -------------------------------------------------
[INFO] ------------------------------------------------------------------------
[INFO] BUILD SUCCESS
[INFO] ------------------------------------------------------------------------
[INFO] Total time:  17:16 min
[INFO] Finished at: 2019-10-01T04:30:12-07:00
[INFO] ------------------------------------------------------------------------
[INFO] [jenkins-event-spy] Generated F:\jenkins\jenkins-slave\workspace\aven-javadoc-plugin_MJAVADOC-607@3@2@tmp\withMaven9d26ff62\maven-spy-20191001-041254-79116455176771318263344.log
[Pipeline] }
[Pipeline] // dir
[Pipeline] }
[withMaven] artifactsPublisher - Archive artifact windows-jdk14-m3.6.x_build\pom.xml under org\apache\maven\plugins\maven-javadoc-plugin\3.1.2-SNAPSHOT\maven-javadoc-plugin-3.1.2-SNAPSHOT.pom
[withMaven] artifactsPublisher - Archive artifact windows-jdk14-m3.6.x_build\target\maven-javadoc-plugin-3.1.2-SNAPSHOT.jar under org\apache\maven\plugins\maven-javadoc-plugin\3.1.2-SNAPSHOT\maven-javadoc-plugin-3.1.2-SNAPSHOT.jar
[Fast Archiver] Compressed 491.66 KB of artifacts by 45.6% relative to #3
[withMaven] junitPublisher - Archive test results for Maven artifact org.apache.maven.plugins:maven-javadoc-plugin:maven-plugin:3.1.2-SNAPSHOT generated by maven-surefire-plugin:test (default-test): windows-jdk14-m3.6.x_build\target\surefire-reports\*.xml
Recording test results
[withMaven] openTasksPublisher - Scan Tasks for Maven artifact org.apache.maven.plugins:maven-javadoc-plugin:maven-plugin:3.1.2-SNAPSHOT in source directory windows-jdk14-m3.6.x_build\src\main\java
[TASKS] Scanning folder 'f:\jenkins\jenkins-slave\workspace\aven-javadoc-plugin_MJAVADOC-607@3@2' for files matching the pattern 'windows-jdk14-m3.6.x_build\src\main\java\**\*' - excludes: null
[TASKS] Found 26 files to scan for tasks
[TASKS] Found 7 open tasks.
Skipping warnings blame since pipelines do not have an SCM link.%n
[TASKS] Computing warning deltas based on reference build #3
[withMaven] invokerPublisher - Archive invoker results for Maven artifact MavenArtifact{org.apache.maven.plugins:maven-javadoc-plugin:maven-plugin:3.1.2-SNAPSHOT(version: 3.1.2-SNAPSHOT, snapshot:false) } generated by PluginInvocation{org.apache.maven.plugins:maven-invoker-plugin:3.1.0@integration-test  integration-test}: windows-jdk14-m3.6.x_build\target\invoker-reports\*.xml
[withMaven] Publishers: Generated Artifacts Publisher: 154 ms, Junit Publisher: 303 ms, Open Task Scanner Publisher: 209 ms, Dependencies Fingerprint Publisher: 1 ms, Invoker Publisher: 66204 ms, Pipeline Graph Publisher: 3 ms
[Pipeline] // withMaven
[Pipeline] cleanWs
[WS-CLEANUP] Deleting project workspace...
[WS-CLEANUP] Deferred wipeout is used...
[WS-CLEANUP] done
[Pipeline] }
[Pipeline] // stage
[Pipeline] }
[Pipeline] // ws
[Pipeline] }
[Pipeline] // node
[Pipeline] }
[Pipeline] // parallel
[Pipeline] stage
[Pipeline] { (Notifications)
[Pipeline] echo
Build result: FAILURE
[Pipeline] jiraIssueSelector
[Pipeline] echo
The authors of changes [rfscholte].
[Pipeline] echo
Sending email ...
[Pipeline] emailext
Reply | Threaded
Open this post in threaded view
|

Build failed in Jenkins: Maven TLP » maven-javadoc-plugin » MJAVADOC-607 #6

Apache Jenkins Server-2
See https://builds.apache.org/job/maven-box/job/maven-javadoc-plugin/job/MJAVADOC-607/6/

No changes.

4 tests failed.
FAILED:  org.apache.maven.plugins.javadoc.JavadocReportTest.linux-jdk13-m3.6.x_build / Build linux-jdk13-m3.6.x_build / testDefaultConfiguration

Error Message:
https://docs.oracle.com/en/java/javase/13/docs/api/ available, but def/configuration/App.html is missing link to java.lang.Object
Expected: (a string containing "/docs/api/java/lang/Object.html" or a string containing "/docs/api/java.base/java/lang/Object.html")
     but: was "<!DOCTYPE HTML>\n<!-- NewPage -->\n<html lang=\"en\">\n<head>\n<!-- Generated by javadoc (13) on Fri Oct 04 11:21:59 UTC 2019 -->\n<title>App (Maven Javadoc Plugin Default configuration Test 1.0-SNAPSHOT API)</title>\n<meta http-equiv=\"Content-Type\" content=\"text/html; charset=UTF-8\">\n<meta name=\"dc.created\" content=\"2019-10-04\">\n<meta name=\"description\" content=\"declaration: package: def.configuration, class: App\">\n<meta name=\"generator\" content=\"javadoc/ClassWriterImpl\">\n<link rel=\"stylesheet\" type=\"text/css\" href=\"../../stylesheet.css\" title=\"Style\">\n<link rel=\"stylesheet\" type=\"text/css\" href=\"../../script-dir/jquery-ui.css\" title=\"Style\">\n<script type=\"text/javascript\" src=\"../../script.js\"></script>\n<script type=\"text/javascript\" src=\"../../script-dir/jszip/dist/jszip.min.js\"></script>\n<script type=\"text/javascript\" src=\"../../script-dir/jszip-utils/dist/jszip-utils.min.js\"></script>\n<!--[if IE]>\n<script type=\"text/javascript\" src=\"../../script-dir/jszip-utils/dist/jszip-utils-ie.min.js\"></script>\n<![endif]-->\n<script type=\"text/javascript\" src=\"../../script-dir/jquery-3.4.1.js\"></script>\n<script type=\"text/javascript\" src=\"../../script-dir/jquery-ui.js\"></script>\n</head>\n<body class=\"class-declaration\">\n<script type=\"text/javascript\">var data = {\"i0\":9,\"i1\":10};\nvar tabs = {65535:[\"t0\",\"All Methods\"],1:[\"t1\",\"Static Methods\"],2:[\"t2\",\"Instance Methods\"],8:[\"t4\",\"Concrete Methods\"]};\nvar altColor = \"altColor\";\nvar rowColor = \"rowColor\";\nvar tableTab = \"tableTab\";\nvar activeTableTab = \"activeTableTab\";\nvar pathtoroot = \"../../\";\nloadScripts(document, 'script');</script>\n<noscript>\n<div>JavaScript is disabled on your browser.</div>\n</noscript>\n<header role=\"banner\">\n<nav role=\"navigation\">\n<div class=\"fixedNav\">\n<!-- ========= START OF TOP NAVBAR ======= -->\n<div class=\"topNav\"><a id=\"navbar.top\">\n<!--   -->\n</a>\n<div class=\"skipNav\"><a href=\"#skip.navbar.top\" title=\"Skip navigation links\">Skip navigation links</a></div>\n<a id=\"navbar.top.firstrow\">\n<!--   -->\n</a>\n<ul class=\"navList\" title=\"Navigation\">\n<li><a href=\"package-summary.html\">Package</a></li>\n<li class=\"navBarCell1Rev\">Class</li>\n<li><a href=\"class-use/App.html\">Use</a></li>\n<li><a href=\"package-tree.html\">Tree</a></li>\n<li><a href=\"../../deprecated-list.html\">Deprecated</a></li>\n<li><a href=\"../../index-all.html\">Index</a></li>\n<li><a href=\"../../help-doc.html\">Help</a></li>\n</ul>\n</div>\n<div class=\"subNav\">\n<div>\n<ul class=\"subNavList\">\n<li>Summary:&nbsp;</li>\n<li>Nested&nbsp;|&nbsp;</li>\n<li>Field&nbsp;|&nbsp;</li>\n<li><a href=\"#constructor.summary\">Constr</a>&nbsp;|&nbsp;</li>\n<li><a href=\"#method.summary\">Method</a></li>\n</ul>\n<ul class=\"subNavList\">\n<li>Detail:&nbsp;</li>\n<li>Field&nbsp;|&nbsp;</li>\n<li><a href=\"#constructor.detail\">Constr</a>&nbsp;|&nbsp;</li>\n<li><a href=\"#method.detail\">Method</a></li>\n</ul>\n</div>\n<div class=\"navListSearch\"><label for=\"search\">SEARCH:</label>\n<input type=\"text\" id=\"search\" value=\"search\" disabled=\"disabled\">\n<input type=\"reset\" id=\"reset\" value=\"reset\" disabled=\"disabled\">\n</div>\n</div>\n<a id=\"skip.navbar.top\">\n<!--   -->\n</a>\n<!-- ========= END OF TOP NAVBAR ========= -->\n</div>\n<div class=\"navPadding\">&nbsp;</div>\n<script type=\"text/javascript\"><!--\n$('.navPadding').css('padding-top', $('.fixedNav').css(\"height\"));\n//-->\n</script>\n</nav>\n</header>\n<!-- ======== START OF CLASS DATA ======== -->\n<main role=\"main\">\n<div class=\"header\">\n<div class=\"subTitle\"><span class=\"packageLabelInType\">Package</span>&nbsp;<a href=\"package-summary.html\">def.configuration</a></div>\n<h1 title=\"Class App\" class=\"title\">Class App</h1>\n</div>\n<div class=\"contentContainer\">\n<div class=\"inheritance\" title=\"Inheritance Tree\">java.lang.Object\n<div class=\"inheritance\">def.configuration.App</div>\n</div>\n<section class=\"description\">\n<hr>\n<pre>public class <span class=\"typeNameLabel\">App</span>\nextends java.lang.Object</pre>\n</section>\n<section class=\"summary\">\n<ul class=\"blockList\">\n<!-- ======== CONSTRUCTOR SUMMARY ======== -->\n<li class=\"blockList\">\n<section class=\"constructorSummary\"><a id=\"constructor.summary\">\n<!--   -->\n</a>\n<h2>Constructor Summary</h2>\n<div class=\"memberSummary\">\n<table>\n<caption><span>Constructors</span><span class=\"tabEnd\">&nbsp;</span></caption>\n<thead>\n<tr>\n<th class=\"colFirst\" scope=\"col\">Constructor</th>\n<th class=\"colLast\" scope=\"col\">Description</th>\n</tr>\n</thead>\n<tbody>\n<tr class=\"altColor\">\n<th class=\"colConstructorName\" scope=\"row\"><code><span class=\"memberNameLink\"><a href=\"#%3Cinit%3E()\">App</a></span>()</code></th>\n<td class=\"colLast\">&nbsp;</td>\n</tr>\n</tbody>\n</table>\n</div>\n</section>\n</li>\n<!-- ========== METHOD SUMMARY =========== -->\n<li class=\"blockList\">\n<section class=\"methodSummary\"><a id=\"method.summary\">\n<!--   -->\n</a>\n<h2>Method Summary</h2>\n<div class=\"memberSummary\">\n<div role=\"tablist\" aria-orientation=\"horizontal\"><button role=\"tab\" aria-selected=\"true\" aria-controls=\"memberSummary_tabpanel\" tabindex=\"0\" onkeydown=\"switchTab(event)\" id=\"t0\" class=\"activeTableTab\">All Methods</button><button role=\"tab\" aria-selected=\"false\" aria-controls=\"memberSummary_tabpanel\" tabindex=\"-1\" onkeydown=\"switchTab(event)\" id=\"t1\" class=\"tableTab\" onclick=\"show(1);\">Static Methods</button><button role=\"tab\" aria-selected=\"false\" aria-controls=\"memberSummary_tabpanel\" tabindex=\"-1\" onkeydown=\"switchTab(event)\" id=\"t2\" class=\"tableTab\" onclick=\"show(2);\">Instance Methods</button><button role=\"tab\" aria-selected=\"false\" aria-controls=\"memberSummary_tabpanel\" tabindex=\"-1\" onkeydown=\"switchTab(event)\" id=\"t4\" class=\"tableTab\" onclick=\"show(8);\">Concrete Methods</button></div>\n<div id=\"memberSummary_tabpanel\" role=\"tabpanel\">\n<table aria-labelledby=\"t0\">\n<thead>\n<tr>\n<th class=\"colFirst\" scope=\"col\">Modifier and Type</th>\n<th class=\"colSecond\" scope=\"col\">Method</th>\n<th class=\"colLast\" scope=\"col\">Description</th>\n</tr>\n</thead>\n<tbody>\n<tr class=\"altColor\" id=\"i0\">\n<td class=\"colFirst\"><code>static void</code></td>\n<th class=\"colSecond\" scope=\"row\"><code><span class=\"memberNameLink\"><a href=\"#main(java.lang.String%5B%5D)\">main</a></span>&#8203;(java.lang.String[]&nbsp;args)</code></th>\n<td class=\"colLast\">&nbsp;</td>\n</tr>\n<tr class=\"rowColor\" id=\"i1\">\n<td class=\"colFirst\"><code>protected void</code></td>\n<th class=\"colSecond\" scope=\"row\"><code><span class=\"memberNameLink\"><a href=\"#sampleMethod(java.lang.String)\">sampleMethod</a></span>&#8203;(java.lang.String&nbsp;str)</code></th>\n<td class=\"colLast\">&nbsp;</td>\n</tr>\n</tbody>\n</table>\n</div>\n</div>\n<div class=\"inheritedList\">\n<h3>Methods inherited from class&nbsp;java.lang.Object</h3>\n<a id=\"methods.inherited.from.class.java.lang.Object\">\n<!--   -->\n</a><code>clone, equals, finalize, getClass, hashCode, notify, notifyAll, toString, wait, wait, wait</code></div>\n</section>\n</li>\n</ul>\n</section>\n<section class=\"details\">\n<ul class=\"blockList\">\n<!-- ========= CONSTRUCTOR DETAIL ======== -->\n<li class=\"blockList\">\n<section class=\"constructorDetails\"><a id=\"constructor.detail\">\n<!--   -->\n</a>\n<h2>Constructor Details</h2>\n<ul class=\"blockList\">\n<li class=\"blockList\">\n<section class=\"detail\">\n<h3><a id=\"&lt;init&gt;()\">App</a></h3>\n<div class=\"memberSignature\"><span class=\"modifiers\">public</span>&nbsp;<span class=\"memberName\">App</span>()</div>\n</section>\n</li>\n</ul>\n</section>\n</li>\n<!-- ============ METHOD DETAIL ========== -->\n<li class=\"blockList\">\n<section class=\"methodDetails\"><a id=\"method.detail\">\n<!--   -->\n</a>\n<h2>Method Details</h2>\n<ul class=\"blockList\">\n<li class=\"blockList\">\n<section class=\"detail\">\n<h3><a id=\"main(java.lang.String[])\">main</a></h3>\n<div class=\"memberSignature\"><span class=\"modifiers\">public static</span>&nbsp;<span class=\"returnType\">void</span>&nbsp;<span class=\"memberName\">main</span>&#8203;(<span class=\"arguments\">java.lang.String[]&nbsp;args)</span></div>\n</section>\n</li>\n<li class=\"blockList\">\n<section class=\"detail\">\n<h3><a id=\"sampleMethod(java.lang.String)\">sampleMethod</a></h3>\n<div class=\"memberSignature\"><span class=\"modifiers\">protected</span>&nbsp;<span class=\"returnType\">void</span>&nbsp;<span class=\"memberName\">sampleMethod</span>&#8203;(<span class=\"arguments\">java.lang.String&nbsp;str)</span></div>\n</section>\n</li>\n</ul>\n</section>\n</li>\n</ul>\n</section>\n</div>\n</main>\n<!-- ========= END OF CLASS DATA ========= -->\n<footer role=\"contentinfo\">\n<nav role=\"navigation\">\n<!-- ======= START OF BOTTOM NAVBAR ====== -->\n<div class=\"bottomNav\"><a id=\"navbar.bottom\">\n<!--   -->\n</a>\n<div class=\"skipNav\"><a href=\"#skip.navbar.bottom\" title=\"Skip navigation links\">Skip navigation links</a></div>\n<a id=\"navbar.bottom.firstrow\">\n<!--   -->\n</a>\n<ul class=\"navList\" title=\"Navigation\">\n<li><a href=\"package-summary.html\">Package</a></li>\n<li class=\"navBarCell1Rev\">Class</li>\n<li><a href=\"class-use/App.html\">Use</a></li>\n<li><a href=\"package-tree.html\">Tree</a></li>\n<li><a href=\"../../deprecated-list.html\">Deprecated</a></li>\n<li><a href=\"../../index-all.html\">Index</a></li>\n<li><a href=\"../../help-doc.html\">Help</a></li>\n</ul>\n</div>\n<div class=\"subNav\">\n<div>\n<ul class=\"subNavList\">\n<li>Summary:&nbsp;</li>\n<li>Nested&nbsp;|&nbsp;</li>\n<li>Field&nbsp;|&nbsp;</li>\n<li><a href=\"#constructor.summary\">Constr</a>&nbsp;|&nbsp;</li>\n<li><a href=\"#method.summary\">Method</a></li>\n</ul>\n<ul class=\"subNavList\">\n<li>Detail:&nbsp;</li>\n<li>Field&nbsp;|&nbsp;</li>\n<li><a href=\"#constructor.detail\">Constr</a>&nbsp;|&nbsp;</li>\n<li><a href=\"#method.detail\">Method</a></li>\n</ul>\n</div>\n</div>\n<a id=\"skip.navbar.bottom\">\n<!--   -->\n</a>\n<!-- ======== END OF BOTTOM NAVBAR ======= -->\n</nav>\n</footer>\n</body>\n</html>\n"

Stack Trace:
java.lang.AssertionError:
https://docs.oracle.com/en/java/javase/13/docs/api/ available, but def/configuration/App.html is missing link to java.lang.Object
Expected: (a string containing "/docs/api/java/lang/Object.html" or a string containing "/docs/api/java.base/java/lang/Object.html")
     but: was "<!DOCTYPE HTML>\n<!-- NewPage -->\n<html lang=\"en\">\n<head>\n<!-- Generated by javadoc (13) on Fri Oct 04 11:21:59 UTC 2019 -->\n<title>App (Maven Javadoc Plugin Default configuration Test 1.0-SNAPSHOT API)</title>\n<meta http-equiv=\"Content-Type\" content=\"text/html; charset=UTF-8\">\n<meta name=\"dc.created\" content=\"2019-10-04\">\n<meta name=\"description\" content=\"declaration: package: def.configuration, class: App\">\n<meta name=\"generator\" content=\"javadoc/ClassWriterImpl\">\n<link rel=\"stylesheet\" type=\"text/css\" href=\"../../stylesheet.css\" title=\"Style\">\n<link rel=\"stylesheet\" type=\"text/css\" href=\"../../script-dir/jquery-ui.css\" title=\"Style\">\n<script type=\"text/javascript\" src=\"../../script.js\"></script>\n<script type=\"text/javascript\" src=\"../../script-dir/jszip/dist/jszip.min.js\"></script>\n<script type=\"text/javascript\" src=\"../../script-dir/jszip-utils/dist/jszip-utils.min.js\"></script>\n<!--[if IE]>\n<script type=\"text/javascript\" src=\"../../script-dir/jszip-utils/dist/jszip-utils-ie.min.js\"></script>\n<![endif]-->\n<script type=\"text/javascript\" src=\"../../script-dir/jquery-3.4.1.js\"></script>\n<script type=\"text/javascript\" src=\"../../script-dir/jquery-ui.js\"></script>\n</head>\n<body class=\"class-declaration\">\n<script type=\"text/javascript\">var data = {\"i0\":9,\"i1\":10};\nvar tabs = {65535:[\"t0\",\"All Methods\"],1:[\"t1\",\"Static Methods\"],2:[\"t2\",\"Instance Methods\"],8:[\"t4\",\"Concrete Methods\"]};\nvar altColor = \"altColor\";\nvar rowColor = \"rowColor\";\nvar tableTab = \"tableTab\";\nvar activeTableTab = \"activeTableTab\";\nvar pathtoroot = \"../../\";\nloadScripts(document, 'script');</script>\n<noscript>\n<div>JavaScript is disabled on your browser.</div>\n</noscript>\n<header role=\"banner\">\n<nav role=\"navigation\">\n<div class=\"fixedNav\">\n<!-- ========= START OF TOP NAVBAR ======= -->\n<div class=\"topNav\"><a id=\"navbar.top\">\n<!--   -->\n</a>\n<div class=\"skipNav\"><a href=\"#skip.navbar.top\" title=\"Skip navigation links\">Skip navigation links</a></div>\n<a id=\"navbar.top.firstrow\">\n<!--   -->\n</a>\n<ul class=\"navList\" title=\"Navigation\">\n<li><a href=\"package-summary.html\">Package</a></li>\n<li class=\"navBarCell1Rev\">Class</li>\n<li><a href=\"class-use/App.html\">Use</a></li>\n<li><a href=\"package-tree.html\">Tree</a></li>\n<li><a href=\"../../deprecated-list.html\">Deprecated</a></li>\n<li><a href=\"../../index-all.html\">Index</a></li>\n<li><a href=\"../../help-doc.html\">Help</a></li>\n</ul>\n</div>\n<div class=\"subNav\">\n<div>\n<ul class=\"subNavList\">\n<li>Summary:&nbsp;</li>\n<li>Nested&nbsp;|&nbsp;</li>\n<li>Field&nbsp;|&nbsp;</li>\n<li><a href=\"#constructor.summary\">Constr</a>&nbsp;|&nbsp;</li>\n<li><a href=\"#method.summary\">Method</a></li>\n</ul>\n<ul class=\"subNavList\">\n<li>Detail:&nbsp;</li>\n<li>Field&nbsp;|&nbsp;</li>\n<li><a href=\"#constructor.detail\">Constr</a>&nbsp;|&nbsp;</li>\n<li><a href=\"#method.detail\">Method</a></li>\n</ul>\n</div>\n<div class=\"navListSearch\"><label for=\"search\">SEARCH:</label>\n<input type=\"text\" id=\"search\" value=\"search\" disabled=\"disabled\">\n<input type=\"reset\" id=\"reset\" value=\"reset\" disabled=\"disabled\">\n</div>\n</div>\n<a id=\"skip.navbar.top\">\n<!--   -->\n</a>\n<!-- ========= END OF TOP NAVBAR ========= -->\n</div>\n<div class=\"navPadding\">&nbsp;</div>\n<script type=\"text/javascript\"><!--\n$('.navPadding').css('padding-top', $('.fixedNav').css(\"height\"));\n//-->\n</script>\n</nav>\n</header>\n<!-- ======== START OF CLASS DATA ======== -->\n<main role=\"main\">\n<div class=\"header\">\n<div class=\"subTitle\"><span class=\"packageLabelInType\">Package</span>&nbsp;<a href=\"package-summary.html\">def.configuration</a></div>\n<h1 title=\"Class App\" class=\"title\">Class App</h1>\n</div>\n<div class=\"contentContainer\">\n<div class=\"inheritance\" title=\"Inheritance Tree\">java.lang.Object\n<div class=\"inheritance\">def.configuration.App</div>\n</div>\n<section class=\"description\">\n<hr>\n<pre>public class <span class=\"typeNameLabel\">App</span>\nextends java.lang.Object</pre>\n</section>\n<section class=\"summary\">\n<ul class=\"blockList\">\n<!-- ======== CONSTRUCTOR SUMMARY ======== -->\n<li class=\"blockList\">\n<section class=\"constructorSummary\"><a id=\"constructor.summary\">\n<!--   -->\n</a>\n<h2>Constructor Summary</h2>\n<div class=\"memberSummary\">\n<table>\n<caption><span>Constructors</span><span class=\"tabEnd\">&nbsp;</span></caption>\n<thead>\n<tr>\n<th class=\"colFirst\" scope=\"col\">Constructor</th>\n<th class=\"colLast\" scope=\"col\">Description</th>\n</tr>\n</thead>\n<tbody>\n<tr class=\"altColor\">\n<th class=\"colConstructorName\" scope=\"row\"><code><span class=\"memberNameLink\"><a href=\"#%3Cinit%3E()\">App</a></span>()</code></th>\n<td class=\"colLast\">&nbsp;</td>\n</tr>\n</tbody>\n</table>\n</div>\n</section>\n</li>\n<!-- ========== METHOD SUMMARY =========== -->\n<li class=\"blockList\">\n<section class=\"methodSummary\"><a id=\"method.summary\">\n<!--   -->\n</a>\n<h2>Method Summary</h2>\n<div class=\"memberSummary\">\n<div role=\"tablist\" aria-orientation=\"horizontal\"><button role=\"tab\" aria-selected=\"true\" aria-controls=\"memberSummary_tabpanel\" tabindex=\"0\" onkeydown=\"switchTab(event)\" id=\"t0\" class=\"activeTableTab\">All Methods</button><button role=\"tab\" aria-selected=\"false\" aria-controls=\"memberSummary_tabpanel\" tabindex=\"-1\" onkeydown=\"switchTab(event)\" id=\"t1\" class=\"tableTab\" onclick=\"show(1);\">Static Methods</button><button role=\"tab\" aria-selected=\"false\" aria-controls=\"memberSummary_tabpanel\" tabindex=\"-1\" onkeydown=\"switchTab(event)\" id=\"t2\" class=\"tableTab\" onclick=\"show(2);\">Instance Methods</button><button role=\"tab\" aria-selected=\"false\" aria-controls=\"memberSummary_tabpanel\" tabindex=\"-1\" onkeydown=\"switchTab(event)\" id=\"t4\" class=\"tableTab\" onclick=\"show(8);\">Concrete Methods</button></div>\n<div id=\"memberSummary_tabpanel\" role=\"tabpanel\">\n<table aria-labelledby=\"t0\">\n<thead>\n<tr>\n<th class=\"colFirst\" scope=\"col\">Modifier and Type</th>\n<th class=\"colSecond\" scope=\"col\">Method</th>\n<th class=\"colLast\" scope=\"col\">Description</th>\n</tr>\n</thead>\n<tbody>\n<tr class=\"altColor\" id=\"i0\">\n<td class=\"colFirst\"><code>static void</code></td>\n<th class=\"colSecond\" scope=\"row\"><code><span class=\"memberNameLink\"><a href=\"#main(java.lang.String%5B%5D)\">main</a></span>&#8203;(java.lang.String[]&nbsp;args)</code></th>\n<td class=\"colLast\">&nbsp;</td>\n</tr>\n<tr class=\"rowColor\" id=\"i1\">\n<td class=\"colFirst\"><code>protected void</code></td>\n<th class=\"colSecond\" scope=\"row\"><code><span class=\"memberNameLink\"><a href=\"#sampleMethod(java.lang.String)\">sampleMethod</a></span>&#8203;(java.lang.String&nbsp;str)</code></th>\n<td class=\"colLast\">&nbsp;</td>\n</tr>\n</tbody>\n</table>\n</div>\n</div>\n<div class=\"inheritedList\">\n<h3>Methods inherited from class&nbsp;java.lang.Object</h3>\n<a id=\"methods.inherited.from.class.java.lang.Object\">\n<!--   -->\n</a><code>clone, equals, finalize, getClass, hashCode, notify, notifyAll, toString, wait, wait, wait</code></div>\n</section>\n</li>\n</ul>\n</section>\n<section class=\"details\">\n<ul class=\"blockList\">\n<!-- ========= CONSTRUCTOR DETAIL ======== -->\n<li class=\"blockList\">\n<section class=\"constructorDetails\"><a id=\"constructor.detail\">\n<!--   -->\n</a>\n<h2>Constructor Details</h2>\n<ul class=\"blockList\">\n<li class=\"blockList\">\n<section class=\"detail\">\n<h3><a id=\"&lt;init&gt;()\">App</a></h3>\n<div class=\"memberSignature\"><span class=\"modifiers\">public</span>&nbsp;<span class=\"memberName\">App</span>()</div>\n</section>\n</li>\n</ul>\n</section>\n</li>\n<!-- ============ METHOD DETAIL ========== -->\n<li class=\"blockList\">\n<section class=\"methodDetails\"><a id=\"method.detail\">\n<!--   -->\n</a>\n<h2>Method Details</h2>\n<ul class=\"blockList\">\n<li class=\"blockList\">\n<section class=\"detail\">\n<h3><a id=\"main(java.lang.String[])\">main</a></h3>\n<div class=\"memberSignature\"><span class=\"modifiers\">public static</span>&nbsp;<span class=\"returnType\">void</span>&nbsp;<span class=\"memberName\">main</span>&#8203;(<span class=\"arguments\">java.lang.String[]&nbsp;args)</span></div>\n</section>\n</li>\n<li class=\"blockList\">\n<section class=\"detail\">\n<h3><a id=\"sampleMethod(java.lang.String)\">sampleMethod</a></h3>\n<div class=\"memberSignature\"><span class=\"modifiers\">protected</span>&nbsp;<span class=\"returnType\">void</span>&nbsp;<span class=\"memberName\">sampleMethod</span>&#8203;(<span class=\"arguments\">java.lang.String&nbsp;str)</span></div>\n</section>\n</li>\n</ul>\n</section>\n</li>\n</ul>\n</section>\n</div>\n</main>\n<!-- ========= END OF CLASS DATA ========= -->\n<footer role=\"contentinfo\">\n<nav role=\"navigation\">\n<!-- ======= START OF BOTTOM NAVBAR ====== -->\n<div class=\"bottomNav\"><a id=\"navbar.bottom\">\n<!--   -->\n</a>\n<div class=\"skipNav\"><a href=\"#skip.navbar.bottom\" title=\"Skip navigation links\">Skip navigation links</a></div>\n<a id=\"navbar.bottom.firstrow\">\n<!--   -->\n</a>\n<ul class=\"navList\" title=\"Navigation\">\n<li><a href=\"package-summary.html\">Package</a></li>\n<li class=\"navBarCell1Rev\">Class</li>\n<li><a href=\"class-use/App.html\">Use</a></li>\n<li><a href=\"package-tree.html\">Tree</a></li>\n<li><a href=\"../../deprecated-list.html\">Deprecated</a></li>\n<li><a href=\"../../index-all.html\">Index</a></li>\n<li><a href=\"../../help-doc.html\">Help</a></li>\n</ul>\n</div>\n<div class=\"subNav\">\n<div>\n<ul class=\"subNavList\">\n<li>Summary:&nbsp;</li>\n<li>Nested&nbsp;|&nbsp;</li>\n<li>Field&nbsp;|&nbsp;</li>\n<li><a href=\"#constructor.summary\">Constr</a>&nbsp;|&nbsp;</li>\n<li><a href=\"#method.summary\">Method</a></li>\n</ul>\n<ul class=\"subNavList\">\n<li>Detail:&nbsp;</li>\n<li>Field&nbsp;|&nbsp;</li>\n<li><a href=\"#constructor.detail\">Constr</a>&nbsp;|&nbsp;</li>\n<li><a href=\"#method.detail\">Method</a></li>\n</ul>\n</div>\n</div>\n<a id=\"skip.navbar.bottom\">\n<!--   -->\n</a>\n<!-- ======== END OF BOTTOM NAVBAR ======= -->\n</nav>\n</footer>\n</body>\n</html>\n"
        at org.apache.maven.plugins.javadoc.JavadocReportTest.testDefaultConfiguration(JavadocReportTest.java:263)


FAILED:  org.apache.maven.plugins.javadoc.JavadocReportTest.windows-jdk13-m3.6.x_build / Build windows-jdk13-m3.6.x_build / testDefaultConfiguration

Error Message:
https://docs.oracle.com/en/java/javase/13/docs/api/ available, but def/configuration/App.html is missing link to java.lang.Object
Expected: (a string containing "/docs/api/java/lang/Object.html" or a string containing "/docs/api/java.base/java/lang/Object.html")
     but: was "<!DOCTYPE HTML>\r\n<!-- NewPage -->\r\n<html lang=\"en\">\r\n<head>\r\n<!-- Generated by javadoc (13-ea) on Fri Oct 04 06:17:28 PDT 2019 -->\r\n<title>App (Maven Javadoc Plugin Default configuration Test 1.0-SNAPSHOT API)</title>\r\n<meta http-equiv=\"Content-Type\" content=\"text/html; charset=UTF-8\">\r\n<meta name=\"dc.created\" content=\"2019-10-04\">\r\n<meta name=\"description\" content=\"declaration: package: def.configuration, class: App\">\r\n<meta name=\"generator\" content=\"javadoc/ClassWriterImpl\">\r\n<link rel=\"stylesheet\" type=\"text/css\" href=\"../../stylesheet.css\" title=\"Style\">\r\n<link rel=\"stylesheet\" type=\"text/css\" href=\"../../script-dir/jquery-ui.css\" title=\"Style\">\r\n<script type=\"text/javascript\" src=\"../../script.js\"></script>\r\n<script type=\"text/javascript\" src=\"../../script-dir/jszip/dist/jszip.min.js\"></script>\r\n<script type=\"text/javascript\" src=\"../../script-dir/jszip-utils/dist/jszip-utils.min.js\"></script>\r\n<!--[if IE]>\r\n<script type=\"text/javascript\" src=\"../../script-dir/jszip-utils/dist/jszip-utils-ie.min.js\"></script>\r\n<![endif]-->\r\n<script type=\"text/javascript\" src=\"../../script-dir/jquery-3.4.1.js\"></script>\r\n<script type=\"text/javascript\" src=\"../../script-dir/jquery-ui.js\"></script>\r\n</head>\r\n<body class=\"class-declaration\">\r\n<script type=\"text/javascript\">var data = {\"i0\":9,\"i1\":10};\r\nvar tabs = {65535:[\"t0\",\"All Methods\"],1:[\"t1\",\"Static Methods\"],2:[\"t2\",\"Instance Methods\"],8:[\"t4\",\"Concrete Methods\"]};\r\nvar altColor = \"altColor\";\r\nvar rowColor = \"rowColor\";\r\nvar tableTab = \"tableTab\";\r\nvar activeTableTab = \"activeTableTab\";\r\nvar pathtoroot = \"../../\";\r\nloadScripts(document, 'script');</script>\r\n<noscript>\r\n<div>JavaScript is disabled on your browser.</div>\r\n</noscript>\r\n<header role=\"banner\">\r\n<nav role=\"navigation\">\r\n<div class=\"fixedNav\">\r\n<!-- ========= START OF TOP NAVBAR ======= -->\r\n<div class=\"topNav\"><a id=\"navbar.top\">\r\n<!--   -->\r\n</a>\r\n<div class=\"skipNav\"><a href=\"#skip.navbar.top\" title=\"Skip navigation links\">Skip navigation links</a></div>\r\n<a id=\"navbar.top.firstrow\">\r\n<!--   -->\r\n</a>\r\n<ul class=\"navList\" title=\"Navigation\">\r\n<li><a href=\"package-summary.html\">Package</a></li>\r\n<li class=\"navBarCell1Rev\">Class</li>\r\n<li><a href=\"class-use/App.html\">Use</a></li>\r\n<li><a href=\"package-tree.html\">Tree</a></li>\r\n<li><a href=\"../../deprecated-list.html\">Deprecated</a></li>\r\n<li><a href=\"../../index-all.html\">Index</a></li>\r\n<li><a href=\"../../help-doc.html\">Help</a></li>\r\n</ul>\r\n</div>\r\n<div class=\"subNav\">\r\n<div>\r\n<ul class=\"subNavList\">\r\n<li>Summary:&nbsp;</li>\r\n<li>Nested&nbsp;|&nbsp;</li>\r\n<li>Field&nbsp;|&nbsp;</li>\r\n<li><a href=\"#constructor.summary\">Constr</a>&nbsp;|&nbsp;</li>\r\n<li><a href=\"#method.summary\">Method</a></li>\r\n</ul>\r\n<ul class=\"subNavList\">\r\n<li>Detail:&nbsp;</li>\r\n<li>Field&nbsp;|&nbsp;</li>\r\n<li><a href=\"#constructor.detail\">Constr</a>&nbsp;|&nbsp;</li>\r\n<li><a href=\"#method.detail\">Method</a></li>\r\n</ul>\r\n</div>\r\n<div class=\"navListSearch\"><label for=\"search\">SEARCH:</label>\r\n<input type=\"text\" id=\"search\" value=\"search\" disabled=\"disabled\">\r\n<input type=\"reset\" id=\"reset\" value=\"reset\" disabled=\"disabled\">\r\n</div>\r\n</div>\r\n<a id=\"skip.navbar.top\">\r\n<!--   -->\r\n</a>\r\n<!-- ========= END OF TOP NAVBAR ========= -->\r\n</div>\r\n<div class=\"navPadding\">&nbsp;</div>\r\n<script type=\"text/javascript\"><!--\r\n$('.navPadding').css('padding-top', $('.fixedNav').css(\"height\"));\r\n//-->\r\n</script>\r\n</nav>\r\n</header>\r\n<!-- ======== START OF CLASS DATA ======== -->\r\n<main role=\"main\">\r\n<div class=\"header\">\r\n<div class=\"subTitle\"><span class=\"packageLabelInType\">Package</span>&nbsp;<a href=\"package-summary.html\">def.configuration</a></div>\r\n<h1 title=\"Class App\" class=\"title\">Class App</h1>\r\n</div>\r\n<div class=\"contentContainer\">\r\n<div class=\"inheritance\" title=\"Inheritance Tree\">java.lang.Object\r\n<div class=\"inheritance\">def.configuration.App</div>\r\n</div>\r\n<section class=\"description\">\r\n<hr>\r\n<pre>public class <span class=\"typeNameLabel\">App</span>\r\nextends java.lang.Object</pre>\r\n</section>\r\n<section class=\"summary\">\r\n<ul class=\"blockList\">\r\n<!-- ======== CONSTRUCTOR SUMMARY ======== -->\r\n<li class=\"blockList\">\r\n<section class=\"constructorSummary\"><a id=\"constructor.summary\">\r\n<!--   -->\r\n</a>\r\n<h2>Constructor Summary</h2>\r\n<div class=\"memberSummary\">\r\n<table>\r\n<caption><span>Constructors</span><span class=\"tabEnd\">&nbsp;</span></caption>\r\n<thead>\r\n<tr>\r\n<th class=\"colFirst\" scope=\"col\">Constructor</th>\r\n<th class=\"colLast\" scope=\"col\">Description</th>\r\n</tr>\r\n</thead>\r\n<tbody>\r\n<tr class=\"altColor\">\r\n<th class=\"colConstructorName\" scope=\"row\"><code><span class=\"memberNameLink\"><a href=\"#%3Cinit%3E()\">App</a></span>()</code></th>\r\n<td class=\"colLast\">&nbsp;</td>\r\n</tr>\r\n</tbody>\r\n</table>\r\n</div>\r\n</section>\r\n</li>\r\n<!-- ========== METHOD SUMMARY =========== -->\r\n<li class=\"blockList\">\r\n<section class=\"methodSummary\"><a id=\"method.summary\">\r\n<!--   -->\r\n</a>\r\n<h2>Method Summary</h2>\r\n<div class=\"memberSummary\">\r\n<div role=\"tablist\" aria-orientation=\"horizontal\"><button role=\"tab\" aria-selected=\"true\" aria-controls=\"memberSummary_tabpanel\" tabindex=\"0\" onkeydown=\"switchTab(event)\" id=\"t0\" class=\"activeTableTab\">All Methods</button><button role=\"tab\" aria-selected=\"false\" aria-controls=\"memberSummary_tabpanel\" tabindex=\"-1\" onkeydown=\"switchTab(event)\" id=\"t1\" class=\"tableTab\" onclick=\"show(1);\">Static Methods</button><button role=\"tab\" aria-selected=\"false\" aria-controls=\"memberSummary_tabpanel\" tabindex=\"-1\" onkeydown=\"switchTab(event)\" id=\"t2\" class=\"tableTab\" onclick=\"show(2);\">Instance Methods</button><button role=\"tab\" aria-selected=\"false\" aria-controls=\"memberSummary_tabpanel\" tabindex=\"-1\" onkeydown=\"switchTab(event)\" id=\"t4\" class=\"tableTab\" onclick=\"show(8);\">Concrete Methods</button></div>\r\n<div id=\"memberSummary_tabpanel\" role=\"tabpanel\">\r\n<table aria-labelledby=\"t0\">\r\n<thead>\r\n<tr>\r\n<th class=\"colFirst\" scope=\"col\">Modifier and Type</th>\r\n<th class=\"colSecond\" scope=\"col\">Method</th>\r\n<th class=\"colLast\" scope=\"col\">Description</th>\r\n</tr>\r\n</thead>\r\n<tbody>\r\n<tr class=\"altColor\" id=\"i0\">\r\n<td class=\"colFirst\"><code>static void</code></td>\r\n<th class=\"colSecond\" scope=\"row\"><code><span class=\"memberNameLink\"><a href=\"#main(java.lang.String%5B%5D)\">main</a></span>&#8203;(java.lang.String[]&nbsp;args)</code></th>\r\n<td class=\"colLast\">&nbsp;</td>\r\n</tr>\r\n<tr class=\"rowColor\" id=\"i1\">\r\n<td class=\"colFirst\"><code>protected void</code></td>\r\n<th class=\"colSecond\" scope=\"row\"><code><span class=\"memberNameLink\"><a href=\"#sampleMethod(java.lang.String)\">sampleMethod</a></span>&#8203;(java.lang.String&nbsp;str)</code></th>\r\n<td class=\"colLast\">&nbsp;</td>\r\n</tr>\r\n</tbody>\r\n</table>\r\n</div>\r\n</div>\r\n<div class=\"inheritedList\">\r\n<h3>Methods inherited from class&nbsp;java.lang.Object</h3>\r\n<a id=\"methods.inherited.from.class.java.lang.Object\">\r\n<!--   -->\r\n</a><code>clone, equals, finalize, getClass, hashCode, notify, notifyAll, toString, wait, wait, wait</code></div>\r\n</section>\r\n</li>\r\n</ul>\r\n</section>\r\n<section class=\"details\">\r\n<ul class=\"blockList\">\r\n<!-- ========= CONSTRUCTOR DETAIL ======== -->\r\n<li class=\"blockList\">\r\n<section class=\"constructorDetails\"><a id=\"constructor.detail\">\r\n<!--   -->\r\n</a>\r\n<h2>Constructor Details</h2>\r\n<ul class=\"blockList\">\r\n<li class=\"blockList\">\r\n<section class=\"detail\">\r\n<h3><a id=\"&lt;init&gt;()\">App</a></h3>\r\n<div class=\"memberSignature\"><span class=\"modifiers\">public</span>&nbsp;<span class=\"memberName\">App</span>()</div>\r\n</section>\r\n</li>\r\n</ul>\r\n</section>\r\n</li>\r\n<!-- ============ METHOD DETAIL ========== -->\r\n<li class=\"blockList\">\r\n<section class=\"methodDetails\"><a id=\"method.detail\">\r\n<!--   -->\r\n</a>\r\n<h2>Method Details</h2>\r\n<ul class=\"blockList\">\r\n<li class=\"blockList\">\r\n<section class=\"detail\">\r\n<h3><a id=\"main(java.lang.String[])\">main</a></h3>\r\n<div class=\"memberSignature\"><span class=\"modifiers\">public static</span>&nbsp;<span class=\"returnType\">void</span>&nbsp;<span class=\"memberName\">main</span>&#8203;(<span class=\"arguments\">java.lang.String[]&nbsp;args)</span></div>\r\n</section>\r\n</li>\r\n<li class=\"blockList\">\r\n<section class=\"detail\">\r\n<h3><a id=\"sampleMethod(java.lang.String)\">sampleMethod</a></h3>\r\n<div class=\"memberSignature\"><span class=\"modifiers\">protected</span>&nbsp;<span class=\"returnType\">void</span>&nbsp;<span class=\"memberName\">sampleMethod</span>&#8203;(<span class=\"arguments\">java.lang.String&nbsp;str)</span></div>\r\n</section>\r\n</li>\r\n</ul>\r\n</section>\r\n</li>\r\n</ul>\r\n</section>\r\n</div>\r\n</main>\r\n<!-- ========= END OF CLASS DATA ========= -->\r\n<footer role=\"contentinfo\">\r\n<nav role=\"navigation\">\r\n<!-- ======= START OF BOTTOM NAVBAR ====== -->\r\n<div class=\"bottomNav\"><a id=\"navbar.bottom\">\r\n<!--   -->\r\n</a>\r\n<div class=\"skipNav\"><a href=\"#skip.navbar.bottom\" title=\"Skip navigation links\">Skip navigation links</a></div>\r\n<a id=\"navbar.bottom.firstrow\">\r\n<!--   -->\r\n</a>\r\n<ul class=\"navList\" title=\"Navigation\">\r\n<li><a href=\"package-summary.html\">Package</a></li>\r\n<li class=\"navBarCell1Rev\">Class</li>\r\n<li><a href=\"class-use/App.html\">Use</a></li>\r\n<li><a href=\"package-tree.html\">Tree</a></li>\r\n<li><a href=\"../../deprecated-list.html\">Deprecated</a></li>\r\n<li><a href=\"../../index-all.html\">Index</a></li>\r\n<li><a href=\"../../help-doc.html\">Help</a></li>\r\n</ul>\r\n</div>\r\n<div class=\"subNav\">\r\n<div>\r\n<ul class=\"subNavList\">\r\n<li>Summary:&nbsp;</li>\r\n<li>Nested&nbsp;|&nbsp;</li>\r\n<li>Field&nbsp;|&nbsp;</li>\r\n<li><a href=\"#constructor.summary\">Constr</a>&nbsp;|&nbsp;</li>\r\n<li><a href=\"#method.summary\">Method</a></li>\r\n</ul>\r\n<ul class=\"subNavList\">\r\n<li>Detail:&nbsp;</li>\r\n<li>Field&nbsp;|&nbsp;</li>\r\n<li><a href=\"#constructor.detail\">Constr</a>&nbsp;|&nbsp;</li>\r\n<li><a href=\"#method.detail\">Method</a></li>\r\n</ul>\r\n</div>\r\n</div>\r\n<a id=\"skip.navbar.bottom\">\r\n<!--   -->\r\n</a>\r\n<!-- ======== END OF BOTTOM NAVBAR ======= -->\r\n</nav>\r\n</footer>\r\n</body>\r\n</html>\r\n"

Stack Trace:
java.lang.AssertionError:
https://docs.oracle.com/en/java/javase/13/docs/api/ available, but def/configuration/App.html is missing link to java.lang.Object
Expected: (a string containing "/docs/api/java/lang/Object.html" or a string containing "/docs/api/java.base/java/lang/Object.html")
     but: was "<!DOCTYPE HTML>\r\n<!-- NewPage -->\r\n<html lang=\"en\">\r\n<head>\r\n<!-- Generated by javadoc (13-ea) on Fri Oct 04 06:17:28 PDT 2019 -->\r\n<title>App (Maven Javadoc Plugin Default configuration Test 1.0-SNAPSHOT API)</title>\r\n<meta http-equiv=\"Content-Type\" content=\"text/html; charset=UTF-8\">\r\n<meta name=\"dc.created\" content=\"2019-10-04\">\r\n<meta name=\"description\" content=\"declaration: package: def.configuration, class: App\">\r\n<meta name=\"generator\" content=\"javadoc/ClassWriterImpl\">\r\n<link rel=\"stylesheet\" type=\"text/css\" href=\"../../stylesheet.css\" title=\"Style\">\r\n<link rel=\"stylesheet\" type=\"text/css\" href=\"../../script-dir/jquery-ui.css\" title=\"Style\">\r\n<script type=\"text/javascript\" src=\"../../script.js\"></script>\r\n<script type=\"text/javascript\" src=\"../../script-dir/jszip/dist/jszip.min.js\"></script>\r\n<script type=\"text/javascript\" src=\"../../script-dir/jszip-utils/dist/jszip-utils.min.js\"></script>\r\n<!--[if IE]>\r\n<script type=\"text/javascript\" src=\"../../script-dir/jszip-utils/dist/jszip-utils-ie.min.js\"></script>\r\n<![endif]-->\r\n<script type=\"text/javascript\" src=\"../../script-dir/jquery-3.4.1.js\"></script>\r\n<script type=\"text/javascript\" src=\"../../script-dir/jquery-ui.js\"></script>\r\n</head>\r\n<body class=\"class-declaration\">\r\n<script type=\"text/javascript\">var data = {\"i0\":9,\"i1\":10};\r\nvar tabs = {65535:[\"t0\",\"All Methods\"],1:[\"t1\",\"Static Methods\"],2:[\"t2\",\"Instance Methods\"],8:[\"t4\",\"Concrete Methods\"]};\r\nvar altColor = \"altColor\";\r\nvar rowColor = \"rowColor\";\r\nvar tableTab = \"tableTab\";\r\nvar activeTableTab = \"activeTableTab\";\r\nvar pathtoroot = \"../../\";\r\nloadScripts(document, 'script');</script>\r\n<noscript>\r\n<div>JavaScript is disabled on your browser.</div>\r\n</noscript>\r\n<header role=\"banner\">\r\n<nav role=\"navigation\">\r\n<div class=\"fixedNav\">\r\n<!-- ========= START OF TOP NAVBAR ======= -->\r\n<div class=\"topNav\"><a id=\"navbar.top\">\r\n<!--   -->\r\n</a>\r\n<div class=\"skipNav\"><a href=\"#skip.navbar.top\" title=\"Skip navigation links\">Skip navigation links</a></div>\r\n<a id=\"navbar.top.firstrow\">\r\n<!--   -->\r\n</a>\r\n<ul class=\"navList\" title=\"Navigation\">\r\n<li><a href=\"package-summary.html\">Package</a></li>\r\n<li class=\"navBarCell1Rev\">Class</li>\r\n<li><a href=\"class-use/App.html\">Use</a></li>\r\n<li><a href=\"package-tree.html\">Tree</a></li>\r\n<li><a href=\"../../deprecated-list.html\">Deprecated</a></li>\r\n<li><a href=\"../../index-all.html\">Index</a></li>\r\n<li><a href=\"../../help-doc.html\">Help</a></li>\r\n</ul>\r\n</div>\r\n<div class=\"subNav\">\r\n<div>\r\n<ul class=\"subNavList\">\r\n<li>Summary:&nbsp;</li>\r\n<li>Nested&nbsp;|&nbsp;</li>\r\n<li>Field&nbsp;|&nbsp;</li>\r\n<li><a href=\"#constructor.summary\">Constr</a>&nbsp;|&nbsp;</li>\r\n<li><a href=\"#method.summary\">Method</a></li>\r\n</ul>\r\n<ul class=\"subNavList\">\r\n<li>Detail:&nbsp;</li>\r\n<li>Field&nbsp;|&nbsp;</li>\r\n<li><a href=\"#constructor.detail\">Constr</a>&nbsp;|&nbsp;</li>\r\n<li><a href=\"#method.detail\">Method</a></li>\r\n</ul>\r\n</div>\r\n<div class=\"navListSearch\"><label for=\"search\">SEARCH:</label>\r\n<input type=\"text\" id=\"search\" value=\"search\" disabled=\"disabled\">\r\n<input type=\"reset\" id=\"reset\" value=\"reset\" disabled=\"disabled\">\r\n</div>\r\n</div>\r\n<a id=\"skip.navbar.top\">\r\n<!--   -->\r\n</a>\r\n<!-- ========= END OF TOP NAVBAR ========= -->\r\n</div>\r\n<div class=\"navPadding\">&nbsp;</div>\r\n<script type=\"text/javascript\"><!--\r\n$('.navPadding').css('padding-top', $('.fixedNav').css(\"height\"));\r\n//-->\r\n</script>\r\n</nav>\r\n</header>\r\n<!-- ======== START OF CLASS DATA ======== -->\r\n<main role=\"main\">\r\n<div class=\"header\">\r\n<div class=\"subTitle\"><span class=\"packageLabelInType\">Package</span>&nbsp;<a href=\"package-summary.html\">def.configuration</a></div>\r\n<h1 title=\"Class App\" class=\"title\">Class App</h1>\r\n</div>\r\n<div class=\"contentContainer\">\r\n<div class=\"inheritance\" title=\"Inheritance Tree\">java.lang.Object\r\n<div class=\"inheritance\">def.configuration.App</div>\r\n</div>\r\n<section class=\"description\">\r\n<hr>\r\n<pre>public class <span class=\"typeNameLabel\">App</span>\r\nextends java.lang.Object</pre>\r\n</section>\r\n<section class=\"summary\">\r\n<ul class=\"blockList\">\r\n<!-- ======== CONSTRUCTOR SUMMARY ======== -->\r\n<li class=\"blockList\">\r\n<section class=\"constructorSummary\"><a id=\"constructor.summary\">\r\n<!--   -->\r\n</a>\r\n<h2>Constructor Summary</h2>\r\n<div class=\"memberSummary\">\r\n<table>\r\n<caption><span>Constructors</span><span class=\"tabEnd\">&nbsp;</span></caption>\r\n<thead>\r\n<tr>\r\n<th class=\"colFirst\" scope=\"col\">Constructor</th>\r\n<th class=\"colLast\" scope=\"col\">Description</th>\r\n</tr>\r\n</thead>\r\n<tbody>\r\n<tr class=\"altColor\">\r\n<th class=\"colConstructorName\" scope=\"row\"><code><span class=\"memberNameLink\"><a href=\"#%3Cinit%3E()\">App</a></span>()</code></th>\r\n<td class=\"colLast\">&nbsp;</td>\r\n</tr>\r\n</tbody>\r\n</table>\r\n</div>\r\n</section>\r\n</li>\r\n<!-- ========== METHOD SUMMARY =========== -->\r\n<li class=\"blockList\">\r\n<section class=\"methodSummary\"><a id=\"method.summary\">\r\n<!--   -->\r\n</a>\r\n<h2>Method Summary</h2>\r\n<div class=\"memberSummary\">\r\n<div role=\"tablist\" aria-orientation=\"horizontal\"><button role=\"tab\" aria-selected=\"true\" aria-controls=\"memberSummary_tabpanel\" tabindex=\"0\" onkeydown=\"switchTab(event)\" id=\"t0\" class=\"activeTableTab\">All Methods</button><button role=\"tab\" aria-selected=\"false\" aria-controls=\"memberSummary_tabpanel\" tabindex=\"-1\" onkeydown=\"switchTab(event)\" id=\"t1\" class=\"tableTab\" onclick=\"show(1);\">Static Methods</button><button role=\"tab\" aria-selected=\"false\" aria-controls=\"memberSummary_tabpanel\" tabindex=\"-1\" onkeydown=\"switchTab(event)\" id=\"t2\" class=\"tableTab\" onclick=\"show(2);\">Instance Methods</button><button role=\"tab\" aria-selected=\"false\" aria-controls=\"memberSummary_tabpanel\" tabindex=\"-1\" onkeydown=\"switchTab(event)\" id=\"t4\" class=\"tableTab\" onclick=\"show(8);\">Concrete Methods</button></div>\r\n<div id=\"memberSummary_tabpanel\" role=\"tabpanel\">\r\n<table aria-labelledby=\"t0\">\r\n<thead>\r\n<tr>\r\n<th class=\"colFirst\" scope=\"col\">Modifier and Type</th>\r\n<th class=\"colSecond\" scope=\"col\">Method</th>\r\n<th class=\"colLast\" scope=\"col\">Description</th>\r\n</tr>\r\n</thead>\r\n<tbody>\r\n<tr class=\"altColor\" id=\"i0\">\r\n<td class=\"colFirst\"><code>static void</code></td>\r\n<th class=\"colSecond\" scope=\"row\"><code><span class=\"memberNameLink\"><a href=\"#main(java.lang.String%5B%5D)\">main</a></span>&#8203;(java.lang.String[]&nbsp;args)</code></th>\r\n<td class=\"colLast\">&nbsp;</td>\r\n</tr>\r\n<tr class=\"rowColor\" id=\"i1\">\r\n<td class=\"colFirst\"><code>protected void</code></td>\r\n<th class=\"colSecond\" scope=\"row\"><code><span class=\"memberNameLink\"><a href=\"#sampleMethod(java.lang.String)\">sampleMethod</a></span>&#8203;(java.lang.String&nbsp;str)</code></th>\r\n<td class=\"colLast\">&nbsp;</td>\r\n</tr>\r\n</tbody>\r\n</table>\r\n</div>\r\n</div>\r\n<div class=\"inheritedList\">\r\n<h3>Methods inherited from class&nbsp;java.lang.Object</h3>\r\n<a id=\"methods.inherited.from.class.java.lang.Object\">\r\n<!--   -->\r\n</a><code>clone, equals, finalize, getClass, hashCode, notify, notifyAll, toString, wait, wait, wait</code></div>\r\n</section>\r\n</li>\r\n</ul>\r\n</section>\r\n<section class=\"details\">\r\n<ul class=\"blockList\">\r\n<!-- ========= CONSTRUCTOR DETAIL ======== -->\r\n<li class=\"blockList\">\r\n<section class=\"constructorDetails\"><a id=\"constructor.detail\">\r\n<!--   -->\r\n</a>\r\n<h2>Constructor Details</h2>\r\n<ul class=\"blockList\">\r\n<li class=\"blockList\">\r\n<section class=\"detail\">\r\n<h3><a id=\"&lt;init&gt;()\">App</a></h3>\r\n<div class=\"memberSignature\"><span class=\"modifiers\">public</span>&nbsp;<span class=\"memberName\">App</span>()</div>\r\n</section>\r\n</li>\r\n</ul>\r\n</section>\r\n</li>\r\n<!-- ============ METHOD DETAIL ========== -->\r\n<li class=\"blockList\">\r\n<section class=\"methodDetails\"><a id=\"method.detail\">\r\n<!--   -->\r\n</a>\r\n<h2>Method Details</h2>\r\n<ul class=\"blockList\">\r\n<li class=\"blockList\">\r\n<section class=\"detail\">\r\n<h3><a id=\"main(java.lang.String[])\">main</a></h3>\r\n<div class=\"memberSignature\"><span class=\"modifiers\">public static</span>&nbsp;<span class=\"returnType\">void</span>&nbsp;<span class=\"memberName\">main</span>&#8203;(<span class=\"arguments\">java.lang.String[]&nbsp;args)</span></div>\r\n</section>\r\n</li>\r\n<li class=\"blockList\">\r\n<section class=\"detail\">\r\n<h3><a id=\"sampleMethod(java.lang.String)\">sampleMethod</a></h3>\r\n<div class=\"memberSignature\"><span class=\"modifiers\">protected</span>&nbsp;<span class=\"returnType\">void</span>&nbsp;<span class=\"memberName\">sampleMethod</span>&#8203;(<span class=\"arguments\">java.lang.String&nbsp;str)</span></div>\r\n</section>\r\n</li>\r\n</ul>\r\n</section>\r\n</li>\r\n</ul>\r\n</section>\r\n</div>\r\n</main>\r\n<!-- ========= END OF CLASS DATA ========= -->\r\n<footer role=\"contentinfo\">\r\n<nav role=\"navigation\">\r\n<!-- ======= START OF BOTTOM NAVBAR ====== -->\r\n<div class=\"bottomNav\"><a id=\"navbar.bottom\">\r\n<!--   -->\r\n</a>\r\n<div class=\"skipNav\"><a href=\"#skip.navbar.bottom\" title=\"Skip navigation links\">Skip navigation links</a></div>\r\n<a id=\"navbar.bottom.firstrow\">\r\n<!--   -->\r\n</a>\r\n<ul class=\"navList\" title=\"Navigation\">\r\n<li><a href=\"package-summary.html\">Package</a></li>\r\n<li class=\"navBarCell1Rev\">Class</li>\r\n<li><a href=\"class-use/App.html\">Use</a></li>\r\n<li><a href=\"package-tree.html\">Tree</a></li>\r\n<li><a href=\"../../deprecated-list.html\">Deprecated</a></li>\r\n<li><a href=\"../../index-all.html\">Index</a></li>\r\n<li><a href=\"../../help-doc.html\">Help</a></li>\r\n</ul>\r\n</div>\r\n<div class=\"subNav\">\r\n<div>\r\n<ul class=\"subNavList\">\r\n<li>Summary:&nbsp;</li>\r\n<li>Nested&nbsp;|&nbsp;</li>\r\n<li>Field&nbsp;|&nbsp;</li>\r\n<li><a href=\"#constructor.summary\">Constr</a>&nbsp;|&nbsp;</li>\r\n<li><a href=\"#method.summary\">Method</a></li>\r\n</ul>\r\n<ul class=\"subNavList\">\r\n<li>Detail:&nbsp;</li>\r\n<li>Field&nbsp;|&nbsp;</li>\r\n<li><a href=\"#constructor.detail\">Constr</a>&nbsp;|&nbsp;</li>\r\n<li><a href=\"#method.detail\">Method</a></li>\r\n</ul>\r\n</div>\r\n</div>\r\n<a id=\"skip.navbar.bottom\">\r\n<!--   -->\r\n</a>\r\n<!-- ======== END OF BOTTOM NAVBAR ======= -->\r\n</nav>\r\n</footer>\r\n</body>\r\n</html>\r\n"
        at org.apache.maven.plugins.javadoc.JavadocReportTest.testDefaultConfiguration(JavadocReportTest.java:263)


FAILED:  org.apache.maven.plugins.javadoc.JavadocReportTest.linux-jdk14-m3.6.x_build / Build linux-jdk14-m3.6.x_build / testJavadocResources

Error Message:
null

Stack Trace:
junit.framework.AssertionFailedError
        at org.apache.maven.plugins.javadoc.JavadocReportTest.testJavadocResources(JavadocReportTest.java:788)


FAILED:  org.apache.maven.plugins.javadoc.JavadocReportTest.windows-jdk14-m3.6.x_build / Build windows-jdk14-m3.6.x_build / testJavadocResources

Error Message:
null

Stack Trace:
junit.framework.AssertionFailedError
        at org.apache.maven.plugins.javadoc.JavadocReportTest.testJavadocResources(JavadocReportTest.java:788)




Build log:
[...truncated 9362 lines...]
[INFO]
[INFO] --- maven-checkstyle-plugin:3.0.0:check (checkstyle-check) @ maven-javadoc-plugin ---
[INFO] There are 4 errors reported by Checkstyle 6.18 with config/maven_checks.xml ruleset.
[INFO] Ignored 4 errors, 0 violation remaining.
[INFO]
[INFO] --- maven-invoker-plugin:3.1.0:verify (integration-test) @ maven-javadoc-plugin ---
[INFO] -------------------------------------------------
[INFO] Build Summary:
[INFO]   Passed: 60, Failed: 0, Errors: 0, Skipped: 5
[INFO] -------------------------------------------------
[INFO] ------------------------------------------------------------------------
[INFO] BUILD SUCCESS
[INFO] ------------------------------------------------------------------------
[INFO] Total time:  16:16 min
[INFO] Finished at: 2019-10-04T06:31:47-07:00
[INFO] ------------------------------------------------------------------------
[INFO] [jenkins-event-spy] Generated F:\jenkins\jenkins-slave\workspace\aven-javadoc-plugin_MJAVADOC-607@2@tmp\withMavenbcd4a550\maven-spy-20191004-061530-6103577411968446817015.log
[Pipeline] }
[Pipeline] // dir
[Pipeline] }
[withMaven] artifactsPublisher - Archive artifact windows-jdk13-m3.6.x_build\pom.xml under org\apache\maven\plugins\maven-javadoc-plugin\3.1.2-SNAPSHOT\maven-javadoc-plugin-3.1.2-SNAPSHOT.pom
[withMaven] artifactsPublisher - Archive artifact windows-jdk13-m3.6.x_build\target\maven-javadoc-plugin-3.1.2-SNAPSHOT.jar under org\apache\maven\plugins\maven-javadoc-plugin\3.1.2-SNAPSHOT\maven-javadoc-plugin-3.1.2-SNAPSHOT.jar
[Fast Archiver] Compressed 491.66 KB of artifacts by 45.6% relative to #3
[withMaven] junitPublisher - Archive test results for Maven artifact org.apache.maven.plugins:maven-javadoc-plugin:maven-plugin:3.1.2-SNAPSHOT generated by maven-surefire-plugin:test (default-test): windows-jdk13-m3.6.x_build\target\surefire-reports\*.xml
Recording test results
[withMaven] openTasksPublisher - Scan Tasks for Maven artifact org.apache.maven.plugins:maven-javadoc-plugin:maven-plugin:3.1.2-SNAPSHOT in source directory windows-jdk13-m3.6.x_build\src\main\java
[TASKS] Scanning folder 'f:\jenkins\jenkins-slave\workspace\aven-javadoc-plugin_MJAVADOC-607@2' for files matching the pattern 'windows-jdk13-m3.6.x_build\src\main\java\**\*' - excludes: null
[TASKS] Found 26 files to scan for tasks
[TASKS] Found 7 open tasks.
Skipping warnings blame since pipelines do not have an SCM link.%n
[TASKS] Computing warning deltas based on reference build #3
[withMaven] invokerPublisher - Archive invoker results for Maven artifact MavenArtifact{org.apache.maven.plugins:maven-javadoc-plugin:maven-plugin:3.1.2-SNAPSHOT(version: 3.1.2-SNAPSHOT, snapshot:false) } generated by PluginInvocation{org.apache.maven.plugins:maven-invoker-plugin:3.1.0@integration-test  integration-test}: windows-jdk13-m3.6.x_build\target\invoker-reports\*.xml
[INFO] run post-build script verify.bsh
[INFO]           MJAVADOC-172\pom.xml ............................. SUCCESS (15.1 s)
[INFO] Building: MJAVADOC-180\pom.xml
[INFO] run post-build script verify.bsh
[INFO]           MJAVADOC-180\pom.xml ............................. SUCCESS (10.8 s)
[INFO] Building: MJAVADOC-194\pom.xml
[INFO] run post-build script verify.bsh
[INFO]           MJAVADOC-194\pom.xml ............................. SUCCESS (11.5 s)
[INFO] Building: MJAVADOC-250\pom.xml
[INFO] run post-build script verify.bsh
[INFO]           MJAVADOC-250\pom.xml ............................. SUCCESS (13.5 s)
[INFO] Building: MJAVADOC-257\pom.xml
[INFO]           MJAVADOC-257\pom.xml ............................. SKIPPED due to JRE version
[INFO] Building: MJAVADOC-259\pom.xml
[INFO] run post-build script verify.bsh
[INFO]           MJAVADOC-259\pom.xml ............................. SUCCESS (13.4 s)
[INFO] Building: MJAVADOC-262\pom.xml
[withMaven] Publishers: Generated Artifacts Publisher: 207 ms, Junit Publisher: 358 ms, Open Task Scanner Publisher: 235 ms, Dependencies Fingerprint Publisher: 1 ms, Invoker Publisher: 66918 ms, Pipeline Graph Publisher: 2 ms
[Pipeline] // withMaven
[Pipeline] cleanWs
[WS-CLEANUP] Deleting project workspace...
[WS-CLEANUP] Deferred wipeout is used...
[WS-CLEANUP] done
[Pipeline] }
[Pipeline] // stage
[Pipeline] }
[Pipeline] // ws
[Pipeline] }
[Pipeline] // node
[Pipeline] }
[INFO] run post-build script verify.bsh
[INFO]           MJAVADOC-262\pom.xml ............................. SUCCESS (8.3 s)
[INFO] Building: MJAVADOC-275\pom.xml
[INFO]           MJAVADOC-275\pom.xml ............................. SUCCESS (16.1 s)
[INFO] Building: MJAVADOC-278\pom.xml
[INFO] run post-build script verify.bsh
[INFO]           MJAVADOC-278\pom.xml ............................. SUCCESS (7.7 s)
[INFO] Building: MJAVADOC-320\pom.xml
[INFO] run post-build script verify.bsh
[INFO]           MJAVADOC-320\pom.xml ............................. SUCCESS (14.5 s)
[INFO] Building: MJAVADOC-325\pom.xml
[INFO]           MJAVADOC-325\pom.xml ............................. SKIPPED due to JRE version
[INFO] Building: MJAVADOC-338_downloadSources\pom.xml
[INFO] run post-build script verify.groovy
[INFO]           MJAVADOC-338_downloadSources\pom.xml ............. SUCCESS (14.1 s)
[INFO] Building: MJAVADOC-365\pom.xml
[INFO] run post-build script verify.bsh
[INFO]           MJAVADOC-365\pom.xml ............................. SUCCESS (7.0 s)
[INFO] Building: MJAVADOC-369\pom.xml
[INFO] run post-build script verify.bsh
[INFO]           MJAVADOC-369\pom.xml ............................. SUCCESS (18.9 s)
[INFO] Building: MJAVADOC-384\pom.xml
[INFO] run post-build script verify.bsh
[INFO]           MJAVADOC-384\pom.xml ............................. SUCCESS (7.3 s)
[INFO] Building: MJAVADOC-407\pom.xml
[INFO] run post-build script verify.bsh
[INFO]           MJAVADOC-407\pom.xml ............................. SUCCESS (9.4 s)
[INFO] Building: MJAVADOC-414\pom.xml
[INFO] run post-build script verify.bsh
[INFO]           MJAVADOC-414\pom.xml ............................. SUCCESS (8.8 s)
[INFO] Building: MJAVADOC-420_fixparam\pom.xml
[INFO] run post-build script verify.groovy
[INFO]           MJAVADOC-420_fixparam\pom.xml .................... SUCCESS (9.5 s)
[INFO] Building: MJAVADOC-427\pom.xml
[INFO] run post-build script verify.groovy
[INFO]           MJAVADOC-427\pom.xml ............................. SUCCESS (11.1 s)
[INFO] Building: MJAVADOC-434_fixcompile\pom.xml
[INFO]           MJAVADOC-434_fixcompile\pom.xml .................. SUCCESS (12.2 s)
[INFO] Building: MJAVADOC-437\pom.xml
[INFO] run post-build script verify.bsh
[INFO]           MJAVADOC-437\pom.xml ............................. SUCCESS (11.1 s)
[INFO] Building: MJAVADOC-444\pom.xml
[INFO] run post-build script verify.bsh
[INFO]           MJAVADOC-444\pom.xml ............................. SUCCESS (28.2 s)
[INFO] Building: MJAVADOC-449_aggr_modulepath\pom.xml
[INFO] run post-build script verify.groovy
[INFO]           MJAVADOC-449_aggr_modulepath\pom.xml ............. SUCCESS (10.6 s)
[INFO] Building: MJAVADOC-452_fix-duplicateparams\pom.xml
[INFO] run post-build script verify.groovy
[INFO]           MJAVADOC-452_fix-duplicateparams\pom.xml ......... SUCCESS (9.0 s)
[INFO] Building: MJAVADOC-494_aggregate-repositories\pom.xml
[INFO]           MJAVADOC-494_aggregate-repositories\pom.xml ...... SUCCESS (9.1 s)
[INFO] Building: MJAVADOC-495_offline-filescheme\pom.xml
[INFO] run post-build script verify.groovy
[INFO]           MJAVADOC-495_offline-filescheme\pom.xml .......... SUCCESS (13.8 s)
[INFO] Building: MJAVADOC-497\pom.xml
[INFO] run post-build script verify.bsh
[INFO]           MJAVADOC-497\pom.xml ............................. SUCCESS (8.7 s)
[INFO] Building: MJAVADOC-498_aggr_modulepath\pom.xml
[INFO]           MJAVADOC-498_aggr_modulepath\pom.xml ............. SUCCESS (24.8 s)
[INFO] Building: MJAVADOC-498_mm_modulepath\pom.xml
[INFO]           MJAVADOC-498_mm_modulepath\pom.xml ............... SUCCESS (12.1 s)
[INFO] Building: MJAVADOC-498_modulepath\pom.xml
[INFO] run post-build script verify.groovy
[INFO]           MJAVADOC-498_modulepath\pom.xml .................. SUCCESS (14.6 s)
[INFO] Building: MJAVADOC-506_excl-module-info\pom.xml
[INFO] run post-build script verify.groovy
[INFO]           MJAVADOC-506_excl-module-info\pom.xml ............ SUCCESS (9.0 s)
[INFO] Building: MJAVADOC-508\pom.xml
[INFO]           MJAVADOC-508\pom.xml ............................. SUCCESS (6.8 s)
[INFO] Building: MJAVADOC-514_3rdparty-doclettags\pom.xml
[INFO]           MJAVADOC-514_3rdparty-doclettags\pom.xml ......... SKIPPED due to JRE version
[INFO] Building: MJAVADOC-526_aggr-managedDeps\pom.xml
[INFO]           MJAVADOC-526_aggr-managedDeps\pom.xml ............ SUCCESS (10.3 s)
[INFO] Building: MJAVADOC-528\pom.xml
[INFO] run post-build script verify.groovy
[INFO]           MJAVADOC-528\pom.xml ............................. SUCCESS (8.9 s)
[INFO] Building: MJAVADOC-538\pom.xml
[INFO]           MJAVADOC-538\pom.xml ............................. SUCCESS (6.9 s)
[INFO] Building: MJAVADOC-551 spaces\pom.xml
[INFO]           MJAVADOC-551 spaces\pom.xml ...................... SUCCESS (5.5 s)
[INFO] Building: MJAVADOC-552_fix-author\pom.xml
[INFO] run post-build script verify.groovy
[INFO]           MJAVADOC-552_fix-author\pom.xml .................. SUCCESS (8.4 s)
[INFO] Building: MJAVADOC-555_aggr_mixed\pom.xml
[INFO] run post-build script verify.groovy
[INFO]           MJAVADOC-555_aggr_mixed\pom.xml .................. SUCCESS (11.1 s)
[INFO] Building: MJAVADOC-555_link-automatic-modules\pom.xml
[INFO] run post-build script verify.groovy
[INFO]           MJAVADOC-555_link-automatic-modules\pom.xml ...... SUCCESS (12.9 s)
[INFO] Building: MJAVADOC-556_hide-non-exported-packages\pom.xml
[INFO]           MJAVADOC-556_hide-non-exported-packages\pom.xml .. SUCCESS (8.3 s)
[INFO] Building: MJAVADOC-558_fix-unknownthrows\pom.xml
[INFO] run post-build script verify.groovy
[INFO]           MJAVADOC-558_fix-unknownthrows\pom.xml ........... SUCCESS (8.5 s)
[INFO] Building: MJAVADOC-562_release\pom.xml
[INFO]           MJAVADOC-562_release\pom.xml ..................... SUCCESS (10.1 s)
[INFO] Building: MJAVADOC-567_aggr-mixed\pom.xml
[INFO] run post-build script verify.groovy
[INFO]           MJAVADOC-567_aggr-mixed\pom.xml .................. SUCCESS (5.9 s)
[INFO] Building: MJAVADOC-568_export-to-testcase\pom.xml
[INFO]           MJAVADOC-568_export-to-testcase\pom.xml .......... SUCCESS (19.7 s)
[INFO] Building: MJAVADOC-568_jar-mixed\pom.xml
[INFO]           MJAVADOC-568_jar-mixed\pom.xml ................... SUCCESS (14.5 s)
[INFO] Building: MJAVADOC-568_manifest-splitpackage\pom.xml
[INFO]           MJAVADOC-568_manifest-splitpackage\pom.xml ....... SUCCESS (19.1 s)
[INFO] Building: MJAVADOC-569_aggr-mixed\pom.xml
[INFO]           MJAVADOC-569_aggr-mixed\pom.xml .................. SUCCESS (17.5 s)
[INFO] Building: MJAVADOC-575_source8-module-info\pom.xml
[INFO] run post-build script verify.groovy
[INFO]           MJAVADOC-575_source8-module-info\pom.xml ......... SUCCESS (8.9 s)
[INFO] Building: MJAVADOC-580_detectLinks\pom.xml
[INFO] run post-build script verify.groovy
[INFO]           MJAVADOC-580_detectLinks\pom.xml ................. SUCCESS (6.5 s)
[INFO] Building: MJAVADOC-591_release8\pom.xml
[INFO]           MJAVADOC-591_release8\pom.xml .................... SUCCESS (17.2 s)
[INFO] Building: MJAVADOC-599\pom.xml
[INFO] run post-build script verify.groovy
[INFO]           MJAVADOC-599\pom.xml ............................. SUCCESS (9.7 s)
[INFO] Building: site-failOnError\pom.xml
[INFO]           site-failOnError\pom.xml ......................... SUCCESS (8.5 s)
[INFO]
[INFO] --- mrm-maven-plugin:1.1.0:stop (repository) @ maven-javadoc-plugin ---
[INFO] Stopping Mock Repository Manager on http://localhost:54283
[INFO] Stopped SocketConnector@0.0.0.0:54283
[INFO] Mock Repository Manager http://localhost:54283 is stopped.
[INFO]
[INFO] --- mrm-maven-plugin:1.1.0:stop (3rdparty) @ maven-javadoc-plugin ---
[INFO] Stopping Mock Repository Manager on http://localhost:54284
[INFO] Stopped SocketConnector@0.0.0.0:54284
[INFO] Mock Repository Manager http://localhost:54284 is stopped.
[INFO]
[INFO] --- maven-checkstyle-plugin:3.0.0:check (checkstyle-check) @ maven-javadoc-plugin ---
[INFO] There are 4 errors reported by Checkstyle 6.18 with config/maven_checks.xml ruleset.
[INFO] Ignored 4 errors, 0 violation remaining.
[INFO]
[INFO] --- maven-invoker-plugin:3.1.0:verify (integration-test) @ maven-javadoc-plugin ---
[INFO] -------------------------------------------------
[INFO] Build Summary:
[INFO]   Passed: 60, Failed: 0, Errors: 0, Skipped: 5
[INFO] -------------------------------------------------
[INFO] ------------------------------------------------------------------------
[INFO] BUILD SUCCESS
[INFO] ------------------------------------------------------------------------
[INFO] Total time:  16:24 min
[INFO] Finished at: 2019-10-04T06:41:32-07:00
[INFO] ------------------------------------------------------------------------
[INFO] [jenkins-event-spy] Generated F:\jenkins\jenkins-slave\workspace\aven-javadoc-plugin_MJAVADOC-607@2@tmp\withMaven03ce8991\maven-spy-20191004-062507-24810989805050088857396.log
[Pipeline] }
[Pipeline] // dir
[Pipeline] }
[withMaven] artifactsPublisher - Archive artifact windows-jdk14-m3.6.x_build\pom.xml under org\apache\maven\plugins\maven-javadoc-plugin\3.1.2-SNAPSHOT\maven-javadoc-plugin-3.1.2-SNAPSHOT.pom
[withMaven] artifactsPublisher - Archive artifact windows-jdk14-m3.6.x_build\target\maven-javadoc-plugin-3.1.2-SNAPSHOT.jar under org\apache\maven\plugins\maven-javadoc-plugin\3.1.2-SNAPSHOT\maven-javadoc-plugin-3.1.2-SNAPSHOT.jar
[Fast Archiver] Compressed 491.66 KB of artifacts by 45.6% relative to #3
[withMaven] junitPublisher - Archive test results for Maven artifact org.apache.maven.plugins:maven-javadoc-plugin:maven-plugin:3.1.2-SNAPSHOT generated by maven-surefire-plugin:test (default-test): windows-jdk14-m3.6.x_build\target\surefire-reports\*.xml
Recording test results
[withMaven] openTasksPublisher - Scan Tasks for Maven artifact org.apache.maven.plugins:maven-javadoc-plugin:maven-plugin:3.1.2-SNAPSHOT in source directory windows-jdk14-m3.6.x_build\src\main\java
[TASKS] Scanning folder 'f:\jenkins\jenkins-slave\workspace\aven-javadoc-plugin_MJAVADOC-607@2' for files matching the pattern 'windows-jdk14-m3.6.x_build\src\main\java\**\*' - excludes: null
[TASKS] Found 26 files to scan for tasks
[TASKS] Found 7 open tasks.
Skipping warnings blame since pipelines do not have an SCM link.%n
[TASKS] Computing warning deltas based on reference build #3
[withMaven] invokerPublisher - Archive invoker results for Maven artifact MavenArtifact{org.apache.maven.plugins:maven-javadoc-plugin:maven-plugin:3.1.2-SNAPSHOT(version: 3.1.2-SNAPSHOT, snapshot:false) } generated by PluginInvocation{org.apache.maven.plugins:maven-invoker-plugin:3.1.0@integration-test  integration-test}: windows-jdk14-m3.6.x_build\target\invoker-reports\*.xml
[withMaven] Publishers: Generated Artifacts Publisher: 91 ms, Junit Publisher: 279 ms, Open Task Scanner Publisher: 335 ms, Dependencies Fingerprint Publisher: 1 ms, Invoker Publisher: 54108 ms, Pipeline Graph Publisher: 2 ms
[Pipeline] // withMaven
[Pipeline] cleanWs
[WS-CLEANUP] Deleting project workspace...
[WS-CLEANUP] Deferred wipeout is used...
[WS-CLEANUP] done
[Pipeline] }
[Pipeline] // stage
[Pipeline] }
[Pipeline] // ws
[Pipeline] }
[Pipeline] // node
[Pipeline] }
[Pipeline] // parallel
[Pipeline] stage
[Pipeline] { (Notifications)
[Pipeline] echo
Build result: FAILURE
[Pipeline] jiraIssueSelector
[Pipeline] echo
The authors of changes [].
[Pipeline] echo
Sending email ...
[Pipeline] emailext