Build unstable in Jenkins: Maven TLP » maven-javadoc-plugin » MJAVADOC-544 #1

classic Classic list List threaded Threaded
2 messages Options
Reply | Threaded
Open this post in threaded view
|

Build unstable in Jenkins: Maven TLP » maven-javadoc-plugin » MJAVADOC-544 #1

Apache Jenkins Server-2
See https://builds.apache.org/job/maven-box/job/maven-javadoc-plugin/job/MJAVADOC-544/1/

No changes.

6 tests failed.
FAILED:  org.apache.maven.plugins.javadoc.JavadocReportTest.testArgfileUmlautEncoding

Error Message:
An error has occurred in Javadoc report generation:
Exit code: 1 - /home/jenkins/jenkins-slave/workspace/javadoc-plugin_MJAVADOC-544-MKCC2TV3XPKYCGNP7Z5UGDHEHBZLBL3PZPHGHPHJXQBEK2OEPF2A@2/linux-jdk11-m3.5.x_build/src/test/resources/unit/argfileumlautencoding-test/argfileumlautencoding/test/Appäöüß.java:22: error: class Appäöüß is public, should be declared in a file named Appäöüß.java
public class Appäöüß
       ^

Command line was: /home/jenkins/tools/java/latest11/bin/javadoc @options @argfile

Refer to the generated Javadoc files in '/home/jenkins/jenkins-slave/workspace/javadoc-plugin_MJAVADOC-544-MKCC2TV3XPKYCGNP7Z5UGDHEHBZLBL3PZPHGHPHJXQBEK2OEPF2A@2/linux-jdk11-m3.5.x_build/target/test/unit/argfileumlautencoding-test/target/site/apidocs' dir.


Stack Trace:
org.apache.maven.plugin.MojoExecutionException:
An error has occurred in Javadoc report generation:
Exit code: 1 - /home/jenkins/jenkins-slave/workspace/javadoc-plugin_MJAVADOC-544-MKCC2TV3XPKYCGNP7Z5UGDHEHBZLBL3PZPHGHPHJXQBEK2OEPF2A@2/linux-jdk11-m3.5.x_build/src/test/resources/unit/argfileumlautencoding-test/argfileumlautencoding/test/Appäöüß.java:22: error: class Appäöüß is public, should be declared in a file named Appäöüß.java
public class Appäöüß
       ^

Command line was: /home/jenkins/tools/java/latest11/bin/javadoc @options @argfile

Refer to the generated Javadoc files in '/home/jenkins/jenkins-slave/workspace/javadoc-plugin_MJAVADOC-544-MKCC2TV3XPKYCGNP7Z5UGDHEHBZLBL3PZPHGHPHJXQBEK2OEPF2A@2/linux-jdk11-m3.5.x_build/target/test/unit/argfileumlautencoding-test/target/site/apidocs' dir.

        at org.apache.maven.plugins.javadoc.JavadocReportTest.testArgfileUmlautEncoding(JavadocReportTest.java:576)
Caused by: org.apache.maven.reporting.MavenReportException:

Exit code: 1 - /home/jenkins/jenkins-slave/workspace/javadoc-plugin_MJAVADOC-544-MKCC2TV3XPKYCGNP7Z5UGDHEHBZLBL3PZPHGHPHJXQBEK2OEPF2A@2/linux-jdk11-m3.5.x_build/src/test/resources/unit/argfileumlautencoding-test/argfileumlautencoding/test/Appäöüß.java:22: error: class Appäöüß is public, should be declared in a file named Appäöüß.java
public class Appäöüß
       ^

Command line was: /home/jenkins/tools/java/latest11/bin/javadoc @options @argfile

Refer to the generated Javadoc files in '/home/jenkins/jenkins-slave/workspace/javadoc-plugin_MJAVADOC-544-MKCC2TV3XPKYCGNP7Z5UGDHEHBZLBL3PZPHGHPHJXQBEK2OEPF2A@2/linux-jdk11-m3.5.x_build/target/test/unit/argfileumlautencoding-test/target/site/apidocs' dir.

        at org.apache.maven.plugins.javadoc.JavadocReportTest.testArgfileUmlautEncoding(JavadocReportTest.java:576)


FAILED:  org.apache.maven.plugins.javadoc.JavadocReportTest.testArgfileUmlautEncoding

Error Message:
An error has occurred in Javadoc report generation:
Exit code: 1 - /home/jenkins/jenkins-slave/workspace/javadoc-plugin_MJAVADOC-544-MKCC2TV3XPKYCGNP7Z5UGDHEHBZLBL3PZPHGHPHJXQBEK2OEPF2A@2/linux-jdk10-m3.5.x_build/src/test/resources/unit/argfileumlautencoding-test/argfileumlautencoding/test/Appäöüß.java:22: error: class Appäöüß is public, should be declared in a file named Appäöüß.java
public class Appäöüß
       ^

Command line was: /home/jenkins/tools/java/latest10/bin/javadoc @options @argfile

Refer to the generated Javadoc files in '/home/jenkins/jenkins-slave/workspace/javadoc-plugin_MJAVADOC-544-MKCC2TV3XPKYCGNP7Z5UGDHEHBZLBL3PZPHGHPHJXQBEK2OEPF2A@2/linux-jdk10-m3.5.x_build/target/test/unit/argfileumlautencoding-test/target/site/apidocs' dir.


Stack Trace:
org.apache.maven.plugin.MojoExecutionException:
An error has occurred in Javadoc report generation:
Exit code: 1 - /home/jenkins/jenkins-slave/workspace/javadoc-plugin_MJAVADOC-544-MKCC2TV3XPKYCGNP7Z5UGDHEHBZLBL3PZPHGHPHJXQBEK2OEPF2A@2/linux-jdk10-m3.5.x_build/src/test/resources/unit/argfileumlautencoding-test/argfileumlautencoding/test/Appäöüß.java:22: error: class Appäöüß is public, should be declared in a file named Appäöüß.java
public class Appäöüß
       ^

Command line was: /home/jenkins/tools/java/latest10/bin/javadoc @options @argfile

Refer to the generated Javadoc files in '/home/jenkins/jenkins-slave/workspace/javadoc-plugin_MJAVADOC-544-MKCC2TV3XPKYCGNP7Z5UGDHEHBZLBL3PZPHGHPHJXQBEK2OEPF2A@2/linux-jdk10-m3.5.x_build/target/test/unit/argfileumlautencoding-test/target/site/apidocs' dir.

        at org.apache.maven.plugins.javadoc.JavadocReportTest.testArgfileUmlautEncoding(JavadocReportTest.java:576)
Caused by: org.apache.maven.reporting.MavenReportException:

Exit code: 1 - /home/jenkins/jenkins-slave/workspace/javadoc-plugin_MJAVADOC-544-MKCC2TV3XPKYCGNP7Z5UGDHEHBZLBL3PZPHGHPHJXQBEK2OEPF2A@2/linux-jdk10-m3.5.x_build/src/test/resources/unit/argfileumlautencoding-test/argfileumlautencoding/test/Appäöüß.java:22: error: class Appäöüß is public, should be declared in a file named Appäöüß.java
public class Appäöüß
       ^

Command line was: /home/jenkins/tools/java/latest10/bin/javadoc @options @argfile

Refer to the generated Javadoc files in '/home/jenkins/jenkins-slave/workspace/javadoc-plugin_MJAVADOC-544-MKCC2TV3XPKYCGNP7Z5UGDHEHBZLBL3PZPHGHPHJXQBEK2OEPF2A@2/linux-jdk10-m3.5.x_build/target/test/unit/argfileumlautencoding-test/target/site/apidocs' dir.

        at org.apache.maven.plugins.javadoc.JavadocReportTest.testArgfileUmlautEncoding(JavadocReportTest.java:576)


FAILED:  org.apache.maven.plugins.javadoc.JavadocReportTest.testArgfileUmlautEncoding

Error Message:
An error has occurred in Javadoc report generation:
Exit code: 1 - /home/jenkins/jenkins-slave/workspace/javadoc-plugin_MJAVADOC-544-MKCC2TV3XPKYCGNP7Z5UGDHEHBZLBL3PZPHGHPHJXQBEK2OEPF2A@2/linux-jdk9-m3.5.x_build/src/test/resources/unit/argfileumlautencoding-test/argfileumlautencoding/test/Appäöüß.java:22: error: class Appäöüß is public, should be declared in a file named Appäöüß.java
public class Appäöüß
       ^

Command line was: /home/jenkins/tools/java/latest1.9/bin/javadoc @options @argfile

Refer to the generated Javadoc files in '/home/jenkins/jenkins-slave/workspace/javadoc-plugin_MJAVADOC-544-MKCC2TV3XPKYCGNP7Z5UGDHEHBZLBL3PZPHGHPHJXQBEK2OEPF2A@2/linux-jdk9-m3.5.x_build/target/test/unit/argfileumlautencoding-test/target/site/apidocs' dir.


Stack Trace:
org.apache.maven.plugin.MojoExecutionException:
An error has occurred in Javadoc report generation:
Exit code: 1 - /home/jenkins/jenkins-slave/workspace/javadoc-plugin_MJAVADOC-544-MKCC2TV3XPKYCGNP7Z5UGDHEHBZLBL3PZPHGHPHJXQBEK2OEPF2A@2/linux-jdk9-m3.5.x_build/src/test/resources/unit/argfileumlautencoding-test/argfileumlautencoding/test/Appäöüß.java:22: error: class Appäöüß is public, should be declared in a file named Appäöüß.java
public class Appäöüß
       ^

Command line was: /home/jenkins/tools/java/latest1.9/bin/javadoc @options @argfile

Refer to the generated Javadoc files in '/home/jenkins/jenkins-slave/workspace/javadoc-plugin_MJAVADOC-544-MKCC2TV3XPKYCGNP7Z5UGDHEHBZLBL3PZPHGHPHJXQBEK2OEPF2A@2/linux-jdk9-m3.5.x_build/target/test/unit/argfileumlautencoding-test/target/site/apidocs' dir.

        at org.apache.maven.plugins.javadoc.JavadocReportTest.testArgfileUmlautEncoding(JavadocReportTest.java:576)
Caused by: org.apache.maven.reporting.MavenReportException:

Exit code: 1 - /home/jenkins/jenkins-slave/workspace/javadoc-plugin_MJAVADOC-544-MKCC2TV3XPKYCGNP7Z5UGDHEHBZLBL3PZPHGHPHJXQBEK2OEPF2A@2/linux-jdk9-m3.5.x_build/src/test/resources/unit/argfileumlautencoding-test/argfileumlautencoding/test/Appäöüß.java:22: error: class Appäöüß is public, should be declared in a file named Appäöüß.java
public class Appäöüß
       ^

Command line was: /home/jenkins/tools/java/latest1.9/bin/javadoc @options @argfile

Refer to the generated Javadoc files in '/home/jenkins/jenkins-slave/workspace/javadoc-plugin_MJAVADOC-544-MKCC2TV3XPKYCGNP7Z5UGDHEHBZLBL3PZPHGHPHJXQBEK2OEPF2A@2/linux-jdk9-m3.5.x_build/target/test/unit/argfileumlautencoding-test/target/site/apidocs' dir.

        at org.apache.maven.plugins.javadoc.JavadocReportTest.testArgfileUmlautEncoding(JavadocReportTest.java:576)


FAILED:  org.apache.maven.plugins.javadoc.JavadocReportTest.testArgfileUmlautEncoding

Error Message:
null

Stack Trace:
junit.framework.AssertionFailedError
        at org.apache.maven.plugins.javadoc.JavadocReportTest.testArgfileUmlautEncoding(JavadocReportTest.java:591)


FAILED:  org.apache.maven.plugins.javadoc.JavadocReportTest.testArgfileUmlautEncoding

Error Message:
null

Stack Trace:
junit.framework.AssertionFailedError
        at org.apache.maven.plugins.javadoc.JavadocReportTest.testArgfileUmlautEncoding(JavadocReportTest.java:591)


FAILED:  org.apache.maven.plugins.javadoc.JavadocReportTest.testArgfileUmlautEncoding

Error Message:
null

Stack Trace:
junit.framework.AssertionFailedError
        at org.apache.maven.plugins.javadoc.JavadocReportTest.testArgfileUmlautEncoding(JavadocReportTest.java:591)




Build log:
[...truncated 6.05 MB...]
[windows-jdk7-m3.5.x_build] [INFO] Building: MJAVADOC-528\pom.xml
[windows-jdk7-m3.5.x_build] [INFO] run post-build script verify.groovy
[windows-jdk7-m3.5.x_build] [INFO]           MJAVADOC-528\pom.xml ............................. SUCCESS (11.4 s)
[windows-jdk7-m3.5.x_build] [INFO] Building: MJAVADOC-538\pom.xml
[windows-jdk7-m3.5.x_build] [INFO]           MJAVADOC-538\pom.xml ............................. SUCCESS (9.8 s)
[windows-jdk7-m3.5.x_build] [INFO] Building: site-failOnError\pom.xml
[windows-jdk7-m3.2.x_build] [INFO]           site-failOnError\pom.xml ......................... SUCCESS (19.9 s)
[windows-jdk7-m3.2.x_build] [INFO]
[windows-jdk7-m3.2.x_build] [INFO] --- mrm-maven-plugin:1.1.0:stop (repository) @ maven-javadoc-plugin ---
[windows-jdk7-m3.2.x_build] [INFO] Stopping Mock Repository Manager on http://localhost:49332
[windows-jdk7-m3.2.x_build] [INFO] Stopped SocketConnector@0.0.0.0:49332
[windows-jdk7-m3.2.x_build] [INFO] Mock Repository Manager http://localhost:49332 is stopped.
[windows-jdk7-m3.2.x_build] [INFO]
[windows-jdk7-m3.2.x_build] [INFO] --- mrm-maven-plugin:1.1.0:stop (3rdparty) @ maven-javadoc-plugin ---
[windows-jdk7-m3.2.x_build] [INFO] Stopping Mock Repository Manager on http://localhost:49333
[windows-jdk7-m3.2.x_build] [INFO] Stopped SocketConnector@0.0.0.0:49333
[windows-jdk7-m3.2.x_build] [INFO] Mock Repository Manager http://localhost:49333 is stopped.
[windows-jdk7-m3.2.x_build] [INFO]
[windows-jdk7-m3.2.x_build] [INFO] --- maven-checkstyle-plugin:3.0.0:check (checkstyle-check) @ maven-javadoc-plugin ---
[windows-jdk7-m3.2.x_build] [INFO] Downloading: https://repo.maven.apache.org/maven2/org/apache/maven/shared/maven-shared-resources/2/maven-shared-resources-2.pom
[windows-jdk7-m3.2.x_build] [INFO] Downloaded: https://repo.maven.apache.org/maven2/org/apache/maven/shared/maven-shared-resources/2/maven-shared-resources-2.pom (3 KB at 65.6 KB/sec)
[windows-jdk7-m3.2.x_build] [INFO] Downloading: https://repo.maven.apache.org/maven2/org/codehaus/plexus/plexus-utils/3.0.10/plexus-utils-3.0.10.pom
[windows-jdk7-m3.2.x_build] [INFO] Downloaded: https://repo.maven.apache.org/maven2/org/codehaus/plexus/plexus-utils/3.0.10/plexus-utils-3.0.10.pom (4 KB at 71.4 KB/sec)
[windows-jdk7-m3.2.x_build] [INFO] Downloading: https://repo.maven.apache.org/maven2/org/codehaus/plexus/plexus/3.3/plexus-3.3.pom
[windows-jdk7-m3.2.x_build] [INFO] Downloaded: https://repo.maven.apache.org/maven2/org/codehaus/plexus/plexus/3.3/plexus-3.3.pom (20 KB at 413.5 KB/sec)
[windows-jdk7-m3.2.x_build] [INFO] Downloading: https://repo.maven.apache.org/maven2/org/apache/maven/doxia/doxia-integration-tools/1.6/doxia-integration-tools-1.6.pom
[windows-jdk7-m3.2.x_build] [INFO] Downloaded: https://repo.maven.apache.org/maven2/org/apache/maven/doxia/doxia-integration-tools/1.6/doxia-integration-tools-1.6.pom (7 KB at 158.0 KB/sec)
[windows-jdk7-m3.2.x_build] [INFO] Downloading: https://repo.maven.apache.org/maven2/org/apache/maven/doxia/doxia-tools/3/doxia-tools-3.pom
[windows-jdk7-m3.2.x_build] [INFO] Downloaded: https://repo.maven.apache.org/maven2/org/apache/maven/doxia/doxia-tools/3/doxia-tools-3.pom (10 KB at 149.2 KB/sec)
[windows-jdk7-m3.2.x_build] [INFO] Downloading: https://repo.maven.apache.org/maven2/org/codehaus/plexus/plexus-resources/1.1.0/plexus-resources-1.1.0.pom
[windows-jdk7-m3.2.x_build] [INFO] Downloaded: https://repo.maven.apache.org/maven2/org/codehaus/plexus/plexus-resources/1.1.0/plexus-resources-1.1.0.pom (4 KB at 68.9 KB/sec)
[windows-jdk7-m3.2.x_build] [INFO] Downloading: https://repo.maven.apache.org/maven2/com/puppycrawl/tools/checkstyle/6.18/checkstyle-6.18.pom
[windows-jdk7-m3.2.x_build] [INFO] Downloaded: https://repo.maven.apache.org/maven2/com/puppycrawl/tools/checkstyle/6.18/checkstyle-6.18.pom (70 KB at 1261.1 KB/sec)
[windows-jdk7-m3.2.x_build] [INFO] Downloading: https://repo.maven.apache.org/maven2/antlr/antlr/2.7.7/antlr-2.7.7.pom
[windows-jdk7-m3.2.x_build] [INFO] Downloaded: https://repo.maven.apache.org/maven2/antlr/antlr/2.7.7/antlr-2.7.7.pom (632 B at 12.3 KB/sec)
[windows-jdk7-m3.2.x_build] [INFO] Downloading: https://repo.maven.apache.org/maven2/org/antlr/antlr4-runtime/4.5.3/antlr4-runtime-4.5.3.pom
[windows-jdk7-m3.2.x_build] [INFO] Downloaded: https://repo.maven.apache.org/maven2/org/antlr/antlr4-runtime/4.5.3/antlr4-runtime-4.5.3.pom (3 KB at 57.8 KB/sec)
[windows-jdk7-m3.2.x_build] [INFO] Downloading: https://repo.maven.apache.org/maven2/org/antlr/antlr4-master/4.5.3/antlr4-master-4.5.3.pom
[windows-jdk7-m3.2.x_build] [INFO] Downloaded: https://repo.maven.apache.org/maven2/org/antlr/antlr4-master/4.5.3/antlr4-master-4.5.3.pom (4 KB at 70.5 KB/sec)
[windows-jdk7-m3.2.x_build] [INFO] Downloading: https://repo.maven.apache.org/maven2/commons-beanutils/commons-beanutils/1.9.2/commons-beanutils-1.9.2.pom
[windows-jdk7-m3.2.x_build] [INFO] Downloaded: https://repo.maven.apache.org/maven2/commons-beanutils/commons-beanutils/1.9.2/commons-beanutils-1.9.2.pom (14 KB at 303.7 KB/sec)
[windows-jdk7-m3.2.x_build] [INFO] Downloading: https://repo.maven.apache.org/maven2/org/apache/commons/commons-parent/33/commons-parent-33.pom
[windows-jdk7-m3.2.x_build] [INFO] Downloaded: https://repo.maven.apache.org/maven2/org/apache/commons/commons-parent/33/commons-parent-33.pom (52 KB at 893.9 KB/sec)
[windows-jdk7-m3.2.x_build] [INFO] Downloading: https://repo.maven.apache.org/maven2/commons-cli/commons-cli/1.3.1/commons-cli-1.3.1.pom
[windows-jdk7-m3.2.x_build] [INFO] Downloaded: https://repo.maven.apache.org/maven2/commons-cli/commons-cli/1.3.1/commons-cli-1.3.1.pom (11 KB at 230.7 KB/sec)
[windows-jdk7-m3.2.x_build] [INFO] Downloading: https://repo.maven.apache.org/maven2/com/google/guava/guava/19.0/guava-19.0.pom
[windows-jdk7-m3.2.x_build] [INFO] Downloaded: https://repo.maven.apache.org/maven2/com/google/guava/guava/19.0/guava-19.0.pom (7 KB at 154.3 KB/sec)
[windows-jdk7-m3.2.x_build] [INFO] Downloading: https://repo.maven.apache.org/maven2/com/google/guava/guava-parent/19.0/guava-parent-19.0.pom
[windows-jdk7-m3.2.x_build] [INFO] Downloaded: https://repo.maven.apache.org/maven2/com/google/guava/guava-parent/19.0/guava-parent-19.0.pom (10 KB at 205.2 KB/sec)
[windows-jdk7-m3.2.x_build] [INFO] Downloading: https://repo.maven.apache.org/maven2/org/sonatype/oss/oss-parent/7/oss-parent-7.pom
[windows-jdk7-m3.2.x_build] [INFO] Downloaded: https://repo.maven.apache.org/maven2/org/sonatype/oss/oss-parent/7/oss-parent-7.pom (5 KB at 104.7 KB/sec)
[windows-jdk7-m3.2.x_build] [INFO] Downloading: https://repo.maven.apache.org/maven2/org/apache/maven/shared/maven-shared-resources/2/maven-shared-resources-2.jar
[windows-jdk7-m3.2.x_build] [INFO] Downloading: https://repo.maven.apache.org/maven2/org/apache/maven/doxia/doxia-core/1.2/doxia-core-1.2.jar
[windows-jdk7-m3.2.x_build] [INFO] Downloading: https://repo.maven.apache.org/maven2/commons-digester/commons-digester/1.6/commons-digester-1.6.jar
[windows-jdk7-m3.2.x_build] [INFO] Downloading: https://repo.maven.apache.org/maven2/org/apache/maven/doxia/doxia-integration-tools/1.6/doxia-integration-tools-1.6.jar
[windows-jdk7-m3.2.x_build] [INFO] Downloading: https://repo.maven.apache.org/maven2/commons-logging/commons-logging/1.0.4/commons-logging-1.0.4.jar
[windows-jdk7-m3.2.x_build] [INFO] Downloaded: https://repo.maven.apache.org/maven2/commons-logging/commons-logging/1.0.4/commons-logging-1.0.4.jar (38 KB at 905.5 KB/sec)
[windows-jdk7-m3.2.x_build] [INFO] Downloading: https://repo.maven.apache.org/maven2/commons-io/commons-io/1.4/commons-io-1.4.jar
[windows-jdk7-m3.2.x_build] [INFO] Downloaded: https://repo.maven.apache.org/maven2/commons-digester/commons-digester/1.6/commons-digester-1.6.jar (165 KB at 2741.6 KB/sec)
[windows-jdk7-m3.2.x_build] [INFO] Downloading: https://repo.maven.apache.org/maven2/org/codehaus/plexus/plexus-resources/1.1.0/plexus-resources-1.1.0.jar
[windows-jdk7-m3.2.x_build] [INFO] Downloaded: https://repo.maven.apache.org/maven2/org/apache/maven/doxia/doxia-core/1.2/doxia-core-1.2.jar (151 KB at 1929.6 KB/sec)
[windows-jdk7-m3.2.x_build] [INFO] Downloading: https://repo.maven.apache.org/maven2/com/puppycrawl/tools/checkstyle/6.18/checkstyle-6.18.jar
[windows-jdk7-m3.2.x_build] [INFO] Downloaded: https://repo.maven.apache.org/maven2/org/apache/maven/shared/maven-shared-resources/2/maven-shared-resources-2.jar (13 KB at 87.3 KB/sec)
[windows-jdk7-m3.2.x_build] [INFO] Downloading: https://repo.maven.apache.org/maven2/antlr/antlr/2.7.7/antlr-2.7.7.jar
[windows-jdk7-m3.2.x_build] [INFO] Downloaded: https://repo.maven.apache.org/maven2/commons-io/commons-io/1.4/commons-io-1.4.jar (107 KB at 724.4 KB/sec)
[windows-jdk7-m3.2.x_build] [INFO] Downloading: https://repo.maven.apache.org/maven2/org/antlr/antlr4-runtime/4.5.3/antlr4-runtime-4.5.3.jar
[windows-jdk7-m3.2.x_build] [INFO] Downloaded: https://repo.maven.apache.org/maven2/com/puppycrawl/tools/checkstyle/6.18/checkstyle-6.18.jar (1132 KB at 6463.8 KB/sec)
[windows-jdk7-m3.2.x_build] [INFO] Downloading: https://repo.maven.apache.org/maven2/commons-beanutils/commons-beanutils/1.9.2/commons-beanutils-1.9.2.jar
[windows-jdk7-m3.2.x_build] [INFO] Downloaded: https://repo.maven.apache.org/maven2/org/antlr/antlr4-runtime/4.5.3/antlr4-runtime-4.5.3.jar (296 KB at 1498.3 KB/sec)
[windows-jdk7-m3.2.x_build] [INFO] Downloading: https://repo.maven.apache.org/maven2/commons-cli/commons-cli/1.3.1/commons-cli-1.3.1.jar
[windows-jdk7-m3.2.x_build] [INFO] Downloaded: https://repo.maven.apache.org/maven2/antlr/antlr/2.7.7/antlr-2.7.7.jar (435 KB at 2131.6 KB/sec)
[windows-jdk7-m3.2.x_build] [INFO] Downloading: https://repo.maven.apache.org/maven2/com/google/guava/guava/19.0/guava-19.0.jar
[windows-jdk7-m3.2.x_build] [INFO] Downloaded: https://repo.maven.apache.org/maven2/commons-beanutils/commons-beanutils/1.9.2/commons-beanutils-1.9.2.jar (229 KB at 1006.1 KB/sec)
[windows-jdk7-m3.2.x_build] [INFO] Downloaded: https://repo.maven.apache.org/maven2/org/codehaus/plexus/plexus-resources/1.1.0/plexus-resources-1.1.0.jar (23 KB at 99.8 KB/sec)
[windows-jdk7-m3.2.x_build] [INFO] Downloading: https://repo.maven.apache.org/maven2/commons-lang/commons-lang/2.1/commons-lang-2.1.jar
[windows-jdk7-m3.2.x_build] [INFO] Downloaded: https://repo.maven.apache.org/maven2/org/apache/maven/doxia/doxia-integration-tools/1.6/doxia-integration-tools-1.6.jar (44 KB at 186.3 KB/sec)
[windows-jdk7-m3.2.x_build] [INFO] Downloaded: https://repo.maven.apache.org/maven2/commons-cli/commons-cli/1.3.1/commons-cli-1.3.1.jar (52 KB at 213.8 KB/sec)
[windows-jdk7-m3.2.x_build] [INFO] Downloaded: https://repo.maven.apache.org/maven2/commons-lang/commons-lang/2.1/commons-lang-2.1.jar (203 KB at 727.1 KB/sec)
[windows-jdk7-m3.2.x_build] [INFO] Downloaded: https://repo.maven.apache.org/maven2/com/google/guava/guava/19.0/guava-19.0.jar (2255 KB at 7111.7 KB/sec)
[windows-jdk7-m3.2.x_build] [INFO] There are 4 errors reported by Checkstyle 6.18 with config/maven_checks.xml ruleset.
[windows-jdk7-m3.2.x_build] [INFO] Ignored 4 errors, 0 violation remaining.
[windows-jdk7-m3.2.x_build] [INFO]
[windows-jdk7-m3.2.x_build] [INFO] --- maven-invoker-plugin:3.1.0:verify (integration-test) @ maven-javadoc-plugin ---
[windows-jdk7-m3.2.x_build] [INFO] -------------------------------------------------
[windows-jdk7-m3.2.x_build] [INFO] Build Summary:
[windows-jdk7-m3.2.x_build] [INFO]   Passed: 36, Failed: 0, Errors: 0, Skipped: 5
[windows-jdk7-m3.2.x_build] [INFO] -------------------------------------------------
[windows-jdk7-m3.2.x_build] [INFO] ------------------------------------------------------------------------
[windows-jdk7-m3.2.x_build] [INFO] BUILD SUCCESS
[windows-jdk7-m3.2.x_build] [INFO] ------------------------------------------------------------------------
[windows-jdk7-m3.2.x_build] [INFO] Total time: 14:50 min
[windows-jdk7-m3.2.x_build] [INFO] Finished at: 2018-12-03T08:48:19-08:00
[windows-jdk7-m3.2.x_build] [INFO] Final Memory: 62M/935M
[windows-jdk7-m3.2.x_build] [INFO] ------------------------------------------------------------------------
[windows-jdk7-m3.2.x_build] [INFO] [jenkins-event-spy] Generated F:\jenkins\jenkins-slave\workspace\javadoc-plugin_MJAVADOC-544-MKCC2TV3XPKYCGNP7Z5UGDHEHBZLBL3PZPHGHPHJXQBEK2OEPF2A@3@tmp\withMaven1d95fff0\maven-spy-20181203-083327-9171742270496555003747.log
[windows-jdk7-m3.2.x_build] Picked up JAVA_TOOL_OPTIONS: -Dmaven.ext.class.path="f:\jenkins\jenkins-slave\workspace\javadoc-plugin_MJAVADOC-544-MKCC2TV3XPKYCGNP7Z5UGDHEHBZLBL3PZPHGHPHJXQBEK2OEPF2A@3@tmp\withMaven1d95fff0\pipeline-maven-spy.jar" -Dorg.jenkinsci.plugins.pipeline.maven.reportsFolder="f:\jenkins\jenkins-slave\workspace\javadoc-plugin_MJAVADOC-544-MKCC2TV3XPKYCGNP7Z5UGDHEHBZLBL3PZPHGHPHJXQBEK2OEPF2A@3@tmp\withMaven1d95fff0"
[Pipeline] [windows-jdk7-m3.2.x_build] }
[Pipeline] [windows-jdk7-m3.2.x_build] // dir
[Pipeline] [windows-jdk7-m3.2.x_build] }
[windows-jdk7-m3.2.x_build] [withMaven] artifactsPublisher - Archive artifact windows-jdk7-m3.2.x_build\pom.xml under org\apache\maven\plugins\maven-javadoc-plugin\3.0.2-SNAPSHOT\maven-javadoc-plugin-3.0.2-SNAPSHOT.pom
[windows-jdk7-m3.2.x_build] [withMaven] artifactsPublisher - Archive artifact windows-jdk7-m3.2.x_build\target\maven-javadoc-plugin-3.0.2-SNAPSHOT.jar under org\apache\maven\plugins\maven-javadoc-plugin\3.0.2-SNAPSHOT\maven-javadoc-plugin-3.0.2-SNAPSHOT.jar
[windows-jdk7-m3.2.x_build] [Fast Archiver] No prior successful build to compare, so performing full copy of artifacts
[windows-jdk7-m3.2.x_build] [withMaven] invokerPublisher - Archive invoker results for Maven artifact MavenArtifact{org.apache.maven.plugins:maven-javadoc-plugin::3.0.2-SNAPSHOT(version: 3.0.2-SNAPSHOT, snapshot:false) } generated by PluginInvocation{org.apache.maven.plugins:maven-invoker-plugin:3.1.0@integration-test  integration-test}: windows-jdk7-m3.2.x_build\target\invoker-reports\*.xml
[windows-jdk7-m3.2.x_build] performing MavenInvokerRecorder, reportsFilenamePattern:'**/windows-jdk7-m3.2.x_build\target\invoker-reports/BUILD*.xml', invokerBuildDir:'**/windows-jdk7-m3.2.x_build\target\it'
[windows-jdk7-m3.2.x_build] Found reports:[f:\jenkins\jenkins-slave\workspace\javadoc-plugin_MJAVADOC-544-MKCC2TV3XPKYCGNP7Z5UGDHEHBZLBL3PZPHGHPHJXQBEK2OEPF2A@3\windows-jdk7-m3.2.x_build\target\invoker-reports\BUILD-MJAVADOC-110.xml, f:\jenkins\jenkins-slave\workspace\javadoc-plugin_MJAVADOC-544-MKCC2TV3XPKYCGNP7Z5UGDHEHBZLBL3PZPHGHPHJXQBEK2OEPF2A@3\windows-jdk7-m3.2.x_build\target\invoker-reports\BUILD-MJAVADOC-126.xml, f:\jenkins\jenkins-slave\workspace\javadoc-plugin_MJAVADOC-544-MKCC2TV3XPKYCGNP7Z5UGDHEHBZLBL3PZPHGHPHJXQBEK2OEPF2A@3\windows-jdk7-m3.2.x_build\target\invoker-reports\BUILD-MJAVADOC-137.xml, f:\jenkins\jenkins-slave\workspace\javadoc-plugin_MJAVADOC-544-MKCC2TV3XPKYCGNP7Z5UGDHEHBZLBL3PZPHGHPHJXQBEK2OEPF2A@3\windows-jdk7-m3.2.x_build\target\invoker-reports\BUILD-MJAVADOC-172.xml, f:\jenkins\jenkins-slave\workspace\javadoc-plugin_MJAVADOC-544-MKCC2TV3XPKYCGNP7Z5UGDHEHBZLBL3PZPHGHPHJXQBEK2OEPF2A@3\windows-jdk7-m3.2.x_build\target\invoker-reports\BUILD-MJAVADOC-180.xml, f:\jenkins\jenkins-slave\workspace\javadoc-plugin_MJAVADOC-544-MKCC2TV3XPKYCGNP7Z5UGDHEHBZLBL3PZPHGHPHJXQBEK2OEPF2A@3\windows-jdk7-m3.2.x_build\target\invoker-reports\BUILD-MJAVADOC-194.xml, f:\jenkins\jenkins-slave\workspace\javadoc-plugin_MJAVADOC-544-MKCC2TV3XPKYCGNP7Z5UGDHEHBZLBL3PZPHGHPHJXQBEK2OEPF2A@3\windows-jdk7-m3.2.x_build\target\invoker-reports\BUILD-MJAVADOC-250.xml, f:\jenkins\jenkins-slave\workspace\javadoc-plugin_MJAVADOC-544-MKCC2TV3XPKYCGNP7Z5UGDHEHBZLBL3PZPHGHPHJXQBEK2OEPF2A@3\windows-jdk7-m3.2.x_build\target\invoker-reports\BUILD-MJAVADOC-257.xml, f:\jenkins\jenkins-slave\workspace\javadoc-plugin_MJAVADOC-544-MKCC2TV3XPKYCGNP7Z5UGDHEHBZLBL3PZPHGHPHJXQBEK2OEPF2A@3\windows-jdk7-m3.2.x_build\target\invoker-reports\BUILD-MJAVADOC-259.xml, f:\jenkins\jenkins-slave\workspace\javadoc-plugin_MJAVADOC-544-MKCC2TV3XPKYCGNP7Z5UGDHEHBZLBL3PZPHGHPHJXQBEK2OEPF2A@3\windows-jdk7-m3.2.x_build\target\invoker-reports\BUILD-MJAVADOC-262.xml, f:\jenkins\jenkins-slave\workspace\javadoc-plugin_MJAVADOC-544-MKCC2TV3XPKYCGNP7Z5UGDHEHBZLBL3PZPHGHPHJXQBEK2OEPF2A@3\windows-jdk7-m3.2.x_build\target\invoker-reports\BUILD-MJAVADOC-275.xml, f:\jenkins\jenkins-slave\workspace\javadoc-plugin_MJAVADOC-544-MKCC2TV3XPKYCGNP7Z5UGDHEHBZLBL3PZPHGHPHJXQBEK2OEPF2A@3\windows-jdk7-m3.2.x_build\target\invoker-reports\BUILD-MJAVADOC-278.xml, f:\jenkins\jenkins-slave\workspace\javadoc-plugin_MJAVADOC-544-MKCC2TV3XPKYCGNP7Z5UGDHEHBZLBL3PZPHGHPHJXQBEK2OEPF2A@3\windows-jdk7-m3.2.x_build\target\invoker-reports\BUILD-MJAVADOC-320.xml, f:\jenkins\jenkins-slave\workspace\javadoc-plugin_MJAVADOC-544-MKCC2TV3XPKYCGNP7Z5UGDHEHBZLBL3PZPHGHPHJXQBEK2OEPF2A@3\windows-jdk7-m3.2.x_build\target\invoker-reports\BUILD-MJAVADOC-325.xml, f:\jenkins\jenkins-slave\workspace\javadoc-plugin_MJAVADOC-544-MKCC2TV3XPKYCGNP7Z5UGDHEHBZLBL3PZPHGHPHJXQBEK2OEPF2A@3\windows-jdk7-m3.2.x_build\target\invoker-reports\BUILD-MJAVADOC-365.xml, f:\jenkins\jenkins-slave\workspace\javadoc-plugin_MJAVADOC-544-MKCC2TV3XPKYCGNP7Z5UGDHEHBZLBL3PZPHGHPHJXQBEK2OEPF2A@3\windows-jdk7-m3.2.x_build\target\invoker-reports\BUILD-MJAVADOC-369.xml, f:\jenkins\jenkins-slave\workspace\javadoc-plugin_MJAVADOC-544-MKCC2TV3XPKYCGNP7Z5UGDHEHBZLBL3PZPHGHPHJXQBEK2OEPF2A@3\windows-jdk7-m3.2.x_build\target\invoker-reports\BUILD-MJAVADOC-384.xml, f:\jenkins\jenkins-slave\workspace\javadoc-plugin_MJAVADOC-544-MKCC2TV3XPKYCGNP7Z5UGDHEHBZLBL3PZPHGHPHJXQBEK2OEPF2A@3\windows-jdk7-m3.2.x_build\target\invoker-reports\BUILD-MJAVADOC-407.xml, f:\jenkins\jenkins-slave\workspace\javadoc-plugin_MJAVADOC-544-MKCC2TV3XPKYCGNP7Z5UGDHEHBZLBL3PZPHGHPHJXQBEK2OEPF2A@3\windows-jdk7-m3.2.x_build\target\invoker-reports\BUILD-MJAVADOC-414.xml, f:\jenkins\jenkins-slave\workspace\javadoc-plugin_MJAVADOC-544-MKCC2TV3XPKYCGNP7Z5UGDHEHBZLBL3PZPHGHPHJXQBEK2OEPF2A@3\windows-jdk7-m3.2.x_build\target\invoker-reports\BUILD-MJAVADOC-427.xml, f:\jenkins\jenkins-slave\workspace\javadoc-plugin_MJAVADOC-544-MKCC2TV3XPKYCGNP7Z5UGDHEHBZLBL3PZPHGHPHJXQBEK2OEPF2A@3\windows-jdk7-m3.2.x_build\target\invoker-reports\BUILD-MJAVADOC-437.xml, f:\jenkins\jenkins-slave\workspace\javadoc-plugin_MJAVADOC-544-MKCC2TV3XPKYCGNP7Z5UGDHEHBZLBL3PZPHGHPHJXQBEK2OEPF2A@3\windows-jdk7-m3.2.x_build\target\invoker-reports\BUILD-MJAVADOC-449_aggr_modulepath.xml, f:\jenkins\jenkins-slave\workspace\javadoc-plugin_MJAVADOC-544-MKCC2TV3XPKYCGNP7Z5UGDHEHBZLBL3PZPHGHPHJXQBEK2OEPF2A@3\windows-jdk7-m3.2.x_build\target\invoker-reports\BUILD-MJAVADOC-494_aggregate-repositories.xml, f:\jenkins\jenkins-slave\workspace\javadoc-plugin_MJAVADOC-544-MKCC2TV3XPKYCGNP7Z5UGDHEHBZLBL3PZPHGHPHJXQBEK2OEPF2A@3\windows-jdk7-m3.2.x_build\target\invoker-reports\BUILD-MJAVADOC-497.xml, f:\jenkins\jenkins-slave\workspace\javadoc-plugin_MJAVADOC-544-MKCC2TV3XPKYCGNP7Z5UGDHEHBZLBL3PZPHGHPHJXQBEK2OEPF2A@3\windows-jdk7-m3.2.x_build\target\invoker-reports\BUILD-MJAVADOC-498_aggr_modulepath.xml, f:\jenkins\jenkins-slave\workspace\javadoc-plugin_MJAVADOC-544-MKCC2TV3XPKYCGNP7Z5UGDHEHBZLBL3PZPHGHPHJXQBEK2OEPF2A@3\windows-jdk7-m3.2.x_build\target\invoker-reports\BUILD-MJAVADOC-498_mm_modulepath.xml, f:\jenkins\jenkins-slave\workspace\javadoc-plugin_MJAVADOC-544-MKCC2TV3XPKYCGNP7Z5UGDHEHBZLBL3PZPHGHPHJXQBEK2OEPF2A@3\windows-jdk7-m3.2.x_build\target\invoker-reports\BUILD-MJAVADOC-498_modulepath.xml, f:\jenkins\jenkins-slave\workspace\javadoc-plugin_MJAVADOC-544-MKCC2TV3XPKYCGNP7Z5UGDHEHBZLBL3PZPHGHPHJXQBEK2OEPF2A@3\windows-jdk7-m3.2.x_build\target\invoker-reports\BUILD-MJAVADOC-506_excl-module-info.xml, f:\jenkins\jenkins-slave\workspace\javadoc-plugin_MJAVADOC-544-MKCC2TV3XPKYCGNP7Z5UGDHEHBZLBL3PZPHGHPHJXQBEK2OEPF2A@3\windows-jdk7-m3.2.x_build\target\invoker-reports\BUILD-MJAVADOC-508.xml, f:\jenkins\jenkins-slave\workspace\javadoc-plugin_MJAVADOC-544-MKCC2TV3XPKYCGNP7Z5UGDHEHBZLBL3PZPHGHPHJXQBEK2OEPF2A@3\windows-jdk7-m3.2.x_build\target\invoker-reports\BUILD-MJAVADOC-514_3rdparty-doclettags.xml, f:\jenkins\jenkins-slave\workspace\javadoc-plugin_MJAVADOC-544-MKCC2TV3XPKYCGNP7Z5UGDHEHBZLBL3PZPHGHPHJXQBEK2OEPF2A@3\windows-jdk7-m3.2.x_build\target\invoker-reports\BUILD-MJAVADOC-528.xml, f:\jenkins\jenkins-slave\workspace\javadoc-plugin_MJAVADOC-544-MKCC2TV3XPKYCGNP7Z5UGDHEHBZLBL3PZPHGHPHJXQBEK2OEPF2A@3\windows-jdk7-m3.2.x_build\target\invoker-reports\BUILD-MJAVADOC-538.xml, f:\jenkins\jenkins-slave\workspace\javadoc-plugin_MJAVADOC-544-MKCC2TV3XPKYCGNP7Z5UGDHEHBZLBL3PZPHGHPHJXQBEK2OEPF2A@3\windows-jdk7-m3.2.x_build\target\invoker-reports\BUILD-additional-dependencies-non-aggregate.xml, f:\jenkins\jenkins-slave\workspace\javadoc-plugin_MJAVADOC-544-MKCC2TV3XPKYCGNP7Z5UGDHEHBZLBL3PZPHGHPHJXQBEK2OEPF2A@3\windows-jdk7-m3.2.x_build\target\invoker-reports\BUILD-additional-dependencies.xml, f:\jenkins\jenkins-slave\workspace\javadoc-plugin_MJAVADOC-544-MKCC2TV3XPKYCGNP7Z5UGDHEHBZLBL3PZPHGHPHJXQBEK2OEPF2A@3\windows-jdk7-m3.2.x_build\target\invoker-reports\BUILD-dependencySource-1.xml, f:\jenkins\jenkins-slave\workspace\javadoc-plugin_MJAVADOC-544-MKCC2TV3XPKYCGNP7Z5UGDHEHBZLBL3PZPHGHPHJXQBEK2OEPF2A@3\windows-jdk7-m3.2.x_build\target\invoker-reports\BUILD-dependencySource-2.xml, f:\jenkins\jenkins-slave\workspace\javadoc-plugin_MJAVADOC-544-MKCC2TV3XPKYCGNP7Z5UGDHEHBZLBL3PZPHGHPHJXQBEK2OEPF2A@3\windows-jdk7-m3.2.x_build\target\invoker-reports\BUILD-dependencySource-3.xml, f:\jenkins\jenkins-slave\workspace\javadoc-plugin_MJAVADOC-544-MKCC2TV3XPKYCGNP7Z5UGDHEHBZLBL3PZPHGHPHJXQBEK2OEPF2A@3\windows-jdk7-m3.2.x_build\target\invoker-reports\BUILD-dependencySource-4.xml, f:\jenkins\jenkins-slave\workspace\javadoc-plugin_MJAVADOC-544-MKCC2TV3XPKYCGNP7Z5UGDHEHBZLBL3PZPHGHPHJXQBEK2OEPF2A@3\windows-jdk7-m3.2.x_build\target\invoker-reports\BUILD-detectLinks.xml, f:\jenkins\jenkins-slave\workspace\javadoc-plugin_MJAVADOC-544-MKCC2TV3XPKYCGNP7Z5UGDHEHBZLBL3PZPHGHPHJXQBEK2OEPF2A@3\windows-jdk7-m3.2.x_build\target\invoker-reports\BUILD-javadoc-fix.xml, f:\jenkins\jenkins-slave\workspace\javadoc-plugin_MJAVADOC-544-MKCC2TV3XPKYCGNP7Z5UGDHEHBZLBL3PZPHGHPHJXQBEK2OEPF2A@3\windows-jdk7-m3.2.x_build\target\invoker-reports\BUILD-site-failOnError.xml]
[windows-jdk7-m3.2.x_build] Found logs:[f:\jenkins\jenkins-slave\workspace\javadoc-plugin_MJAVADOC-544-MKCC2TV3XPKYCGNP7Z5UGDHEHBZLBL3PZPHGHPHJXQBEK2OEPF2A@3\windows-jdk7-m3.2.x_build\target\it\MJAVADOC-110\build.log, f:\jenkins\jenkins-slave\workspace\javadoc-plugin_MJAVADOC-544-MKCC2TV3XPKYCGNP7Z5UGDHEHBZLBL3PZPHGHPHJXQBEK2OEPF2A@3\windows-jdk7-m3.2.x_build\target\it\MJAVADOC-126\build.log, f:\jenkins\jenkins-slave\workspace\javadoc-plugin_MJAVADOC-544-MKCC2TV3XPKYCGNP7Z5UGDHEHBZLBL3PZPHGHPHJXQBEK2OEPF2A@3\windows-jdk7-m3.2.x_build\target\it\MJAVADOC-137\build.log, f:\jenkins\jenkins-slave\workspace\javadoc-plugin_MJAVADOC-544-MKCC2TV3XPKYCGNP7Z5UGDHEHBZLBL3PZPHGHPHJXQBEK2OEPF2A@3\windows-jdk7-m3.2.x_build\target\it\MJAVADOC-172\build.log, f:\jenkins\jenkins-slave\workspace\javadoc-plugin_MJAVADOC-544-MKCC2TV3XPKYCGNP7Z5UGDHEHBZLBL3PZPHGHPHJXQBEK2OEPF2A@3\windows-jdk7-m3.2.x_build\target\it\MJAVADOC-180\build.log, f:\jenkins\jenkins-slave\workspace\javadoc-plugin_MJAVADOC-544-MKCC2TV3XPKYCGNP7Z5UGDHEHBZLBL3PZPHGHPHJXQBEK2OEPF2A@3\windows-jdk7-m3.2.x_build\target\it\MJAVADOC-194\build.log, f:\jenkins\jenkins-slave\workspace\javadoc-plugin_MJAVADOC-544-MKCC2TV3XPKYCGNP7Z5UGDHEHBZLBL3PZPHGHPHJXQBEK2OEPF2A@3\windows-jdk7-m3.2.x_build\target\it\MJAVADOC-250\build.log, f:\jenkins\jenkins-slave\workspace\javadoc-plugin_MJAVADOC-544-MKCC2TV3XPKYCGNP7Z5UGDHEHBZLBL3PZPHGHPHJXQBEK2OEPF2A@3\windows-jdk7-m3.2.x_build\target\it\MJAVADOC-257\build.log, f:\jenkins\jenkins-slave\workspace\javadoc-plugin_MJAVADOC-544-MKCC2TV3XPKYCGNP7Z5UGDHEHBZLBL3PZPHGHPHJXQBEK2OEPF2A@3\windows-jdk7-m3.2.x_build\target\it\MJAVADOC-259\build.log, f:\jenkins\jenkins-slave\workspace\javadoc-plugin_MJAVADOC-544-MKCC2TV3XPKYCGNP7Z5UGDHEHBZLBL3PZPHGHPHJXQBEK2OEPF2A@3\windows-jdk7-m3.2.x_build\target\it\MJAVADOC-262\build.log, f:\jenkins\jenkins-slave\workspace\javadoc-plugin_MJAVADOC-544-MKCC2TV3XPKYCGNP7Z5UGDHEHBZLBL3PZPHGHPHJXQBEK2OEPF2A@3\windows-jdk7-m3.2.x_build\target\it\MJAVADOC-275\build.log, f:\jenkins\jenkins-slave\workspace\javadoc-plugin_MJAVADOC-544-MKCC2TV3XPKYCGNP7Z5UGDHEHBZLBL3PZPHGHPHJXQBEK2OEPF2A@3\windows-jdk7-m3.2.x_build\target\it\MJAVADOC-278\build.log, f:\jenkins\jenkins-slave\workspace\javadoc-plugin_MJAVADOC-544-MKCC2TV3XPKYCGNP7Z5UGDHEHBZLBL3PZPHGHPHJXQBEK2OEPF2A@3\windows-jdk7-m3.2.x_build\target\it\MJAVADOC-320\build.log, f:\jenkins\jenkins-slave\workspace\javadoc-plugin_MJAVADOC-544-MKCC2TV3XPKYCGNP7Z5UGDHEHBZLBL3PZPHGHPHJXQBEK2OEPF2A@3\windows-jdk7-m3.2.x_build\target\it\MJAVADOC-325\build.log, f:\jenkins\jenkins-slave\workspace\javadoc-plugin_MJAVADOC-544-MKCC2TV3XPKYCGNP7Z5UGDHEHBZLBL3PZPHGHPHJXQBEK2OEPF2A@3\windows-jdk7-m3.2.x_build\target\it\MJAVADOC-365\build.log, f:\jenkins\jenkins-slave\workspace\javadoc-plugin_MJAVADOC-544-MKCC2TV3XPKYCGNP7Z5UGDHEHBZLBL3PZPHGHPHJXQBEK2OEPF2A@3\windows-jdk7-m3.2.x_build\target\it\MJAVADOC-369\build.log, f:\jenkins\jenkins-slave\workspace\javadoc-plugin_MJAVADOC-544-MKCC2TV3XPKYCGNP7Z5UGDHEHBZLBL3PZPHGHPHJXQBEK2OEPF2A@3\windows-jdk7-m3.2.x_build\target\it\MJAVADOC-384\build.log, f:\jenkins\jenkins-slave\workspace\javadoc-plugin_MJAVADOC-544-MKCC2TV3XPKYCGNP7Z5UGDHEHBZLBL3PZPHGHPHJXQBEK2OEPF2A@3\windows-jdk7-m3.2.x_build\target\it\MJAVADOC-407\build.log, f:\jenkins\jenkins-slave\workspace\javadoc-plugin_MJAVADOC-544-MKCC2TV3XPKYCGNP7Z5UGDHEHBZLBL3PZPHGHPHJXQBEK2OEPF2A@3\windows-jdk7-m3.2.x_build\target\it\MJAVADOC-414\build.log, f:\jenkins\jenkins-slave\workspace\javadoc-plugin_MJAVADOC-544-MKCC2TV3XPKYCGNP7Z5UGDHEHBZLBL3PZPHGHPHJXQBEK2OEPF2A@3\windows-jdk7-m3.2.x_build\target\it\MJAVADOC-437\build.log, f:\jenkins\jenkins-slave\workspace\javadoc-plugin_MJAVADOC-544-MKCC2TV3XPKYCGNP7Z5UGDHEHBZLBL3PZPHGHPHJXQBEK2OEPF2A@3\windows-jdk7-m3.2.x_build\target\it\MJAVADOC-494_aggregate-repositories\build.log, f:\jenkins\jenkins-slave\workspace\javadoc-plugin_MJAVADOC-544-MKCC2TV3XPKYCGNP7Z5UGDHEHBZLBL3PZPHGHPHJXQBEK2OEPF2A@3\windows-jdk7-m3.2.x_build\target\it\MJAVADOC-497\build.log, f:\jenkins\jenkins-slave\workspace\javadoc-plugin_MJAVADOC-544-MKCC2TV3XPKYCGNP7Z5UGDHEHBZLBL3PZPHGHPHJXQBEK2OEPF2A@3\windows-jdk7-m3.2.x_build\target\it\MJAVADOC-506_excl-module-info\build.log, f:\jenkins\jenkins-slave\workspace\javadoc-plugin_MJAVADOC-544-MKCC2TV3XPKYCGNP7Z5UGDHEHBZLBL3PZPHGHPHJXQBEK2OEPF2A@3\windows-jdk7-m3.2.x_build\target\it\MJAVADOC-508\build.log, f:\jenkins\jenkins-slave\workspace\javadoc-plugin_MJAVADOC-544-MKCC2TV3XPKYCGNP7Z5UGDHEHBZLBL3PZPHGHPHJXQBEK2OEPF2A@3\windows-jdk7-m3.2.x_build\target\it\MJAVADOC-514_3rdparty-doclettags\build.log, f:\jenkins\jenkins-slave\workspace\javadoc-plugin_MJAVADOC-544-MKCC2TV3XPKYCGNP7Z5UGDHEHBZLBL3PZPHGHPHJXQBEK2OEPF2A@3\windows-jdk7-m3.2.x_build\target\it\MJAVADOC-528\build.log, f:\jenkins\jenkins-slave\workspace\javadoc-plugin_MJAVADOC-544-MKCC2TV3XPKYCGNP7Z5UGDHEHBZLBL3PZPHGHPHJXQBEK2OEPF2A@3\windows-jdk7-m3.2.x_build\target\it\MJAVADOC-538\build.log, f:\jenkins\jenkins-slave\workspace\javadoc-plugin_MJAVADOC-544-MKCC2TV3XPKYCGNP7Z5UGDHEHBZLBL3PZPHGHPHJXQBEK2OEPF2A@3\windows-jdk7-m3.2.x_build\target\it\additional-dependencies-non-aggregate\build.log, f:\jenkins\jenkins-slave\workspace\javadoc-plugin_MJAVADOC-544-MKCC2TV3XPKYCGNP7Z5UGDHEHBZLBL3PZPHGHPHJXQBEK2OEPF2A@3\windows-jdk7-m3.2.x_build\target\it\additional-dependencies\build.log, f:\jenkins\jenkins-slave\workspace\javadoc-plugin_MJAVADOC-544-MKCC2TV3XPKYCGNP7Z5UGDHEHBZLBL3PZPHGHPHJXQBEK2OEPF2A@3\windows-jdk7-m3.2.x_build\target\it\dependencySource-1\build.log, f:\jenkins\jenkins-slave\workspace\javadoc-plugin_MJAVADOC-544-MKCC2TV3XPKYCGNP7Z5UGDHEHBZLBL3PZPHGHPHJXQBEK2OEPF2A@3\windows-jdk7-m3.2.x_build\target\it\dependencySource-2\build.log, f:\jenkins\jenkins-slave\workspace\javadoc-plugin_MJAVADOC-544-MKCC2TV3XPKYCGNP7Z5UGDHEHBZLBL3PZPHGHPHJXQBEK2OEPF2A@3\windows-jdk7-m3.2.x_build\target\it\dependencySource-3\build.log, f:\jenkins\jenkins-slave\workspace\javadoc-plugin_MJAVADOC-544-MKCC2TV3XPKYCGNP7Z5UGDHEHBZLBL3PZPHGHPHJXQBEK2OEPF2A@3\windows-jdk7-m3.2.x_build\target\it\dependencySource-4\build.log, f:\jenkins\jenkins-slave\workspace\javadoc-plugin_MJAVADOC-544-MKCC2TV3XPKYCGNP7Z5UGDHEHBZLBL3PZPHGHPHJXQBEK2OEPF2A@3\windows-jdk7-m3.2.x_build\target\it\detectLinks\build.log, f:\jenkins\jenkins-slave\workspace\javadoc-plugin_MJAVADOC-544-MKCC2TV3XPKYCGNP7Z5UGDHEHBZLBL3PZPHGHPHJXQBEK2OEPF2A@3\windows-jdk7-m3.2.x_build\target\it\javadoc-fix\build.log, f:\jenkins\jenkins-slave\workspace\javadoc-plugin_MJAVADOC-544-MKCC2TV3XPKYCGNP7Z5UGDHEHBZLBL3PZPHGHPHJXQBEK2OEPF2A@3\windows-jdk7-m3.2.x_build\target\it\site-failOnError\build.log]
[windows-jdk7-m3.2.x_build] Finished parsing Maven Invoker results (found 41)
[windows-jdk7-m3.2.x_build] [withMaven] junitPublisher - Archive test results for Maven artifact org.apache.maven.plugins:maven-javadoc-plugin:3.0.2-SNAPSHOT generated by maven-surefire-plugin:test (default-test): windows-jdk7-m3.2.x_build\target\surefire-reports\*.xml
[windows-jdk7-m3.2.x_build] Recording test results
[windows-jdk7-m3.2.x_build] [withMaven] openTasksPublisher - Scan Tasks for Maven artifact org.apache.maven.plugins:maven-javadoc-plugin:3.0.2-SNAPSHOT in source directory windows-jdk7-m3.2.x_build\src\main\java
[windows-jdk7-m3.2.x_build] [TASKS] Scanning folder 'f:\jenkins\jenkins-slave\workspace\javadoc-plugin_MJAVADOC-544-MKCC2TV3XPKYCGNP7Z5UGDHEHBZLBL3PZPHGHPHJXQBEK2OEPF2A@3' for files matching the pattern 'windows-jdk7-m3.2.x_build\src\main\java\**\*' - excludes: null
[windows-jdk7-m3.2.x_build] [TASKS] Found 24 files to scan for tasks
[windows-jdk7-m3.2.x_build] [TASKS] Found 7 open tasks.
[windows-jdk7-m3.2.x_build] Skipping warnings blame since pipelines do not have an SCM link.%n
[Pipeline] [windows-jdk7-m3.2.x_build] // withMaven
[Pipeline] [windows-jdk7-m3.2.x_build] cleanWs
[windows-jdk7-m3.2.x_build] [WS-CLEANUP] Deleting project workspace...[WS-CLEANUP] done
[Pipeline] [windows-jdk7-m3.2.x_build] }
[Pipeline] [windows-jdk7-m3.2.x_build] // stage
[Pipeline] [windows-jdk7-m3.2.x_build] }
[Pipeline] [windows-jdk7-m3.2.x_build] // ws
[Pipeline] [windows-jdk7-m3.2.x_build] }
[Pipeline] [windows-jdk7-m3.2.x_build] // node
[Pipeline] [windows-jdk7-m3.2.x_build] }
[windows-jdk7-m3.5.x_build] [INFO]           site-failOnError\pom.xml ......................... SUCCESS (21.4 s)
[windows-jdk7-m3.5.x_build] [INFO]
[windows-jdk7-m3.5.x_build] [INFO] --- mrm-maven-plugin:1.1.0:stop (repository) @ maven-javadoc-plugin ---
[windows-jdk7-m3.5.x_build] [INFO] Stopping Mock Repository Manager on http://localhost:49334
[windows-jdk7-m3.5.x_build] [INFO] Stopped SocketConnector@0.0.0.0:49334
[windows-jdk7-m3.5.x_build] [INFO] Mock Repository Manager http://localhost:49334 is stopped.
[windows-jdk7-m3.5.x_build] [INFO]
[windows-jdk7-m3.5.x_build] [INFO] --- mrm-maven-plugin:1.1.0:stop (3rdparty) @ maven-javadoc-plugin ---
[windows-jdk7-m3.5.x_build] [INFO] Stopping Mock Repository Manager on http://localhost:49335
[windows-jdk7-m3.5.x_build] [INFO] Stopped SocketConnector@0.0.0.0:49335
[windows-jdk7-m3.5.x_build] [INFO] Mock Repository Manager http://localhost:49335 is stopped.
[windows-jdk7-m3.5.x_build] [INFO]
[windows-jdk7-m3.5.x_build] [INFO] --- maven-checkstyle-plugin:3.0.0:check (checkstyle-check) @ maven-javadoc-plugin ---
[windows-jdk7-m3.5.x_build] [INFO] Downloading from central: https://repo.maven.apache.org/maven2/org/apache/maven/shared/maven-shared-resources/2/maven-shared-resources-2.pom
[windows-jdk7-m3.5.x_build] [INFO] Downloaded from central: https://repo.maven.apache.org/maven2/org/apache/maven/shared/maven-shared-resources/2/maven-shared-resources-2.pom (3.0 kB at 70 kB/s)
[windows-jdk7-m3.5.x_build] [INFO] Downloading from central: https://repo.maven.apache.org/maven2/org/codehaus/plexus/plexus-utils/3.0.10/plexus-utils-3.0.10.pom
[windows-jdk7-m3.5.x_build] [INFO] Downloaded from central: https://repo.maven.apache.org/maven2/org/codehaus/plexus/plexus-utils/3.0.10/plexus-utils-3.0.10.pom (3.1 kB at 92 kB/s)
[windows-jdk7-m3.5.x_build] [INFO] Downloading from central: https://repo.maven.apache.org/maven2/org/codehaus/plexus/plexus/3.3/plexus-3.3.pom
[windows-jdk7-m3.5.x_build] [INFO] Downloaded from central: https://repo.maven.apache.org/maven2/org/codehaus/plexus/plexus/3.3/plexus-3.3.pom (20 kB at 423 kB/s)
[windows-jdk7-m3.5.x_build] [INFO] Downloading from central: https://repo.maven.apache.org/maven2/org/apache/maven/doxia/doxia-integration-tools/1.6/doxia-integration-tools-1.6.pom
[windows-jdk7-m3.5.x_build] [INFO] Downloaded from central: https://repo.maven.apache.org/maven2/org/apache/maven/doxia/doxia-integration-tools/1.6/doxia-integration-tools-1.6.pom (7.0 kB at 224 kB/s)
[windows-jdk7-m3.5.x_build] [INFO] Downloading from central: https://repo.maven.apache.org/maven2/org/apache/maven/doxia/doxia-tools/3/doxia-tools-3.pom
[windows-jdk7-m3.5.x_build] [INFO] Downloaded from central: https://repo.maven.apache.org/maven2/org/apache/maven/doxia/doxia-tools/3/doxia-tools-3.pom (9.9 kB at 276 kB/s)
[windows-jdk7-m3.5.x_build] [INFO] Downloading from central: https://repo.maven.apache.org/maven2/org/codehaus/plexus/plexus-resources/1.1.0/plexus-resources-1.1.0.pom
[windows-jdk7-m3.5.x_build] [INFO] Downloaded from central: https://repo.maven.apache.org/maven2/org/codehaus/plexus/plexus-resources/1.1.0/plexus-resources-1.1.0.pom (3.2 kB at 86 kB/s)
[windows-jdk7-m3.5.x_build] [INFO] Downloading from central: https://repo.maven.apache.org/maven2/com/puppycrawl/tools/checkstyle/6.18/checkstyle-6.18.pom
[windows-jdk7-m3.5.x_build] [INFO] Downloaded from central: https://repo.maven.apache.org/maven2/com/puppycrawl/tools/checkstyle/6.18/checkstyle-6.18.pom (71 kB at 1.3 MB/s)
[windows-jdk7-m3.5.x_build] [INFO] Downloading from central: https://repo.maven.apache.org/maven2/antlr/antlr/2.7.7/antlr-2.7.7.pom
[windows-jdk7-m3.5.x_build] [INFO] Downloaded from central: https://repo.maven.apache.org/maven2/antlr/antlr/2.7.7/antlr-2.7.7.pom (632 B at 22 kB/s)
[windows-jdk7-m3.5.x_build] [INFO] Downloading from central: https://repo.maven.apache.org/maven2/org/antlr/antlr4-runtime/4.5.3/antlr4-runtime-4.5.3.pom
[windows-jdk7-m3.5.x_build] [INFO] Downloaded from central: https://repo.maven.apache.org/maven2/org/antlr/antlr4-runtime/4.5.3/antlr4-runtime-4.5.3.pom (2.3 kB at 50 kB/s)
[windows-jdk7-m3.5.x_build] [INFO] Downloading from central: https://repo.maven.apache.org/maven2/org/antlr/antlr4-master/4.5.3/antlr4-master-4.5.3.pom
[windows-jdk7-m3.5.x_build] [INFO] Downloaded from central: https://repo.maven.apache.org/maven2/org/antlr/antlr4-master/4.5.3/antlr4-master-4.5.3.pom (3.7 kB at 102 kB/s)
[windows-jdk7-m3.5.x_build] [INFO] Downloading from central: https://repo.maven.apache.org/maven2/commons-beanutils/commons-beanutils/1.9.2/commons-beanutils-1.9.2.pom
[windows-jdk7-m3.5.x_build] [INFO] Downloaded from central: https://repo.maven.apache.org/maven2/commons-beanutils/commons-beanutils/1.9.2/commons-beanutils-1.9.2.pom (14 kB at 304 kB/s)
[windows-jdk7-m3.5.x_build] [INFO] Downloading from central: https://repo.maven.apache.org/maven2/org/apache/commons/commons-parent/33/commons-parent-33.pom
[windows-jdk7-m3.5.x_build] [INFO] Downloaded from central: https://repo.maven.apache.org/maven2/org/apache/commons/commons-parent/33/commons-parent-33.pom (53 kB at 1.0 MB/s)
[windows-jdk7-m3.5.x_build] [INFO] Downloading from central: https://repo.maven.apache.org/maven2/commons-cli/commons-cli/1.3.1/commons-cli-1.3.1.pom
[windows-jdk7-m3.5.x_build] [INFO] Downloaded from central: https://repo.maven.apache.org/maven2/commons-cli/commons-cli/1.3.1/commons-cli-1.3.1.pom (10 kB at 260 kB/s)
[windows-jdk7-m3.5.x_build] [INFO] Downloading from central: https://repo.maven.apache.org/maven2/com/google/guava/guava/19.0/guava-19.0.pom
[windows-jdk7-m3.5.x_build] [INFO] Downloaded from central: https://repo.maven.apache.org/maven2/com/google/guava/guava/19.0/guava-19.0.pom (6.8 kB at 184 kB/s)
[windows-jdk7-m3.5.x_build] [INFO] Downloading from central: https://repo.maven.apache.org/maven2/com/google/guava/guava-parent/19.0/guava-parent-19.0.pom
[windows-jdk7-m3.5.x_build] [INFO] Downloaded from central: https://repo.maven.apache.org/maven2/com/google/guava/guava-parent/19.0/guava-parent-19.0.pom (9.9 kB at 219 kB/s)
[windows-jdk7-m3.5.x_build] [INFO] Downloading from central: https://repo.maven.apache.org/maven2/org/sonatype/oss/oss-parent/7/oss-parent-7.pom
[windows-jdk7-m3.5.x_build] [INFO] Downloaded from central: https://repo.maven.apache.org/maven2/org/sonatype/oss/oss-parent/7/oss-parent-7.pom (4.8 kB at 124 kB/s)
[windows-jdk7-m3.5.x_build] [INFO] Downloading from central: https://repo.maven.apache.org/maven2/org/apache/maven/shared/maven-shared-resources/2/maven-shared-resources-2.jar
[windows-jdk7-m3.5.x_build] [INFO] Downloading from central: https://repo.maven.apache.org/maven2/org/apache/maven/doxia/doxia-core/1.2/doxia-core-1.2.jar
[windows-jdk7-m3.5.x_build] [INFO] Downloading from central: https://repo.maven.apache.org/maven2/commons-digester/commons-digester/1.6/commons-digester-1.6.jar
[windows-jdk7-m3.5.x_build] [INFO] Downloading from central: https://repo.maven.apache.org/maven2/org/apache/maven/doxia/doxia-integration-tools/1.6/doxia-integration-tools-1.6.jar
[windows-jdk7-m3.5.x_build] [INFO] Downloading from central: https://repo.maven.apache.org/maven2/commons-logging/commons-logging/1.0.4/commons-logging-1.0.4.jar
[windows-jdk7-m3.5.x_build] [INFO] Downloaded from central: https://repo.maven.apache.org/maven2/commons-logging/commons-logging/1.0.4/commons-logging-1.0.4.jar (38 kB at 1.1 MB/s)
[windows-jdk7-m3.5.x_build] [INFO] Downloading from central: https://repo.maven.apache.org/maven2/commons-io/commons-io/1.4/commons-io-1.4.jar
[windows-jdk7-m3.5.x_build] [INFO] Downloaded from central: https://repo.maven.apache.org/maven2/org/apache/maven/doxia/doxia-core/1.2/doxia-core-1.2.jar (154 kB at 2.9 MB/s)
[windows-jdk7-m3.5.x_build] [INFO] Downloading from central: https://repo.maven.apache.org/maven2/org/codehaus/plexus/plexus-resources/1.1.0/plexus-resources-1.1.0.jar
[windows-jdk7-m3.5.x_build] [INFO] Downloaded from central: https://repo.maven.apache.org/maven2/commons-digester/commons-digester/1.6/commons-digester-1.6.jar (168 kB at 2.8 MB/s)
[windows-jdk7-m3.5.x_build] [INFO] Downloading from central: https://repo.maven.apache.org/maven2/com/puppycrawl/tools/checkstyle/6.18/checkstyle-6.18.jar
[windows-jdk7-m3.5.x_build] [INFO] Downloaded from central: https://repo.maven.apache.org/maven2/commons-io/commons-io/1.4/commons-io-1.4.jar (109 kB at 1.3 MB/s)
[windows-jdk7-m3.5.x_build] [INFO] Downloading from central: https://repo.maven.apache.org/maven2/antlr/antlr/2.7.7/antlr-2.7.7.jar
[windows-jdk7-m3.5.x_build] [INFO] Downloaded from central: https://repo.maven.apache.org/maven2/org/apache/maven/shared/maven-shared-resources/2/maven-shared-resources-2.jar (13 kB at 108 kB/s)
[windows-jdk7-m3.5.x_build] [INFO] Downloading from central: https://repo.maven.apache.org/maven2/org/antlr/antlr4-runtime/4.5.3/antlr4-runtime-4.5.3.jar
[windows-jdk7-m3.5.x_build] [INFO] Downloaded from central: https://repo.maven.apache.org/maven2/antlr/antlr/2.7.7/antlr-2.7.7.jar (445 kB at 3.2 MB/s)
[windows-jdk7-m3.5.x_build] [INFO] Downloading from central: https://repo.maven.apache.org/maven2/commons-beanutils/commons-beanutils/1.9.2/commons-beanutils-1.9.2.jar
[windows-jdk7-m3.5.x_build] [INFO] Downloaded from central: https://repo.maven.apache.org/maven2/com/puppycrawl/tools/checkstyle/6.18/checkstyle-6.18.jar (1.2 MB at 7.7 MB/s)
[windows-jdk7-m3.5.x_build] [INFO] Downloading from central: https://repo.maven.apache.org/maven2/commons-cli/commons-cli/1.3.1/commons-cli-1.3.1.jar
[windows-jdk7-m3.5.x_build] [INFO] Downloaded from central: https://repo.maven.apache.org/maven2/org/antlr/antlr4-runtime/4.5.3/antlr4-runtime-4.5.3.jar (302 kB at 1.7 MB/s)
[windows-jdk7-m3.5.x_build] [INFO] Downloading from central: https://repo.maven.apache.org/maven2/com/google/guava/guava/19.0/guava-19.0.jar
[windows-jdk7-m3.5.x_build] [INFO] Downloaded from central: https://repo.maven.apache.org/maven2/commons-cli/commons-cli/1.3.1/commons-cli-1.3.1.jar (53 kB at 272 kB/s)
[windows-jdk7-m3.5.x_build] [INFO] Downloading from central: https://repo.maven.apache.org/maven2/commons-lang/commons-lang/2.1/commons-lang-2.1.jar
[windows-jdk7-m3.5.x_build] [INFO] Downloaded from central: https://repo.maven.apache.org/maven2/commons-beanutils/commons-beanutils/1.9.2/commons-beanutils-1.9.2.jar (234 kB at 1.2 MB/s)
[windows-jdk7-m3.5.x_build] [INFO] Downloaded from central: https://repo.maven.apache.org/maven2/org/codehaus/plexus/plexus-resources/1.1.0/plexus-resources-1.1.0.jar (23 kB at 106 kB/s)
[windows-jdk7-m3.5.x_build] [INFO] Downloaded from central: https://repo.maven.apache.org/maven2/commons-lang/commons-lang/2.1/commons-lang-2.1.jar (208 kB at 873 kB/s)
[windows-jdk7-m3.5.x_build] [INFO] Downloaded from central: https://repo.maven.apache.org/maven2/com/google/guava/guava/19.0/guava-19.0.jar (2.3 MB at 8.3 MB/s)
[windows-jdk7-m3.5.x_build] [INFO] Downloaded from central: https://repo.maven.apache.org/maven2/org/apache/maven/doxia/doxia-integration-tools/1.6/doxia-integration-tools-1.6.jar (45 kB at 156 kB/s)
[windows-jdk7-m3.5.x_build] [INFO] There are 4 errors reported by Checkstyle 6.18 with config/maven_checks.xml ruleset.
[windows-jdk7-m3.5.x_build] [INFO] Ignored 4 errors, 0 violation remaining.
[windows-jdk7-m3.5.x_build] [INFO]
[windows-jdk7-m3.5.x_build] [INFO] --- maven-invoker-plugin:3.1.0:verify (integration-test) @ maven-javadoc-plugin ---
[windows-jdk7-m3.5.x_build] [INFO] -------------------------------------------------
[windows-jdk7-m3.5.x_build] [INFO] Build Summary:
[windows-jdk7-m3.5.x_build] [INFO]   Passed: 36, Failed: 0, Errors: 0, Skipped: 5
[windows-jdk7-m3.5.x_build] [INFO] -------------------------------------------------
[windows-jdk7-m3.5.x_build] [INFO] ------------------------------------------------------------------------
[windows-jdk7-m3.5.x_build] [INFO] BUILD SUCCESS
[windows-jdk7-m3.5.x_build] [INFO] ------------------------------------------------------------------------
[windows-jdk7-m3.5.x_build] [INFO] Total time: 15:09 min
[windows-jdk7-m3.5.x_build] [INFO] Finished at: 2018-12-03T08:48:41-08:00
[windows-jdk7-m3.5.x_build] [INFO] Final Memory: 66M/927M
[windows-jdk7-m3.5.x_build] [INFO] ------------------------------------------------------------------------
[windows-jdk7-m3.5.x_build] [INFO] [jenkins-event-spy] Generated F:\jenkins\jenkins-slave\workspace\javadoc-plugin_MJAVADOC-544-MKCC2TV3XPKYCGNP7Z5UGDHEHBZLBL3PZPHGHPHJXQBEK2OEPF2A@2@2@tmp\withMaven89ca07e6\maven-spy-20181203-083331-4012429805775047151788.log
[windows-jdk7-m3.5.x_build] Picked up JAVA_TOOL_OPTIONS: -Dmaven.ext.class.path="f:\jenkins\jenkins-slave\workspace\javadoc-plugin_MJAVADOC-544-MKCC2TV3XPKYCGNP7Z5UGDHEHBZLBL3PZPHGHPHJXQBEK2OEPF2A@2@2@tmp\withMaven89ca07e6\pipeline-maven-spy.jar" -Dorg.jenkinsci.plugins.pipeline.maven.reportsFolder="f:\jenkins\jenkins-slave\workspace\javadoc-plugin_MJAVADOC-544-MKCC2TV3XPKYCGNP7Z5UGDHEHBZLBL3PZPHGHPHJXQBEK2OEPF2A@2@2@tmp\withMaven89ca07e6"
[Pipeline] [windows-jdk7-m3.5.x_build] }
[Pipeline] [windows-jdk7-m3.5.x_build] // dir
[Pipeline] [windows-jdk7-m3.5.x_build] }
[windows-jdk7-m3.5.x_build] [withMaven] artifactsPublisher - Archive artifact windows-jdk7-m3.5.x_build\pom.xml under org\apache\maven\plugins\maven-javadoc-plugin\3.0.2-SNAPSHOT\maven-javadoc-plugin-3.0.2-SNAPSHOT.pom
[windows-jdk7-m3.5.x_build] [withMaven] artifactsPublisher - Archive artifact windows-jdk7-m3.5.x_build\target\maven-javadoc-plugin-3.0.2-SNAPSHOT.jar under org\apache\maven\plugins\maven-javadoc-plugin\3.0.2-SNAPSHOT\maven-javadoc-plugin-3.0.2-SNAPSHOT.jar
[windows-jdk7-m3.5.x_build] [Fast Archiver] No prior successful build to compare, so performing full copy of artifacts
[windows-jdk7-m3.5.x_build] [withMaven] invokerPublisher - Archive invoker results for Maven artifact MavenArtifact{org.apache.maven.plugins:maven-javadoc-plugin::3.0.2-SNAPSHOT(version: 3.0.2-SNAPSHOT, snapshot:false) } generated by PluginInvocation{org.apache.maven.plugins:maven-invoker-plugin:3.1.0@integration-test  integration-test}: windows-jdk7-m3.5.x_build\target\invoker-reports\*.xml
[windows-jdk7-m3.5.x_build] performing MavenInvokerRecorder, reportsFilenamePattern:'**/windows-jdk7-m3.5.x_build\target\invoker-reports/BUILD*.xml', invokerBuildDir:'**/windows-jdk7-m3.5.x_build\target\it'
[windows-jdk7-m3.5.x_build] Found reports:[f:\jenkins\jenkins-slave\workspace\javadoc-plugin_MJAVADOC-544-MKCC2TV3XPKYCGNP7Z5UGDHEHBZLBL3PZPHGHPHJXQBEK2OEPF2A@2@2\windows-jdk7-m3.5.x_build\target\invoker-reports\BUILD-MJAVADOC-110.xml, f:\jenkins\jenkins-slave\workspace\javadoc-plugin_MJAVADOC-544-MKCC2TV3XPKYCGNP7Z5UGDHEHBZLBL3PZPHGHPHJXQBEK2OEPF2A@2@2\windows-jdk7-m3.5.x_build\target\invoker-reports\BUILD-MJAVADOC-126.xml, f:\jenkins\jenkins-slave\workspace\javadoc-plugin_MJAVADOC-544-MKCC2TV3XPKYCGNP7Z5UGDHEHBZLBL3PZPHGHPHJXQBEK2OEPF2A@2@2\windows-jdk7-m3.5.x_build\target\invoker-reports\BUILD-MJAVADOC-137.xml, f:\jenkins\jenkins-slave\workspace\javadoc-plugin_MJAVADOC-544-MKCC2TV3XPKYCGNP7Z5UGDHEHBZLBL3PZPHGHPHJXQBEK2OEPF2A@2@2\windows-jdk7-m3.5.x_build\target\invoker-reports\BUILD-MJAVADOC-172.xml, f:\jenkins\jenkins-slave\workspace\javadoc-plugin_MJAVADOC-544-MKCC2TV3XPKYCGNP7Z5UGDHEHBZLBL3PZPHGHPHJXQBEK2OEPF2A@2@2\windows-jdk7-m3.5.x_build\target\invoker-reports\BUILD-MJAVADOC-180.xml, f:\jenkins\jenkins-slave\workspace\javadoc-plugin_MJAVADOC-544-MKCC2TV3XPKYCGNP7Z5UGDHEHBZLBL3PZPHGHPHJXQBEK2OEPF2A@2@2\windows-jdk7-m3.5.x_build\target\invoker-reports\BUILD-MJAVADOC-194.xml, f:\jenkins\jenkins-slave\workspace\javadoc-plugin_MJAVADOC-544-MKCC2TV3XPKYCGNP7Z5UGDHEHBZLBL3PZPHGHPHJXQBEK2OEPF2A@2@2\windows-jdk7-m3.5.x_build\target\invoker-reports\BUILD-MJAVADOC-250.xml, f:\jenkins\jenkins-slave\workspace\javadoc-plugin_MJAVADOC-544-MKCC2TV3XPKYCGNP7Z5UGDHEHBZLBL3PZPHGHPHJXQBEK2OEPF2A@2@2\windows-jdk7-m3.5.x_build\target\invoker-reports\BUILD-MJAVADOC-257.xml, f:\jenkins\jenkins-slave\workspace\javadoc-plugin_MJAVADOC-544-MKCC2TV3XPKYCGNP7Z5UGDHEHBZLBL3PZPHGHPHJXQBEK2OEPF2A@2@2\windows-jdk7-m3.5.x_build\target\invoker-reports\BUILD-MJAVADOC-259.xml, f:\jenkins\jenkins-slave\workspace\javadoc-plugin_MJAVADOC-544-MKCC2TV3XPKYCGNP7Z5UGDHEHBZLBL3PZPHGHPHJXQBEK2OEPF2A@2@2\windows-jdk7-m3.5.x_build\target\invoker-reports\BUILD-MJAVADOC-262.xml, f:\jenkins\jenkins-slave\workspace\javadoc-plugin_MJAVADOC-544-MKCC2TV3XPKYCGNP7Z5UGDHEHBZLBL3PZPHGHPHJXQBEK2OEPF2A@2@2\windows-jdk7-m3.5.x_build\target\invoker-reports\BUILD-MJAVADOC-275.xml, f:\jenkins\jenkins-slave\workspace\javadoc-plugin_MJAVADOC-544-MKCC2TV3XPKYCGNP7Z5UGDHEHBZLBL3PZPHGHPHJXQBEK2OEPF2A@2@2\windows-jdk7-m3.5.x_build\target\invoker-reports\BUILD-MJAVADOC-278.xml, f:\jenkins\jenkins-slave\workspace\javadoc-plugin_MJAVADOC-544-MKCC2TV3XPKYCGNP7Z5UGDHEHBZLBL3PZPHGHPHJXQBEK2OEPF2A@2@2\windows-jdk7-m3.5.x_build\target\invoker-reports\BUILD-MJAVADOC-320.xml, f:\jenkins\jenkins-slave\workspace\javadoc-plugin_MJAVADOC-544-MKCC2TV3XPKYCGNP7Z5UGDHEHBZLBL3PZPHGHPHJXQBEK2OEPF2A@2@2\windows-jdk7-m3.5.x_build\target\invoker-reports\BUILD-MJAVADOC-325.xml, f:\jenkins\jenkins-slave\workspace\javadoc-plugin_MJAVADOC-544-MKCC2TV3XPKYCGNP7Z5UGDHEHBZLBL3PZPHGHPHJXQBEK2OEPF2A@2@2\windows-jdk7-m3.5.x_build\target\invoker-reports\BUILD-MJAVADOC-365.xml, f:\jenkins\jenkins-slave\workspace\javadoc-plugin_MJAVADOC-544-MKCC2TV3XPKYCGNP7Z5UGDHEHBZLBL3PZPHGHPHJXQBEK2OEPF2A@2@2\windows-jdk7-m3.5.x_build\target\invoker-reports\BUILD-MJAVADOC-369.xml, f:\jenkins\jenkins-slave\workspace\javadoc-plugin_MJAVADOC-544-MKCC2TV3XPKYCGNP7Z5UGDHEHBZLBL3PZPHGHPHJXQBEK2OEPF2A@2@2\windows-jdk7-m3.5.x_build\target\invoker-reports\BUILD-MJAVADOC-384.xml, f:\jenkins\jenkins-slave\workspace\javadoc-plugin_MJAVADOC-544-MKCC2TV3XPKYCGNP7Z5UGDHEHBZLBL3PZPHGHPHJXQBEK2OEPF2A@2@2\windows-jdk7-m3.5.x_build\target\invoker-reports\BUILD-MJAVADOC-407.xml, f:\jenkins\jenkins-slave\workspace\javadoc-plugin_MJAVADOC-544-MKCC2TV3XPKYCGNP7Z5UGDHEHBZLBL3PZPHGHPHJXQBEK2OEPF2A@2@2\windows-jdk7-m3.5.x_build\target\invoker-reports\BUILD-MJAVADOC-414.xml, f:\jenkins\jenkins-slave\workspace\javadoc-plugin_MJAVADOC-544-MKCC2TV3XPKYCGNP7Z5UGDHEHBZLBL3PZPHGHPHJXQBEK2OEPF2A@2@2\windows-jdk7-m3.5.x_build\target\invoker-reports\BUILD-MJAVADOC-427.xml, f:\jenkins\jenkins-slave\workspace\javadoc-plugin_MJAVADOC-544-MKCC2TV3XPKYCGNP7Z5UGDHEHBZLBL3PZPHGHPHJXQBEK2OEPF2A@2@2\windows-jdk7-m3.5.x_build\target\invoker-reports\BUILD-MJAVADOC-437.xml, f:\jenkins\jenkins-slave\workspace\javadoc-plugin_MJAVADOC-544-MKCC2TV3XPKYCGNP7Z5UGDHEHBZLBL3PZPHGHPHJXQBEK2OEPF2A@2@2\windows-jdk7-m3.5.x_build\target\invoker-reports\BUILD-MJAVADOC-449_aggr_modulepath.xml, f:\jenkins\jenkins-slave\workspace\javadoc-plugin_MJAVADOC-544-MKCC2TV3XPKYCGNP7Z5UGDHEHBZLBL3PZPHGHPHJXQBEK2OEPF2A@2@2\windows-jdk7-m3.5.x_build\target\invoker-reports\BUILD-MJAVADOC-494_aggregate-repositories.xml, f:\jenkins\jenkins-slave\workspace\javadoc-plugin_MJAVADOC-544-MKCC2TV3XPKYCGNP7Z5UGDHEHBZLBL3PZPHGHPHJXQBEK2OEPF2A@2@2\windows-jdk7-m3.5.x_build\target\invoker-reports\BUILD-MJAVADOC-497.xml, f:\jenkins\jenkins-slave\workspace\javadoc-plugin_MJAVADOC-544-MKCC2TV3XPKYCGNP7Z5UGDHEHBZLBL3PZPHGHPHJXQBEK2OEPF2A@2@2\windows-jdk7-m3.5.x_build\target\invoker-reports\BUILD-MJAVADOC-498_aggr_modulepath.xml, f:\jenkins\jenkins-slave\workspace\javadoc-plugin_MJAVADOC-544-MKCC2TV3XPKYCGNP7Z5UGDHEHBZLBL3PZPHGHPHJXQBEK2OEPF2A@2@2\windows-jdk7-m3.5.x_build\target\invoker-reports\BUILD-MJAVADOC-498_mm_modulepath.xml, f:\jenkins\jenkins-slave\workspace\javadoc-plugin_MJAVADOC-544-MKCC2TV3XPKYCGNP7Z5UGDHEHBZLBL3PZPHGHPHJXQBEK2OEPF2A@2@2\windows-jdk7-m3.5.x_build\target\invoker-reports\BUILD-MJAVADOC-498_modulepath.xml, f:\jenkins\jenkins-slave\workspace\javadoc-plugin_MJAVADOC-544-MKCC2TV3XPKYCGNP7Z5UGDHEHBZLBL3PZPHGHPHJXQBEK2OEPF2A@2@2\windows-jdk7-m3.5.x_build\target\invoker-reports\BUILD-MJAVADOC-506_excl-module-info.xml, f:\jenkins\jenkins-slave\workspace\javadoc-plugin_MJAVADOC-544-MKCC2TV3XPKYCGNP7Z5UGDHEHBZLBL3PZPHGHPHJXQBEK2OEPF2A@2@2\windows-jdk7-m3.5.x_build\target\invoker-reports\BUILD-MJAVADOC-508.xml, f:\jenkins\jenkins-slave\workspace\javadoc-plugin_MJAVADOC-544-MKCC2TV3XPKYCGNP7Z5UGDHEHBZLBL3PZPHGHPHJXQBEK2OEPF2A@2@2\windows-jdk7-m3.5.x_build\target\invoker-reports\BUILD-MJAVADOC-514_3rdparty-doclettags.xml, f:\jenkins\jenkins-slave\workspace\javadoc-plugin_MJAVADOC-544-MKCC2TV3XPKYCGNP7Z5UGDHEHBZLBL3PZPHGHPHJXQBEK2OEPF2A@2@2\windows-jdk7-m3.5.x_build\target\invoker-reports\BUILD-MJAVADOC-528.xml, f:\jenkins\jenkins-slave\workspace\javadoc-plugin_MJAVADOC-544-MKCC2TV3XPKYCGNP7Z5UGDHEHBZLBL3PZPHGHPHJXQBEK2OEPF2A@2@2\windows-jdk7-m3.5.x_build\target\invoker-reports\BUILD-MJAVADOC-538.xml, f:\jenkins\jenkins-slave\workspace\javadoc-plugin_MJAVADOC-544-MKCC2TV3XPKYCGNP7Z5UGDHEHBZLBL3PZPHGHPHJXQBEK2OEPF2A@2@2\windows-jdk7-m3.5.x_build\target\invoker-reports\BUILD-additional-dependencies-non-aggregate.xml, f:\jenkins\jenkins-slave\workspace\javadoc-plugin_MJAVADOC-544-MKCC2TV3XPKYCGNP7Z5UGDHEHBZLBL3PZPHGHPHJXQBEK2OEPF2A@2@2\windows-jdk7-m3.5.x_build\target\invoker-reports\BUILD-additional-dependencies.xml, f:\jenkins\jenkins-slave\workspace\javadoc-plugin_MJAVADOC-544-MKCC2TV3XPKYCGNP7Z5UGDHEHBZLBL3PZPHGHPHJXQBEK2OEPF2A@2@2\windows-jdk7-m3.5.x_build\target\invoker-reports\BUILD-dependencySource-1.xml, f:\jenkins\jenkins-slave\workspace\javadoc-plugin_MJAVADOC-544-MKCC2TV3XPKYCGNP7Z5UGDHEHBZLBL3PZPHGHPHJXQBEK2OEPF2A@2@2\windows-jdk7-m3.5.x_build\target\invoker-reports\BUILD-dependencySource-2.xml, f:\jenkins\jenkins-slave\workspace\javadoc-plugin_MJAVADOC-544-MKCC2TV3XPKYCGNP7Z5UGDHEHBZLBL3PZPHGHPHJXQBEK2OEPF2A@2@2\windows-jdk7-m3.5.x_build\target\invoker-reports\BUILD-dependencySource-3.xml, f:\jenkins\jenkins-slave\workspace\javadoc-plugin_MJAVADOC-544-MKCC2TV3XPKYCGNP7Z5UGDHEHBZLBL3PZPHGHPHJXQBEK2OEPF2A@2@2\windows-jdk7-m3.5.x_build\target\invoker-reports\BUILD-dependencySource-4.xml, f:\jenkins\jenkins-slave\workspace\javadoc-plugin_MJAVADOC-544-MKCC2TV3XPKYCGNP7Z5UGDHEHBZLBL3PZPHGHPHJXQBEK2OEPF2A@2@2\windows-jdk7-m3.5.x_build\target\invoker-reports\BUILD-detectLinks.xml, f:\jenkins\jenkins-slave\workspace\javadoc-plugin_MJAVADOC-544-MKCC2TV3XPKYCGNP7Z5UGDHEHBZLBL3PZPHGHPHJXQBEK2OEPF2A@2@2\windows-jdk7-m3.5.x_build\target\invoker-reports\BUILD-javadoc-fix.xml, f:\jenkins\jenkins-slave\workspace\javadoc-plugin_MJAVADOC-544-MKCC2TV3XPKYCGNP7Z5UGDHEHBZLBL3PZPHGHPHJXQBEK2OEPF2A@2@2\windows-jdk7-m3.5.x_build\target\invoker-reports\BUILD-site-failOnError.xml]
[windows-jdk7-m3.5.x_build] Found logs:[f:\jenkins\jenkins-slave\workspace\javadoc-plugin_MJAVADOC-544-MKCC2TV3XPKYCGNP7Z5UGDHEHBZLBL3PZPHGHPHJXQBEK2OEPF2A@2@2\windows-jdk7-m3.5.x_build\target\it\MJAVADOC-110\build.log, f:\jenkins\jenkins-slave\workspace\javadoc-plugin_MJAVADOC-544-MKCC2TV3XPKYCGNP7Z5UGDHEHBZLBL3PZPHGHPHJXQBEK2OEPF2A@2@2\windows-jdk7-m3.5.x_build\target\it\MJAVADOC-126\build.log, f:\jenkins\jenkins-slave\workspace\javadoc-plugin_MJAVADOC-544-MKCC2TV3XPKYCGNP7Z5UGDHEHBZLBL3PZPHGHPHJXQBEK2OEPF2A@2@2\windows-jdk7-m3.5.x_build\target\it\MJAVADOC-137\build.log, f:\jenkins\jenkins-slave\workspace\javadoc-plugin_MJAVADOC-544-MKCC2TV3XPKYCGNP7Z5UGDHEHBZLBL3PZPHGHPHJXQBEK2OEPF2A@2@2\windows-jdk7-m3.5.x_build\target\it\MJAVADOC-172\build.log, f:\jenkins\jenkins-slave\workspace\javadoc-plugin_MJAVADOC-544-MKCC2TV3XPKYCGNP7Z5UGDHEHBZLBL3PZPHGHPHJXQBEK2OEPF2A@2@2\windows-jdk7-m3.5.x_build\target\it\MJAVADOC-180\build.log, f:\jenkins\jenkins-slave\workspace\javadoc-plugin_MJAVADOC-544-MKCC2TV3XPKYCGNP7Z5UGDHEHBZLBL3PZPHGHPHJXQBEK2OEPF2A@2@2\windows-jdk7-m3.5.x_build\target\it\MJAVADOC-194\build.log, f:\jenkins\jenkins-slave\workspace\javadoc-plugin_MJAVADOC-544-MKCC2TV3XPKYCGNP7Z5UGDHEHBZLBL3PZPHGHPHJXQBEK2OEPF2A@2@2\windows-jdk7-m3.5.x_build\target\it\MJAVADOC-250\build.log, f:\jenkins\jenkins-slave\workspace\javadoc-plugin_MJAVADOC-544-MKCC2TV3XPKYCGNP7Z5UGDHEHBZLBL3PZPHGHPHJXQBEK2OEPF2A@2@2\windows-jdk7-m3.5.x_build\target\it\MJAVADOC-257\build.log, f:\jenkins\jenkins-slave\workspace\javadoc-plugin_MJAVADOC-544-MKCC2TV3XPKYCGNP7Z5UGDHEHBZLBL3PZPHGHPHJXQBEK2OEPF2A@2@2\windows-jdk7-m3.5.x_build\target\it\MJAVADOC-259\build.log, f:\jenkins\jenkins-slave\workspace\javadoc-plugin_MJAVADOC-544-MKCC2TV3XPKYCGNP7Z5UGDHEHBZLBL3PZPHGHPHJXQBEK2OEPF2A@2@2\windows-jdk7-m3.5.x_build\target\it\MJAVADOC-262\build.log, f:\jenkins\jenkins-slave\workspace\javadoc-plugin_MJAVADOC-544-MKCC2TV3XPKYCGNP7Z5UGDHEHBZLBL3PZPHGHPHJXQBEK2OEPF2A@2@2\windows-jdk7-m3.5.x_build\target\it\MJAVADOC-275\build.log, f:\jenkins\jenkins-slave\workspace\javadoc-plugin_MJAVADOC-544-MKCC2TV3XPKYCGNP7Z5UGDHEHBZLBL3PZPHGHPHJXQBEK2OEPF2A@2@2\windows-jdk7-m3.5.x_build\target\it\MJAVADOC-278\build.log, f:\jenkins\jenkins-slave\workspace\javadoc-plugin_MJAVADOC-544-MKCC2TV3XPKYCGNP7Z5UGDHEHBZLBL3PZPHGHPHJXQBEK2OEPF2A@2@2\windows-jdk7-m3.5.x_build\target\it\MJAVADOC-320\build.log, f:\jenkins\jenkins-slave\workspace\javadoc-plugin_MJAVADOC-544-MKCC2TV3XPKYCGNP7Z5UGDHEHBZLBL3PZPHGHPHJXQBEK2OEPF2A@2@2\windows-jdk7-m3.5.x_build\target\it\MJAVADOC-325\build.log, f:\jenkins\jenkins-slave\workspace\javadoc-plugin_MJAVADOC-544-MKCC2TV3XPKYCGNP7Z5UGDHEHBZLBL3PZPHGHPHJXQBEK2OEPF2A@2@2\windows-jdk7-m3.5.x_build\target\it\MJAVADOC-365\build.log, f:\jenkins\jenkins-slave\workspace\javadoc-plugin_MJAVADOC-544-MKCC2TV3XPKYCGNP7Z5UGDHEHBZLBL3PZPHGHPHJXQBEK2OEPF2A@2@2\windows-jdk7-m3.5.x_build\target\it\MJAVADOC-369\build.log, f:\jenkins\jenkins-slave\workspace\javadoc-plugin_MJAVADOC-544-MKCC2TV3XPKYCGNP7Z5UGDHEHBZLBL3PZPHGHPHJXQBEK2OEPF2A@2@2\windows-jdk7-m3.5.x_build\target\it\MJAVADOC-384\build.log, f:\jenkins\jenkins-slave\workspace\javadoc-plugin_MJAVADOC-544-MKCC2TV3XPKYCGNP7Z5UGDHEHBZLBL3PZPHGHPHJXQBEK2OEPF2A@2@2\windows-jdk7-m3.5.x_build\target\it\MJAVADOC-407\build.log, f:\jenkins\jenkins-slave\workspace\javadoc-plugin_MJAVADOC-544-MKCC2TV3XPKYCGNP7Z5UGDHEHBZLBL3PZPHGHPHJXQBEK2OEPF2A@2@2\windows-jdk7-m3.5.x_build\target\it\MJAVADOC-414\build.log, f:\jenkins\jenkins-slave\workspace\javadoc-plugin_MJAVADOC-544-MKCC2TV3XPKYCGNP7Z5UGDHEHBZLBL3PZPHGHPHJXQBEK2OEPF2A@2@2\windows-jdk7-m3.5.x_build\target\it\MJAVADOC-437\build.log, f:\jenkins\jenkins-slave\workspace\javadoc-plugin_MJAVADOC-544-MKCC2TV3XPKYCGNP7Z5UGDHEHBZLBL3PZPHGHPHJXQBEK2OEPF2A@2@2\windows-jdk7-m3.5.x_build\target\it\MJAVADOC-494_aggregate-repositories\build.log, f:\jenkins\jenkins-slave\workspace\javadoc-plugin_MJAVADOC-544-MKCC2TV3XPKYCGNP7Z5UGDHEHBZLBL3PZPHGHPHJXQBEK2OEPF2A@2@2\windows-jdk7-m3.5.x_build\target\it\MJAVADOC-497\build.log, f:\jenkins\jenkins-slave\workspace\javadoc-plugin_MJAVADOC-544-MKCC2TV3XPKYCGNP7Z5UGDHEHBZLBL3PZPHGHPHJXQBEK2OEPF2A@2@2\windows-jdk7-m3.5.x_build\target\it\MJAVADOC-506_excl-module-info\build.log, f:\jenkins\jenkins-slave\workspace\javadoc-plugin_MJAVADOC-544-MKCC2TV3XPKYCGNP7Z5UGDHEHBZLBL3PZPHGHPHJXQBEK2OEPF2A@2@2\windows-jdk7-m3.5.x_build\target\it\MJAVADOC-508\build.log, f:\jenkins\jenkins-slave\workspace\javadoc-plugin_MJAVADOC-544-MKCC2TV3XPKYCGNP7Z5UGDHEHBZLBL3PZPHGHPHJXQBEK2OEPF2A@2@2\windows-jdk7-m3.5.x_build\target\it\MJAVADOC-514_3rdparty-doclettags\build.log, f:\jenkins\jenkins-slave\workspace\javadoc-plugin_MJAVADOC-544-MKCC2TV3XPKYCGNP7Z5UGDHEHBZLBL3PZPHGHPHJXQBEK2OEPF2A@2@2\windows-jdk7-m3.5.x_build\target\it\MJAVADOC-528\build.log, f:\jenkins\jenkins-slave\workspace\javadoc-plugin_MJAVADOC-544-MKCC2TV3XPKYCGNP7Z5UGDHEHBZLBL3PZPHGHPHJXQBEK2OEPF2A@2@2\windows-jdk7-m3.5.x_build\target\it\MJAVADOC-538\build.log, f:\jenkins\jenkins-slave\workspace\javadoc-plugin_MJAVADOC-544-MKCC2TV3XPKYCGNP7Z5UGDHEHBZLBL3PZPHGHPHJXQBEK2OEPF2A@2@2\windows-jdk7-m3.5.x_build\target\it\additional-dependencies-non-aggregate\build.log, f:\jenkins\jenkins-slave\workspace\javadoc-plugin_MJAVADOC-544-MKCC2TV3XPKYCGNP7Z5UGDHEHBZLBL3PZPHGHPHJXQBEK2OEPF2A@2@2\windows-jdk7-m3.5.x_build\target\it\additional-dependencies\build.log, f:\jenkins\jenkins-slave\workspace\javadoc-plugin_MJAVADOC-544-MKCC2TV3XPKYCGNP7Z5UGDHEHBZLBL3PZPHGHPHJXQBEK2OEPF2A@2@2\windows-jdk7-m3.5.x_build\target\it\dependencySource-1\build.log, f:\jenkins\jenkins-slave\workspace\javadoc-plugin_MJAVADOC-544-MKCC2TV3XPKYCGNP7Z5UGDHEHBZLBL3PZPHGHPHJXQBEK2OEPF2A@2@2\windows-jdk7-m3.5.x_build\target\it\dependencySource-2\build.log, f:\jenkins\jenkins-slave\workspace\javadoc-plugin_MJAVADOC-544-MKCC2TV3XPKYCGNP7Z5UGDHEHBZLBL3PZPHGHPHJXQBEK2OEPF2A@2@2\windows-jdk7-m3.5.x_build\target\it\dependencySource-3\build.log, f:\jenkins\jenkins-slave\workspace\javadoc-plugin_MJAVADOC-544-MKCC2TV3XPKYCGNP7Z5UGDHEHBZLBL3PZPHGHPHJXQBEK2OEPF2A@2@2\windows-jdk7-m3.5.x_build\target\it\dependencySource-4\build.log, f:\jenkins\jenkins-slave\workspace\javadoc-plugin_MJAVADOC-544-MKCC2TV3XPKYCGNP7Z5UGDHEHBZLBL3PZPHGHPHJXQBEK2OEPF2A@2@2\windows-jdk7-m3.5.x_build\target\it\detectLinks\build.log, f:\jenkins\jenkins-slave\workspace\javadoc-plugin_MJAVADOC-544-MKCC2TV3XPKYCGNP7Z5UGDHEHBZLBL3PZPHGHPHJXQBEK2OEPF2A@2@2\windows-jdk7-m3.5.x_build\target\it\javadoc-fix\build.log, f:\jenkins\jenkins-slave\workspace\javadoc-plugin_MJAVADOC-544-MKCC2TV3XPKYCGNP7Z5UGDHEHBZLBL3PZPHGHPHJXQBEK2OEPF2A@2@2\windows-jdk7-m3.5.x_build\target\it\site-failOnError\build.log]
[windows-jdk7-m3.5.x_build] Finished parsing Maven Invoker results (found 41)
[windows-jdk7-m3.5.x_build] [withMaven] junitPublisher - Archive test results for Maven artifact org.apache.maven.plugins:maven-javadoc-plugin:3.0.2-SNAPSHOT generated by maven-surefire-plugin:test (default-test): windows-jdk7-m3.5.x_build\target\surefire-reports\*.xml
[windows-jdk7-m3.5.x_build] Recording test results
[windows-jdk7-m3.5.x_build] [withMaven] openTasksPublisher - Scan Tasks for Maven artifact org.apache.maven.plugins:maven-javadoc-plugin:3.0.2-SNAPSHOT in source directory windows-jdk7-m3.5.x_build\src\main\java
[windows-jdk7-m3.5.x_build] [TASKS] Scanning folder 'f:\jenkins\jenkins-slave\workspace\javadoc-plugin_MJAVADOC-544-MKCC2TV3XPKYCGNP7Z5UGDHEHBZLBL3PZPHGHPHJXQBEK2OEPF2A@2@2' for files matching the pattern 'windows-jdk7-m3.5.x_build\src\main\java\**\*' - excludes: null
[windows-jdk7-m3.5.x_build] [TASKS] Found 24 files to scan for tasks
[windows-jdk7-m3.5.x_build] [TASKS] Found 7 open tasks.
[windows-jdk7-m3.5.x_build] Skipping warnings blame since pipelines do not have an SCM link.%n
[Pipeline] [windows-jdk7-m3.5.x_build] // withMaven
[Pipeline] [windows-jdk7-m3.5.x_build] cleanWs
[windows-jdk7-m3.5.x_build] [WS-CLEANUP] Deleting project workspace...[WS-CLEANUP] done
[Pipeline] [windows-jdk7-m3.5.x_build] }
[Pipeline] [windows-jdk7-m3.5.x_build] // stage
[Pipeline] [windows-jdk7-m3.5.x_build] }
[Pipeline] [windows-jdk7-m3.5.x_build] // ws
[Pipeline] [windows-jdk7-m3.5.x_build] }
[Pipeline] [windows-jdk7-m3.5.x_build] // node
[Pipeline] [windows-jdk7-m3.5.x_build] }
[Pipeline] // parallel
[Pipeline] stage
[Pipeline] { (Notifications)
[Pipeline] echo
Build result: UNSTABLE
[Pipeline] jiraIssueSelector
[Pipeline] emailext
Reply | Threaded
Open this post in threaded view
|

Build succeeded in Jenkins: Maven TLP » maven-javadoc-plugin » MJAVADOC-544 #2

Apache Jenkins Server-2