Build unstable in Jenkins: Maven TLP » maven-doxia » DOXIA-568 #7

classic Classic list List threaded Threaded
2 messages Options
Reply | Threaded
Open this post in threaded view
|

Build unstable in Jenkins: Maven TLP » maven-doxia » DOXIA-568 #7

Apache Jenkins Server-2
See https://builds.apache.org/job/maven-box/job/maven-doxia/job/DOXIA-568/7/

Changes:

* Java 14 released, so Java 13 EOL. Include Java 15-ea

60 tests failed.
FAILED:  org.apache.maven.doxia.module.markdown.MarkdownParserTest.linux-jdk8 / Build linux-jdk8 / testHtmlContent

Error Message:
expected:<...izontalRule
unknown
[text]
unknown
paragraph
t...> but was:<...izontalRule
unknown
[link
text
link_]
unknown
paragraph
t...>

Stack Trace:
junit.framework.ComparisonFailure:
expected:<...izontalRule
unknown
[text]
unknown
paragraph
t...> but was:<...izontalRule
unknown
[link
text
link_]
unknown
paragraph
t...>
        at org.apache.maven.doxia.module.markdown.MarkdownParserTest.testHtmlContent(MarkdownParserTest.java:328)


FAILED:  org.apache.maven.doxia.module.markdown.MarkdownParserTest.linux-jdk8 / Build linux-jdk8 / testCommentBeforeHeadingSinkEvent

Error Message:
expected:<...omment
text
unknown
[text]
unknown
paragraph
t...> but was:<...omment
text
unknown
[link
text
link_]
unknown
paragraph
t...>

Stack Trace:
junit.framework.ComparisonFailure:
expected:<...omment
text
unknown
[text]
unknown
paragraph
t...> but was:<...omment
text
unknown
[link
text
link_]
unknown
paragraph
t...>
        at org.apache.maven.doxia.module.markdown.MarkdownParserTest.testCommentBeforeHeadingSinkEvent(MarkdownParserTest.java:311)


FAILED:  org.apache.maven.doxia.module.markdown.MarkdownParserTest.linux-jdk8 / Build linux-jdk8 / testFirstHeadingSinkEvent

Error Message:
expected:<...tion1
sectionTitle1
[text]
sectionTitle1_
para...> but was:<...tion1
sectionTitle1
[link
text
link_]
sectionTitle1_
para...>

Stack Trace:
junit.framework.ComparisonFailure:
expected:<...tion1
sectionTitle1
[text]
sectionTitle1_
para...> but was:<...tion1
sectionTitle1
[link
text
link_]
sectionTitle1_
para...>
        at org.apache.maven.doxia.module.markdown.MarkdownParserTest.testFirstHeadingSinkEvent(MarkdownParserTest.java:294)


FAILED:  org.apache.maven.doxia.module.markdown.MarkdownParserTest.linux-jdk8 / Build linux-jdk8 / testTocMacro

Error Message:
expected:<...tion2
sectionTitle2
[text
sectionTitle2_
section2_
section2
sectionTitle2
text]
sectionTitle2_
sect...> but was:<...tion2
sectionTitle2
[link
text
link_
sectionTitle2_
section2_
section2
sectionTitle2
link
text
link_]
sectionTitle2_
sect...>

Stack Trace:
junit.framework.ComparisonFailure:
expected:<...tion2
sectionTitle2
[text
sectionTitle2_
section2_
section2
sectionTitle2
text]
sectionTitle2_
sect...> but was:<...tion2
sectionTitle2
[link
text
link_
sectionTitle2_
section2_
section2
sectionTitle2
link
text
link_]
sectionTitle2_
sect...>
        at org.apache.maven.doxia.module.markdown.MarkdownParserTest.testTocMacro(MarkdownParserTest.java:376)


FAILED:  org.apache.maven.doxia.module.markdown.MarkdownParserTest.linux-jdk8 / Build linux-jdk8 / testTocMacroDoxia559

Error Message:
expected:<...tion1
sectionTitle1
[text
sectionTitle1_
section2
section3
sectionTitle3
text
sectionTitle3_
section3_
section2_
section1_
section1
sectionTitle1
text]
sectionTitle1_
sect...> but was:<...tion1
sectionTitle1
[link
text
link_
sectionTitle1_
section2
section3
sectionTitle3
link
text
link_
sectionTitle3_
section3_
section2_
section1_
section1
sectionTitle1
link
text
link_]
sectionTitle1_
sect...>

Stack Trace:
junit.framework.ComparisonFailure:
expected:<...tion1
sectionTitle1
[text
sectionTitle1_
section2
section3
sectionTitle3
text
sectionTitle3_
section3_
section2_
section1_
section1
sectionTitle1
text]
sectionTitle1_
sect...> but was:<...tion1
sectionTitle1
[link
text
link_
sectionTitle1_
section2
section3
sectionTitle3
link
text
link_
sectionTitle3_
section3_
section2_
section1_
section1
sectionTitle1
link
text
link_]
sectionTitle1_
sect...>
        at org.apache.maven.doxia.module.markdown.MarkdownParserTest.testTocMacroDoxia559(MarkdownParserTest.java:404)


FAILED:  org.apache.maven.doxia.module.markdown.MarkdownParserTest.linux-jdk8 / Build linux-jdk8 / testMetadataSinkEvent

Error Message:
expected:<...
head_
body
unknown
[text
unknown
paragraph
text
paragraph_
section1
sectionTitle1
text]
sectionTitle1_
para...> but was:<...
head_
body
unknown
[link
text
link_
unknown
paragraph
text
paragraph_
section1
sectionTitle1
link
text
link_]
sectionTitle1_
para...>

Stack Trace:
junit.framework.ComparisonFailure:
expected:<...
head_
body
unknown
[text
unknown
paragraph
text
paragraph_
section1
sectionTitle1
text]
sectionTitle1_
para...> but was:<...
head_
body
unknown
[link
text
link_
unknown
paragraph
text
paragraph_
section1
sectionTitle1
link
text
link_]
sectionTitle1_
para...>
        at org.apache.maven.doxia.module.markdown.MarkdownParserTest.testMetadataSinkEvent(MarkdownParserTest.java:275)


FAILED:  org.apache.maven.doxia.module.markdown.MarkdownParserTest.linux-jdk13 / Build linux-jdk13 / testHtmlContent

Error Message:
expected:<...izontalRule
unknown
[text]
unknown
paragraph
t...> but was:<...izontalRule
unknown
[link
text
link_]
unknown
paragraph
t...>

Stack Trace:
junit.framework.ComparisonFailure:
expected:<...izontalRule
unknown
[text]
unknown
paragraph
t...> but was:<...izontalRule
unknown
[link
text
link_]
unknown
paragraph
t...>
        at org.apache.maven.doxia.module.markdown.MarkdownParserTest.testHtmlContent(MarkdownParserTest.java:328)


FAILED:  org.apache.maven.doxia.module.markdown.MarkdownParserTest.linux-jdk13 / Build linux-jdk13 / testCommentBeforeHeadingSinkEvent

Error Message:
expected:<...omment
text
unknown
[text]
unknown
paragraph
t...> but was:<...omment
text
unknown
[link
text
link_]
unknown
paragraph
t...>

Stack Trace:
junit.framework.ComparisonFailure:
expected:<...omment
text
unknown
[text]
unknown
paragraph
t...> but was:<...omment
text
unknown
[link
text
link_]
unknown
paragraph
t...>
        at org.apache.maven.doxia.module.markdown.MarkdownParserTest.testCommentBeforeHeadingSinkEvent(MarkdownParserTest.java:311)


FAILED:  org.apache.maven.doxia.module.markdown.MarkdownParserTest.linux-jdk13 / Build linux-jdk13 / testFirstHeadingSinkEvent

Error Message:
expected:<...tion1
sectionTitle1
[text]
sectionTitle1_
para...> but was:<...tion1
sectionTitle1
[link
text
link_]
sectionTitle1_
para...>

Stack Trace:
junit.framework.ComparisonFailure:
expected:<...tion1
sectionTitle1
[text]
sectionTitle1_
para...> but was:<...tion1
sectionTitle1
[link
text
link_]
sectionTitle1_
para...>
        at org.apache.maven.doxia.module.markdown.MarkdownParserTest.testFirstHeadingSinkEvent(MarkdownParserTest.java:294)


FAILED:  org.apache.maven.doxia.module.markdown.MarkdownParserTest.linux-jdk13 / Build linux-jdk13 / testTocMacro

Error Message:
expected:<...tion2
sectionTitle2
[text
sectionTitle2_
section2_
section2
sectionTitle2
text]
sectionTitle2_
sect...> but was:<...tion2
sectionTitle2
[link
text
link_
sectionTitle2_
section2_
section2
sectionTitle2
link
text
link_]
sectionTitle2_
sect...>

Stack Trace:
junit.framework.ComparisonFailure:
expected:<...tion2
sectionTitle2
[text
sectionTitle2_
section2_
section2
sectionTitle2
text]
sectionTitle2_
sect...> but was:<...tion2
sectionTitle2
[link
text
link_
sectionTitle2_
section2_
section2
sectionTitle2
link
text
link_]
sectionTitle2_
sect...>
        at org.apache.maven.doxia.module.markdown.MarkdownParserTest.testTocMacro(MarkdownParserTest.java:376)


FAILED:  org.apache.maven.doxia.module.markdown.MarkdownParserTest.linux-jdk13 / Build linux-jdk13 / testTocMacroDoxia559

Error Message:
expected:<...tion1
sectionTitle1
[text
sectionTitle1_
section2
section3
sectionTitle3
text
sectionTitle3_
section3_
section2_
section1_
section1
sectionTitle1
text]
sectionTitle1_
sect...> but was:<...tion1
sectionTitle1
[link
text
link_
sectionTitle1_
section2
section3
sectionTitle3
link
text
link_
sectionTitle3_
section3_
section2_
section1_
section1
sectionTitle1
link
text
link_]
sectionTitle1_
sect...>

Stack Trace:
junit.framework.ComparisonFailure:
expected:<...tion1
sectionTitle1
[text
sectionTitle1_
section2
section3
sectionTitle3
text
sectionTitle3_
section3_
section2_
section1_
section1
sectionTitle1
text]
sectionTitle1_
sect...> but was:<...tion1
sectionTitle1
[link
text
link_
sectionTitle1_
section2
section3
sectionTitle3
link
text
link_
sectionTitle3_
section3_
section2_
section1_
section1
sectionTitle1
link
text
link_]
sectionTitle1_
sect...>
        at org.apache.maven.doxia.module.markdown.MarkdownParserTest.testTocMacroDoxia559(MarkdownParserTest.java:404)


FAILED:  org.apache.maven.doxia.module.markdown.MarkdownParserTest.linux-jdk13 / Build linux-jdk13 / testMetadataSinkEvent

Error Message:
expected:<...
head_
body
unknown
[text
unknown
paragraph
text
paragraph_
section1
sectionTitle1
text]
sectionTitle1_
para...> but was:<...
head_
body
unknown
[link
text
link_
unknown
paragraph
text
paragraph_
section1
sectionTitle1
link
text
link_]
sectionTitle1_
para...>

Stack Trace:
junit.framework.ComparisonFailure:
expected:<...
head_
body
unknown
[text
unknown
paragraph
text
paragraph_
section1
sectionTitle1
text]
sectionTitle1_
para...> but was:<...
head_
body
unknown
[link
text
link_
unknown
paragraph
text
paragraph_
section1
sectionTitle1
link
text
link_]
sectionTitle1_
para...>
        at org.apache.maven.doxia.module.markdown.MarkdownParserTest.testMetadataSinkEvent(MarkdownParserTest.java:275)


FAILED:  org.apache.maven.doxia.module.markdown.MarkdownParserTest.linux-jdk7 / Build linux-jdk7 / testHtmlContent

Error Message:
expected:<...izontalRule
unknown
[text]
unknown
paragraph
t...> but was:<...izontalRule
unknown
[link
text
link_]
unknown
paragraph
t...>

Stack Trace:
junit.framework.ComparisonFailure:
expected:<...izontalRule
unknown
[text]
unknown
paragraph
t...> but was:<...izontalRule
unknown
[link
text
link_]
unknown
paragraph
t...>
        at org.apache.maven.doxia.module.markdown.MarkdownParserTest.testHtmlContent(MarkdownParserTest.java:328)


FAILED:  org.apache.maven.doxia.module.markdown.MarkdownParserTest.linux-jdk7 / Build linux-jdk7 / testCommentBeforeHeadingSinkEvent

Error Message:
expected:<...omment
text
unknown
[text]
unknown
paragraph
t...> but was:<...omment
text
unknown
[link
text
link_]
unknown
paragraph
t...>

Stack Trace:
junit.framework.ComparisonFailure:
expected:<...omment
text
unknown
[text]
unknown
paragraph
t...> but was:<...omment
text
unknown
[link
text
link_]
unknown
paragraph
t...>
        at org.apache.maven.doxia.module.markdown.MarkdownParserTest.testCommentBeforeHeadingSinkEvent(MarkdownParserTest.java:311)


FAILED:  org.apache.maven.doxia.module.markdown.MarkdownParserTest.linux-jdk7 / Build linux-jdk7 / testFirstHeadingSinkEvent

Error Message:
expected:<...tion1
sectionTitle1
[text]
sectionTitle1_
para...> but was:<...tion1
sectionTitle1
[link
text
link_]
sectionTitle1_
para...>

Stack Trace:
junit.framework.ComparisonFailure:
expected:<...tion1
sectionTitle1
[text]
sectionTitle1_
para...> but was:<...tion1
sectionTitle1
[link
text
link_]
sectionTitle1_
para...>
        at org.apache.maven.doxia.module.markdown.MarkdownParserTest.testFirstHeadingSinkEvent(MarkdownParserTest.java:294)


FAILED:  org.apache.maven.doxia.module.markdown.MarkdownParserTest.linux-jdk7 / Build linux-jdk7 / testTocMacro

Error Message:
expected:<...tion2
sectionTitle2
[text
sectionTitle2_
section2_
section2
sectionTitle2
text]
sectionTitle2_
sect...> but was:<...tion2
sectionTitle2
[link
text
link_
sectionTitle2_
section2_
section2
sectionTitle2
link
text
link_]
sectionTitle2_
sect...>

Stack Trace:
junit.framework.ComparisonFailure:
expected:<...tion2
sectionTitle2
[text
sectionTitle2_
section2_
section2
sectionTitle2
text]
sectionTitle2_
sect...> but was:<...tion2
sectionTitle2
[link
text
link_
sectionTitle2_
section2_
section2
sectionTitle2
link
text
link_]
sectionTitle2_
sect...>
        at org.apache.maven.doxia.module.markdown.MarkdownParserTest.testTocMacro(MarkdownParserTest.java:376)


FAILED:  org.apache.maven.doxia.module.markdown.MarkdownParserTest.linux-jdk7 / Build linux-jdk7 / testTocMacroDoxia559

Error Message:
expected:<...tion1
sectionTitle1
[text
sectionTitle1_
section2
section3
sectionTitle3
text
sectionTitle3_
section3_
section2_
section1_
section1
sectionTitle1
text]
sectionTitle1_
sect...> but was:<...tion1
sectionTitle1
[link
text
link_
sectionTitle1_
section2
section3
sectionTitle3
link
text
link_
sectionTitle3_
section3_
section2_
section1_
section1
sectionTitle1
link
text
link_]
sectionTitle1_
sect...>

Stack Trace:
junit.framework.ComparisonFailure:
expected:<...tion1
sectionTitle1
[text
sectionTitle1_
section2
section3
sectionTitle3
text
sectionTitle3_
section3_
section2_
section1_
section1
sectionTitle1
text]
sectionTitle1_
sect...> but was:<...tion1
sectionTitle1
[link
text
link_
sectionTitle1_
section2
section3
sectionTitle3
link
text
link_
sectionTitle3_
section3_
section2_
section1_
section1
sectionTitle1
link
text
link_]
sectionTitle1_
sect...>
        at org.apache.maven.doxia.module.markdown.MarkdownParserTest.testTocMacroDoxia559(MarkdownParserTest.java:404)


FAILED:  org.apache.maven.doxia.module.markdown.MarkdownParserTest.linux-jdk7 / Build linux-jdk7 / testMetadataSinkEvent

Error Message:
expected:<...
head_
body
unknown
[text
unknown
paragraph
text
paragraph_
section1
sectionTitle1
text]
sectionTitle1_
para...> but was:<...
head_
body
unknown
[link
text
link_
unknown
paragraph
text
paragraph_
section1
sectionTitle1
link
text
link_]
sectionTitle1_
para...>

Stack Trace:
junit.framework.ComparisonFailure:
expected:<...
head_
body
unknown
[text
unknown
paragraph
text
paragraph_
section1
sectionTitle1
text]
sectionTitle1_
para...> but was:<...
head_
body
unknown
[link
text
link_
unknown
paragraph
text
paragraph_
section1
sectionTitle1
link
text
link_]
sectionTitle1_
para...>
        at org.apache.maven.doxia.module.markdown.MarkdownParserTest.testMetadataSinkEvent(MarkdownParserTest.java:275)


FAILED:  org.apache.maven.doxia.module.markdown.MarkdownParserTest.linux-jdk11 / Build linux-jdk11 / testHtmlContent

Error Message:
expected:<...izontalRule
unknown
[text]
unknown
paragraph
t...> but was:<...izontalRule
unknown
[link
text
link_]
unknown
paragraph
t...>

Stack Trace:
junit.framework.ComparisonFailure:
expected:<...izontalRule
unknown
[text]
unknown
paragraph
t...> but was:<...izontalRule
unknown
[link
text
link_]
unknown
paragraph
t...>
        at org.apache.maven.doxia.module.markdown.MarkdownParserTest.testHtmlContent(MarkdownParserTest.java:328)


FAILED:  org.apache.maven.doxia.module.markdown.MarkdownParserTest.linux-jdk11 / Build linux-jdk11 / testCommentBeforeHeadingSinkEvent

Error Message:
expected:<...omment
text
unknown
[text]
unknown
paragraph
t...> but was:<...omment
text
unknown
[link
text
link_]
unknown
paragraph
t...>

Stack Trace:
junit.framework.ComparisonFailure:
expected:<...omment
text
unknown
[text]
unknown
paragraph
t...> but was:<...omment
text
unknown
[link
text
link_]
unknown
paragraph
t...>
        at org.apache.maven.doxia.module.markdown.MarkdownParserTest.testCommentBeforeHeadingSinkEvent(MarkdownParserTest.java:311)


FAILED:  org.apache.maven.doxia.module.markdown.MarkdownParserTest.linux-jdk11 / Build linux-jdk11 / testFirstHeadingSinkEvent

Error Message:
expected:<...tion1
sectionTitle1
[text]
sectionTitle1_
para...> but was:<...tion1
sectionTitle1
[link
text
link_]
sectionTitle1_
para...>

Stack Trace:
junit.framework.ComparisonFailure:
expected:<...tion1
sectionTitle1
[text]
sectionTitle1_
para...> but was:<...tion1
sectionTitle1
[link
text
link_]
sectionTitle1_
para...>
        at org.apache.maven.doxia.module.markdown.MarkdownParserTest.testFirstHeadingSinkEvent(MarkdownParserTest.java:294)


FAILED:  org.apache.maven.doxia.module.markdown.MarkdownParserTest.linux-jdk11 / Build linux-jdk11 / testTocMacro

Error Message:
expected:<...tion2
sectionTitle2
[text
sectionTitle2_
section2_
section2
sectionTitle2
text]
sectionTitle2_
sect...> but was:<...tion2
sectionTitle2
[link
text
link_
sectionTitle2_
section2_
section2
sectionTitle2
link
text
link_]
sectionTitle2_
sect...>

Stack Trace:
junit.framework.ComparisonFailure:
expected:<...tion2
sectionTitle2
[text
sectionTitle2_
section2_
section2
sectionTitle2
text]
sectionTitle2_
sect...> but was:<...tion2
sectionTitle2
[link
text
link_
sectionTitle2_
section2_
section2
sectionTitle2
link
text
link_]
sectionTitle2_
sect...>
        at org.apache.maven.doxia.module.markdown.MarkdownParserTest.testTocMacro(MarkdownParserTest.java:376)


FAILED:  org.apache.maven.doxia.module.markdown.MarkdownParserTest.linux-jdk11 / Build linux-jdk11 / testTocMacroDoxia559

Error Message:
expected:<...tion1
sectionTitle1
[text
sectionTitle1_
section2
section3
sectionTitle3
text
sectionTitle3_
section3_
section2_
section1_
section1
sectionTitle1
text]
sectionTitle1_
sect...> but was:<...tion1
sectionTitle1
[link
text
link_
sectionTitle1_
section2
section3
sectionTitle3
link
text
link_
sectionTitle3_
section3_
section2_
section1_
section1
sectionTitle1
link
text
link_]
sectionTitle1_
sect...>

Stack Trace:
junit.framework.ComparisonFailure:
expected:<...tion1
sectionTitle1
[text
sectionTitle1_
section2
section3
sectionTitle3
text
sectionTitle3_
section3_
section2_
section1_
section1
sectionTitle1
text]
sectionTitle1_
sect...> but was:<...tion1
sectionTitle1
[link
text
link_
sectionTitle1_
section2
section3
sectionTitle3
link
text
link_
sectionTitle3_
section3_
section2_
section1_
section1
sectionTitle1
link
text
link_]
sectionTitle1_
sect...>
        at org.apache.maven.doxia.module.markdown.MarkdownParserTest.testTocMacroDoxia559(MarkdownParserTest.java:404)


FAILED:  org.apache.maven.doxia.module.markdown.MarkdownParserTest.linux-jdk11 / Build linux-jdk11 / testMetadataSinkEvent

Error Message:
expected:<...
head_
body
unknown
[text
unknown
paragraph
text
paragraph_
section1
sectionTitle1
text]
sectionTitle1_
para...> but was:<...
head_
body
unknown
[link
text
link_
unknown
paragraph
text
paragraph_
section1
sectionTitle1
link
text
link_]
sectionTitle1_
para...>

Stack Trace:
junit.framework.ComparisonFailure:
expected:<...
head_
body
unknown
[text
unknown
paragraph
text
paragraph_
section1
sectionTitle1
text]
sectionTitle1_
para...> but was:<...
head_
body
unknown
[link
text
link_
unknown
paragraph
text
paragraph_
section1
sectionTitle1
link
text
link_]
sectionTitle1_
para...>
        at org.apache.maven.doxia.module.markdown.MarkdownParserTest.testMetadataSinkEvent(MarkdownParserTest.java:275)


FAILED:  org.apache.maven.doxia.module.markdown.MarkdownParserTest.linux-jdk14 / Build linux-jdk14 / testHtmlContent

Error Message:
expected:<...izontalRule
unknown
[text]
unknown
paragraph
t...> but was:<...izontalRule
unknown
[link
text
link_]
unknown
paragraph
t...>

Stack Trace:
junit.framework.ComparisonFailure:
expected:<...izontalRule
unknown
[text]
unknown
paragraph
t...> but was:<...izontalRule
unknown
[link
text
link_]
unknown
paragraph
t...>
        at org.apache.maven.doxia.module.markdown.MarkdownParserTest.testHtmlContent(MarkdownParserTest.java:328)


FAILED:  org.apache.maven.doxia.module.markdown.MarkdownParserTest.linux-jdk14 / Build linux-jdk14 / testCommentBeforeHeadingSinkEvent

Error Message:
expected:<...omment
text
unknown
[text]
unknown
paragraph
t...> but was:<...omment
text
unknown
[link
text
link_]
unknown
paragraph
t...>

Stack Trace:
junit.framework.ComparisonFailure:
expected:<...omment
text
unknown
[text]
unknown
paragraph
t...> but was:<...omment
text
unknown
[link
text
link_]
unknown
paragraph
t...>
        at org.apache.maven.doxia.module.markdown.MarkdownParserTest.testCommentBeforeHeadingSinkEvent(MarkdownParserTest.java:311)


FAILED:  org.apache.maven.doxia.module.markdown.MarkdownParserTest.linux-jdk14 / Build linux-jdk14 / testFirstHeadingSinkEvent

Error Message:
expected:<...tion1
sectionTitle1
[text]
sectionTitle1_
para...> but was:<...tion1
sectionTitle1
[link
text
link_]
sectionTitle1_
para...>

Stack Trace:
junit.framework.ComparisonFailure:
expected:<...tion1
sectionTitle1
[text]
sectionTitle1_
para...> but was:<...tion1
sectionTitle1
[link
text
link_]
sectionTitle1_
para...>
        at org.apache.maven.doxia.module.markdown.MarkdownParserTest.testFirstHeadingSinkEvent(MarkdownParserTest.java:294)


FAILED:  org.apache.maven.doxia.module.markdown.MarkdownParserTest.linux-jdk14 / Build linux-jdk14 / testTocMacro

Error Message:
expected:<...tion2
sectionTitle2
[text
sectionTitle2_
section2_
section2
sectionTitle2
text]
sectionTitle2_
sect...> but was:<...tion2
sectionTitle2
[link
text
link_
sectionTitle2_
section2_
section2
sectionTitle2
link
text
link_]
sectionTitle2_
sect...>

Stack Trace:
junit.framework.ComparisonFailure:
expected:<...tion2
sectionTitle2
[text
sectionTitle2_
section2_
section2
sectionTitle2
text]
sectionTitle2_
sect...> but was:<...tion2
sectionTitle2
[link
text
link_
sectionTitle2_
section2_
section2
sectionTitle2
link
text
link_]
sectionTitle2_
sect...>
        at org.apache.maven.doxia.module.markdown.MarkdownParserTest.testTocMacro(MarkdownParserTest.java:376)


FAILED:  org.apache.maven.doxia.module.markdown.MarkdownParserTest.linux-jdk14 / Build linux-jdk14 / testTocMacroDoxia559

Error Message:
expected:<...tion1
sectionTitle1
[text
sectionTitle1_
section2
section3
sectionTitle3
text
sectionTitle3_
section3_
section2_
section1_
section1
sectionTitle1
text]
sectionTitle1_
sect...> but was:<...tion1
sectionTitle1
[link
text
link_
sectionTitle1_
section2
section3
sectionTitle3
link
text
link_
sectionTitle3_
section3_
section2_
section1_
section1
sectionTitle1
link
text
link_]
sectionTitle1_
sect...>

Stack Trace:
junit.framework.ComparisonFailure:
expected:<...tion1
sectionTitle1
[text
sectionTitle1_
section2
section3
sectionTitle3
text
sectionTitle3_
section3_
section2_
section1_
section1
sectionTitle1
text]
sectionTitle1_
sect...> but was:<...tion1
sectionTitle1
[link
text
link_
sectionTitle1_
section2
section3
sectionTitle3
link
text
link_
sectionTitle3_
section3_
section2_
section1_
section1
sectionTitle1
link
text
link_]
sectionTitle1_
sect...>
        at org.apache.maven.doxia.module.markdown.MarkdownParserTest.testTocMacroDoxia559(MarkdownParserTest.java:404)


FAILED:  org.apache.maven.doxia.module.markdown.MarkdownParserTest.linux-jdk14 / Build linux-jdk14 / testMetadataSinkEvent

Error Message:
expected:<...
head_
body
unknown
[text
unknown
paragraph
text
paragraph_
section1
sectionTitle1
text]
sectionTitle1_
para...> but was:<...
head_
body
unknown
[link
text
link_
unknown
paragraph
text
paragraph_
section1
sectionTitle1
link
text
link_]
sectionTitle1_
para...>

Stack Trace:
junit.framework.ComparisonFailure:
expected:<...
head_
body
unknown
[text
unknown
paragraph
text
paragraph_
section1
sectionTitle1
text]
sectionTitle1_
para...> but was:<...
head_
body
unknown
[link
text
link_
unknown
paragraph
text
paragraph_
section1
sectionTitle1
link
text
link_]
sectionTitle1_
para...>
        at org.apache.maven.doxia.module.markdown.MarkdownParserTest.testMetadataSinkEvent(MarkdownParserTest.java:275)


FAILED:  org.apache.maven.doxia.module.markdown.MarkdownParserTest.windows-jdk7 / Build windows-jdk7 / testHtmlContent

Error Message:
expected:<...izontalRule
unknown
[text]
unknown
paragraph
t...> but was:<...izontalRule
unknown
[link
text
link_]
unknown
paragraph
t...>

Stack Trace:
junit.framework.ComparisonFailure:
expected:<...izontalRule
unknown
[text]
unknown
paragraph
t...> but was:<...izontalRule
unknown
[link
text
link_]
unknown
paragraph
t...>
        at org.apache.maven.doxia.module.markdown.MarkdownParserTest.testHtmlContent(MarkdownParserTest.java:328)


FAILED:  org.apache.maven.doxia.module.markdown.MarkdownParserTest.windows-jdk7 / Build windows-jdk7 / testCommentBeforeHeadingSinkEvent

Error Message:
expected:<...omment
text
unknown
[text]
unknown
paragraph
t...> but was:<...omment
text
unknown
[link
text
link_]
unknown
paragraph
t...>

Stack Trace:
junit.framework.ComparisonFailure:
expected:<...omment
text
unknown
[text]
unknown
paragraph
t...> but was:<...omment
text
unknown
[link
text
link_]
unknown
paragraph
t...>
        at org.apache.maven.doxia.module.markdown.MarkdownParserTest.testCommentBeforeHeadingSinkEvent(MarkdownParserTest.java:311)


FAILED:  org.apache.maven.doxia.module.markdown.MarkdownParserTest.windows-jdk7 / Build windows-jdk7 / testFirstHeadingSinkEvent

Error Message:
expected:<...tion1
sectionTitle1
[text]
sectionTitle1_
para...> but was:<...tion1
sectionTitle1
[link
text
link_]
sectionTitle1_
para...>

Stack Trace:
junit.framework.ComparisonFailure:
expected:<...tion1
sectionTitle1
[text]
sectionTitle1_
para...> but was:<...tion1
sectionTitle1
[link
text
link_]
sectionTitle1_
para...>
        at org.apache.maven.doxia.module.markdown.MarkdownParserTest.testFirstHeadingSinkEvent(MarkdownParserTest.java:294)


FAILED:  org.apache.maven.doxia.module.markdown.MarkdownParserTest.windows-jdk7 / Build windows-jdk7 / testTocMacro

Error Message:
expected:<...tion2
sectionTitle2
[text
sectionTitle2_
section2_
section2
sectionTitle2
text]
sectionTitle2_
sect...> but was:<...tion2
sectionTitle2
[link
text
link_
sectionTitle2_
section2_
section2
sectionTitle2
link
text
link_]
sectionTitle2_
sect...>

Stack Trace:
junit.framework.ComparisonFailure:
expected:<...tion2
sectionTitle2
[text
sectionTitle2_
section2_
section2
sectionTitle2
text]
sectionTitle2_
sect...> but was:<...tion2
sectionTitle2
[link
text
link_
sectionTitle2_
section2_
section2
sectionTitle2
link
text
link_]
sectionTitle2_
sect...>
        at org.apache.maven.doxia.module.markdown.MarkdownParserTest.testTocMacro(MarkdownParserTest.java:376)


FAILED:  org.apache.maven.doxia.module.markdown.MarkdownParserTest.windows-jdk7 / Build windows-jdk7 / testTocMacroDoxia559

Error Message:
expected:<...tion1
sectionTitle1
[text
sectionTitle1_
section2
section3
sectionTitle3
text
sectionTitle3_
section3_
section2_
section1_
section1
sectionTitle1
text]
sectionTitle1_
sect...> but was:<...tion1
sectionTitle1
[link
text
link_
sectionTitle1_
section2
section3
sectionTitle3
link
text
link_
sectionTitle3_
section3_
section2_
section1_
section1
sectionTitle1
link
text
link_]
sectionTitle1_
sect...>

Stack Trace:
junit.framework.ComparisonFailure:
expected:<...tion1
sectionTitle1
[text
sectionTitle1_
section2
section3
sectionTitle3
text
sectionTitle3_
section3_
section2_
section1_
section1
sectionTitle1
text]
sectionTitle1_
sect...> but was:<...tion1
sectionTitle1
[link
text
link_
sectionTitle1_
section2
section3
sectionTitle3
link
text
link_
sectionTitle3_
section3_
section2_
section1_
section1
sectionTitle1
link
text
link_]
sectionTitle1_
sect...>
        at org.apache.maven.doxia.module.markdown.MarkdownParserTest.testTocMacroDoxia559(MarkdownParserTest.java:404)


FAILED:  org.apache.maven.doxia.module.markdown.MarkdownParserTest.windows-jdk7 / Build windows-jdk7 / testMetadataSinkEvent

Error Message:
expected:<...
head_
body
unknown
[text
unknown
paragraph
text
paragraph_
section1
sectionTitle1
text]
sectionTitle1_
para...> but was:<...
head_
body
unknown
[link
text
link_
unknown
paragraph
text
paragraph_
section1
sectionTitle1
link
text
link_]
sectionTitle1_
para...>

Stack Trace:
junit.framework.ComparisonFailure:
expected:<...
head_
body
unknown
[text
unknown
paragraph
text
paragraph_
section1
sectionTitle1
text]
sectionTitle1_
para...> but was:<...
head_
body
unknown
[link
text
link_
unknown
paragraph
text
paragraph_
section1
sectionTitle1
link
text
link_]
sectionTitle1_
para...>
        at org.apache.maven.doxia.module.markdown.MarkdownParserTest.testMetadataSinkEvent(MarkdownParserTest.java:275)


FAILED:  org.apache.maven.doxia.module.markdown.MarkdownParserTest.windows-jdk8 / Build windows-jdk8 / testHtmlContent

Error Message:
expected:<...izontalRule
unknown
[text]
unknown
paragraph
t...> but was:<...izontalRule
unknown
[link
text
link_]
unknown
paragraph
t...>

Stack Trace:
junit.framework.ComparisonFailure:
expected:<...izontalRule
unknown
[text]
unknown
paragraph
t...> but was:<...izontalRule
unknown
[link
text
link_]
unknown
paragraph
t...>
        at org.apache.maven.doxia.module.markdown.MarkdownParserTest.testHtmlContent(MarkdownParserTest.java:328)


FAILED:  org.apache.maven.doxia.module.markdown.MarkdownParserTest.windows-jdk8 / Build windows-jdk8 / testCommentBeforeHeadingSinkEvent

Error Message:
expected:<...omment
text
unknown
[text]
unknown
paragraph
t...> but was:<...omment
text
unknown
[link
text
link_]
unknown
paragraph
t...>

Stack Trace:
junit.framework.ComparisonFailure:
expected:<...omment
text
unknown
[text]
unknown
paragraph
t...> but was:<...omment
text
unknown
[link
text
link_]
unknown
paragraph
t...>
        at org.apache.maven.doxia.module.markdown.MarkdownParserTest.testCommentBeforeHeadingSinkEvent(MarkdownParserTest.java:311)


FAILED:  org.apache.maven.doxia.module.markdown.MarkdownParserTest.windows-jdk8 / Build windows-jdk8 / testFirstHeadingSinkEvent

Error Message:
expected:<...tion1
sectionTitle1
[text]
sectionTitle1_
para...> but was:<...tion1
sectionTitle1
[link
text
link_]
sectionTitle1_
para...>

Stack Trace:
junit.framework.ComparisonFailure:
expected:<...tion1
sectionTitle1
[text]
sectionTitle1_
para...> but was:<...tion1
sectionTitle1
[link
text
link_]
sectionTitle1_
para...>
        at org.apache.maven.doxia.module.markdown.MarkdownParserTest.testFirstHeadingSinkEvent(MarkdownParserTest.java:294)


FAILED:  org.apache.maven.doxia.module.markdown.MarkdownParserTest.windows-jdk8 / Build windows-jdk8 / testTocMacro

Error Message:
expected:<...tion2
sectionTitle2
[text
sectionTitle2_
section2_
section2
sectionTitle2
text]
sectionTitle2_
sect...> but was:<...tion2
sectionTitle2
[link
text
link_
sectionTitle2_
section2_
section2
sectionTitle2
link
text
link_]
sectionTitle2_
sect...>

Stack Trace:
junit.framework.ComparisonFailure:
expected:<...tion2
sectionTitle2
[text
sectionTitle2_
section2_
section2
sectionTitle2
text]
sectionTitle2_
sect...> but was:<...tion2
sectionTitle2
[link
text
link_
sectionTitle2_
section2_
section2
sectionTitle2
link
text
link_]
sectionTitle2_
sect...>
        at org.apache.maven.doxia.module.markdown.MarkdownParserTest.testTocMacro(MarkdownParserTest.java:376)


FAILED:  org.apache.maven.doxia.module.markdown.MarkdownParserTest.windows-jdk8 / Build windows-jdk8 / testTocMacroDoxia559

Error Message:
expected:<...tion1
sectionTitle1
[text
sectionTitle1_
section2
section3
sectionTitle3
text
sectionTitle3_
section3_
section2_
section1_
section1
sectionTitle1
text]
sectionTitle1_
sect...> but was:<...tion1
sectionTitle1
[link
text
link_
sectionTitle1_
section2
section3
sectionTitle3
link
text
link_
sectionTitle3_
section3_
section2_
section1_
section1
sectionTitle1
link
text
link_]
sectionTitle1_
sect...>

Stack Trace:
junit.framework.ComparisonFailure:
expected:<...tion1
sectionTitle1
[text
sectionTitle1_
section2
section3
sectionTitle3
text
sectionTitle3_
section3_
section2_
section1_
section1
sectionTitle1
text]
sectionTitle1_
sect...> but was:<...tion1
sectionTitle1
[link
text
link_
sectionTitle1_
section2
section3
sectionTitle3
link
text
link_
sectionTitle3_
section3_
section2_
section1_
section1
sectionTitle1
link
text
link_]
sectionTitle1_
sect...>
        at org.apache.maven.doxia.module.markdown.MarkdownParserTest.testTocMacroDoxia559(MarkdownParserTest.java:404)


FAILED:  org.apache.maven.doxia.module.markdown.MarkdownParserTest.windows-jdk8 / Build windows-jdk8 / testMetadataSinkEvent

Error Message:
expected:<...
head_
body
unknown
[text
unknown
paragraph
text
paragraph_
section1
sectionTitle1
text]
sectionTitle1_
para...> but was:<...
head_
body
unknown
[link
text
link_
unknown
paragraph
text
paragraph_
section1
sectionTitle1
link
text
link_]
sectionTitle1_
para...>

Stack Trace:
junit.framework.ComparisonFailure:
expected:<...
head_
body
unknown
[text
unknown
paragraph
text
paragraph_
section1
sectionTitle1
text]
sectionTitle1_
para...> but was:<...
head_
body
unknown
[link
text
link_
unknown
paragraph
text
paragraph_
section1
sectionTitle1
link
text
link_]
sectionTitle1_
para...>
        at org.apache.maven.doxia.module.markdown.MarkdownParserTest.testMetadataSinkEvent(MarkdownParserTest.java:275)


FAILED:  org.apache.maven.doxia.module.markdown.MarkdownParserTest.windows-jdk11 / Build windows-jdk11 / testHtmlContent

Error Message:
expected:<...izontalRule
unknown
[text]
unknown
paragraph
t...> but was:<...izontalRule
unknown
[link
text
link_]
unknown
paragraph
t...>

Stack Trace:
junit.framework.ComparisonFailure:
expected:<...izontalRule
unknown
[text]
unknown
paragraph
t...> but was:<...izontalRule
unknown
[link
text
link_]
unknown
paragraph
t...>
        at org.apache.maven.doxia.module.markdown.MarkdownParserTest.testHtmlContent(MarkdownParserTest.java:328)


FAILED:  org.apache.maven.doxia.module.markdown.MarkdownParserTest.windows-jdk11 / Build windows-jdk11 / testCommentBeforeHeadingSinkEvent

Error Message:
expected:<...omment
text
unknown
[text]
unknown
paragraph
t...> but was:<...omment
text
unknown
[link
text
link_]
unknown
paragraph
t...>

Stack Trace:
junit.framework.ComparisonFailure:
expected:<...omment
text
unknown
[text]
unknown
paragraph
t...> but was:<...omment
text
unknown
[link
text
link_]
unknown
paragraph
t...>
        at org.apache.maven.doxia.module.markdown.MarkdownParserTest.testCommentBeforeHeadingSinkEvent(MarkdownParserTest.java:311)


FAILED:  org.apache.maven.doxia.module.markdown.MarkdownParserTest.windows-jdk11 / Build windows-jdk11 / testFirstHeadingSinkEvent

Error Message:
expected:<...tion1
sectionTitle1
[text]
sectionTitle1_
para...> but was:<...tion1
sectionTitle1
[link
text
link_]
sectionTitle1_
para...>

Stack Trace:
junit.framework.ComparisonFailure:
expected:<...tion1
sectionTitle1
[text]
sectionTitle1_
para...> but was:<...tion1
sectionTitle1
[link
text
link_]
sectionTitle1_
para...>
        at org.apache.maven.doxia.module.markdown.MarkdownParserTest.testFirstHeadingSinkEvent(MarkdownParserTest.java:294)


FAILED:  org.apache.maven.doxia.module.markdown.MarkdownParserTest.windows-jdk11 / Build windows-jdk11 / testTocMacro

Error Message:
expected:<...tion2
sectionTitle2
[text
sectionTitle2_
section2_
section2
sectionTitle2
text]
sectionTitle2_
sect...> but was:<...tion2
sectionTitle2
[link
text
link_
sectionTitle2_
section2_
section2
sectionTitle2
link
text
link_]
sectionTitle2_
sect...>

Stack Trace:
junit.framework.ComparisonFailure:
expected:<...tion2
sectionTitle2
[text
sectionTitle2_
section2_
section2
sectionTitle2
text]
sectionTitle2_
sect...> but was:<...tion2
sectionTitle2
[link
text
link_
sectionTitle2_
section2_
section2
sectionTitle2
link
text
link_]
sectionTitle2_
sect...>
        at org.apache.maven.doxia.module.markdown.MarkdownParserTest.testTocMacro(MarkdownParserTest.java:376)


FAILED:  org.apache.maven.doxia.module.markdown.MarkdownParserTest.windows-jdk11 / Build windows-jdk11 / testTocMacroDoxia559

Error Message:
expected:<...tion1
sectionTitle1
[text
sectionTitle1_
section2
section3
sectionTitle3
text
sectionTitle3_
section3_
section2_
section1_
section1
sectionTitle1
text]
sectionTitle1_
sect...> but was:<...tion1
sectionTitle1
[link
text
link_
sectionTitle1_
section2
section3
sectionTitle3
link
text
link_
sectionTitle3_
section3_
section2_
section1_
section1
sectionTitle1
link
text
link_]
sectionTitle1_
sect...>

Stack Trace:
junit.framework.ComparisonFailure:
expected:<...tion1
sectionTitle1
[text
sectionTitle1_
section2
section3
sectionTitle3
text
sectionTitle3_
section3_
section2_
section1_
section1
sectionTitle1
text]
sectionTitle1_
sect...> but was:<...tion1
sectionTitle1
[link
text
link_
sectionTitle1_
section2
section3
sectionTitle3
link
text
link_
sectionTitle3_
section3_
section2_
section1_
section1
sectionTitle1
link
text
link_]
sectionTitle1_
sect...>
        at org.apache.maven.doxia.module.markdown.MarkdownParserTest.testTocMacroDoxia559(MarkdownParserTest.java:404)


FAILED:  org.apache.maven.doxia.module.markdown.MarkdownParserTest.windows-jdk11 / Build windows-jdk11 / testMetadataSinkEvent

Error Message:
expected:<...
head_
body
unknown
[text
unknown
paragraph
text
paragraph_
section1
sectionTitle1
text]
sectionTitle1_
para...> but was:<...
head_
body
unknown
[link
text
link_
unknown
paragraph
text
paragraph_
section1
sectionTitle1
link
text
link_]
sectionTitle1_
para...>

Stack Trace:
junit.framework.ComparisonFailure:
expected:<...
head_
body
unknown
[text
unknown
paragraph
text
paragraph_
section1
sectionTitle1
text]
sectionTitle1_
para...> but was:<...
head_
body
unknown
[link
text
link_
unknown
paragraph
text
paragraph_
section1
sectionTitle1
link
text
link_]
sectionTitle1_
para...>
        at org.apache.maven.doxia.module.markdown.MarkdownParserTest.testMetadataSinkEvent(MarkdownParserTest.java:275)


FAILED:  org.apache.maven.doxia.module.markdown.MarkdownParserTest.windows-jdk13 / Build windows-jdk13 / testHtmlContent

Error Message:
expected:<...izontalRule
unknown
[text]
unknown
paragraph
t...> but was:<...izontalRule
unknown
[link
text
link_]
unknown
paragraph
t...>

Stack Trace:
junit.framework.ComparisonFailure:
expected:<...izontalRule
unknown
[text]
unknown
paragraph
t...> but was:<...izontalRule
unknown
[link
text
link_]
unknown
paragraph
t...>
        at org.apache.maven.doxia.module.markdown.MarkdownParserTest.testHtmlContent(MarkdownParserTest.java:328)


FAILED:  org.apache.maven.doxia.module.markdown.MarkdownParserTest.windows-jdk13 / Build windows-jdk13 / testCommentBeforeHeadingSinkEvent

Error Message:
expected:<...omment
text
unknown
[text]
unknown
paragraph
t...> but was:<...omment
text
unknown
[link
text
link_]
unknown
paragraph
t...>

Stack Trace:
junit.framework.ComparisonFailure:
expected:<...omment
text
unknown
[text]
unknown
paragraph
t...> but was:<...omment
text
unknown
[link
text
link_]
unknown
paragraph
t...>
        at org.apache.maven.doxia.module.markdown.MarkdownParserTest.testCommentBeforeHeadingSinkEvent(MarkdownParserTest.java:311)


FAILED:  org.apache.maven.doxia.module.markdown.MarkdownParserTest.windows-jdk13 / Build windows-jdk13 / testFirstHeadingSinkEvent

Error Message:
expected:<...tion1
sectionTitle1
[text]
sectionTitle1_
para...> but was:<...tion1
sectionTitle1
[link
text
link_]
sectionTitle1_
para...>

Stack Trace:
junit.framework.ComparisonFailure:
expected:<...tion1
sectionTitle1
[text]
sectionTitle1_
para...> but was:<...tion1
sectionTitle1
[link
text
link_]
sectionTitle1_
para...>
        at org.apache.maven.doxia.module.markdown.MarkdownParserTest.testFirstHeadingSinkEvent(MarkdownParserTest.java:294)


FAILED:  org.apache.maven.doxia.module.markdown.MarkdownParserTest.windows-jdk13 / Build windows-jdk13 / testTocMacro

Error Message:
expected:<...tion2
sectionTitle2
[text
sectionTitle2_
section2_
section2
sectionTitle2
text]
sectionTitle2_
sect...> but was:<...tion2
sectionTitle2
[link
text
link_
sectionTitle2_
section2_
section2
sectionTitle2
link
text
link_]
sectionTitle2_
sect...>

Stack Trace:
junit.framework.ComparisonFailure:
expected:<...tion2
sectionTitle2
[text
sectionTitle2_
section2_
section2
sectionTitle2
text]
sectionTitle2_
sect...> but was:<...tion2
sectionTitle2
[link
text
link_
sectionTitle2_
section2_
section2
sectionTitle2
link
text
link_]
sectionTitle2_
sect...>
        at org.apache.maven.doxia.module.markdown.MarkdownParserTest.testTocMacro(MarkdownParserTest.java:376)


FAILED:  org.apache.maven.doxia.module.markdown.MarkdownParserTest.windows-jdk13 / Build windows-jdk13 / testTocMacroDoxia559

Error Message:
expected:<...tion1
sectionTitle1
[text
sectionTitle1_
section2
section3
sectionTitle3
text
sectionTitle3_
section3_
section2_
section1_
section1
sectionTitle1
text]
sectionTitle1_
sect...> but was:<...tion1
sectionTitle1
[link
text
link_
sectionTitle1_
section2
section3
sectionTitle3
link
text
link_
sectionTitle3_
section3_
section2_
section1_
section1
sectionTitle1
link
text
link_]
sectionTitle1_
sect...>

Stack Trace:
junit.framework.ComparisonFailure:
expected:<...tion1
sectionTitle1
[text
sectionTitle1_
section2
section3
sectionTitle3
text
sectionTitle3_
section3_
section2_
section1_
section1
sectionTitle1
text]
sectionTitle1_
sect...> but was:<...tion1
sectionTitle1
[link
text
link_
sectionTitle1_
section2
section3
sectionTitle3
link
text
link_
sectionTitle3_
section3_
section2_
section1_
section1
sectionTitle1
link
text
link_]
sectionTitle1_
sect...>
        at org.apache.maven.doxia.module.markdown.MarkdownParserTest.testTocMacroDoxia559(MarkdownParserTest.java:404)


FAILED:  org.apache.maven.doxia.module.markdown.MarkdownParserTest.windows-jdk13 / Build windows-jdk13 / testMetadataSinkEvent

Error Message:
expected:<...
head_
body
unknown
[text
unknown
paragraph
text
paragraph_
section1
sectionTitle1
text]
sectionTitle1_
para...> but was:<...
head_
body
unknown
[link
text
link_
unknown
paragraph
text
paragraph_
section1
sectionTitle1
link
text
link_]
sectionTitle1_
para...>

Stack Trace:
junit.framework.ComparisonFailure:
expected:<...
head_
body
unknown
[text
unknown
paragraph
text
paragraph_
section1
sectionTitle1
text]
sectionTitle1_
para...> but was:<...
head_
body
unknown
[link
text
link_
unknown
paragraph
text
paragraph_
section1
sectionTitle1
link
text
link_]
sectionTitle1_
para...>
        at org.apache.maven.doxia.module.markdown.MarkdownParserTest.testMetadataSinkEvent(MarkdownParserTest.java:275)


FAILED:  org.apache.maven.doxia.module.markdown.MarkdownParserTest.windows-jdk14 / Build windows-jdk14 / testHtmlContent

Error Message:
expected:<...izontalRule
unknown
[text]
unknown
paragraph
t...> but was:<...izontalRule
unknown
[link
text
link_]
unknown
paragraph
t...>

Stack Trace:
junit.framework.ComparisonFailure:
expected:<...izontalRule
unknown
[text]
unknown
paragraph
t...> but was:<...izontalRule
unknown
[link
text
link_]
unknown
paragraph
t...>
        at org.apache.maven.doxia.module.markdown.MarkdownParserTest.testHtmlContent(MarkdownParserTest.java:328)


FAILED:  org.apache.maven.doxia.module.markdown.MarkdownParserTest.windows-jdk14 / Build windows-jdk14 / testCommentBeforeHeadingSinkEvent

Error Message:
expected:<...omment
text
unknown
[text]
unknown
paragraph
t...> but was:<...omment
text
unknown
[link
text
link_]
unknown
paragraph
t...>

Stack Trace:
junit.framework.ComparisonFailure:
expected:<...omment
text
unknown
[text]
unknown
paragraph
t...> but was:<...omment
text
unknown
[link
text
link_]
unknown
paragraph
t...>
        at org.apache.maven.doxia.module.markdown.MarkdownParserTest.testCommentBeforeHeadingSinkEvent(MarkdownParserTest.java:311)


FAILED:  org.apache.maven.doxia.module.markdown.MarkdownParserTest.windows-jdk14 / Build windows-jdk14 / testFirstHeadingSinkEvent

Error Message:
expected:<...tion1
sectionTitle1
[text]
sectionTitle1_
para...> but was:<...tion1
sectionTitle1
[link
text
link_]
sectionTitle1_
para...>

Stack Trace:
junit.framework.ComparisonFailure:
expected:<...tion1
sectionTitle1
[text]
sectionTitle1_
para...> but was:<...tion1
sectionTitle1
[link
text
link_]
sectionTitle1_
para...>
        at org.apache.maven.doxia.module.markdown.MarkdownParserTest.testFirstHeadingSinkEvent(MarkdownParserTest.java:294)


FAILED:  org.apache.maven.doxia.module.markdown.MarkdownParserTest.windows-jdk14 / Build windows-jdk14 / testTocMacro

Error Message:
expected:<...tion2
sectionTitle2
[text
sectionTitle2_
section2_
section2
sectionTitle2
text]
sectionTitle2_
sect...> but was:<...tion2
sectionTitle2
[link
text
link_
sectionTitle2_
section2_
section2
sectionTitle2
link
text
link_]
sectionTitle2_
sect...>

Stack Trace:
junit.framework.ComparisonFailure:
expected:<...tion2
sectionTitle2
[text
sectionTitle2_
section2_
section2
sectionTitle2
text]
sectionTitle2_
sect...> but was:<...tion2
sectionTitle2
[link
text
link_
sectionTitle2_
section2_
section2
sectionTitle2
link
text
link_]
sectionTitle2_
sect...>
        at org.apache.maven.doxia.module.markdown.MarkdownParserTest.testTocMacro(MarkdownParserTest.java:376)


FAILED:  org.apache.maven.doxia.module.markdown.MarkdownParserTest.windows-jdk14 / Build windows-jdk14 / testTocMacroDoxia559

Error Message:
expected:<...tion1
sectionTitle1
[text
sectionTitle1_
section2
section3
sectionTitle3
text
sectionTitle3_
section3_
section2_
section1_
section1
sectionTitle1
text]
sectionTitle1_
sect...> but was:<...tion1
sectionTitle1
[link
text
link_
sectionTitle1_
section2
section3
sectionTitle3
link
text
link_
sectionTitle3_
section3_
section2_
section1_
section1
sectionTitle1
link
text
link_]
sectionTitle1_
sect...>

Stack Trace:
junit.framework.ComparisonFailure:
expected:<...tion1
sectionTitle1
[text
sectionTitle1_
section2
section3
sectionTitle3
text
sectionTitle3_
section3_
section2_
section1_
section1
sectionTitle1
text]
sectionTitle1_
sect...> but was:<...tion1
sectionTitle1
[link
text
link_
sectionTitle1_
section2
section3
sectionTitle3
link
text
link_
sectionTitle3_
section3_
section2_
section1_
section1
sectionTitle1
link
text
link_]
sectionTitle1_
sect...>
        at org.apache.maven.doxia.module.markdown.MarkdownParserTest.testTocMacroDoxia559(MarkdownParserTest.java:404)


FAILED:  org.apache.maven.doxia.module.markdown.MarkdownParserTest.windows-jdk14 / Build windows-jdk14 / testMetadataSinkEvent

Error Message:
expected:<...
head_
body
unknown
[text
unknown
paragraph
text
paragraph_
section1
sectionTitle1
text]
sectionTitle1_
para...> but was:<...
head_
body
unknown
[link
text
link_
unknown
paragraph
text
paragraph_
section1
sectionTitle1
link
text
link_]
sectionTitle1_
para...>

Stack Trace:
junit.framework.ComparisonFailure:
expected:<...
head_
body
unknown
[text
unknown
paragraph
text
paragraph_
section1
sectionTitle1
text]
sectionTitle1_
para...> but was:<...
head_
body
unknown
[link
text
link_
unknown
paragraph
text
paragraph_
section1
sectionTitle1
link
text
link_]
sectionTitle1_
para...>
        at org.apache.maven.doxia.module.markdown.MarkdownParserTest.testMetadataSinkEvent(MarkdownParserTest.java:275)




Build log:
[...truncated 48810 lines...]
sectionTitle1_
para...> but was:<...tion1
sectionTitle1
[link
text
link_]
sectionTitle1_
para...>
[ERROR]   MarkdownParserTest.testHtmlContent:328->AbstractParserTest.assertEquals:131 expected:<...izontalRule
unknown
[text]
unknown
paragraph
t...> but was:<...izontalRule
unknown
[link
text
link_]
unknown
paragraph
t...>
[ERROR]   MarkdownParserTest.testMetadataSinkEvent:275->AbstractParserTest.assertEquals:131 expected:<...
head_
body
unknown
[text
unknown
paragraph
text
paragraph_
section1
sectionTitle1
text]
sectionTitle1_
para...> but was:<...
head_
body
unknown
[link
text
link_
unknown
paragraph
text
paragraph_
section1
sectionTitle1
link
text
link_]
sectionTitle1_
para...>
[ERROR]   MarkdownParserTest.testTocMacro:376->AbstractParserTest.assertEquals:131 expected:<...tion2
sectionTitle2
[text
sectionTitle2_
section2_
section2
sectionTitle2
text]
sectionTitle2_
sect...> but was:<...tion2
sectionTitle2
[link
text
link_
sectionTitle2_
section2_
section2
sectionTitle2
link
text
link_]
sectionTitle2_
sect...>
[ERROR]   MarkdownParserTest.testTocMacroDoxia559:404->AbstractParserTest.assertEquals:131 expected:<...tion1
sectionTitle1
[text
sectionTitle1_
section2
section3
sectionTitle3
text
sectionTitle3_
section3_
section2_
section1_
section1
sectionTitle1
text]
sectionTitle1_
sect...> but was:<...tion1
sectionTitle1
[link
text
link_
sectionTitle1_
section2
section3
sectionTitle3
link
text
link_
sectionTitle3_
section3_
section2_
section1_
section1
sectionTitle1
link
text
link_]
sectionTitle1_
sect...>
[INFO]
[ERROR] Tests run: 23, Failures: 6, Errors: 0, Skipped: 0
[INFO]
[ERROR] There are test failures.

Please refer to F:\jenkins\jenkins-slave\workspace\maven-box_maven-doxia_DOXIA-568\m\doxia-modules\doxia-module-markdown\target\surefire-reports for the individual test results.
Please refer to dump files (if any exist) [date]-jvmRun[N].dump, [date].dumpstream and [date]-jvmRun[N].dumpstream.
[INFO]
[INFO] --- maven-jar-plugin:3.2.0:jar (default-jar) @ doxia-module-markdown ---
[INFO] Building jar: F:\jenkins\jenkins-slave\workspace\maven-box_maven-doxia_DOXIA-568\m\doxia-modules\doxia-module-markdown\target\doxia-module-markdown-1.9.2-SNAPSHOT.jar
[INFO]
[INFO] --- maven-site-plugin:3.7.1:attach-descriptor (attach-descriptor) @ doxia-module-markdown ---
[INFO] Skipping because packaging 'jar' is not pom.
[INFO]
[INFO] --- maven-checkstyle-plugin:3.0.0:check (checkstyle-check) @ doxia-module-markdown ---
[INFO]
[INFO] >>> clirr-maven-plugin:2.8:check (default) > compile @ doxia-module-markdown >>>
[INFO]
[INFO] --- maven-enforcer-plugin:1.4.1:enforce (enforce-maven-version) @ doxia-module-markdown ---
[INFO]
[INFO] --- maven-enforcer-plugin:1.4.1:enforce (enforce-bytecode-version) @ doxia-module-markdown ---
[INFO] Adding ignore: module-info
[INFO]
[INFO] --- apache-rat-plugin:0.13:check (rat-check) @ doxia-module-markdown ---
[INFO] Enabled default license matchers.
[INFO] Will parse SCM ignores for exclusions...
[INFO] Finished adding exclusions from SCM ignore files.
[INFO] 62 implicit excludes (use -debug for more details).
[INFO] 11 explicit excludes (use -debug for more details).
[INFO] 11 resources included (use -debug for more details)
[INFO] Rat check: Summary over all files. Unapproved: 0, unknown: 0, generated: 0, approved: 11 licenses.
[INFO]
[INFO] --- maven-remote-resources-plugin:1.7.0:process (process-resource-bundles) @ doxia-module-markdown ---
[INFO] Preparing remote bundle org.apache:apache-jar-resource-bundle:1.4
[INFO] Copying 3 resources from 1 bundle.
[INFO]
[INFO] --- maven-resources-plugin:3.1.0:resources (default-resources) @ doxia-module-markdown ---
[INFO] Using 'UTF-8' encoding to copy filtered resources.
[INFO] skip non existing resourceDirectory F:\jenkins\jenkins-slave\workspace\maven-box_maven-doxia_DOXIA-568\m\doxia-modules\doxia-module-markdown\src\main\resources
[INFO] skip non existing resourceDirectory F:\jenkins\jenkins-slave\workspace\maven-box_maven-doxia_DOXIA-568\m\doxia-modules\doxia-module-markdown\target\generated-site\xsd
[INFO] Copying 3 resources
[INFO] Copying 3 resources
[INFO]
[INFO] --- maven-compiler-plugin:3.8.1:compile (default-compile) @ doxia-module-markdown ---
[INFO] Changes detected - recompiling the module!
[INFO] Compiling 5 source files to F:\jenkins\jenkins-slave\workspace\maven-box_maven-doxia_DOXIA-568\m\doxia-modules\doxia-module-markdown\target\classes
[INFO] /F:/jenkins/jenkins-slave/workspace/maven-box_maven-doxia_DOXIA-568/m/doxia-modules/doxia-module-markdown/src/main/java/org/apache/maven/doxia/module/markdown/MarkdownParser.java: F:\jenkins\jenkins-slave\workspace\maven-box_maven-doxia_DOXIA-568\m\doxia-modules\doxia-module-markdown\src\main\java\org\apache\maven\doxia\module\markdown\MarkdownParser.java uses or overrides a deprecated API.
[INFO] /F:/jenkins/jenkins-slave/workspace/maven-box_maven-doxia_DOXIA-568/m/doxia-modules/doxia-module-markdown/src/main/java/org/apache/maven/doxia/module/markdown/MarkdownParser.java: Recompile with -Xlint:deprecation for details.
[INFO]
[INFO] <<< clirr-maven-plugin:2.8:check (default) < compile @ doxia-module-markdown <<<
[INFO]
[INFO]
[INFO] --- clirr-maven-plugin:2.8:check (default) @ doxia-module-markdown ---
[INFO] artifact org.apache.maven.doxia:doxia-module-markdown: checking for updates from apache-snapshots
[INFO] artifact org.apache.maven.doxia:doxia-module-markdown: checking for updates from Nexus
[INFO] artifact org.apache.maven.doxia:doxia-module-markdown: checking for updates from central
[INFO] Comparing to version: 1.9.1
[INFO] Downloading from central: https://repo.maven.apache.org/maven2/org/apache/maven/doxia/doxia-module-markdown/1.9.1/doxia-module-markdown-1.9.1.jar
[INFO] Downloaded from central: https://repo.maven.apache.org/maven2/org/apache/maven/doxia/doxia-module-markdown/1.9.1/doxia-module-markdown-1.9.1.jar (23 kB at 1.1 MB/s)
[INFO] Downloading from central: https://repo.maven.apache.org/maven2/org/apache/maven/doxia/doxia-module-markdown/1.9.1/doxia-module-markdown-1.9.1.pom
[INFO] Downloaded from central: https://repo.maven.apache.org/maven2/org/apache/maven/doxia/doxia-module-markdown/1.9.1/doxia-module-markdown-1.9.1.pom (2.6 kB at 99 kB/s)
[INFO] Succeeded with 0 errors; 0 warnings; and 0 other changes.
[INFO] ------------------------------------------------------------------------
[INFO] Reactor Summary for Doxia 1.9.2-SNAPSHOT:
[INFO]
[INFO] Doxia .............................................. SUCCESS [ 42.456 s]
[INFO] Doxia :: Logging API ............................... SUCCESS [  8.805 s]
[INFO] Doxia :: Sink API .................................. SUCCESS [  3.684 s]
[INFO] Doxia :: Test Documents ............................ SUCCESS [  2.836 s]
[INFO] Doxia :: Core ...................................... SUCCESS [01:06 min]
[INFO] Doxia :: Modules ................................... SUCCESS [  1.133 s]
[INFO] Doxia :: APT Module ................................ SUCCESS [  6.183 s]
[INFO] Doxia :: Confluence Module ......................... SUCCESS [  6.977 s]
[INFO] Doxia :: Simplified DocBook Module ................. SUCCESS [  7.743 s]
[INFO] Doxia :: FML Module ................................ SUCCESS [  5.343 s]
[INFO] Doxia :: FO Module ................................. SUCCESS [ 19.008 s]
[INFO] Doxia :: iText Module .............................. SUCCESS [  6.035 s]
[INFO] Doxia :: Latex Module .............................. SUCCESS [  4.520 s]
[INFO] Doxia :: RTF Module ................................ SUCCESS [  6.179 s]
[INFO] Doxia :: TWiki Module .............................. SUCCESS [  6.610 s]
[INFO] Doxia :: XDoc Module ............................... SUCCESS [ 25.500 s]
[INFO] Doxia :: XHTML Module .............................. SUCCESS [  5.617 s]
[INFO] Doxia :: XHTML5 Module ............................. SUCCESS [  6.943 s]
[INFO] Doxia :: Markdown Module ........................... SUCCESS [ 11.554 s]
[INFO] ------------------------------------------------------------------------
[INFO] BUILD SUCCESS
[INFO] ------------------------------------------------------------------------
[INFO] Total time:  04:05 min
[INFO] Finished at: 2020-03-18T16:51:32-07:00
[INFO] ------------------------------------------------------------------------
[WARNING] The requested profile "run-its" could not be activated because it does not exist.
[INFO] [jenkins-event-spy] Generated F:\jenkins\jenkins-slave\workspace\maven-box_maven-doxia_DOXIA-568@tmp\withMavena3d09b2a\maven-spy-20200318-164726-1347809757517163442403.log
[Pipeline] }
[Pipeline] // dir
[Pipeline] }
[withMaven] junitPublisher - Archive test results for Maven artifact org.apache.maven.doxia:doxia-logging-api:jar:1.9.2-SNAPSHOT generated by maven-surefire-plugin:test (default-test): m\doxia-logging-api\target\surefire-reports\*.xml
[withMaven] junitPublisher - Archive test results for Maven artifact org.apache.maven.doxia:doxia-sink-api:jar:1.9.2-SNAPSHOT generated by maven-surefire-plugin:test (default-test): m\doxia-sink-api\target\surefire-reports\*.xml
[withMaven] junitPublisher - Archive test results for Maven artifact org.apache.maven.doxia:doxia-test-docs:jar:1.9.2-SNAPSHOT generated by maven-surefire-plugin:test (default-test): m\doxia-test-docs\target\surefire-reports\*.xml
[withMaven] junitPublisher - Archive test results for Maven artifact org.apache.maven.doxia:doxia-core:jar:1.9.2-SNAPSHOT generated by maven-surefire-plugin:test (default-test): m\doxia-core\target\surefire-reports\*.xml
[withMaven] junitPublisher - Archive test results for Maven artifact org.apache.maven.doxia:doxia-module-apt:jar:1.9.2-SNAPSHOT generated by maven-surefire-plugin:test (default-test): m\doxia-modules\doxia-module-apt\target\surefire-reports\*.xml
[withMaven] junitPublisher - Archive test results for Maven artifact org.apache.maven.doxia:doxia-module-confluence:jar:1.9.2-SNAPSHOT generated by maven-surefire-plugin:test (default-test): m\doxia-modules\doxia-module-confluence\target\surefire-reports\*.xml
[withMaven] junitPublisher - Archive test results for Maven artifact org.apache.maven.doxia:doxia-module-docbook-simple:jar:1.9.2-SNAPSHOT generated by maven-surefire-plugin:test (default-test): m\doxia-modules\doxia-module-docbook-simple\target\surefire-reports\*.xml
[withMaven] junitPublisher - Archive test results for Maven artifact org.apache.maven.doxia:doxia-module-fml:jar:1.9.2-SNAPSHOT generated by maven-surefire-plugin:test (default-test): m\doxia-modules\doxia-module-fml\target\surefire-reports\*.xml
[withMaven] junitPublisher - Archive test results for Maven artifact org.apache.maven.doxia:doxia-module-fo:jar:1.9.2-SNAPSHOT generated by maven-surefire-plugin:test (default-test): m\doxia-modules\doxia-module-fo\target\surefire-reports\*.xml
[withMaven] junitPublisher - Archive test results for Maven artifact org.apache.maven.doxia:doxia-module-itext:jar:1.9.2-SNAPSHOT generated by maven-surefire-plugin:test (default-test): m\doxia-modules\doxia-module-itext\target\surefire-reports\*.xml
[withMaven] junitPublisher - Archive test results for Maven artifact org.apache.maven.doxia:doxia-module-latex:jar:1.9.2-SNAPSHOT generated by maven-surefire-plugin:test (default-test): m\doxia-modules\doxia-module-latex\target\surefire-reports\*.xml
[withMaven] junitPublisher - Archive test results for Maven artifact org.apache.maven.doxia:doxia-module-rtf:jar:1.9.2-SNAPSHOT generated by maven-surefire-plugin:test (default-test): m\doxia-modules\doxia-module-rtf\target\surefire-reports\*.xml
[withMaven] junitPublisher - Archive test results for Maven artifact org.apache.maven.doxia:doxia-module-twiki:jar:1.9.2-SNAPSHOT generated by maven-surefire-plugin:test (default-test): m\doxia-modules\doxia-module-twiki\target\surefire-reports\*.xml
[withMaven] junitPublisher - Archive test results for Maven artifact org.apache.maven.doxia:doxia-module-xdoc:jar:1.9.2-SNAPSHOT generated by maven-surefire-plugin:test (default-test): m\doxia-modules\doxia-module-xdoc\target\surefire-reports\*.xml
[withMaven] junitPublisher - Archive test results for Maven artifact org.apache.maven.doxia:doxia-module-xhtml:jar:1.9.2-SNAPSHOT generated by maven-surefire-plugin:test (default-test): m\doxia-modules\doxia-module-xhtml\target\surefire-reports\*.xml
[withMaven] junitPublisher - Archive test results for Maven artifact org.apache.maven.doxia:doxia-module-xhtml5:jar:1.9.2-SNAPSHOT generated by maven-surefire-plugin:test (default-test): m\doxia-modules\doxia-module-xhtml5\target\surefire-reports\*.xml
[withMaven] junitPublisher - Archive test results for Maven artifact org.apache.maven.doxia:doxia-module-markdown:jar:1.9.2-SNAPSHOT generated by maven-surefire-plugin:test (default-test): m\doxia-modules\doxia-module-markdown\target\surefire-reports\*.xml
Recording test results
[withMaven] Publishers: Pipeline Graph Publisher: 15 ms, Invoker Publisher: 1 ms, Junit Publisher: 2800 ms, Concordion Publisher: 1 ms, Dependencies Fingerprint Publisher: 2695 ms, JGiven Publisher: 2 ms, Jacoco Publisher: 1 ms, SpotBugs Publisher: 1 ms
[Pipeline] // withMaven
[Pipeline] cleanWs
[WS-CLEANUP] Deleting project workspace...
[WS-CLEANUP] Deferred wipeout is used...
[WS-CLEANUP] done
[Pipeline] }
[Pipeline] // stage
[Pipeline] }
[Pipeline] // node
[Pipeline] }
[Pipeline] // parallel
[Pipeline] stage
[Pipeline] { (Notifications)
[Pipeline] echo
Build result: UNSTABLE
[Pipeline] jiraIssueSelector
[Pipeline] echo
The authors of changes [rfscholte].
[Pipeline] echo
Sending email ...
[Pipeline] emailext
Reply | Threaded
Open this post in threaded view
|

Build unstable in Jenkins: Maven TLP » maven-doxia » DOXIA-568 #8

Apache Jenkins Server-2
See https://builds.apache.org/job/maven-box/job/maven-doxia/job/DOXIA-568/8/

Changes:

* Java 14 released, so Java 13 EOL. Include Java 15-ea

60 tests failed.
FAILED:  org.apache.maven.doxia.module.markdown.MarkdownParserTest.linux-jdk7 / Build linux-jdk7 / testHtmlContent

Error Message:
expected:<...izontalRule
unknown
[text]
unknown
paragraph
t...> but was:<...izontalRule
unknown
[link
text
link_]
unknown
paragraph
t...>

Stack Trace:
junit.framework.ComparisonFailure:
expected:<...izontalRule
unknown
[text]
unknown
paragraph
t...> but was:<...izontalRule
unknown
[link
text
link_]
unknown
paragraph
t...>
        at org.apache.maven.doxia.module.markdown.MarkdownParserTest.testHtmlContent(MarkdownParserTest.java:328)


FAILED:  org.apache.maven.doxia.module.markdown.MarkdownParserTest.linux-jdk7 / Build linux-jdk7 / testCommentBeforeHeadingSinkEvent

Error Message:
expected:<...omment
text
unknown
[text]
unknown
paragraph
t...> but was:<...omment
text
unknown
[link
text
link_]
unknown
paragraph
t...>

Stack Trace:
junit.framework.ComparisonFailure:
expected:<...omment
text
unknown
[text]
unknown
paragraph
t...> but was:<...omment
text
unknown
[link
text
link_]
unknown
paragraph
t...>
        at org.apache.maven.doxia.module.markdown.MarkdownParserTest.testCommentBeforeHeadingSinkEvent(MarkdownParserTest.java:311)


FAILED:  org.apache.maven.doxia.module.markdown.MarkdownParserTest.linux-jdk7 / Build linux-jdk7 / testFirstHeadingSinkEvent

Error Message:
expected:<...tion1
sectionTitle1
[text]
sectionTitle1_
para...> but was:<...tion1
sectionTitle1
[link
text
link_]
sectionTitle1_
para...>

Stack Trace:
junit.framework.ComparisonFailure:
expected:<...tion1
sectionTitle1
[text]
sectionTitle1_
para...> but was:<...tion1
sectionTitle1
[link
text
link_]
sectionTitle1_
para...>
        at org.apache.maven.doxia.module.markdown.MarkdownParserTest.testFirstHeadingSinkEvent(MarkdownParserTest.java:294)


FAILED:  org.apache.maven.doxia.module.markdown.MarkdownParserTest.linux-jdk7 / Build linux-jdk7 / testTocMacro

Error Message:
expected:<...tion2
sectionTitle2
[text
sectionTitle2_
section2_
section2
sectionTitle2
text]
sectionTitle2_
sect...> but was:<...tion2
sectionTitle2
[link
text
link_
sectionTitle2_
section2_
section2
sectionTitle2
link
text
link_]
sectionTitle2_
sect...>

Stack Trace:
junit.framework.ComparisonFailure:
expected:<...tion2
sectionTitle2
[text
sectionTitle2_
section2_
section2
sectionTitle2
text]
sectionTitle2_
sect...> but was:<...tion2
sectionTitle2
[link
text
link_
sectionTitle2_
section2_
section2
sectionTitle2
link
text
link_]
sectionTitle2_
sect...>
        at org.apache.maven.doxia.module.markdown.MarkdownParserTest.testTocMacro(MarkdownParserTest.java:376)


FAILED:  org.apache.maven.doxia.module.markdown.MarkdownParserTest.linux-jdk7 / Build linux-jdk7 / testTocMacroDoxia559

Error Message:
expected:<...tion1
sectionTitle1
[text
sectionTitle1_
section2
section3
sectionTitle3
text
sectionTitle3_
section3_
section2_
section1_
section1
sectionTitle1
text]
sectionTitle1_
sect...> but was:<...tion1
sectionTitle1
[link
text
link_
sectionTitle1_
section2
section3
sectionTitle3
link
text
link_
sectionTitle3_
section3_
section2_
section1_
section1
sectionTitle1
link
text
link_]
sectionTitle1_
sect...>

Stack Trace:
junit.framework.ComparisonFailure:
expected:<...tion1
sectionTitle1
[text
sectionTitle1_
section2
section3
sectionTitle3
text
sectionTitle3_
section3_
section2_
section1_
section1
sectionTitle1
text]
sectionTitle1_
sect...> but was:<...tion1
sectionTitle1
[link
text
link_
sectionTitle1_
section2
section3
sectionTitle3
link
text
link_
sectionTitle3_
section3_
section2_
section1_
section1
sectionTitle1
link
text
link_]
sectionTitle1_
sect...>
        at org.apache.maven.doxia.module.markdown.MarkdownParserTest.testTocMacroDoxia559(MarkdownParserTest.java:404)


FAILED:  org.apache.maven.doxia.module.markdown.MarkdownParserTest.linux-jdk7 / Build linux-jdk7 / testMetadataSinkEvent

Error Message:
expected:<...
head_
body
unknown
[text
unknown
paragraph
text
paragraph_
section1
sectionTitle1
text]
sectionTitle1_
para...> but was:<...
head_
body
unknown
[link
text
link_
unknown
paragraph
text
paragraph_
section1
sectionTitle1
link
text
link_]
sectionTitle1_
para...>

Stack Trace:
junit.framework.ComparisonFailure:
expected:<...
head_
body
unknown
[text
unknown
paragraph
text
paragraph_
section1
sectionTitle1
text]
sectionTitle1_
para...> but was:<...
head_
body
unknown
[link
text
link_
unknown
paragraph
text
paragraph_
section1
sectionTitle1
link
text
link_]
sectionTitle1_
para...>
        at org.apache.maven.doxia.module.markdown.MarkdownParserTest.testMetadataSinkEvent(MarkdownParserTest.java:275)


FAILED:  org.apache.maven.doxia.module.markdown.MarkdownParserTest.linux-jdk8 / Build linux-jdk8 / testHtmlContent

Error Message:
expected:<...izontalRule
unknown
[text]
unknown
paragraph
t...> but was:<...izontalRule
unknown
[link
text
link_]
unknown
paragraph
t...>

Stack Trace:
junit.framework.ComparisonFailure:
expected:<...izontalRule
unknown
[text]
unknown
paragraph
t...> but was:<...izontalRule
unknown
[link
text
link_]
unknown
paragraph
t...>
        at org.apache.maven.doxia.module.markdown.MarkdownParserTest.testHtmlContent(MarkdownParserTest.java:328)


FAILED:  org.apache.maven.doxia.module.markdown.MarkdownParserTest.linux-jdk8 / Build linux-jdk8 / testCommentBeforeHeadingSinkEvent

Error Message:
expected:<...omment
text
unknown
[text]
unknown
paragraph
t...> but was:<...omment
text
unknown
[link
text
link_]
unknown
paragraph
t...>

Stack Trace:
junit.framework.ComparisonFailure:
expected:<...omment
text
unknown
[text]
unknown
paragraph
t...> but was:<...omment
text
unknown
[link
text
link_]
unknown
paragraph
t...>
        at org.apache.maven.doxia.module.markdown.MarkdownParserTest.testCommentBeforeHeadingSinkEvent(MarkdownParserTest.java:311)


FAILED:  org.apache.maven.doxia.module.markdown.MarkdownParserTest.linux-jdk8 / Build linux-jdk8 / testFirstHeadingSinkEvent

Error Message:
expected:<...tion1
sectionTitle1
[text]
sectionTitle1_
para...> but was:<...tion1
sectionTitle1
[link
text
link_]
sectionTitle1_
para...>

Stack Trace:
junit.framework.ComparisonFailure:
expected:<...tion1
sectionTitle1
[text]
sectionTitle1_
para...> but was:<...tion1
sectionTitle1
[link
text
link_]
sectionTitle1_
para...>
        at org.apache.maven.doxia.module.markdown.MarkdownParserTest.testFirstHeadingSinkEvent(MarkdownParserTest.java:294)


FAILED:  org.apache.maven.doxia.module.markdown.MarkdownParserTest.linux-jdk8 / Build linux-jdk8 / testTocMacro

Error Message:
expected:<...tion2
sectionTitle2
[text
sectionTitle2_
section2_
section2
sectionTitle2
text]
sectionTitle2_
sect...> but was:<...tion2
sectionTitle2
[link
text
link_
sectionTitle2_
section2_
section2
sectionTitle2
link
text
link_]
sectionTitle2_
sect...>

Stack Trace:
junit.framework.ComparisonFailure:
expected:<...tion2
sectionTitle2
[text
sectionTitle2_
section2_
section2
sectionTitle2
text]
sectionTitle2_
sect...> but was:<...tion2
sectionTitle2
[link
text
link_
sectionTitle2_
section2_
section2
sectionTitle2
link
text
link_]
sectionTitle2_
sect...>
        at org.apache.maven.doxia.module.markdown.MarkdownParserTest.testTocMacro(MarkdownParserTest.java:376)


FAILED:  org.apache.maven.doxia.module.markdown.MarkdownParserTest.linux-jdk8 / Build linux-jdk8 / testTocMacroDoxia559

Error Message:
expected:<...tion1
sectionTitle1
[text
sectionTitle1_
section2
section3
sectionTitle3
text
sectionTitle3_
section3_
section2_
section1_
section1
sectionTitle1
text]
sectionTitle1_
sect...> but was:<...tion1
sectionTitle1
[link
text
link_
sectionTitle1_
section2
section3
sectionTitle3
link
text
link_
sectionTitle3_
section3_
section2_
section1_
section1
sectionTitle1
link
text
link_]
sectionTitle1_
sect...>

Stack Trace:
junit.framework.ComparisonFailure:
expected:<...tion1
sectionTitle1
[text
sectionTitle1_
section2
section3
sectionTitle3
text
sectionTitle3_
section3_
section2_
section1_
section1
sectionTitle1
text]
sectionTitle1_
sect...> but was:<...tion1
sectionTitle1
[link
text
link_
sectionTitle1_
section2
section3
sectionTitle3
link
text
link_
sectionTitle3_
section3_
section2_
section1_
section1
sectionTitle1
link
text
link_]
sectionTitle1_
sect...>
        at org.apache.maven.doxia.module.markdown.MarkdownParserTest.testTocMacroDoxia559(MarkdownParserTest.java:404)


FAILED:  org.apache.maven.doxia.module.markdown.MarkdownParserTest.linux-jdk8 / Build linux-jdk8 / testMetadataSinkEvent

Error Message:
expected:<...
head_
body
unknown
[text
unknown
paragraph
text
paragraph_
section1
sectionTitle1
text]
sectionTitle1_
para...> but was:<...
head_
body
unknown
[link
text
link_
unknown
paragraph
text
paragraph_
section1
sectionTitle1
link
text
link_]
sectionTitle1_
para...>

Stack Trace:
junit.framework.ComparisonFailure:
expected:<...
head_
body
unknown
[text
unknown
paragraph
text
paragraph_
section1
sectionTitle1
text]
sectionTitle1_
para...> but was:<...
head_
body
unknown
[link
text
link_
unknown
paragraph
text
paragraph_
section1
sectionTitle1
link
text
link_]
sectionTitle1_
para...>
        at org.apache.maven.doxia.module.markdown.MarkdownParserTest.testMetadataSinkEvent(MarkdownParserTest.java:275)


FAILED:  org.apache.maven.doxia.module.markdown.MarkdownParserTest.linux-jdk11 / Build linux-jdk11 / testHtmlContent

Error Message:
expected:<...izontalRule
unknown
[text]
unknown
paragraph
t...> but was:<...izontalRule
unknown
[link
text
link_]
unknown
paragraph
t...>

Stack Trace:
junit.framework.ComparisonFailure:
expected:<...izontalRule
unknown
[text]
unknown
paragraph
t...> but was:<...izontalRule
unknown
[link
text
link_]
unknown
paragraph
t...>
        at org.apache.maven.doxia.module.markdown.MarkdownParserTest.testHtmlContent(MarkdownParserTest.java:328)


FAILED:  org.apache.maven.doxia.module.markdown.MarkdownParserTest.linux-jdk11 / Build linux-jdk11 / testCommentBeforeHeadingSinkEvent

Error Message:
expected:<...omment
text
unknown
[text]
unknown
paragraph
t...> but was:<...omment
text
unknown
[link
text
link_]
unknown
paragraph
t...>

Stack Trace:
junit.framework.ComparisonFailure:
expected:<...omment
text
unknown
[text]
unknown
paragraph
t...> but was:<...omment
text
unknown
[link
text
link_]
unknown
paragraph
t...>
        at org.apache.maven.doxia.module.markdown.MarkdownParserTest.testCommentBeforeHeadingSinkEvent(MarkdownParserTest.java:311)


FAILED:  org.apache.maven.doxia.module.markdown.MarkdownParserTest.linux-jdk11 / Build linux-jdk11 / testFirstHeadingSinkEvent

Error Message:
expected:<...tion1
sectionTitle1
[text]
sectionTitle1_
para...> but was:<...tion1
sectionTitle1
[link
text
link_]
sectionTitle1_
para...>

Stack Trace:
junit.framework.ComparisonFailure:
expected:<...tion1
sectionTitle1
[text]
sectionTitle1_
para...> but was:<...tion1
sectionTitle1
[link
text
link_]
sectionTitle1_
para...>
        at org.apache.maven.doxia.module.markdown.MarkdownParserTest.testFirstHeadingSinkEvent(MarkdownParserTest.java:294)


FAILED:  org.apache.maven.doxia.module.markdown.MarkdownParserTest.linux-jdk11 / Build linux-jdk11 / testTocMacro

Error Message:
expected:<...tion2
sectionTitle2
[text
sectionTitle2_
section2_
section2
sectionTitle2
text]
sectionTitle2_
sect...> but was:<...tion2
sectionTitle2
[link
text
link_
sectionTitle2_
section2_
section2
sectionTitle2
link
text
link_]
sectionTitle2_
sect...>

Stack Trace:
junit.framework.ComparisonFailure:
expected:<...tion2
sectionTitle2
[text
sectionTitle2_
section2_
section2
sectionTitle2
text]
sectionTitle2_
sect...> but was:<...tion2
sectionTitle2
[link
text
link_
sectionTitle2_
section2_
section2
sectionTitle2
link
text
link_]
sectionTitle2_
sect...>
        at org.apache.maven.doxia.module.markdown.MarkdownParserTest.testTocMacro(MarkdownParserTest.java:376)


FAILED:  org.apache.maven.doxia.module.markdown.MarkdownParserTest.linux-jdk11 / Build linux-jdk11 / testTocMacroDoxia559

Error Message:
expected:<...tion1
sectionTitle1
[text
sectionTitle1_
section2
section3
sectionTitle3
text
sectionTitle3_
section3_
section2_
section1_
section1
sectionTitle1
text]
sectionTitle1_
sect...> but was:<...tion1
sectionTitle1
[link
text
link_
sectionTitle1_
section2
section3
sectionTitle3
link
text
link_
sectionTitle3_
section3_
section2_
section1_
section1
sectionTitle1
link
text
link_]
sectionTitle1_
sect...>

Stack Trace:
junit.framework.ComparisonFailure:
expected:<...tion1
sectionTitle1
[text
sectionTitle1_
section2
section3
sectionTitle3
text
sectionTitle3_
section3_
section2_
section1_
section1
sectionTitle1
text]
sectionTitle1_
sect...> but was:<...tion1
sectionTitle1
[link
text
link_
sectionTitle1_
section2
section3
sectionTitle3
link
text
link_
sectionTitle3_
section3_
section2_
section1_
section1
sectionTitle1
link
text
link_]
sectionTitle1_
sect...>
        at org.apache.maven.doxia.module.markdown.MarkdownParserTest.testTocMacroDoxia559(MarkdownParserTest.java:404)


FAILED:  org.apache.maven.doxia.module.markdown.MarkdownParserTest.linux-jdk11 / Build linux-jdk11 / testMetadataSinkEvent

Error Message:
expected:<...
head_
body
unknown
[text
unknown
paragraph
text
paragraph_
section1
sectionTitle1
text]
sectionTitle1_
para...> but was:<...
head_
body
unknown
[link
text
link_
unknown
paragraph
text
paragraph_
section1
sectionTitle1
link
text
link_]
sectionTitle1_
para...>

Stack Trace:
junit.framework.ComparisonFailure:
expected:<...
head_
body
unknown
[text
unknown
paragraph
text
paragraph_
section1
sectionTitle1
text]
sectionTitle1_
para...> but was:<...
head_
body
unknown
[link
text
link_
unknown
paragraph
text
paragraph_
section1
sectionTitle1
link
text
link_]
sectionTitle1_
para...>
        at org.apache.maven.doxia.module.markdown.MarkdownParserTest.testMetadataSinkEvent(MarkdownParserTest.java:275)


FAILED:  org.apache.maven.doxia.module.markdown.MarkdownParserTest.linux-jdk14 / Build linux-jdk14 / testHtmlContent

Error Message:
expected:<...izontalRule
unknown
[text]
unknown
paragraph
t...> but was:<...izontalRule
unknown
[link
text
link_]
unknown
paragraph
t...>

Stack Trace:
junit.framework.ComparisonFailure:
expected:<...izontalRule
unknown
[text]
unknown
paragraph
t...> but was:<...izontalRule
unknown
[link
text
link_]
unknown
paragraph
t...>
        at org.apache.maven.doxia.module.markdown.MarkdownParserTest.testHtmlContent(MarkdownParserTest.java:328)


FAILED:  org.apache.maven.doxia.module.markdown.MarkdownParserTest.linux-jdk14 / Build linux-jdk14 / testCommentBeforeHeadingSinkEvent

Error Message:
expected:<...omment
text
unknown
[text]
unknown
paragraph
t...> but was:<...omment
text
unknown
[link
text
link_]
unknown
paragraph
t...>

Stack Trace:
junit.framework.ComparisonFailure:
expected:<...omment
text
unknown
[text]
unknown
paragraph
t...> but was:<...omment
text
unknown
[link
text
link_]
unknown
paragraph
t...>
        at org.apache.maven.doxia.module.markdown.MarkdownParserTest.testCommentBeforeHeadingSinkEvent(MarkdownParserTest.java:311)


FAILED:  org.apache.maven.doxia.module.markdown.MarkdownParserTest.linux-jdk14 / Build linux-jdk14 / testFirstHeadingSinkEvent

Error Message:
expected:<...tion1
sectionTitle1
[text]
sectionTitle1_
para...> but was:<...tion1
sectionTitle1
[link
text
link_]
sectionTitle1_
para...>

Stack Trace:
junit.framework.ComparisonFailure:
expected:<...tion1
sectionTitle1
[text]
sectionTitle1_
para...> but was:<...tion1
sectionTitle1
[link
text
link_]
sectionTitle1_
para...>
        at org.apache.maven.doxia.module.markdown.MarkdownParserTest.testFirstHeadingSinkEvent(MarkdownParserTest.java:294)


FAILED:  org.apache.maven.doxia.module.markdown.MarkdownParserTest.linux-jdk14 / Build linux-jdk14 / testTocMacro

Error Message:
expected:<...tion2
sectionTitle2
[text
sectionTitle2_
section2_
section2
sectionTitle2
text]
sectionTitle2_
sect...> but was:<...tion2
sectionTitle2
[link
text
link_
sectionTitle2_
section2_
section2
sectionTitle2
link
text
link_]
sectionTitle2_
sect...>

Stack Trace:
junit.framework.ComparisonFailure:
expected:<...tion2
sectionTitle2
[text
sectionTitle2_
section2_
section2
sectionTitle2
text]
sectionTitle2_
sect...> but was:<...tion2
sectionTitle2
[link
text
link_
sectionTitle2_
section2_
section2
sectionTitle2
link
text
link_]
sectionTitle2_
sect...>
        at org.apache.maven.doxia.module.markdown.MarkdownParserTest.testTocMacro(MarkdownParserTest.java:376)


FAILED:  org.apache.maven.doxia.module.markdown.MarkdownParserTest.linux-jdk14 / Build linux-jdk14 / testTocMacroDoxia559

Error Message:
expected:<...tion1
sectionTitle1
[text
sectionTitle1_
section2
section3
sectionTitle3
text
sectionTitle3_
section3_
section2_
section1_
section1
sectionTitle1
text]
sectionTitle1_
sect...> but was:<...tion1
sectionTitle1
[link
text
link_
sectionTitle1_
section2
section3
sectionTitle3
link
text
link_
sectionTitle3_
section3_
section2_
section1_
section1
sectionTitle1
link
text
link_]
sectionTitle1_
sect...>

Stack Trace:
junit.framework.ComparisonFailure:
expected:<...tion1
sectionTitle1
[text
sectionTitle1_
section2
section3
sectionTitle3
text
sectionTitle3_
section3_
section2_
section1_
section1
sectionTitle1
text]
sectionTitle1_
sect...> but was:<...tion1
sectionTitle1
[link
text
link_
sectionTitle1_
section2
section3
sectionTitle3
link
text
link_
sectionTitle3_
section3_
section2_
section1_
section1
sectionTitle1
link
text
link_]
sectionTitle1_
sect...>
        at org.apache.maven.doxia.module.markdown.MarkdownParserTest.testTocMacroDoxia559(MarkdownParserTest.java:404)


FAILED:  org.apache.maven.doxia.module.markdown.MarkdownParserTest.linux-jdk14 / Build linux-jdk14 / testMetadataSinkEvent

Error Message:
expected:<...
head_
body
unknown
[text
unknown
paragraph
text
paragraph_
section1
sectionTitle1
text]
sectionTitle1_
para...> but was:<...
head_
body
unknown
[link
text
link_
unknown
paragraph
text
paragraph_
section1
sectionTitle1
link
text
link_]
sectionTitle1_
para...>

Stack Trace:
junit.framework.ComparisonFailure:
expected:<...
head_
body
unknown
[text
unknown
paragraph
text
paragraph_
section1
sectionTitle1
text]
sectionTitle1_
para...> but was:<...
head_
body
unknown
[link
text
link_
unknown
paragraph
text
paragraph_
section1
sectionTitle1
link
text
link_]
sectionTitle1_
para...>
        at org.apache.maven.doxia.module.markdown.MarkdownParserTest.testMetadataSinkEvent(MarkdownParserTest.java:275)


FAILED:  org.apache.maven.doxia.module.markdown.MarkdownParserTest.linux-jdk15 / Build linux-jdk15 / testHtmlContent

Error Message:
expected:<...izontalRule
unknown
[text]
unknown
paragraph
t...> but was:<...izontalRule
unknown
[link
text
link_]
unknown
paragraph
t...>

Stack Trace:
junit.framework.ComparisonFailure:
expected:<...izontalRule
unknown
[text]
unknown
paragraph
t...> but was:<...izontalRule
unknown
[link
text
link_]
unknown
paragraph
t...>
        at org.apache.maven.doxia.module.markdown.MarkdownParserTest.testHtmlContent(MarkdownParserTest.java:328)


FAILED:  org.apache.maven.doxia.module.markdown.MarkdownParserTest.linux-jdk15 / Build linux-jdk15 / testCommentBeforeHeadingSinkEvent

Error Message:
expected:<...omment
text
unknown
[text]
unknown
paragraph
t...> but was:<...omment
text
unknown
[link
text
link_]
unknown
paragraph
t...>

Stack Trace:
junit.framework.ComparisonFailure:
expected:<...omment
text
unknown
[text]
unknown
paragraph
t...> but was:<...omment
text
unknown
[link
text
link_]
unknown
paragraph
t...>
        at org.apache.maven.doxia.module.markdown.MarkdownParserTest.testCommentBeforeHeadingSinkEvent(MarkdownParserTest.java:311)


FAILED:  org.apache.maven.doxia.module.markdown.MarkdownParserTest.linux-jdk15 / Build linux-jdk15 / testFirstHeadingSinkEvent

Error Message:
expected:<...tion1
sectionTitle1
[text]
sectionTitle1_
para...> but was:<...tion1
sectionTitle1
[link
text
link_]
sectionTitle1_
para...>

Stack Trace:
junit.framework.ComparisonFailure:
expected:<...tion1
sectionTitle1
[text]
sectionTitle1_
para...> but was:<...tion1
sectionTitle1
[link
text
link_]
sectionTitle1_
para...>
        at org.apache.maven.doxia.module.markdown.MarkdownParserTest.testFirstHeadingSinkEvent(MarkdownParserTest.java:294)


FAILED:  org.apache.maven.doxia.module.markdown.MarkdownParserTest.linux-jdk15 / Build linux-jdk15 / testTocMacro

Error Message:
expected:<...tion2
sectionTitle2
[text
sectionTitle2_
section2_
section2
sectionTitle2
text]
sectionTitle2_
sect...> but was:<...tion2
sectionTitle2
[link
text
link_
sectionTitle2_
section2_
section2
sectionTitle2
link
text
link_]
sectionTitle2_
sect...>

Stack Trace:
junit.framework.ComparisonFailure:
expected:<...tion2
sectionTitle2
[text
sectionTitle2_
section2_
section2
sectionTitle2
text]
sectionTitle2_
sect...> but was:<...tion2
sectionTitle2
[link
text
link_
sectionTitle2_
section2_
section2
sectionTitle2
link
text
link_]
sectionTitle2_
sect...>
        at org.apache.maven.doxia.module.markdown.MarkdownParserTest.testTocMacro(MarkdownParserTest.java:376)


FAILED:  org.apache.maven.doxia.module.markdown.MarkdownParserTest.linux-jdk15 / Build linux-jdk15 / testTocMacroDoxia559

Error Message:
expected:<...tion1
sectionTitle1
[text
sectionTitle1_
section2
section3
sectionTitle3
text
sectionTitle3_
section3_
section2_
section1_
section1
sectionTitle1
text]
sectionTitle1_
sect...> but was:<...tion1
sectionTitle1
[link
text
link_
sectionTitle1_
section2
section3
sectionTitle3
link
text
link_
sectionTitle3_
section3_
section2_
section1_
section1
sectionTitle1
link
text
link_]
sectionTitle1_
sect...>

Stack Trace:
junit.framework.ComparisonFailure:
expected:<...tion1
sectionTitle1
[text
sectionTitle1_
section2
section3
sectionTitle3
text
sectionTitle3_
section3_
section2_
section1_
section1
sectionTitle1
text]
sectionTitle1_
sect...> but was:<...tion1
sectionTitle1
[link
text
link_
sectionTitle1_
section2
section3
sectionTitle3
link
text
link_
sectionTitle3_
section3_
section2_
section1_
section1
sectionTitle1
link
text
link_]
sectionTitle1_
sect...>
        at org.apache.maven.doxia.module.markdown.MarkdownParserTest.testTocMacroDoxia559(MarkdownParserTest.java:404)


FAILED:  org.apache.maven.doxia.module.markdown.MarkdownParserTest.linux-jdk15 / Build linux-jdk15 / testMetadataSinkEvent

Error Message:
expected:<...
head_
body
unknown
[text
unknown
paragraph
text
paragraph_
section1
sectionTitle1
text]
sectionTitle1_
para...> but was:<...
head_
body
unknown
[link
text
link_
unknown
paragraph
text
paragraph_
section1
sectionTitle1
link
text
link_]
sectionTitle1_
para...>

Stack Trace:
junit.framework.ComparisonFailure:
expected:<...
head_
body
unknown
[text
unknown
paragraph
text
paragraph_
section1
sectionTitle1
text]
sectionTitle1_
para...> but was:<...
head_
body
unknown
[link
text
link_
unknown
paragraph
text
paragraph_
section1
sectionTitle1
link
text
link_]
sectionTitle1_
para...>
        at org.apache.maven.doxia.module.markdown.MarkdownParserTest.testMetadataSinkEvent(MarkdownParserTest.java:275)


FAILED:  org.apache.maven.doxia.module.markdown.MarkdownParserTest.windows-jdk7 / Build windows-jdk7 / testHtmlContent

Error Message:
expected:<...izontalRule
unknown
[text]
unknown
paragraph
t...> but was:<...izontalRule
unknown
[link
text
link_]
unknown
paragraph
t...>

Stack Trace:
junit.framework.ComparisonFailure:
expected:<...izontalRule
unknown
[text]
unknown
paragraph
t...> but was:<...izontalRule
unknown
[link
text
link_]
unknown
paragraph
t...>
        at org.apache.maven.doxia.module.markdown.MarkdownParserTest.testHtmlContent(MarkdownParserTest.java:328)


FAILED:  org.apache.maven.doxia.module.markdown.MarkdownParserTest.windows-jdk7 / Build windows-jdk7 / testCommentBeforeHeadingSinkEvent

Error Message:
expected:<...omment
text
unknown
[text]
unknown
paragraph
t...> but was:<...omment
text
unknown
[link
text
link_]
unknown
paragraph
t...>

Stack Trace:
junit.framework.ComparisonFailure:
expected:<...omment
text
unknown
[text]
unknown
paragraph
t...> but was:<...omment
text
unknown
[link
text
link_]
unknown
paragraph
t...>
        at org.apache.maven.doxia.module.markdown.MarkdownParserTest.testCommentBeforeHeadingSinkEvent(MarkdownParserTest.java:311)


FAILED:  org.apache.maven.doxia.module.markdown.MarkdownParserTest.windows-jdk7 / Build windows-jdk7 / testFirstHeadingSinkEvent

Error Message:
expected:<...tion1
sectionTitle1
[text]
sectionTitle1_
para...> but was:<...tion1
sectionTitle1
[link
text
link_]
sectionTitle1_
para...>

Stack Trace:
junit.framework.ComparisonFailure:
expected:<...tion1
sectionTitle1
[text]
sectionTitle1_
para...> but was:<...tion1
sectionTitle1
[link
text
link_]
sectionTitle1_
para...>
        at org.apache.maven.doxia.module.markdown.MarkdownParserTest.testFirstHeadingSinkEvent(MarkdownParserTest.java:294)


FAILED:  org.apache.maven.doxia.module.markdown.MarkdownParserTest.windows-jdk7 / Build windows-jdk7 / testTocMacro

Error Message:
expected:<...tion2
sectionTitle2
[text
sectionTitle2_
section2_
section2
sectionTitle2
text]
sectionTitle2_
sect...> but was:<...tion2
sectionTitle2
[link
text
link_
sectionTitle2_
section2_
section2
sectionTitle2
link
text
link_]
sectionTitle2_
sect...>

Stack Trace:
junit.framework.ComparisonFailure:
expected:<...tion2
sectionTitle2
[text
sectionTitle2_
section2_
section2
sectionTitle2
text]
sectionTitle2_
sect...> but was:<...tion2
sectionTitle2
[link
text
link_
sectionTitle2_
section2_
section2
sectionTitle2
link
text
link_]
sectionTitle2_
sect...>
        at org.apache.maven.doxia.module.markdown.MarkdownParserTest.testTocMacro(MarkdownParserTest.java:376)


FAILED:  org.apache.maven.doxia.module.markdown.MarkdownParserTest.windows-jdk7 / Build windows-jdk7 / testTocMacroDoxia559

Error Message:
expected:<...tion1
sectionTitle1
[text
sectionTitle1_
section2
section3
sectionTitle3
text
sectionTitle3_
section3_
section2_
section1_
section1
sectionTitle1
text]
sectionTitle1_
sect...> but was:<...tion1
sectionTitle1
[link
text
link_
sectionTitle1_
section2
section3
sectionTitle3
link
text
link_
sectionTitle3_
section3_
section2_
section1_
section1
sectionTitle1
link
text
link_]
sectionTitle1_
sect...>

Stack Trace:
junit.framework.ComparisonFailure:
expected:<...tion1
sectionTitle1
[text
sectionTitle1_
section2
section3
sectionTitle3
text
sectionTitle3_
section3_
section2_
section1_
section1
sectionTitle1
text]
sectionTitle1_
sect...> but was:<...tion1
sectionTitle1
[link
text
link_
sectionTitle1_
section2
section3
sectionTitle3
link
text
link_
sectionTitle3_
section3_
section2_
section1_
section1
sectionTitle1
link
text
link_]
sectionTitle1_
sect...>
        at org.apache.maven.doxia.module.markdown.MarkdownParserTest.testTocMacroDoxia559(MarkdownParserTest.java:404)


FAILED:  org.apache.maven.doxia.module.markdown.MarkdownParserTest.windows-jdk7 / Build windows-jdk7 / testMetadataSinkEvent

Error Message:
expected:<...
head_
body
unknown
[text
unknown
paragraph
text
paragraph_
section1
sectionTitle1
text]
sectionTitle1_
para...> but was:<...
head_
body
unknown
[link
text
link_
unknown
paragraph
text
paragraph_
section1
sectionTitle1
link
text
link_]
sectionTitle1_
para...>

Stack Trace:
junit.framework.ComparisonFailure:
expected:<...
head_
body
unknown
[text
unknown
paragraph
text
paragraph_
section1
sectionTitle1
text]
sectionTitle1_
para...> but was:<...
head_
body
unknown
[link
text
link_
unknown
paragraph
text
paragraph_
section1
sectionTitle1
link
text
link_]
sectionTitle1_
para...>
        at org.apache.maven.doxia.module.markdown.MarkdownParserTest.testMetadataSinkEvent(MarkdownParserTest.java:275)


FAILED:  org.apache.maven.doxia.module.markdown.MarkdownParserTest.windows-jdk8 / Build windows-jdk8 / testHtmlContent

Error Message:
expected:<...izontalRule
unknown
[text]
unknown
paragraph
t...> but was:<...izontalRule
unknown
[link
text
link_]
unknown
paragraph
t...>

Stack Trace:
junit.framework.ComparisonFailure:
expected:<...izontalRule
unknown
[text]
unknown
paragraph
t...> but was:<...izontalRule
unknown
[link
text
link_]
unknown
paragraph
t...>
        at org.apache.maven.doxia.module.markdown.MarkdownParserTest.testHtmlContent(MarkdownParserTest.java:328)


FAILED:  org.apache.maven.doxia.module.markdown.MarkdownParserTest.windows-jdk8 / Build windows-jdk8 / testCommentBeforeHeadingSinkEvent

Error Message:
expected:<...omment
text
unknown
[text]
unknown
paragraph
t...> but was:<...omment
text
unknown
[link
text
link_]
unknown
paragraph
t...>

Stack Trace:
junit.framework.ComparisonFailure:
expected:<...omment
text
unknown
[text]
unknown
paragraph
t...> but was:<...omment
text
unknown
[link
text
link_]
unknown
paragraph
t...>
        at org.apache.maven.doxia.module.markdown.MarkdownParserTest.testCommentBeforeHeadingSinkEvent(MarkdownParserTest.java:311)


FAILED:  org.apache.maven.doxia.module.markdown.MarkdownParserTest.windows-jdk8 / Build windows-jdk8 / testFirstHeadingSinkEvent

Error Message:
expected:<...tion1
sectionTitle1
[text]
sectionTitle1_
para...> but was:<...tion1
sectionTitle1
[link
text
link_]
sectionTitle1_
para...>

Stack Trace:
junit.framework.ComparisonFailure:
expected:<...tion1
sectionTitle1
[text]
sectionTitle1_
para...> but was:<...tion1
sectionTitle1
[link
text
link_]
sectionTitle1_
para...>
        at org.apache.maven.doxia.module.markdown.MarkdownParserTest.testFirstHeadingSinkEvent(MarkdownParserTest.java:294)


FAILED:  org.apache.maven.doxia.module.markdown.MarkdownParserTest.windows-jdk8 / Build windows-jdk8 / testTocMacro

Error Message:
expected:<...tion2
sectionTitle2
[text
sectionTitle2_
section2_
section2
sectionTitle2
text]
sectionTitle2_
sect...> but was:<...tion2
sectionTitle2
[link
text
link_
sectionTitle2_
section2_
section2
sectionTitle2
link
text
link_]
sectionTitle2_
sect...>

Stack Trace:
junit.framework.ComparisonFailure:
expected:<...tion2
sectionTitle2
[text
sectionTitle2_
section2_
section2
sectionTitle2
text]
sectionTitle2_
sect...> but was:<...tion2
sectionTitle2
[link
text
link_
sectionTitle2_
section2_
section2
sectionTitle2
link
text
link_]
sectionTitle2_
sect...>
        at org.apache.maven.doxia.module.markdown.MarkdownParserTest.testTocMacro(MarkdownParserTest.java:376)


FAILED:  org.apache.maven.doxia.module.markdown.MarkdownParserTest.windows-jdk8 / Build windows-jdk8 / testTocMacroDoxia559

Error Message:
expected:<...tion1
sectionTitle1
[text
sectionTitle1_
section2
section3
sectionTitle3
text
sectionTitle3_
section3_
section2_
section1_
section1
sectionTitle1
text]
sectionTitle1_
sect...> but was:<...tion1
sectionTitle1
[link
text
link_
sectionTitle1_
section2
section3
sectionTitle3
link
text
link_
sectionTitle3_
section3_
section2_
section1_
section1
sectionTitle1
link
text
link_]
sectionTitle1_
sect...>

Stack Trace:
junit.framework.ComparisonFailure:
expected:<...tion1
sectionTitle1
[text
sectionTitle1_
section2
section3
sectionTitle3
text
sectionTitle3_
section3_
section2_
section1_
section1
sectionTitle1
text]
sectionTitle1_
sect...> but was:<...tion1
sectionTitle1
[link
text
link_
sectionTitle1_
section2
section3
sectionTitle3
link
text
link_
sectionTitle3_
section3_
section2_
section1_
section1
sectionTitle1
link
text
link_]
sectionTitle1_
sect...>
        at org.apache.maven.doxia.module.markdown.MarkdownParserTest.testTocMacroDoxia559(MarkdownParserTest.java:404)


FAILED:  org.apache.maven.doxia.module.markdown.MarkdownParserTest.windows-jdk8 / Build windows-jdk8 / testMetadataSinkEvent

Error Message:
expected:<...
head_
body
unknown
[text
unknown
paragraph
text
paragraph_
section1
sectionTitle1
text]
sectionTitle1_
para...> but was:<...
head_
body
unknown
[link
text
link_
unknown
paragraph
text
paragraph_
section1
sectionTitle1
link
text
link_]
sectionTitle1_
para...>

Stack Trace:
junit.framework.ComparisonFailure:
expected:<...
head_
body
unknown
[text
unknown
paragraph
text
paragraph_
section1
sectionTitle1
text]
sectionTitle1_
para...> but was:<...
head_
body
unknown
[link
text
link_
unknown
paragraph
text
paragraph_
section1
sectionTitle1
link
text
link_]
sectionTitle1_
para...>
        at org.apache.maven.doxia.module.markdown.MarkdownParserTest.testMetadataSinkEvent(MarkdownParserTest.java:275)


FAILED:  org.apache.maven.doxia.module.markdown.MarkdownParserTest.windows-jdk11 / Build windows-jdk11 / testHtmlContent

Error Message:
expected:<...izontalRule
unknown
[text]
unknown
paragraph
t...> but was:<...izontalRule
unknown
[link
text
link_]
unknown
paragraph
t...>

Stack Trace:
junit.framework.ComparisonFailure:
expected:<...izontalRule
unknown
[text]
unknown
paragraph
t...> but was:<...izontalRule
unknown
[link
text
link_]
unknown
paragraph
t...>
        at org.apache.maven.doxia.module.markdown.MarkdownParserTest.testHtmlContent(MarkdownParserTest.java:328)


FAILED:  org.apache.maven.doxia.module.markdown.MarkdownParserTest.windows-jdk11 / Build windows-jdk11 / testCommentBeforeHeadingSinkEvent

Error Message:
expected:<...omment
text
unknown
[text]
unknown
paragraph
t...> but was:<...omment
text
unknown
[link
text
link_]
unknown
paragraph
t...>

Stack Trace:
junit.framework.ComparisonFailure:
expected:<...omment
text
unknown
[text]
unknown
paragraph
t...> but was:<...omment
text
unknown
[link
text
link_]
unknown
paragraph
t...>
        at org.apache.maven.doxia.module.markdown.MarkdownParserTest.testCommentBeforeHeadingSinkEvent(MarkdownParserTest.java:311)


FAILED:  org.apache.maven.doxia.module.markdown.MarkdownParserTest.windows-jdk11 / Build windows-jdk11 / testFirstHeadingSinkEvent

Error Message:
expected:<...tion1
sectionTitle1
[text]
sectionTitle1_
para...> but was:<...tion1
sectionTitle1
[link
text
link_]
sectionTitle1_
para...>

Stack Trace:
junit.framework.ComparisonFailure:
expected:<...tion1
sectionTitle1
[text]
sectionTitle1_
para...> but was:<...tion1
sectionTitle1
[link
text
link_]
sectionTitle1_
para...>
        at org.apache.maven.doxia.module.markdown.MarkdownParserTest.testFirstHeadingSinkEvent(MarkdownParserTest.java:294)


FAILED:  org.apache.maven.doxia.module.markdown.MarkdownParserTest.windows-jdk11 / Build windows-jdk11 / testTocMacro

Error Message:
expected:<...tion2
sectionTitle2
[text
sectionTitle2_
section2_
section2
sectionTitle2
text]
sectionTitle2_
sect...> but was:<...tion2
sectionTitle2
[link
text
link_
sectionTitle2_
section2_
section2
sectionTitle2
link
text
link_]
sectionTitle2_
sect...>

Stack Trace:
junit.framework.ComparisonFailure:
expected:<...tion2
sectionTitle2
[text
sectionTitle2_
section2_
section2
sectionTitle2
text]
sectionTitle2_
sect...> but was:<...tion2
sectionTitle2
[link
text
link_
sectionTitle2_
section2_
section2
sectionTitle2
link
text
link_]
sectionTitle2_
sect...>
        at org.apache.maven.doxia.module.markdown.MarkdownParserTest.testTocMacro(MarkdownParserTest.java:376)


FAILED:  org.apache.maven.doxia.module.markdown.MarkdownParserTest.windows-jdk11 / Build windows-jdk11 / testTocMacroDoxia559

Error Message:
expected:<...tion1
sectionTitle1
[text
sectionTitle1_
section2
section3
sectionTitle3
text
sectionTitle3_
section3_
section2_
section1_
section1
sectionTitle1
text]
sectionTitle1_
sect...> but was:<...tion1
sectionTitle1
[link
text
link_
sectionTitle1_
section2
section3
sectionTitle3
link
text
link_
sectionTitle3_
section3_
section2_
section1_
section1
sectionTitle1
link
text
link_]
sectionTitle1_
sect...>

Stack Trace:
junit.framework.ComparisonFailure:
expected:<...tion1
sectionTitle1
[text
sectionTitle1_
section2
section3
sectionTitle3
text
sectionTitle3_
section3_
section2_
section1_
section1
sectionTitle1
text]
sectionTitle1_
sect...> but was:<...tion1
sectionTitle1
[link
text
link_
sectionTitle1_
section2
section3
sectionTitle3
link
text
link_
sectionTitle3_
section3_
section2_
section1_
section1
sectionTitle1
link
text
link_]
sectionTitle1_
sect...>
        at org.apache.maven.doxia.module.markdown.MarkdownParserTest.testTocMacroDoxia559(MarkdownParserTest.java:404)


FAILED:  org.apache.maven.doxia.module.markdown.MarkdownParserTest.windows-jdk11 / Build windows-jdk11 / testMetadataSinkEvent

Error Message:
expected:<...
head_
body
unknown
[text
unknown
paragraph
text
paragraph_
section1
sectionTitle1
text]
sectionTitle1_
para...> but was:<...
head_
body
unknown
[link
text
link_
unknown
paragraph
text
paragraph_
section1
sectionTitle1
link
text
link_]
sectionTitle1_
para...>

Stack Trace:
junit.framework.ComparisonFailure:
expected:<...
head_
body
unknown
[text
unknown
paragraph
text
paragraph_
section1
sectionTitle1
text]
sectionTitle1_
para...> but was:<...
head_
body
unknown
[link
text
link_
unknown
paragraph
text
paragraph_
section1
sectionTitle1
link
text
link_]
sectionTitle1_
para...>
        at org.apache.maven.doxia.module.markdown.MarkdownParserTest.testMetadataSinkEvent(MarkdownParserTest.java:275)


FAILED:  org.apache.maven.doxia.module.markdown.MarkdownParserTest.windows-jdk14 / Build windows-jdk14 / testHtmlContent

Error Message:
expected:<...izontalRule
unknown
[text]
unknown
paragraph
t...> but was:<...izontalRule
unknown
[link
text
link_]
unknown
paragraph
t...>

Stack Trace:
junit.framework.ComparisonFailure:
expected:<...izontalRule
unknown
[text]
unknown
paragraph
t...> but was:<...izontalRule
unknown
[link
text
link_]
unknown
paragraph
t...>
        at org.apache.maven.doxia.module.markdown.MarkdownParserTest.testHtmlContent(MarkdownParserTest.java:328)


FAILED:  org.apache.maven.doxia.module.markdown.MarkdownParserTest.windows-jdk14 / Build windows-jdk14 / testCommentBeforeHeadingSinkEvent

Error Message:
expected:<...omment
text
unknown
[text]
unknown
paragraph
t...> but was:<...omment
text
unknown
[link
text
link_]
unknown
paragraph
t...>

Stack Trace:
junit.framework.ComparisonFailure:
expected:<...omment
text
unknown
[text]
unknown
paragraph
t...> but was:<...omment
text
unknown
[link
text
link_]
unknown
paragraph
t...>
        at org.apache.maven.doxia.module.markdown.MarkdownParserTest.testCommentBeforeHeadingSinkEvent(MarkdownParserTest.java:311)


FAILED:  org.apache.maven.doxia.module.markdown.MarkdownParserTest.windows-jdk14 / Build windows-jdk14 / testFirstHeadingSinkEvent

Error Message:
expected:<...tion1
sectionTitle1
[text]
sectionTitle1_
para...> but was:<...tion1
sectionTitle1
[link
text
link_]
sectionTitle1_
para...>

Stack Trace:
junit.framework.ComparisonFailure:
expected:<...tion1
sectionTitle1
[text]
sectionTitle1_
para...> but was:<...tion1
sectionTitle1
[link
text
link_]
sectionTitle1_
para...>
        at org.apache.maven.doxia.module.markdown.MarkdownParserTest.testFirstHeadingSinkEvent(MarkdownParserTest.java:294)


FAILED:  org.apache.maven.doxia.module.markdown.MarkdownParserTest.windows-jdk14 / Build windows-jdk14 / testTocMacro

Error Message:
expected:<...tion2
sectionTitle2
[text
sectionTitle2_
section2_
section2
sectionTitle2
text]
sectionTitle2_
sect...> but was:<...tion2
sectionTitle2
[link
text
link_
sectionTitle2_
section2_
section2
sectionTitle2
link
text
link_]
sectionTitle2_
sect...>

Stack Trace:
junit.framework.ComparisonFailure:
expected:<...tion2
sectionTitle2
[text
sectionTitle2_
section2_
section2
sectionTitle2
text]
sectionTitle2_
sect...> but was:<...tion2
sectionTitle2
[link
text
link_
sectionTitle2_
section2_
section2
sectionTitle2
link
text
link_]
sectionTitle2_
sect...>
        at org.apache.maven.doxia.module.markdown.MarkdownParserTest.testTocMacro(MarkdownParserTest.java:376)


FAILED:  org.apache.maven.doxia.module.markdown.MarkdownParserTest.windows-jdk14 / Build windows-jdk14 / testTocMacroDoxia559

Error Message:
expected:<...tion1
sectionTitle1
[text
sectionTitle1_
section2
section3
sectionTitle3
text
sectionTitle3_
section3_
section2_
section1_
section1
sectionTitle1
text]
sectionTitle1_
sect...> but was:<...tion1
sectionTitle1
[link
text
link_
sectionTitle1_
section2
section3
sectionTitle3
link
text
link_
sectionTitle3_
section3_
section2_
section1_
section1
sectionTitle1
link
text
link_]
sectionTitle1_
sect...>

Stack Trace:
junit.framework.ComparisonFailure:
expected:<...tion1
sectionTitle1
[text
sectionTitle1_
section2
section3
sectionTitle3
text
sectionTitle3_
section3_
section2_
section1_
section1
sectionTitle1
text]
sectionTitle1_
sect...> but was:<...tion1
sectionTitle1
[link
text
link_
sectionTitle1_
section2
section3
sectionTitle3
link
text
link_
sectionTitle3_
section3_
section2_
section1_
section1
sectionTitle1
link
text
link_]
sectionTitle1_
sect...>
        at org.apache.maven.doxia.module.markdown.MarkdownParserTest.testTocMacroDoxia559(MarkdownParserTest.java:404)


FAILED:  org.apache.maven.doxia.module.markdown.MarkdownParserTest.windows-jdk14 / Build windows-jdk14 / testMetadataSinkEvent

Error Message:
expected:<...
head_
body
unknown
[text
unknown
paragraph
text
paragraph_
section1
sectionTitle1
text]
sectionTitle1_
para...> but was:<...
head_
body
unknown
[link
text
link_
unknown
paragraph
text
paragraph_
section1
sectionTitle1
link
text
link_]
sectionTitle1_
para...>

Stack Trace:
junit.framework.ComparisonFailure:
expected:<...
head_
body
unknown
[text
unknown
paragraph
text
paragraph_
section1
sectionTitle1
text]
sectionTitle1_
para...> but was:<...
head_
body
unknown
[link
text
link_
unknown
paragraph
text
paragraph_
section1
sectionTitle1
link
text
link_]
sectionTitle1_
para...>
        at org.apache.maven.doxia.module.markdown.MarkdownParserTest.testMetadataSinkEvent(MarkdownParserTest.java:275)


FAILED:  org.apache.maven.doxia.module.markdown.MarkdownParserTest.windows-jdk15 / Build windows-jdk15 / testHtmlContent

Error Message:
expected:<...izontalRule
unknown
[text]
unknown
paragraph
t...> but was:<...izontalRule
unknown
[link
text
link_]
unknown
paragraph
t...>

Stack Trace:
junit.framework.ComparisonFailure:
expected:<...izontalRule
unknown
[text]
unknown
paragraph
t...> but was:<...izontalRule
unknown
[link
text
link_]
unknown
paragraph
t...>
        at org.apache.maven.doxia.module.markdown.MarkdownParserTest.testHtmlContent(MarkdownParserTest.java:328)


FAILED:  org.apache.maven.doxia.module.markdown.MarkdownParserTest.windows-jdk15 / Build windows-jdk15 / testCommentBeforeHeadingSinkEvent

Error Message:
expected:<...omment
text
unknown
[text]
unknown
paragraph
t...> but was:<...omment
text
unknown
[link
text
link_]
unknown
paragraph
t...>

Stack Trace:
junit.framework.ComparisonFailure:
expected:<...omment
text
unknown
[text]
unknown
paragraph
t...> but was:<...omment
text
unknown
[link
text
link_]
unknown
paragraph
t...>
        at org.apache.maven.doxia.module.markdown.MarkdownParserTest.testCommentBeforeHeadingSinkEvent(MarkdownParserTest.java:311)


FAILED:  org.apache.maven.doxia.module.markdown.MarkdownParserTest.windows-jdk15 / Build windows-jdk15 / testFirstHeadingSinkEvent

Error Message:
expected:<...tion1
sectionTitle1
[text]
sectionTitle1_
para...> but was:<...tion1
sectionTitle1
[link
text
link_]
sectionTitle1_
para...>

Stack Trace:
junit.framework.ComparisonFailure:
expected:<...tion1
sectionTitle1
[text]
sectionTitle1_
para...> but was:<...tion1
sectionTitle1
[link
text
link_]
sectionTitle1_
para...>
        at org.apache.maven.doxia.module.markdown.MarkdownParserTest.testFirstHeadingSinkEvent(MarkdownParserTest.java:294)


FAILED:  org.apache.maven.doxia.module.markdown.MarkdownParserTest.windows-jdk15 / Build windows-jdk15 / testTocMacro

Error Message:
expected:<...tion2
sectionTitle2
[text
sectionTitle2_
section2_
section2
sectionTitle2
text]
sectionTitle2_
sect...> but was:<...tion2
sectionTitle2
[link
text
link_
sectionTitle2_
section2_
section2
sectionTitle2
link
text
link_]
sectionTitle2_
sect...>

Stack Trace:
junit.framework.ComparisonFailure:
expected:<...tion2
sectionTitle2
[text
sectionTitle2_
section2_
section2
sectionTitle2
text]
sectionTitle2_
sect...> but was:<...tion2
sectionTitle2
[link
text
link_
sectionTitle2_
section2_
section2
sectionTitle2
link
text
link_]
sectionTitle2_
sect...>
        at org.apache.maven.doxia.module.markdown.MarkdownParserTest.testTocMacro(MarkdownParserTest.java:376)


FAILED:  org.apache.maven.doxia.module.markdown.MarkdownParserTest.windows-jdk15 / Build windows-jdk15 / testTocMacroDoxia559

Error Message:
expected:<...tion1
sectionTitle1
[text
sectionTitle1_
section2
section3
sectionTitle3
text
sectionTitle3_
section3_
section2_
section1_
section1
sectionTitle1
text]
sectionTitle1_
sect...> but was:<...tion1
sectionTitle1
[link
text
link_
sectionTitle1_
section2
section3
sectionTitle3
link
text
link_
sectionTitle3_
section3_
section2_
section1_
section1
sectionTitle1
link
text
link_]
sectionTitle1_
sect...>

Stack Trace:
junit.framework.ComparisonFailure:
expected:<...tion1
sectionTitle1
[text
sectionTitle1_
section2
section3
sectionTitle3
text
sectionTitle3_
section3_
section2_
section1_
section1
sectionTitle1
text]
sectionTitle1_
sect...> but was:<...tion1
sectionTitle1
[link
text
link_
sectionTitle1_
section2
section3
sectionTitle3
link
text
link_
sectionTitle3_
section3_
section2_
section1_
section1
sectionTitle1
link
text
link_]
sectionTitle1_
sect...>
        at org.apache.maven.doxia.module.markdown.MarkdownParserTest.testTocMacroDoxia559(MarkdownParserTest.java:404)


FAILED:  org.apache.maven.doxia.module.markdown.MarkdownParserTest.windows-jdk15 / Build windows-jdk15 / testMetadataSinkEvent

Error Message:
expected:<...
head_
body
unknown
[text
unknown
paragraph
text
paragraph_
section1
sectionTitle1
text]
sectionTitle1_
para...> but was:<...
head_
body
unknown
[link
text
link_
unknown
paragraph
text
paragraph_
section1
sectionTitle1
link
text
link_]
sectionTitle1_
para...>

Stack Trace:
junit.framework.ComparisonFailure:
expected:<...
head_
body
unknown
[text
unknown
paragraph
text
paragraph_
section1
sectionTitle1
text]
sectionTitle1_
para...> but was:<...
head_
body
unknown
[link
text
link_
unknown
paragraph
text
paragraph_
section1
sectionTitle1
link
text
link_]
sectionTitle1_
para...>
        at org.apache.maven.doxia.module.markdown.MarkdownParserTest.testMetadataSinkEvent(MarkdownParserTest.java:275)




Build log:
[...truncated 48818 lines...]
sectionTitle1_
para...> but was:<...tion1
sectionTitle1
[link
text
link_]
sectionTitle1_
para...>
[ERROR]   MarkdownParserTest.testHtmlContent:328->AbstractParserTest.assertEquals:131 expected:<...izontalRule
unknown
[text]
unknown
paragraph
t...> but was:<...izontalRule
unknown
[link
text
link_]
unknown
paragraph
t...>
[ERROR]   MarkdownParserTest.testMetadataSinkEvent:275->AbstractParserTest.assertEquals:131 expected:<...
head_
body
unknown
[text
unknown
paragraph
text
paragraph_
section1
sectionTitle1
text]
sectionTitle1_
para...> but was:<...
head_
body
unknown
[link
text
link_
unknown
paragraph
text
paragraph_
section1
sectionTitle1
link
text
link_]
sectionTitle1_
para...>
[ERROR]   MarkdownParserTest.testTocMacro:376->AbstractParserTest.assertEquals:131 expected:<...tion2
sectionTitle2
[text
sectionTitle2_
section2_
section2
sectionTitle2
text]
sectionTitle2_
sect...> but was:<...tion2
sectionTitle2
[link
text
link_
sectionTitle2_
section2_
section2
sectionTitle2
link
text
link_]
sectionTitle2_
sect...>
[ERROR]   MarkdownParserTest.testTocMacroDoxia559:404->AbstractParserTest.assertEquals:131 expected:<...tion1
sectionTitle1
[text
sectionTitle1_
section2
section3
sectionTitle3
text
sectionTitle3_
section3_
section2_
section1_
section1
sectionTitle1
text]
sectionTitle1_
sect...> but was:<...tion1
sectionTitle1
[link
text
link_
sectionTitle1_
section2
section3
sectionTitle3
link
text
link_
sectionTitle3_
section3_
section2_
section1_
section1
sectionTitle1
link
text
link_]
sectionTitle1_
sect...>
[INFO]
[ERROR] Tests run: 23, Failures: 6, Errors: 0, Skipped: 0
[INFO]
[ERROR] There are test failures.

Please refer to F:\jenkins\jenkins-slave\workspace\maven-box_maven-doxia_DOXIA-568\m\doxia-modules\doxia-module-markdown\target\surefire-reports for the individual test results.
Please refer to dump files (if any exist) [date]-jvmRun[N].dump, [date].dumpstream and [date]-jvmRun[N].dumpstream.
[INFO]
[INFO] --- maven-jar-plugin:3.2.0:jar (default-jar) @ doxia-module-markdown ---
[INFO] Building jar: F:\jenkins\jenkins-slave\workspace\maven-box_maven-doxia_DOXIA-568\m\doxia-modules\doxia-module-markdown\target\doxia-module-markdown-1.9.2-SNAPSHOT.jar
[INFO]
[INFO] --- maven-site-plugin:3.7.1:attach-descriptor (attach-descriptor) @ doxia-module-markdown ---
[INFO] Skipping because packaging 'jar' is not pom.
[INFO]
[INFO] --- maven-checkstyle-plugin:3.0.0:check (checkstyle-check) @ doxia-module-markdown ---
[INFO]
[INFO] >>> clirr-maven-plugin:2.8:check (default) > compile @ doxia-module-markdown >>>
[INFO]
[INFO] --- maven-enforcer-plugin:1.4.1:enforce (enforce-maven-version) @ doxia-module-markdown ---
[INFO]
[INFO] --- maven-enforcer-plugin:1.4.1:enforce (enforce-bytecode-version) @ doxia-module-markdown ---
[INFO] Adding ignore: module-info
[INFO]
[INFO] --- apache-rat-plugin:0.13:check (rat-check) @ doxia-module-markdown ---
[INFO] Enabled default license matchers.
[INFO] Will parse SCM ignores for exclusions...
[INFO] Finished adding exclusions from SCM ignore files.
[INFO] 62 implicit excludes (use -debug for more details).
[INFO] 11 explicit excludes (use -debug for more details).
[INFO] 11 resources included (use -debug for more details)
[INFO] Rat check: Summary over all files. Unapproved: 0, unknown: 0, generated: 0, approved: 11 licenses.
[INFO]
[INFO] --- maven-remote-resources-plugin:1.7.0:process (process-resource-bundles) @ doxia-module-markdown ---
[INFO] Preparing remote bundle org.apache:apache-jar-resource-bundle:1.4
[INFO] Copying 3 resources from 1 bundle.
[INFO]
[INFO] --- maven-resources-plugin:3.1.0:resources (default-resources) @ doxia-module-markdown ---
[INFO] Using 'UTF-8' encoding to copy filtered resources.
[INFO] skip non existing resourceDirectory F:\jenkins\jenkins-slave\workspace\maven-box_maven-doxia_DOXIA-568\m\doxia-modules\doxia-module-markdown\src\main\resources
[INFO] skip non existing resourceDirectory F:\jenkins\jenkins-slave\workspace\maven-box_maven-doxia_DOXIA-568\m\doxia-modules\doxia-module-markdown\target\generated-site\xsd
[INFO] Copying 3 resources
[INFO] Copying 3 resources
[INFO]
[INFO] --- maven-compiler-plugin:3.8.1:compile (default-compile) @ doxia-module-markdown ---
[INFO] Changes detected - recompiling the module!
[INFO] Compiling 5 source files to F:\jenkins\jenkins-slave\workspace\maven-box_maven-doxia_DOXIA-568\m\doxia-modules\doxia-module-markdown\target\classes
[INFO] /F:/jenkins/jenkins-slave/workspace/maven-box_maven-doxia_DOXIA-568/m/doxia-modules/doxia-module-markdown/src/main/java/org/apache/maven/doxia/module/markdown/MarkdownParser.java: F:\jenkins\jenkins-slave\workspace\maven-box_maven-doxia_DOXIA-568\m\doxia-modules\doxia-module-markdown\src\main\java\org\apache\maven\doxia\module\markdown\MarkdownParser.java uses or overrides a deprecated API.
[INFO] /F:/jenkins/jenkins-slave/workspace/maven-box_maven-doxia_DOXIA-568/m/doxia-modules/doxia-module-markdown/src/main/java/org/apache/maven/doxia/module/markdown/MarkdownParser.java: Recompile with -Xlint:deprecation for details.
[INFO]
[INFO] <<< clirr-maven-plugin:2.8:check (default) < compile @ doxia-module-markdown <<<
[INFO]
[INFO]
[INFO] --- clirr-maven-plugin:2.8:check (default) @ doxia-module-markdown ---
[INFO] artifact org.apache.maven.doxia:doxia-module-markdown: checking for updates from apache-snapshots
[INFO] artifact org.apache.maven.doxia:doxia-module-markdown: checking for updates from Nexus
[INFO] artifact org.apache.maven.doxia:doxia-module-markdown: checking for updates from central
[INFO] Comparing to version: 1.9.1
[INFO] Downloading from central: https://repo.maven.apache.org/maven2/org/apache/maven/doxia/doxia-module-markdown/1.9.1/doxia-module-markdown-1.9.1.jar
[INFO] Downloaded from central: https://repo.maven.apache.org/maven2/org/apache/maven/doxia/doxia-module-markdown/1.9.1/doxia-module-markdown-1.9.1.jar (23 kB at 1.1 MB/s)
[INFO] Downloading from central: https://repo.maven.apache.org/maven2/org/apache/maven/doxia/doxia-module-markdown/1.9.1/doxia-module-markdown-1.9.1.pom
[INFO] Downloaded from central: https://repo.maven.apache.org/maven2/org/apache/maven/doxia/doxia-module-markdown/1.9.1/doxia-module-markdown-1.9.1.pom (2.6 kB at 128 kB/s)
[INFO] Succeeded with 0 errors; 0 warnings; and 0 other changes.
[INFO] ------------------------------------------------------------------------
[INFO] Reactor Summary for Doxia 1.9.2-SNAPSHOT:
[INFO]
[INFO] Doxia .............................................. SUCCESS [ 51.707 s]
[INFO] Doxia :: Logging API ............................... SUCCESS [  9.344 s]
[INFO] Doxia :: Sink API .................................. SUCCESS [  3.326 s]
[INFO] Doxia :: Test Documents ............................ SUCCESS [  4.751 s]
[INFO] Doxia :: Core ...................................... SUCCESS [01:07 min]
[INFO] Doxia :: Modules ................................... SUCCESS [  0.892 s]
[INFO] Doxia :: APT Module ................................ SUCCESS [  5.430 s]
[INFO] Doxia :: Confluence Module ......................... SUCCESS [  7.021 s]
[INFO] Doxia :: Simplified DocBook Module ................. SUCCESS [  8.265 s]
[INFO] Doxia :: FML Module ................................ SUCCESS [  5.312 s]
[INFO] Doxia :: FO Module ................................. SUCCESS [ 20.007 s]
[INFO] Doxia :: iText Module .............................. SUCCESS [  5.823 s]
[INFO] Doxia :: Latex Module .............................. SUCCESS [  4.552 s]
[INFO] Doxia :: RTF Module ................................ SUCCESS [  7.049 s]
[INFO] Doxia :: TWiki Module .............................. SUCCESS [  6.368 s]
[INFO] Doxia :: XDoc Module ............................... SUCCESS [ 22.844 s]
[INFO] Doxia :: XHTML Module .............................. SUCCESS [  6.467 s]
[INFO] Doxia :: XHTML5 Module ............................. SUCCESS [  5.826 s]
[INFO] Doxia :: Markdown Module ........................... SUCCESS [ 15.618 s]
[INFO] ------------------------------------------------------------------------
[INFO] BUILD SUCCESS
[INFO] ------------------------------------------------------------------------
[INFO] Total time:  04:19 min
[INFO] Finished at: 2020-03-26T11:22:49-07:00
[INFO] ------------------------------------------------------------------------
[WARNING] The requested profile "run-its" could not be activated because it does not exist.
[INFO] [jenkins-event-spy] Generated F:\jenkins\jenkins-slave\workspace\maven-box_maven-doxia_DOXIA-568@tmp\withMavendd3c2aad\maven-spy-20200326-111830-3475702574746250159634.log
[Pipeline] }
[Pipeline] // dir
[Pipeline] }
[withMaven] junitPublisher - Archive test results for Maven artifact org.apache.maven.doxia:doxia-logging-api:jar:1.9.2-SNAPSHOT generated by maven-surefire-plugin:test (default-test): m\doxia-logging-api\target\surefire-reports\*.xml
[withMaven] junitPublisher - Archive test results for Maven artifact org.apache.maven.doxia:doxia-sink-api:jar:1.9.2-SNAPSHOT generated by maven-surefire-plugin:test (default-test): m\doxia-sink-api\target\surefire-reports\*.xml
[withMaven] junitPublisher - Archive test results for Maven artifact org.apache.maven.doxia:doxia-test-docs:jar:1.9.2-SNAPSHOT generated by maven-surefire-plugin:test (default-test): m\doxia-test-docs\target\surefire-reports\*.xml
[withMaven] junitPublisher - Archive test results for Maven artifact org.apache.maven.doxia:doxia-core:jar:1.9.2-SNAPSHOT generated by maven-surefire-plugin:test (default-test): m\doxia-core\target\surefire-reports\*.xml
[withMaven] junitPublisher - Archive test results for Maven artifact org.apache.maven.doxia:doxia-module-apt:jar:1.9.2-SNAPSHOT generated by maven-surefire-plugin:test (default-test): m\doxia-modules\doxia-module-apt\target\surefire-reports\*.xml
[withMaven] junitPublisher - Archive test results for Maven artifact org.apache.maven.doxia:doxia-module-confluence:jar:1.9.2-SNAPSHOT generated by maven-surefire-plugin:test (default-test): m\doxia-modules\doxia-module-confluence\target\surefire-reports\*.xml
[withMaven] junitPublisher - Archive test results for Maven artifact org.apache.maven.doxia:doxia-module-docbook-simple:jar:1.9.2-SNAPSHOT generated by maven-surefire-plugin:test (default-test): m\doxia-modules\doxia-module-docbook-simple\target\surefire-reports\*.xml
[withMaven] junitPublisher - Archive test results for Maven artifact org.apache.maven.doxia:doxia-module-fml:jar:1.9.2-SNAPSHOT generated by maven-surefire-plugin:test (default-test): m\doxia-modules\doxia-module-fml\target\surefire-reports\*.xml
[withMaven] junitPublisher - Archive test results for Maven artifact org.apache.maven.doxia:doxia-module-fo:jar:1.9.2-SNAPSHOT generated by maven-surefire-plugin:test (default-test): m\doxia-modules\doxia-module-fo\target\surefire-reports\*.xml
[withMaven] junitPublisher - Archive test results for Maven artifact org.apache.maven.doxia:doxia-module-itext:jar:1.9.2-SNAPSHOT generated by maven-surefire-plugin:test (default-test): m\doxia-modules\doxia-module-itext\target\surefire-reports\*.xml
[withMaven] junitPublisher - Archive test results for Maven artifact org.apache.maven.doxia:doxia-module-latex:jar:1.9.2-SNAPSHOT generated by maven-surefire-plugin:test (default-test): m\doxia-modules\doxia-module-latex\target\surefire-reports\*.xml
[withMaven] junitPublisher - Archive test results for Maven artifact org.apache.maven.doxia:doxia-module-rtf:jar:1.9.2-SNAPSHOT generated by maven-surefire-plugin:test (default-test): m\doxia-modules\doxia-module-rtf\target\surefire-reports\*.xml
[withMaven] junitPublisher - Archive test results for Maven artifact org.apache.maven.doxia:doxia-module-twiki:jar:1.9.2-SNAPSHOT generated by maven-surefire-plugin:test (default-test): m\doxia-modules\doxia-module-twiki\target\surefire-reports\*.xml
[withMaven] junitPublisher - Archive test results for Maven artifact org.apache.maven.doxia:doxia-module-xdoc:jar:1.9.2-SNAPSHOT generated by maven-surefire-plugin:test (default-test): m\doxia-modules\doxia-module-xdoc\target\surefire-reports\*.xml
[withMaven] junitPublisher - Archive test results for Maven artifact org.apache.maven.doxia:doxia-module-xhtml:jar:1.9.2-SNAPSHOT generated by maven-surefire-plugin:test (default-test): m\doxia-modules\doxia-module-xhtml\target\surefire-reports\*.xml
[withMaven] junitPublisher - Archive test results for Maven artifact org.apache.maven.doxia:doxia-module-xhtml5:jar:1.9.2-SNAPSHOT generated by maven-surefire-plugin:test (default-test): m\doxia-modules\doxia-module-xhtml5\target\surefire-reports\*.xml
[withMaven] junitPublisher - Archive test results for Maven artifact org.apache.maven.doxia:doxia-module-markdown:jar:1.9.2-SNAPSHOT generated by maven-surefire-plugin:test (default-test): m\doxia-modules\doxia-module-markdown\target\surefire-reports\*.xml
Recording test results
[withMaven] Publishers: Pipeline Graph Publisher: 9 ms, Invoker Publisher: 1 ms, Junit Publisher: 2949 ms, Concordion Publisher: 1 ms, Dependencies Fingerprint Publisher: 1182 ms, JGiven Publisher: 2 ms, Jacoco Publisher: 1 ms
[Pipeline] // withMaven
[Pipeline] cleanWs
[WS-CLEANUP] Deleting project workspace...
[WS-CLEANUP] Deferred wipeout is used...
[WS-CLEANUP] done
[Pipeline] }
[Pipeline] // stage
[Pipeline] }
[Pipeline] // node
[Pipeline] }
[Pipeline] // parallel
[Pipeline] stage
[Pipeline] { (Notifications)
[Pipeline] echo
Build result: UNSTABLE
[Pipeline] jiraIssueSelector
[Pipeline] echo
The authors of changes [rfscholte].
[Pipeline] echo
Sending email ...
[Pipeline] emailext