Build unstable in Jenkins: Maven TLP » maven-dependency-analyzer » MSHARED-674_Detect_Java_8_type_annotations #13

classic Classic list List threaded Threaded
2 messages Options
Reply | Threaded
Open this post in threaded view
|

Build unstable in Jenkins: Maven TLP » maven-dependency-analyzer » MSHARED-674_Detect_Java_8_type_annotations #13

Apache Jenkins Server-2
See https://builds.apache.org/job/maven-box/job/maven-dependency-analyzer/job/MSHARED-674_Detect_Java_8_type_annotations/13/

No changes.

34 tests failed.
FAILED:  org.apache.maven.shared.dependency.analyzer.DefaultProjectDependencyAnalyzerTest.testJarWithXmlTransitiveDependency

Error Message:
Error compiling test project expected:<0> but was:<1>

Stack Trace:
junit.framework.AssertionFailedError: Error compiling test project expected:<0> but was:<1>
        at junit.framework.Assert.fail(Assert.java:57)
        at junit.framework.Assert.failNotEquals(Assert.java:329)
        at junit.framework.Assert.assertEquals(Assert.java:78)
        at junit.framework.Assert.assertEquals(Assert.java:234)
        at junit.framework.TestCase.assertEquals(TestCase.java:401)
        at org.apache.maven.shared.dependency.analyzer.DefaultProjectDependencyAnalyzerTest.compileProject(DefaultProjectDependencyAnalyzerTest.java:358)
        at org.apache.maven.shared.dependency.analyzer.DefaultProjectDependencyAnalyzerTest.compileProject(DefaultProjectDependencyAnalyzerTest.java:337)
        at org.apache.maven.shared.dependency.analyzer.DefaultProjectDependencyAnalyzerTest.testJarWithXmlTransitiveDependency(DefaultProjectDependencyAnalyzerTest.java:262)


FAILED:  org.apache.maven.shared.dependency.analyzer.DefaultProjectDependencyAnalyzerTest.testJarWithNoDependencies

Error Message:
Error compiling test project expected:<0> but was:<1>

Stack Trace:
junit.framework.AssertionFailedError: Error compiling test project expected:<0> but was:<1>
        at junit.framework.Assert.fail(Assert.java:57)
        at junit.framework.Assert.failNotEquals(Assert.java:329)
        at junit.framework.Assert.assertEquals(Assert.java:78)
        at junit.framework.Assert.assertEquals(Assert.java:234)
        at junit.framework.TestCase.assertEquals(TestCase.java:401)
        at org.apache.maven.shared.dependency.analyzer.DefaultProjectDependencyAnalyzerTest.compileProject(DefaultProjectDependencyAnalyzerTest.java:358)
        at org.apache.maven.shared.dependency.analyzer.DefaultProjectDependencyAnalyzerTest.compileProject(DefaultProjectDependencyAnalyzerTest.java:337)
        at org.apache.maven.shared.dependency.analyzer.DefaultProjectDependencyAnalyzerTest.testJarWithNoDependencies(DefaultProjectDependencyAnalyzerTest.java:111)


FAILED:  org.apache.maven.shared.dependency.analyzer.DefaultProjectDependencyAnalyzerTest.testPom

Error Message:
Error compiling test project expected:<0> but was:<1>

Stack Trace:
junit.framework.AssertionFailedError: Error compiling test project expected:<0> but was:<1>
        at junit.framework.Assert.fail(Assert.java:57)
        at junit.framework.Assert.failNotEquals(Assert.java:329)
        at junit.framework.Assert.assertEquals(Assert.java:78)
        at junit.framework.Assert.assertEquals(Assert.java:234)
        at junit.framework.TestCase.assertEquals(TestCase.java:401)
        at org.apache.maven.shared.dependency.analyzer.DefaultProjectDependencyAnalyzerTest.compileProject(DefaultProjectDependencyAnalyzerTest.java:358)
        at org.apache.maven.shared.dependency.analyzer.DefaultProjectDependencyAnalyzerTest.compileProject(DefaultProjectDependencyAnalyzerTest.java:337)
        at org.apache.maven.shared.dependency.analyzer.DefaultProjectDependencyAnalyzerTest.testPom(DefaultProjectDependencyAnalyzerTest.java:97)


FAILED:  org.apache.maven.shared.dependency.analyzer.DefaultProjectDependencyAnalyzerTest.testForceDeclaredDependenciesUsage

Error Message:
Error compiling test project expected:<0> but was:<1>

Stack Trace:
junit.framework.AssertionFailedError: Error compiling test project expected:<0> but was:<1>
        at junit.framework.Assert.fail(Assert.java:57)
        at junit.framework.Assert.failNotEquals(Assert.java:329)
        at junit.framework.Assert.assertEquals(Assert.java:78)
        at junit.framework.Assert.assertEquals(Assert.java:234)
        at junit.framework.TestCase.assertEquals(TestCase.java:401)
        at org.apache.maven.shared.dependency.analyzer.DefaultProjectDependencyAnalyzerTest.compileProject(DefaultProjectDependencyAnalyzerTest.java:358)
        at org.apache.maven.shared.dependency.analyzer.DefaultProjectDependencyAnalyzerTest.compileProject(DefaultProjectDependencyAnalyzerTest.java:337)
        at org.apache.maven.shared.dependency.analyzer.DefaultProjectDependencyAnalyzerTest.testForceDeclaredDependenciesUsage(DefaultProjectDependencyAnalyzerTest.java:198)


FAILED:  org.apache.maven.shared.dependency.analyzer.DefaultProjectDependencyAnalyzerTest.testJarWithTestDependency

Error Message:
Error compiling test project expected:<0> but was:<1>

Stack Trace:
junit.framework.AssertionFailedError: Error compiling test project expected:<0> but was:<1>
        at junit.framework.Assert.fail(Assert.java:57)
        at junit.framework.Assert.failNotEquals(Assert.java:329)
        at junit.framework.Assert.assertEquals(Assert.java:78)
        at junit.framework.Assert.assertEquals(Assert.java:234)
        at junit.framework.TestCase.assertEquals(TestCase.java:401)
        at org.apache.maven.shared.dependency.analyzer.DefaultProjectDependencyAnalyzerTest.compileProject(DefaultProjectDependencyAnalyzerTest.java:358)
        at org.apache.maven.shared.dependency.analyzer.DefaultProjectDependencyAnalyzerTest.compileProject(DefaultProjectDependencyAnalyzerTest.java:337)
        at org.apache.maven.shared.dependency.analyzer.DefaultProjectDependencyAnalyzerTest.testJarWithTestDependency(DefaultProjectDependencyAnalyzerTest.java:232)


FAILED:  org.apache.maven.shared.dependency.analyzer.DefaultProjectDependencyAnalyzerTest.testJarWithCompileDependency

Error Message:
Error compiling test project expected:<0> but was:<1>

Stack Trace:
junit.framework.AssertionFailedError: Error compiling test project expected:<0> but was:<1>
        at junit.framework.Assert.fail(Assert.java:57)
        at junit.framework.Assert.failNotEquals(Assert.java:329)
        at junit.framework.Assert.assertEquals(Assert.java:78)
        at junit.framework.Assert.assertEquals(Assert.java:234)
        at junit.framework.TestCase.assertEquals(TestCase.java:401)
        at org.apache.maven.shared.dependency.analyzer.DefaultProjectDependencyAnalyzerTest.compileProject(DefaultProjectDependencyAnalyzerTest.java:358)
        at org.apache.maven.shared.dependency.analyzer.DefaultProjectDependencyAnalyzerTest.compileProject(DefaultProjectDependencyAnalyzerTest.java:337)
        at org.apache.maven.shared.dependency.analyzer.DefaultProjectDependencyAnalyzerTest.testJarWithCompileDependency(DefaultProjectDependencyAnalyzerTest.java:174)


FAILED:  org.apache.maven.shared.dependency.analyzer.DefaultProjectDependencyAnalyzerTest.testMultimoduleProject

Error Message:
Error compiling test project expected:<0> but was:<1>

Stack Trace:
junit.framework.AssertionFailedError: Error compiling test project expected:<0> but was:<1>
        at junit.framework.Assert.fail(Assert.java:57)
        at junit.framework.Assert.failNotEquals(Assert.java:329)
        at junit.framework.Assert.assertEquals(Assert.java:78)
        at junit.framework.Assert.assertEquals(Assert.java:234)
        at junit.framework.TestCase.assertEquals(TestCase.java:401)
        at org.apache.maven.shared.dependency.analyzer.DefaultProjectDependencyAnalyzerTest.compileProject(DefaultProjectDependencyAnalyzerTest.java:358)
        at org.apache.maven.shared.dependency.analyzer.DefaultProjectDependencyAnalyzerTest.compileProject(DefaultProjectDependencyAnalyzerTest.java:337)
        at org.apache.maven.shared.dependency.analyzer.DefaultProjectDependencyAnalyzerTest.testMultimoduleProject(DefaultProjectDependencyAnalyzerTest.java:280)


FAILED:  org.apache.maven.shared.dependency.analyzer.DefaultProjectDependencyAnalyzerTest.testJarWithXmlTransitiveDependency

Error Message:
null

Stack Trace:
java.lang.NullPointerException: null
        at org.apache.commons.lang3.SystemUtils.isJavaVersionAtLeast(SystemUtils.java:1626)
        at org.apache.maven.shared.dependency.analyzer.DefaultProjectDependencyAnalyzerTest.compileProject(DefaultProjectDependencyAnalyzerTest.java:342)
        at org.apache.maven.shared.dependency.analyzer.DefaultProjectDependencyAnalyzerTest.compileProject(DefaultProjectDependencyAnalyzerTest.java:337)
        at org.apache.maven.shared.dependency.analyzer.DefaultProjectDependencyAnalyzerTest.testJarWithXmlTransitiveDependency(DefaultProjectDependencyAnalyzerTest.java:262)


FAILED:  org.apache.maven.shared.dependency.analyzer.DefaultProjectDependencyAnalyzerTest.testJarWithNoDependencies

Error Message:
null

Stack Trace:
java.lang.NullPointerException: null
        at org.apache.commons.lang3.SystemUtils.isJavaVersionAtLeast(SystemUtils.java:1626)
        at org.apache.maven.shared.dependency.analyzer.DefaultProjectDependencyAnalyzerTest.compileProject(DefaultProjectDependencyAnalyzerTest.java:342)
        at org.apache.maven.shared.dependency.analyzer.DefaultProjectDependencyAnalyzerTest.compileProject(DefaultProjectDependencyAnalyzerTest.java:337)
        at org.apache.maven.shared.dependency.analyzer.DefaultProjectDependencyAnalyzerTest.testJarWithNoDependencies(DefaultProjectDependencyAnalyzerTest.java:111)


FAILED:  org.apache.maven.shared.dependency.analyzer.DefaultProjectDependencyAnalyzerTest.testPom

Error Message:
null

Stack Trace:
java.lang.NullPointerException: null
        at org.apache.commons.lang3.SystemUtils.isJavaVersionAtLeast(SystemUtils.java:1626)
        at org.apache.maven.shared.dependency.analyzer.DefaultProjectDependencyAnalyzerTest.compileProject(DefaultProjectDependencyAnalyzerTest.java:342)
        at org.apache.maven.shared.dependency.analyzer.DefaultProjectDependencyAnalyzerTest.compileProject(DefaultProjectDependencyAnalyzerTest.java:337)
        at org.apache.maven.shared.dependency.analyzer.DefaultProjectDependencyAnalyzerTest.testPom(DefaultProjectDependencyAnalyzerTest.java:97)


FAILED:  org.apache.maven.shared.dependency.analyzer.DefaultProjectDependencyAnalyzerTest.testForceDeclaredDependenciesUsage

Error Message:
null

Stack Trace:
java.lang.NullPointerException: null
        at org.apache.commons.lang3.SystemUtils.isJavaVersionAtLeast(SystemUtils.java:1626)
        at org.apache.maven.shared.dependency.analyzer.DefaultProjectDependencyAnalyzerTest.compileProject(DefaultProjectDependencyAnalyzerTest.java:342)
        at org.apache.maven.shared.dependency.analyzer.DefaultProjectDependencyAnalyzerTest.compileProject(DefaultProjectDependencyAnalyzerTest.java:337)
        at org.apache.maven.shared.dependency.analyzer.DefaultProjectDependencyAnalyzerTest.testForceDeclaredDependenciesUsage(DefaultProjectDependencyAnalyzerTest.java:198)


FAILED:  org.apache.maven.shared.dependency.analyzer.DefaultProjectDependencyAnalyzerTest.testJarWithTestDependency

Error Message:
null

Stack Trace:
java.lang.NullPointerException: null
        at org.apache.commons.lang3.SystemUtils.isJavaVersionAtLeast(SystemUtils.java:1626)
        at org.apache.maven.shared.dependency.analyzer.DefaultProjectDependencyAnalyzerTest.compileProject(DefaultProjectDependencyAnalyzerTest.java:342)
        at org.apache.maven.shared.dependency.analyzer.DefaultProjectDependencyAnalyzerTest.compileProject(DefaultProjectDependencyAnalyzerTest.java:337)
        at org.apache.maven.shared.dependency.analyzer.DefaultProjectDependencyAnalyzerTest.testJarWithTestDependency(DefaultProjectDependencyAnalyzerTest.java:232)


FAILED:  org.apache.maven.shared.dependency.analyzer.DefaultProjectDependencyAnalyzerTest.testJarWithCompileDependency

Error Message:
null

Stack Trace:
java.lang.NullPointerException: null
        at org.apache.commons.lang3.SystemUtils.isJavaVersionAtLeast(SystemUtils.java:1626)
        at org.apache.maven.shared.dependency.analyzer.DefaultProjectDependencyAnalyzerTest.compileProject(DefaultProjectDependencyAnalyzerTest.java:342)
        at org.apache.maven.shared.dependency.analyzer.DefaultProjectDependencyAnalyzerTest.compileProject(DefaultProjectDependencyAnalyzerTest.java:337)
        at org.apache.maven.shared.dependency.analyzer.DefaultProjectDependencyAnalyzerTest.testJarWithCompileDependency(DefaultProjectDependencyAnalyzerTest.java:174)


FAILED:  org.apache.maven.shared.dependency.analyzer.DefaultProjectDependencyAnalyzerTest.testJava8methodRefs

Error Message:
null

Stack Trace:
java.lang.NullPointerException: null
        at org.apache.commons.lang3.SystemUtils.isJavaVersionAtLeast(SystemUtils.java:1626)
        at org.apache.maven.shared.dependency.analyzer.DefaultProjectDependencyAnalyzerTest.testJava8methodRefs(DefaultProjectDependencyAnalyzerTest.java:125)


FAILED:  org.apache.maven.shared.dependency.analyzer.DefaultProjectDependencyAnalyzerTest.testInlinedStaticReference

Error Message:
null

Stack Trace:
java.lang.NullPointerException: null
        at org.apache.commons.lang3.SystemUtils.isJavaVersionAtLeast(SystemUtils.java:1626)
        at org.apache.maven.shared.dependency.analyzer.DefaultProjectDependencyAnalyzerTest.testInlinedStaticReference(DefaultProjectDependencyAnalyzerTest.java:150)


FAILED:  org.apache.maven.shared.dependency.analyzer.DefaultProjectDependencyAnalyzerTest.testTypeUseAnnotationDependency

Error Message:
null

Stack Trace:
java.lang.NullPointerException: null
        at org.apache.commons.lang3.SystemUtils.isJavaVersionAtLeast(SystemUtils.java:1626)
        at org.apache.maven.shared.dependency.analyzer.DefaultProjectDependencyAnalyzerTest.testTypeUseAnnotationDependency(DefaultProjectDependencyAnalyzerTest.java:310)


FAILED:  org.apache.maven.shared.dependency.analyzer.DefaultProjectDependencyAnalyzerTest.testMultimoduleProject

Error Message:
null

Stack Trace:
java.lang.NullPointerException: null
        at org.apache.commons.lang3.SystemUtils.isJavaVersionAtLeast(SystemUtils.java:1626)
        at org.apache.maven.shared.dependency.analyzer.DefaultProjectDependencyAnalyzerTest.compileProject(DefaultProjectDependencyAnalyzerTest.java:342)
        at org.apache.maven.shared.dependency.analyzer.DefaultProjectDependencyAnalyzerTest.compileProject(DefaultProjectDependencyAnalyzerTest.java:337)
        at org.apache.maven.shared.dependency.analyzer.DefaultProjectDependencyAnalyzerTest.testMultimoduleProject(DefaultProjectDependencyAnalyzerTest.java:280)


FAILED:  org.apache.maven.shared.dependency.analyzer.DefaultProjectDependencyAnalyzerTest.testJarWithXmlTransitiveDependency

Error Message:
Error compiling test project expected:<0> but was:<1>

Stack Trace:
junit.framework.AssertionFailedError: Error compiling test project expected:<0> but was:<1>
        at junit.framework.Assert.fail(Assert.java:57)
        at junit.framework.Assert.failNotEquals(Assert.java:329)
        at junit.framework.Assert.assertEquals(Assert.java:78)
        at junit.framework.Assert.assertEquals(Assert.java:234)
        at junit.framework.TestCase.assertEquals(TestCase.java:401)
        at org.apache.maven.shared.dependency.analyzer.DefaultProjectDependencyAnalyzerTest.compileProject(DefaultProjectDependencyAnalyzerTest.java:358)
        at org.apache.maven.shared.dependency.analyzer.DefaultProjectDependencyAnalyzerTest.compileProject(DefaultProjectDependencyAnalyzerTest.java:337)
        at org.apache.maven.shared.dependency.analyzer.DefaultProjectDependencyAnalyzerTest.testJarWithXmlTransitiveDependency(DefaultProjectDependencyAnalyzerTest.java:262)


FAILED:  org.apache.maven.shared.dependency.analyzer.DefaultProjectDependencyAnalyzerTest.testJarWithNoDependencies

Error Message:
Error compiling test project expected:<0> but was:<1>

Stack Trace:
junit.framework.AssertionFailedError: Error compiling test project expected:<0> but was:<1>
        at junit.framework.Assert.fail(Assert.java:57)
        at junit.framework.Assert.failNotEquals(Assert.java:329)
        at junit.framework.Assert.assertEquals(Assert.java:78)
        at junit.framework.Assert.assertEquals(Assert.java:234)
        at junit.framework.TestCase.assertEquals(TestCase.java:401)
        at org.apache.maven.shared.dependency.analyzer.DefaultProjectDependencyAnalyzerTest.compileProject(DefaultProjectDependencyAnalyzerTest.java:358)
        at org.apache.maven.shared.dependency.analyzer.DefaultProjectDependencyAnalyzerTest.compileProject(DefaultProjectDependencyAnalyzerTest.java:337)
        at org.apache.maven.shared.dependency.analyzer.DefaultProjectDependencyAnalyzerTest.testJarWithNoDependencies(DefaultProjectDependencyAnalyzerTest.java:111)


FAILED:  org.apache.maven.shared.dependency.analyzer.DefaultProjectDependencyAnalyzerTest.testPom

Error Message:
Error compiling test project expected:<0> but was:<1>

Stack Trace:
junit.framework.AssertionFailedError: Error compiling test project expected:<0> but was:<1>
        at junit.framework.Assert.fail(Assert.java:57)
        at junit.framework.Assert.failNotEquals(Assert.java:329)
        at junit.framework.Assert.assertEquals(Assert.java:78)
        at junit.framework.Assert.assertEquals(Assert.java:234)
        at junit.framework.TestCase.assertEquals(TestCase.java:401)
        at org.apache.maven.shared.dependency.analyzer.DefaultProjectDependencyAnalyzerTest.compileProject(DefaultProjectDependencyAnalyzerTest.java:358)
        at org.apache.maven.shared.dependency.analyzer.DefaultProjectDependencyAnalyzerTest.compileProject(DefaultProjectDependencyAnalyzerTest.java:337)
        at org.apache.maven.shared.dependency.analyzer.DefaultProjectDependencyAnalyzerTest.testPom(DefaultProjectDependencyAnalyzerTest.java:97)


FAILED:  org.apache.maven.shared.dependency.analyzer.DefaultProjectDependencyAnalyzerTest.testForceDeclaredDependenciesUsage

Error Message:
Error compiling test project expected:<0> but was:<1>

Stack Trace:
junit.framework.AssertionFailedError: Error compiling test project expected:<0> but was:<1>
        at junit.framework.Assert.fail(Assert.java:57)
        at junit.framework.Assert.failNotEquals(Assert.java:329)
        at junit.framework.Assert.assertEquals(Assert.java:78)
        at junit.framework.Assert.assertEquals(Assert.java:234)
        at junit.framework.TestCase.assertEquals(TestCase.java:401)
        at org.apache.maven.shared.dependency.analyzer.DefaultProjectDependencyAnalyzerTest.compileProject(DefaultProjectDependencyAnalyzerTest.java:358)
        at org.apache.maven.shared.dependency.analyzer.DefaultProjectDependencyAnalyzerTest.compileProject(DefaultProjectDependencyAnalyzerTest.java:337)
        at org.apache.maven.shared.dependency.analyzer.DefaultProjectDependencyAnalyzerTest.testForceDeclaredDependenciesUsage(DefaultProjectDependencyAnalyzerTest.java:198)


FAILED:  org.apache.maven.shared.dependency.analyzer.DefaultProjectDependencyAnalyzerTest.testJarWithTestDependency

Error Message:
Error compiling test project expected:<0> but was:<1>

Stack Trace:
junit.framework.AssertionFailedError: Error compiling test project expected:<0> but was:<1>
        at junit.framework.Assert.fail(Assert.java:57)
        at junit.framework.Assert.failNotEquals(Assert.java:329)
        at junit.framework.Assert.assertEquals(Assert.java:78)
        at junit.framework.Assert.assertEquals(Assert.java:234)
        at junit.framework.TestCase.assertEquals(TestCase.java:401)
        at org.apache.maven.shared.dependency.analyzer.DefaultProjectDependencyAnalyzerTest.compileProject(DefaultProjectDependencyAnalyzerTest.java:358)
        at org.apache.maven.shared.dependency.analyzer.DefaultProjectDependencyAnalyzerTest.compileProject(DefaultProjectDependencyAnalyzerTest.java:337)
        at org.apache.maven.shared.dependency.analyzer.DefaultProjectDependencyAnalyzerTest.testJarWithTestDependency(DefaultProjectDependencyAnalyzerTest.java:232)


FAILED:  org.apache.maven.shared.dependency.analyzer.DefaultProjectDependencyAnalyzerTest.testJarWithCompileDependency

Error Message:
Error compiling test project expected:<0> but was:<1>

Stack Trace:
junit.framework.AssertionFailedError: Error compiling test project expected:<0> but was:<1>
        at junit.framework.Assert.fail(Assert.java:57)
        at junit.framework.Assert.failNotEquals(Assert.java:329)
        at junit.framework.Assert.assertEquals(Assert.java:78)
        at junit.framework.Assert.assertEquals(Assert.java:234)
        at junit.framework.TestCase.assertEquals(TestCase.java:401)
        at org.apache.maven.shared.dependency.analyzer.DefaultProjectDependencyAnalyzerTest.compileProject(DefaultProjectDependencyAnalyzerTest.java:358)
        at org.apache.maven.shared.dependency.analyzer.DefaultProjectDependencyAnalyzerTest.compileProject(DefaultProjectDependencyAnalyzerTest.java:337)
        at org.apache.maven.shared.dependency.analyzer.DefaultProjectDependencyAnalyzerTest.testJarWithCompileDependency(DefaultProjectDependencyAnalyzerTest.java:174)


FAILED:  org.apache.maven.shared.dependency.analyzer.DefaultProjectDependencyAnalyzerTest.testMultimoduleProject

Error Message:
Error compiling test project expected:<0> but was:<1>

Stack Trace:
junit.framework.AssertionFailedError: Error compiling test project expected:<0> but was:<1>
        at junit.framework.Assert.fail(Assert.java:57)
        at junit.framework.Assert.failNotEquals(Assert.java:329)
        at junit.framework.Assert.assertEquals(Assert.java:78)
        at junit.framework.Assert.assertEquals(Assert.java:234)
        at junit.framework.TestCase.assertEquals(TestCase.java:401)
        at org.apache.maven.shared.dependency.analyzer.DefaultProjectDependencyAnalyzerTest.compileProject(DefaultProjectDependencyAnalyzerTest.java:358)
        at org.apache.maven.shared.dependency.analyzer.DefaultProjectDependencyAnalyzerTest.compileProject(DefaultProjectDependencyAnalyzerTest.java:337)
        at org.apache.maven.shared.dependency.analyzer.DefaultProjectDependencyAnalyzerTest.testMultimoduleProject(DefaultProjectDependencyAnalyzerTest.java:280)


FAILED:  org.apache.maven.shared.dependency.analyzer.DefaultProjectDependencyAnalyzerTest.testJarWithXmlTransitiveDependency

Error Message:
null

Stack Trace:
java.lang.NullPointerException: null
        at org.apache.commons.lang3.SystemUtils.isJavaVersionAtLeast(SystemUtils.java:1626)
        at org.apache.maven.shared.dependency.analyzer.DefaultProjectDependencyAnalyzerTest.compileProject(DefaultProjectDependencyAnalyzerTest.java:342)
        at org.apache.maven.shared.dependency.analyzer.DefaultProjectDependencyAnalyzerTest.compileProject(DefaultProjectDependencyAnalyzerTest.java:337)
        at org.apache.maven.shared.dependency.analyzer.DefaultProjectDependencyAnalyzerTest.testJarWithXmlTransitiveDependency(DefaultProjectDependencyAnalyzerTest.java:262)


FAILED:  org.apache.maven.shared.dependency.analyzer.DefaultProjectDependencyAnalyzerTest.testJarWithNoDependencies

Error Message:
null

Stack Trace:
java.lang.NullPointerException: null
        at org.apache.commons.lang3.SystemUtils.isJavaVersionAtLeast(SystemUtils.java:1626)
        at org.apache.maven.shared.dependency.analyzer.DefaultProjectDependencyAnalyzerTest.compileProject(DefaultProjectDependencyAnalyzerTest.java:342)
        at org.apache.maven.shared.dependency.analyzer.DefaultProjectDependencyAnalyzerTest.compileProject(DefaultProjectDependencyAnalyzerTest.java:337)
        at org.apache.maven.shared.dependency.analyzer.DefaultProjectDependencyAnalyzerTest.testJarWithNoDependencies(DefaultProjectDependencyAnalyzerTest.java:111)


FAILED:  org.apache.maven.shared.dependency.analyzer.DefaultProjectDependencyAnalyzerTest.testPom

Error Message:
null

Stack Trace:
java.lang.NullPointerException: null
        at org.apache.commons.lang3.SystemUtils.isJavaVersionAtLeast(SystemUtils.java:1626)
        at org.apache.maven.shared.dependency.analyzer.DefaultProjectDependencyAnalyzerTest.compileProject(DefaultProjectDependencyAnalyzerTest.java:342)
        at org.apache.maven.shared.dependency.analyzer.DefaultProjectDependencyAnalyzerTest.compileProject(DefaultProjectDependencyAnalyzerTest.java:337)
        at org.apache.maven.shared.dependency.analyzer.DefaultProjectDependencyAnalyzerTest.testPom(DefaultProjectDependencyAnalyzerTest.java:97)


FAILED:  org.apache.maven.shared.dependency.analyzer.DefaultProjectDependencyAnalyzerTest.testForceDeclaredDependenciesUsage

Error Message:
null

Stack Trace:
java.lang.NullPointerException: null
        at org.apache.commons.lang3.SystemUtils.isJavaVersionAtLeast(SystemUtils.java:1626)
        at org.apache.maven.shared.dependency.analyzer.DefaultProjectDependencyAnalyzerTest.compileProject(DefaultProjectDependencyAnalyzerTest.java:342)
        at org.apache.maven.shared.dependency.analyzer.DefaultProjectDependencyAnalyzerTest.compileProject(DefaultProjectDependencyAnalyzerTest.java:337)
        at org.apache.maven.shared.dependency.analyzer.DefaultProjectDependencyAnalyzerTest.testForceDeclaredDependenciesUsage(DefaultProjectDependencyAnalyzerTest.java:198)


FAILED:  org.apache.maven.shared.dependency.analyzer.DefaultProjectDependencyAnalyzerTest.testJarWithTestDependency

Error Message:
null

Stack Trace:
java.lang.NullPointerException: null
        at org.apache.commons.lang3.SystemUtils.isJavaVersionAtLeast(SystemUtils.java:1626)
        at org.apache.maven.shared.dependency.analyzer.DefaultProjectDependencyAnalyzerTest.compileProject(DefaultProjectDependencyAnalyzerTest.java:342)
        at org.apache.maven.shared.dependency.analyzer.DefaultProjectDependencyAnalyzerTest.compileProject(DefaultProjectDependencyAnalyzerTest.java:337)
        at org.apache.maven.shared.dependency.analyzer.DefaultProjectDependencyAnalyzerTest.testJarWithTestDependency(DefaultProjectDependencyAnalyzerTest.java:232)


FAILED:  org.apache.maven.shared.dependency.analyzer.DefaultProjectDependencyAnalyzerTest.testJarWithCompileDependency

Error Message:
null

Stack Trace:
java.lang.NullPointerException: null
        at org.apache.commons.lang3.SystemUtils.isJavaVersionAtLeast(SystemUtils.java:1626)
        at org.apache.maven.shared.dependency.analyzer.DefaultProjectDependencyAnalyzerTest.compileProject(DefaultProjectDependencyAnalyzerTest.java:342)
        at org.apache.maven.shared.dependency.analyzer.DefaultProjectDependencyAnalyzerTest.compileProject(DefaultProjectDependencyAnalyzerTest.java:337)
        at org.apache.maven.shared.dependency.analyzer.DefaultProjectDependencyAnalyzerTest.testJarWithCompileDependency(DefaultProjectDependencyAnalyzerTest.java:174)


FAILED:  org.apache.maven.shared.dependency.analyzer.DefaultProjectDependencyAnalyzerTest.testJava8methodRefs

Error Message:
null

Stack Trace:
java.lang.NullPointerException: null
        at org.apache.commons.lang3.SystemUtils.isJavaVersionAtLeast(SystemUtils.java:1626)
        at org.apache.maven.shared.dependency.analyzer.DefaultProjectDependencyAnalyzerTest.testJava8methodRefs(DefaultProjectDependencyAnalyzerTest.java:125)


FAILED:  org.apache.maven.shared.dependency.analyzer.DefaultProjectDependencyAnalyzerTest.testInlinedStaticReference

Error Message:
null

Stack Trace:
java.lang.NullPointerException: null
        at org.apache.commons.lang3.SystemUtils.isJavaVersionAtLeast(SystemUtils.java:1626)
        at org.apache.maven.shared.dependency.analyzer.DefaultProjectDependencyAnalyzerTest.testInlinedStaticReference(DefaultProjectDependencyAnalyzerTest.java:150)


FAILED:  org.apache.maven.shared.dependency.analyzer.DefaultProjectDependencyAnalyzerTest.testTypeUseAnnotationDependency

Error Message:
null

Stack Trace:
java.lang.NullPointerException: null
        at org.apache.commons.lang3.SystemUtils.isJavaVersionAtLeast(SystemUtils.java:1626)
        at org.apache.maven.shared.dependency.analyzer.DefaultProjectDependencyAnalyzerTest.testTypeUseAnnotationDependency(DefaultProjectDependencyAnalyzerTest.java:310)


FAILED:  org.apache.maven.shared.dependency.analyzer.DefaultProjectDependencyAnalyzerTest.testMultimoduleProject

Error Message:
null

Stack Trace:
java.lang.NullPointerException: null
        at org.apache.commons.lang3.SystemUtils.isJavaVersionAtLeast(SystemUtils.java:1626)
        at org.apache.maven.shared.dependency.analyzer.DefaultProjectDependencyAnalyzerTest.compileProject(DefaultProjectDependencyAnalyzerTest.java:342)
        at org.apache.maven.shared.dependency.analyzer.DefaultProjectDependencyAnalyzerTest.compileProject(DefaultProjectDependencyAnalyzerTest.java:337)
        at org.apache.maven.shared.dependency.analyzer.DefaultProjectDependencyAnalyzerTest.testMultimoduleProject(DefaultProjectDependencyAnalyzerTest.java:280)




Build log:
[...truncated 2.02 MB...]
[windows-jdk8] [INFO] Downloaded from central: https://repo.maven.apache.org/maven2/org/apache/maven/doxia/doxia-module-markdown/1.7/doxia-module-markdown-1.7.jar (15 kB at 51 kB/s)
[windows-jdk8] [INFO] Downloading from central: https://repo.maven.apache.org/maven2/org/parboiled/parboiled-core/1.1.4/parboiled-core-1.1.4.jar
[windows-jdk8] [INFO] Downloaded from central: https://repo.maven.apache.org/maven2/org/pegdown/pegdown/1.2.1/pegdown-1.2.1.jar (59 kB at 194 kB/s)
[windows-jdk8] [INFO] Downloading from central: https://repo.maven.apache.org/maven2/org/ow2/asm/asm/4.1/asm-4.1.jar
[windows-jdk8] [INFO] Downloaded from central: https://repo.maven.apache.org/maven2/org/parboiled/parboiled-java/1.1.4/parboiled-java-1.1.4.jar (73 kB at 235 kB/s)
[windows-jdk8] [INFO] Downloading from central: https://repo.maven.apache.org/maven2/org/ow2/asm/asm-tree/4.1/asm-tree-4.1.jar
[windows-jdk8] [INFO] Downloaded from central: https://repo.maven.apache.org/maven2/org/parboiled/parboiled-core/1.1.4/parboiled-core-1.1.4.jar (185 kB at 560 kB/s)
[windows-jdk8] [INFO] Downloading from central: https://repo.maven.apache.org/maven2/org/ow2/asm/asm-analysis/4.1/asm-analysis-4.1.jar
[windows-jdk8] [INFO] Downloaded from central: https://repo.maven.apache.org/maven2/org/apache/maven/doxia/doxia-module-fml/1.7/doxia-module-fml-1.7.jar (39 kB at 108 kB/s)
[windows-jdk8] [INFO] Downloading from central: https://repo.maven.apache.org/maven2/org/ow2/asm/asm-util/4.1/asm-util-4.1.jar
[windows-jdk8] [INFO] Downloaded from central: https://repo.maven.apache.org/maven2/org/apache/maven/doxia/doxia-module-xdoc/1.7/doxia-module-xdoc-1.7.jar (37 kB at 93 kB/s)
[windows-jdk8] [INFO] Downloading from central: https://repo.maven.apache.org/maven2/javax/servlet/servlet-api/2.5/servlet-api-2.5.jar
[windows-jdk8] [INFO] Downloaded from central: https://repo.maven.apache.org/maven2/javax/servlet/servlet-api/2.5/servlet-api-2.5.jar (105 kB at 223 kB/s)
[windows-jdk8] [INFO] Downloading from central: https://repo.maven.apache.org/maven2/org/apache/maven/doxia/doxia-decoration-model/1.7.1/doxia-decoration-model-1.7.1.jar
[windows-jdk8] [INFO] Downloaded from central: https://repo.maven.apache.org/maven2/org/ow2/asm/asm-analysis/4.1/asm-analysis-4.1.jar (20 kB at 41 kB/s)
[windows-jdk8] [INFO] Downloading from central: https://repo.maven.apache.org/maven2/org/apache/maven/doxia/doxia-site-renderer/1.7.1/doxia-site-renderer-1.7.1.jar
[windows-jdk8] [INFO] Downloaded from central: https://repo.maven.apache.org/maven2/org/apache/maven/doxia/doxia-site-renderer/1.7.1/doxia-site-renderer-1.7.1.jar (63 kB at 125 kB/s)
[windows-jdk8] [INFO] Downloading from central: https://repo.maven.apache.org/maven2/org/apache/maven/doxia/doxia-skin-model/1.7.1/doxia-skin-model-1.7.1.jar
[windows-jdk8] [INFO] Downloaded from central: https://repo.maven.apache.org/maven2/org/apache/maven/doxia/doxia-decoration-model/1.7.1/doxia-decoration-model-1.7.1.jar (61 kB at 119 kB/s)
[windows-jdk8] [INFO] Downloading from central: https://repo.maven.apache.org/maven2/org/codehaus/plexus/plexus-velocity/1.2/plexus-velocity-1.2.jar
[windows-jdk8] [INFO] Downloaded from central: https://repo.maven.apache.org/maven2/org/ow2/asm/asm-tree/4.1/asm-tree-4.1.jar (22 kB at 43 kB/s)
[windows-jdk8] [INFO] Downloading from central: https://repo.maven.apache.org/maven2/org/apache/velocity/velocity-tools/2.0/velocity-tools-2.0.jar
[windows-jdk8] [INFO] Downloaded from central: https://repo.maven.apache.org/maven2/org/codehaus/plexus/plexus-velocity/1.2/plexus-velocity-1.2.jar (8.1 kB at 15 kB/s)
[windows-jdk8] [INFO] Downloading from central: https://repo.maven.apache.org/maven2/commons-beanutils/commons-beanutils/1.7.0/commons-beanutils-1.7.0.jar
[windows-jdk8] [INFO] Downloaded from central: https://repo.maven.apache.org/maven2/org/ow2/asm/asm/4.1/asm-4.1.jar (47 kB at 88 kB/s)
[windows-jdk8] [INFO] Downloading from central: https://repo.maven.apache.org/maven2/commons-digester/commons-digester/1.8/commons-digester-1.8.jar
[windows-jdk8] [INFO] Downloaded from central: https://repo.maven.apache.org/maven2/org/apache/velocity/velocity-tools/2.0/velocity-tools-2.0.jar (347 kB at 622 kB/s)
[windows-jdk8] [INFO] Downloading from central: https://repo.maven.apache.org/maven2/commons-chain/commons-chain/1.1/commons-chain-1.1.jar
[windows-jdk8] [INFO] Downloaded from central: https://repo.maven.apache.org/maven2/commons-beanutils/commons-beanutils/1.7.0/commons-beanutils-1.7.0.jar (189 kB at 335 kB/s)
[windows-jdk8] [INFO] Downloading from central: https://repo.maven.apache.org/maven2/commons-logging/commons-logging/1.1/commons-logging-1.1.jar
[windows-jdk8] [INFO] Downloaded from central: https://repo.maven.apache.org/maven2/commons-digester/commons-digester/1.8/commons-digester-1.8.jar (144 kB at 252 kB/s)
[windows-jdk8] [INFO] Downloading from central: https://repo.maven.apache.org/maven2/commons-validator/commons-validator/1.3.1/commons-validator-1.3.1.jar
[windows-jdk8] [INFO] Downloaded from central: https://repo.maven.apache.org/maven2/commons-chain/commons-chain/1.1/commons-chain-1.1.jar (90 kB at 156 kB/s)
[windows-jdk8] [INFO] Downloading from central: https://repo.maven.apache.org/maven2/dom4j/dom4j/1.1/dom4j-1.1.jar
[windows-jdk8] [INFO] Downloaded from central: https://repo.maven.apache.org/maven2/commons-logging/commons-logging/1.1/commons-logging-1.1.jar (53 kB at 89 kB/s)
[windows-jdk8] [INFO] Downloading from central: https://repo.maven.apache.org/maven2/sslext/sslext/1.2-0/sslext-1.2-0.jar
[windows-jdk8] [INFO] Downloaded from central: https://repo.maven.apache.org/maven2/commons-validator/commons-validator/1.3.1/commons-validator-1.3.1.jar (139 kB at 233 kB/s)
[windows-jdk8] [INFO] Downloading from central: https://repo.maven.apache.org/maven2/org/apache/struts/struts-core/1.3.8/struts-core-1.3.8.jar
[windows-jdk8] [INFO] Downloaded from central: https://repo.maven.apache.org/maven2/org/apache/maven/doxia/doxia-skin-model/1.7.1/doxia-skin-model-1.7.1.jar (16 kB at 26 kB/s)
[windows-jdk8] [INFO] Downloading from central: https://repo.maven.apache.org/maven2/antlr/antlr/2.7.2/antlr-2.7.2.jar
[windows-jdk8] [INFO] Downloaded from central: https://repo.maven.apache.org/maven2/org/ow2/asm/asm-util/4.1/asm-util-4.1.jar (38 kB at 59 kB/s)
[windows-jdk8] [INFO] Downloading from central: https://repo.maven.apache.org/maven2/org/apache/struts/struts-taglib/1.3.8/struts-taglib-1.3.8.jar
[windows-jdk8] [INFO] Downloaded from central: https://repo.maven.apache.org/maven2/dom4j/dom4j/1.1/dom4j-1.1.jar (457 kB at 718 kB/s)
[windows-jdk8] [INFO] Downloading from central: https://repo.maven.apache.org/maven2/org/apache/struts/struts-tiles/1.3.8/struts-tiles-1.3.8.jar
[windows-jdk8] [INFO] Downloaded from central: https://repo.maven.apache.org/maven2/org/apache/struts/struts-core/1.3.8/struts-core-1.3.8.jar (329 kB at 517 kB/s)
[windows-jdk8] [INFO] Downloading from central: https://repo.maven.apache.org/maven2/org/apache/maven/doxia/doxia-integration-tools/1.7.1/doxia-integration-tools-1.7.1.jar
[windows-jdk8] [INFO] Downloaded from central: https://repo.maven.apache.org/maven2/antlr/antlr/2.7.2/antlr-2.7.2.jar (358 kB at 534 kB/s)
[windows-jdk8] [INFO] Downloading from central: https://repo.maven.apache.org/maven2/org/apache/maven/wagon/wagon-provider-api/1.0/wagon-provider-api-1.0.jar
[windows-jdk8] [INFO] Downloaded from central: https://repo.maven.apache.org/maven2/org/apache/struts/struts-taglib/1.3.8/struts-taglib-1.3.8.jar (252 kB at 367 kB/s)
[windows-jdk8] [INFO] Downloading from central: https://repo.maven.apache.org/maven2/org/mortbay/jetty/jetty/6.1.25/jetty-6.1.25.jar
[windows-jdk8] [INFO] Downloaded from central: https://repo.maven.apache.org/maven2/org/apache/struts/struts-tiles/1.3.8/struts-tiles-1.3.8.jar (120 kB at 173 kB/s)
[windows-jdk8] [INFO] Downloading from central: https://repo.maven.apache.org/maven2/org/mortbay/jetty/servlet-api/2.5-20081211/servlet-api-2.5-20081211.jar
[windows-jdk8] [INFO] Downloaded from central: https://repo.maven.apache.org/maven2/org/apache/maven/wagon/wagon-provider-api/1.0/wagon-provider-api-1.0.jar (53 kB at 75 kB/s)
[windows-jdk8] [INFO] Downloading from central: https://repo.maven.apache.org/maven2/org/mortbay/jetty/jetty-util/6.1.25/jetty-util-6.1.25.jar
[windows-jdk8] [INFO] Downloaded from central: https://repo.maven.apache.org/maven2/org/mortbay/jetty/servlet-api/2.5-20081211/servlet-api-2.5-20081211.jar (134 kB at 178 kB/s)
[windows-jdk8] [INFO] Downloading from central: https://repo.maven.apache.org/maven2/org/apache/commons/commons-lang3/3.4/commons-lang3-3.4.jar
[windows-jdk8] [INFO] Downloaded from central: https://repo.maven.apache.org/maven2/org/mortbay/jetty/jetty-util/6.1.25/jetty-util-6.1.25.jar (177 kB at 231 kB/s)
[windows-jdk8] [INFO] Downloading from central: https://repo.maven.apache.org/maven2/commons-io/commons-io/1.4/commons-io-1.4.jar
[windows-jdk8] [INFO] Downloaded from central: https://repo.maven.apache.org/maven2/org/mortbay/jetty/jetty/6.1.25/jetty-6.1.25.jar (539 kB at 700 kB/s)
[windows-jdk8] [INFO] Downloaded from central: https://repo.maven.apache.org/maven2/sslext/sslext/1.2-0/sslext-1.2-0.jar (26 kB at 33 kB/s)
[windows-jdk8] [INFO] Downloaded from central: https://repo.maven.apache.org/maven2/commons-io/commons-io/1.4/commons-io-1.4.jar (109 kB at 137 kB/s)
[windows-jdk8] [INFO] Downloaded from central: https://repo.maven.apache.org/maven2/org/apache/commons/commons-lang3/3.4/commons-lang3-3.4.jar (435 kB at 536 kB/s)
[windows-jdk8] [INFO] Downloaded from central: https://repo.maven.apache.org/maven2/org/apache/maven/doxia/doxia-integration-tools/1.7.1/doxia-integration-tools-1.7.1.jar (47 kB at 51 kB/s)
[windows-jdk8] [INFO]
[windows-jdk8] [INFO] --- maven-checkstyle-plugin:2.15:check (checkstyle-check) @ maven-dependency-analyzer ---
[windows-jdk8] [INFO] Downloading from central: https://repo.maven.apache.org/maven2/org/apache/maven/reporting/maven-reporting-impl/2.3/maven-reporting-impl-2.3.pom
[windows-jdk8] [INFO] Downloaded from central: https://repo.maven.apache.org/maven2/org/apache/maven/reporting/maven-reporting-impl/2.3/maven-reporting-impl-2.3.pom (5.0 kB at 208 kB/s)
[windows-jdk8] [INFO] Downloading from central: https://repo.maven.apache.org/maven2/org/apache/maven/shared/maven-shared-utils/0.6/maven-shared-utils-0.6.pom
[windows-jdk8] [INFO] Downloaded from central: https://repo.maven.apache.org/maven2/org/apache/maven/shared/maven-shared-utils/0.6/maven-shared-utils-0.6.pom (4.9 kB at 257 kB/s)
[windows-jdk8] [INFO] Downloading from central: https://repo.maven.apache.org/maven2/org/apache/maven/shared/maven-shared-resources/2/maven-shared-resources-2.pom
[windows-jdk8] [INFO] Downloaded from central: https://repo.maven.apache.org/maven2/org/apache/maven/shared/maven-shared-resources/2/maven-shared-resources-2.pom (3.0 kB at 148 kB/s)
[windows-jdk8] [INFO] Downloading from central: https://repo.maven.apache.org/maven2/org/apache/maven/doxia/doxia-sink-api/1.4/doxia-sink-api-1.4.pom
[windows-jdk8] [INFO] Downloaded from central: https://repo.maven.apache.org/maven2/org/apache/maven/doxia/doxia-sink-api/1.4/doxia-sink-api-1.4.pom (1.5 kB at 118 kB/s)
[windows-jdk8] [INFO] Downloading from central: https://repo.maven.apache.org/maven2/org/apache/maven/doxia/doxia/1.4/doxia-1.4.pom
[windows-jdk8] [INFO] Downloaded from central: https://repo.maven.apache.org/maven2/org/apache/maven/doxia/doxia/1.4/doxia-1.4.pom (18 kB at 619 kB/s)
[windows-jdk8] [INFO] Downloading from central: https://repo.maven.apache.org/maven2/org/apache/maven/doxia/doxia-logging-api/1.4/doxia-logging-api-1.4.pom
[windows-jdk8] [INFO] Downloaded from central: https://repo.maven.apache.org/maven2/org/apache/maven/doxia/doxia-logging-api/1.4/doxia-logging-api-1.4.pom (1.5 kB at 70 kB/s)
[windows-jdk8] [INFO] Downloading from central: https://repo.maven.apache.org/maven2/org/apache/maven/doxia/doxia-decoration-model/1.4/doxia-decoration-model-1.4.pom
[windows-jdk8] [INFO] Downloaded from central: https://repo.maven.apache.org/maven2/org/apache/maven/doxia/doxia-decoration-model/1.4/doxia-decoration-model-1.4.pom (2.7 kB at 72 kB/s)
[windows-jdk8] [INFO] Downloading from central: https://repo.maven.apache.org/maven2/org/apache/maven/doxia/doxia-sitetools/1.4/doxia-sitetools-1.4.pom
[windows-jdk8] [INFO] Downloaded from central: https://repo.maven.apache.org/maven2/org/apache/maven/doxia/doxia-sitetools/1.4/doxia-sitetools-1.4.pom (17 kB at 858 kB/s)
[windows-jdk8] [INFO] Downloading from central: https://repo.maven.apache.org/maven2/org/codehaus/plexus/plexus-utils/3.0.10/plexus-utils-3.0.10.pom
[windows-jdk8] [INFO] Downloaded from central: https://repo.maven.apache.org/maven2/org/codehaus/plexus/plexus-utils/3.0.10/plexus-utils-3.0.10.pom (3.1 kB at 143 kB/s)
[windows-jdk8] [INFO] Downloading from central: https://repo.maven.apache.org/maven2/org/apache/maven/doxia/doxia-site-renderer/1.4/doxia-site-renderer-1.4.pom
[windows-jdk8] [INFO] Downloaded from central: https://repo.maven.apache.org/maven2/org/apache/maven/doxia/doxia-site-renderer/1.4/doxia-site-renderer-1.4.pom (6.1 kB at 382 kB/s)
[windows-jdk8] [INFO] Downloading from central: https://repo.maven.apache.org/maven2/org/apache/maven/doxia/doxia-core/1.4/doxia-core-1.4.pom
[windows-jdk8] [INFO] Downloaded from central: https://repo.maven.apache.org/maven2/org/apache/maven/doxia/doxia-core/1.4/doxia-core-1.4.pom (4.1 kB at 239 kB/s)
[windows-jdk8] [INFO] Downloading from central: https://repo.maven.apache.org/maven2/org/apache/maven/doxia/doxia-module-xhtml/1.4/doxia-module-xhtml-1.4.pom
[windows-jdk8] [INFO] Downloaded from central: https://repo.maven.apache.org/maven2/org/apache/maven/doxia/doxia-module-xhtml/1.4/doxia-module-xhtml-1.4.pom (1.6 kB at 86 kB/s)
[windows-jdk8] [INFO] Downloading from central: https://repo.maven.apache.org/maven2/org/apache/maven/doxia/doxia-modules/1.4/doxia-modules-1.4.pom
[windows-jdk8] [INFO] Downloaded from central: https://repo.maven.apache.org/maven2/org/apache/maven/doxia/doxia-modules/1.4/doxia-modules-1.4.pom (2.6 kB at 146 kB/s)
[windows-jdk8] [INFO] Downloading from central: https://repo.maven.apache.org/maven2/org/apache/maven/doxia/doxia-module-fml/1.4/doxia-module-fml-1.4.pom
[windows-jdk8] [INFO] Downloaded from central: https://repo.maven.apache.org/maven2/org/apache/maven/doxia/doxia-module-fml/1.4/doxia-module-fml-1.4.pom (4.8 kB at 229 kB/s)
[windows-jdk8] [INFO] Downloading from central: https://repo.maven.apache.org/maven2/org/apache/maven/doxia/doxia-integration-tools/1.6/doxia-integration-tools-1.6.pom
[windows-jdk8] [INFO] Downloaded from central: https://repo.maven.apache.org/maven2/org/apache/maven/doxia/doxia-integration-tools/1.6/doxia-integration-tools-1.6.pom (7.0 kB at 409 kB/s)
[windows-jdk8] [INFO] Downloading from central: https://repo.maven.apache.org/maven2/org/apache/maven/doxia/doxia-tools/3/doxia-tools-3.pom
[windows-jdk8] [INFO] Downloaded from central: https://repo.maven.apache.org/maven2/org/apache/maven/doxia/doxia-tools/3/doxia-tools-3.pom (9.9 kB at 496 kB/s)
[windows-jdk8] [INFO] Downloading from central: https://repo.maven.apache.org/maven2/org/apache/maven/doxia/doxia-logging-api/1.6/doxia-logging-api-1.6.pom
[windows-jdk8] [INFO] Downloaded from central: https://repo.maven.apache.org/maven2/org/apache/maven/doxia/doxia-logging-api/1.6/doxia-logging-api-1.6.pom (1.5 kB at 35 kB/s)
[windows-jdk8] [INFO] Downloading from central: https://repo.maven.apache.org/maven2/org/apache/maven/doxia/doxia/1.6/doxia-1.6.pom
[windows-jdk8] [INFO] Downloaded from central: https://repo.maven.apache.org/maven2/org/apache/maven/doxia/doxia/1.6/doxia-1.6.pom (19 kB at 678 kB/s)
[windows-jdk8] [INFO] Downloading from central: https://repo.maven.apache.org/maven2/org/apache/maven/doxia/doxia-decoration-model/1.6/doxia-decoration-model-1.6.pom
[windows-jdk8] [INFO] Downloaded from central: https://repo.maven.apache.org/maven2/org/apache/maven/doxia/doxia-decoration-model/1.6/doxia-decoration-model-1.6.pom (3.0 kB at 111 kB/s)
[windows-jdk8] [INFO] Downloading from central: https://repo.maven.apache.org/maven2/org/apache/maven/doxia/doxia-sitetools/1.6/doxia-sitetools-1.6.pom
[windows-jdk8] [INFO] Downloaded from central: https://repo.maven.apache.org/maven2/org/apache/maven/doxia/doxia-sitetools/1.6/doxia-sitetools-1.6.pom (18 kB at 715 kB/s)
[windows-jdk8] [INFO] Downloading from central: https://repo.maven.apache.org/maven2/org/codehaus/plexus/plexus-resources/1.0.1/plexus-resources-1.0.1.pom
[windows-jdk8] [INFO] Downloaded from central: https://repo.maven.apache.org/maven2/org/codehaus/plexus/plexus-resources/1.0.1/plexus-resources-1.0.1.pom (1.3 kB at 57 kB/s)
[windows-jdk8] [INFO] Downloading from central: https://repo.maven.apache.org/maven2/org/codehaus/plexus/plexus-velocity/1.1.8/plexus-velocity-1.1.8.pom
[windows-jdk8] [INFO] Downloaded from central: https://repo.maven.apache.org/maven2/org/codehaus/plexus/plexus-velocity/1.1.8/plexus-velocity-1.1.8.pom (1.9 kB at 80 kB/s)
[windows-jdk8] [INFO] Downloading from central: https://repo.maven.apache.org/maven2/com/puppycrawl/tools/checkstyle/6.1.1/checkstyle-6.1.1.pom
[windows-jdk8] [INFO] Downloaded from central: https://repo.maven.apache.org/maven2/com/puppycrawl/tools/checkstyle/6.1.1/checkstyle-6.1.1.pom (30 kB at 1.1 MB/s)
[windows-jdk8] [INFO] Downloading from central: https://repo.maven.apache.org/maven2/org/sonatype/oss/oss-parent/7/oss-parent-7.pom
[windows-jdk8] [INFO] Downloaded from central: https://repo.maven.apache.org/maven2/org/sonatype/oss/oss-parent/7/oss-parent-7.pom (4.8 kB at 172 kB/s)
[windows-jdk8] [INFO] Downloading from central: https://repo.maven.apache.org/maven2/antlr/antlr/2.7.7/antlr-2.7.7.pom
[windows-jdk8] [INFO] Downloaded from central: https://repo.maven.apache.org/maven2/antlr/antlr/2.7.7/antlr-2.7.7.pom (632 B at 53 kB/s)
[windows-jdk8] [INFO] Downloading from central: https://repo.maven.apache.org/maven2/org/antlr/antlr4-runtime/4.3/antlr4-runtime-4.3.pom
[windows-jdk8] [INFO] Downloaded from central: https://repo.maven.apache.org/maven2/org/antlr/antlr4-runtime/4.3/antlr4-runtime-4.3.pom (4.8 kB at 184 kB/s)
[windows-jdk8] [INFO] Downloading from central: https://repo.maven.apache.org/maven2/org/antlr/antlr4-master/4.3/antlr4-master-4.3.pom
[windows-jdk8] [INFO] Downloaded from central: https://repo.maven.apache.org/maven2/org/antlr/antlr4-master/4.3/antlr4-master-4.3.pom (7.9 kB at 248 kB/s)
[windows-jdk8] [INFO] Downloading from central: https://repo.maven.apache.org/maven2/org/abego/treelayout/org.abego.treelayout.core/1.0.1/org.abego.treelayout.core-1.0.1.pom
[windows-jdk8] [INFO] Downloaded from central: https://repo.maven.apache.org/maven2/org/abego/treelayout/org.abego.treelayout.core/1.0.1/org.abego.treelayout.core-1.0.1.pom (3.1 kB at 38 kB/s)
[windows-jdk8] [INFO] Downloading from central: https://repo.maven.apache.org/maven2/org/antlr/antlr4-annotations/4.3/antlr4-annotations-4.3.pom
[windows-jdk8] [INFO] Downloaded from central: https://repo.maven.apache.org/maven2/org/antlr/antlr4-annotations/4.3/antlr4-annotations-4.3.pom (1.3 kB at 61 kB/s)
[windows-jdk8] [INFO] Downloading from central: https://repo.maven.apache.org/maven2/commons-beanutils/commons-beanutils-core/1.8.3/commons-beanutils-core-1.8.3.pom
[windows-jdk8] [INFO] Downloaded from central: https://repo.maven.apache.org/maven2/commons-beanutils/commons-beanutils-core/1.8.3/commons-beanutils-core-1.8.3.pom (1.6 kB at 68 kB/s)
[windows-jdk8] [INFO] Downloading from central: https://repo.maven.apache.org/maven2/com/google/guava/guava/18.0/guava-18.0.pom
[windows-jdk8] [INFO] Downloaded from central: https://repo.maven.apache.org/maven2/com/google/guava/guava/18.0/guava-18.0.pom (5.7 kB at 202 kB/s)
[windows-jdk8] [INFO] Downloading from central: https://repo.maven.apache.org/maven2/com/google/guava/guava-parent/18.0/guava-parent-18.0.pom
[windows-jdk8] [INFO] Downloaded from central: https://repo.maven.apache.org/maven2/com/google/guava/guava-parent/18.0/guava-parent-18.0.pom (7.7 kB at 296 kB/s)
[windows-jdk8] [INFO] Downloading from central: https://repo.maven.apache.org/maven2/org/apache/maven/reporting/maven-reporting-impl/2.3/maven-reporting-impl-2.3.jar
[windows-jdk8] [INFO] Downloading from central: https://repo.maven.apache.org/maven2/org/apache/maven/shared/maven-shared-utils/0.6/maven-shared-utils-0.6.jar
[windows-jdk8] [INFO] Downloading from central: https://repo.maven.apache.org/maven2/xerces/xercesImpl/2.9.1/xercesImpl-2.9.1.jar
[windows-jdk8] [INFO] Downloading from central: https://repo.maven.apache.org/maven2/xml-apis/xml-apis/1.3.04/xml-apis-1.3.04.jar
[windows-jdk8] [INFO] Downloading from central: https://repo.maven.apache.org/maven2/commons-digester/commons-digester/1.6/commons-digester-1.6.jar
[windows-jdk8] [INFO] Downloaded from central: https://repo.maven.apache.org/maven2/commons-digester/commons-digester/1.6/commons-digester-1.6.jar (168 kB at 4.4 MB/s)
[windows-jdk8] [INFO] Downloading from central: https://repo.maven.apache.org/maven2/commons-logging/commons-logging/1.0.4/commons-logging-1.0.4.jar
[windows-jdk8] [INFO] Downloaded from central: https://repo.maven.apache.org/maven2/org/apache/maven/shared/maven-shared-utils/0.6/maven-shared-utils-0.6.jar (165 kB at 3.5 MB/s)
[windows-jdk8] [INFO] Downloading from central: https://repo.maven.apache.org/maven2/org/apache/maven/shared/maven-shared-resources/2/maven-shared-resources-2.jar
[windows-jdk8] [INFO] Downloaded from central: https://repo.maven.apache.org/maven2/commons-logging/commons-logging/1.0.4/commons-logging-1.0.4.jar (38 kB at 543 kB/s)
[windows-jdk8] [INFO] Downloading from central: https://repo.maven.apache.org/maven2/org/apache/maven/doxia/doxia-sink-api/1.4/doxia-sink-api-1.4.jar
[windows-jdk8] [INFO] Downloaded from central: https://repo.maven.apache.org/maven2/xml-apis/xml-apis/1.3.04/xml-apis-1.3.04.jar (194 kB at 2.5 MB/s)
[windows-jdk8] [INFO] Downloading from central: https://repo.maven.apache.org/maven2/org/apache/maven/doxia/doxia-logging-api/1.4/doxia-logging-api-1.4.jar
[windows-jdk8] [INFO] Downloaded from central: https://repo.maven.apache.org/maven2/org/apache/maven/doxia/doxia-sink-api/1.4/doxia-sink-api-1.4.jar (11 kB at 73 kB/s)
[windows-jdk8] [INFO] Downloading from central: https://repo.maven.apache.org/maven2/org/apache/maven/doxia/doxia-decoration-model/1.4/doxia-decoration-model-1.4.jar
[windows-jdk8] [INFO] Downloaded from central: https://repo.maven.apache.org/maven2/xerces/xercesImpl/2.9.1/xercesImpl-2.9.1.jar (1.2 MB at 8.0 MB/s)
[windows-jdk8] [INFO] Downloading from central: https://repo.maven.apache.org/maven2/org/apache/maven/doxia/doxia-site-renderer/1.4/doxia-site-renderer-1.4.jar
[windows-jdk8] [INFO] Downloaded from central: https://repo.maven.apache.org/maven2/org/apache/maven/reporting/maven-reporting-impl/2.3/maven-reporting-impl-2.3.jar (18 kB at 106 kB/s)
[windows-jdk8] [INFO] Downloading from central: https://repo.maven.apache.org/maven2/org/apache/maven/doxia/doxia-module-xhtml/1.4/doxia-module-xhtml-1.4.jar
[windows-jdk8] [INFO] Downloaded from central: https://repo.maven.apache.org/maven2/org/apache/maven/shared/maven-shared-resources/2/maven-shared-resources-2.jar (13 kB at 72 kB/s)
[windows-jdk8] [INFO] Downloading from central: https://repo.maven.apache.org/maven2/org/apache/maven/doxia/doxia-module-fml/1.4/doxia-module-fml-1.4.jar
[windows-jdk8] [INFO] Downloaded from central: https://repo.maven.apache.org/maven2/org/apache/maven/doxia/doxia-site-renderer/1.4/doxia-site-renderer-1.4.jar (53 kB at 287 kB/s)
[windows-jdk8] [INFO] Downloading from central: https://repo.maven.apache.org/maven2/org/apache/maven/doxia/doxia-integration-tools/1.6/doxia-integration-tools-1.6.jar
[windows-jdk8] [INFO] Downloaded from central: https://repo.maven.apache.org/maven2/org/apache/maven/doxia/doxia-decoration-model/1.4/doxia-decoration-model-1.4.jar (61 kB at 322 kB/s)
[windows-jdk8] [INFO] Downloading from central: https://repo.maven.apache.org/maven2/org/codehaus/plexus/plexus-resources/1.0.1/plexus-resources-1.0.1.jar
[windows-jdk8] [INFO] Downloaded from central: https://repo.maven.apache.org/maven2/org/apache/maven/doxia/doxia-logging-api/1.4/doxia-logging-api-1.4.jar (11 kB at 59 kB/s)
[windows-jdk8] [INFO] Downloading from central: https://repo.maven.apache.org/maven2/org/codehaus/plexus/plexus-interpolation/1.21/plexus-interpolation-1.21.jar
[windows-jdk8] [INFO] Downloaded from central: https://repo.maven.apache.org/maven2/org/apache/maven/doxia/doxia-module-xhtml/1.4/doxia-module-xhtml-1.4.jar (15 kB at 58 kB/s)
[windows-jdk8] [INFO] Downloading from central: https://repo.maven.apache.org/maven2/org/codehaus/plexus/plexus-velocity/1.1.8/plexus-velocity-1.1.8.jar
[windows-jdk8] [INFO] Downloaded from central: https://repo.maven.apache.org/maven2/org/codehaus/plexus/plexus-velocity/1.1.8/plexus-velocity-1.1.8.jar (7.9 kB at 28 kB/s)
[windows-jdk8] [INFO] Downloading from central: https://repo.maven.apache.org/maven2/com/puppycrawl/tools/checkstyle/6.1.1/checkstyle-6.1.1.jar
[windows-jdk8] [INFO] Downloaded from central: https://repo.maven.apache.org/maven2/org/codehaus/plexus/plexus-interpolation/1.21/plexus-interpolation-1.21.jar (62 kB at 182 kB/s)
[windows-jdk8] [INFO] Downloading from central: https://repo.maven.apache.org/maven2/antlr/antlr/2.7.7/antlr-2.7.7.jar
[windows-jdk8] [INFO] Downloaded from central: https://repo.maven.apache.org/maven2/org/apache/maven/doxia/doxia-module-fml/1.4/doxia-module-fml-1.4.jar (38 kB at 106 kB/s)
[windows-jdk8] [INFO] Downloading from central: https://repo.maven.apache.org/maven2/org/antlr/antlr4-runtime/4.3/antlr4-runtime-4.3.jar
[windows-jdk8] [INFO] Downloaded from central: https://repo.maven.apache.org/maven2/org/codehaus/plexus/plexus-resources/1.0.1/plexus-resources-1.0.1.jar (22 kB at 61 kB/s)
[windows-jdk8] [INFO] Downloading from central: https://repo.maven.apache.org/maven2/org/abego/treelayout/org.abego.treelayout.core/1.0.1/org.abego.treelayout.core-1.0.1.jar
[windows-jdk8] [INFO] Downloaded from central: https://repo.maven.apache.org/maven2/antlr/antlr/2.7.7/antlr-2.7.7.jar (445 kB at 1.2 MB/s)
[windows-jdk8] [INFO] Downloading from central: https://repo.maven.apache.org/maven2/org/antlr/antlr4-annotations/4.3/antlr4-annotations-4.3.jar
[windows-jdk8] [INFO] Downloaded from central: https://repo.maven.apache.org/maven2/com/puppycrawl/tools/checkstyle/6.1.1/checkstyle-6.1.1.jar (1.0 MB at 2.6 MB/s)
[windows-jdk8] [INFO] Downloading from central: https://repo.maven.apache.org/maven2/commons-beanutils/commons-beanutils-core/1.8.3/commons-beanutils-core-1.8.3.jar
[windows-jdk8] [INFO] Downloaded from central: https://repo.maven.apache.org/maven2/org/antlr/antlr4-runtime/4.3/antlr4-runtime-4.3.jar (345 kB at 820 kB/s)
[windows-jdk8] [INFO] Downloading from central: https://repo.maven.apache.org/maven2/com/google/guava/guava/18.0/guava-18.0.jar
[windows-jdk8] [INFO] Downloaded from central: https://repo.maven.apache.org/maven2/commons-beanutils/commons-beanutils-core/1.8.3/commons-beanutils-core-1.8.3.jar (207 kB at 483 kB/s)
[windows-jdk8] [INFO] Downloaded from central: https://repo.maven.apache.org/maven2/org/apache/maven/doxia/doxia-integration-tools/1.6/doxia-integration-tools-1.6.jar (45 kB at 95 kB/s)
[windows-jdk8] [INFO] Downloaded from central: https://repo.maven.apache.org/maven2/org/antlr/antlr4-annotations/4.3/antlr4-annotations-4.3.jar (10 kB at 22 kB/s)
[windows-jdk8] [INFO] Downloaded from central: https://repo.maven.apache.org/maven2/org/abego/treelayout/org.abego.treelayout.core/1.0.1/org.abego.treelayout.core-1.0.1.jar (26 kB at 48 kB/s)
[windows-jdk8] [INFO] Downloaded from central: https://repo.maven.apache.org/maven2/com/google/guava/guava/18.0/guava-18.0.jar (2.3 MB at 3.9 MB/s)
[windows-jdk8] [INFO] ------------------------------------------------------------------------
[windows-jdk8] [INFO] BUILD SUCCESS
[windows-jdk8] [INFO] ------------------------------------------------------------------------
[windows-jdk8] [INFO] Total time: 02:35 min
[windows-jdk8] [INFO] Finished at: 2018-09-12T05:21:39-07:00
[windows-jdk8] [INFO] Final Memory: 34M/467M
[windows-jdk8] [INFO] ------------------------------------------------------------------------
[windows-jdk8] [WARNING] The requested profile "run-its" could not be activated because it does not exist.
[windows-jdk8] [INFO] [jenkins-event-spy] Generated F:\jenkins\jenkins-slave\workspace\ect_Java_8_type_annotations-6YYONV5DHF2W5ZWSYDAVULES2GVBCB4HSDLCM5SIO3LMNDK77BNQ@tmp\withMaven13150802\maven-spy-20180912-051903-388576853918195905460.log
[windows-jdk8] Picked up JAVA_TOOL_OPTIONS: -Dmaven.ext.class.path="f:\jenkins\jenkins-slave\workspace\ect_Java_8_type_annotations-6YYONV5DHF2W5ZWSYDAVULES2GVBCB4HSDLCM5SIO3LMNDK77BNQ@tmp\withMaven13150802\pipeline-maven-spy.jar" -Dorg.jenkinsci.plugins.pipeline.maven.reportsFolder="f:\jenkins\jenkins-slave\workspace\ect_Java_8_type_annotations-6YYONV5DHF2W5ZWSYDAVULES2GVBCB4HSDLCM5SIO3LMNDK77BNQ@tmp\withMaven13150802"
[Pipeline] [windows-jdk8] }
[Pipeline] [windows-jdk8] // dir
[Pipeline] [windows-jdk8] }
[windows-jdk8] [withMaven] junitPublisher - Archive test results for Maven artifact org.apache.maven.shared:maven-dependency-analyzer:1.8-SNAPSHOT generated by maven-surefire-plugin:test (default-test): m\target\surefire-reports\*.xml
[windows-jdk8] Recording test results
[windows-jdk8] [withMaven] junitPublisher - Archive test results for Maven artifact org.apache.maven.shared.dependency-analyzer.tests:jarWithXercesDependencies:1.0 generated by maven-surefire-plugin:test (default-test): m\target\test-classes\jarWithXmlTransitiveDependency\target\surefire-reports\*.xml
[windows-jdk8] Recording test results
[windows-jdk8] None of the test reports contained any result
[windows-jdk8] [withMaven] junitPublisher - Archive test results for Maven artifact org.apache.maven.shared.dependency-analyzer.tests:jarWithNoDependencies:1.0 generated by maven-surefire-plugin:test (default-test): m\target\test-classes\jarWithNoDependencies\target\surefire-reports\*.xml
[windows-jdk8] Recording test results
[windows-jdk8] None of the test reports contained any result
[windows-jdk8] [withMaven] junitPublisher - Archive test results for Maven artifact org.apache.maven.shared.dependency-analyzer.tests:jarWithTestDependency1:1.0 generated by maven-surefire-plugin:test (default-test): m\target\test-classes\jarWithTestDependency\project1\target\surefire-reports\*.xml
[windows-jdk8] Recording test results
[windows-jdk8] None of the test reports contained any result
[windows-jdk8] [withMaven] junitPublisher - Archive test results for Maven artifact org.apache.maven.shared.dependency-analyzer.tests:jarWithTestDependency2:1.0 generated by maven-surefire-plugin:test (default-test): m\target\test-classes\jarWithTestDependency\project2\target\surefire-reports\*.xml
[windows-jdk8] Recording test results
[windows-jdk8] None of the test reports contained any result
[windows-jdk8] [withMaven] junitPublisher - Archive test results for Maven artifact org.apache.maven.shared.dependency-analyzer.tests:jarWithTestDependency1:1.0 generated by maven-surefire-plugin:test (default-test): m\target\test-classes\jarWithTestDependency\project1\target\surefire-reports\*.xml
[windows-jdk8] Recording test results
[windows-jdk8] None of the test reports contained any result
[windows-jdk8] [withMaven] junitPublisher - Archive test results for Maven artifact org.apache.maven.shared.dependency-analyzer.tests:jarWithTestDependency2:1.0 generated by maven-surefire-plugin:test (default-test): m\target\test-classes\jarWithTestDependency\project2\target\surefire-reports\*.xml
[windows-jdk8] Recording test results
[windows-jdk8] None of the test reports contained any result
[windows-jdk8] [withMaven] junitPublisher - Archive test results for Maven artifact org.apache.maven.shared.dependency-analyzer.tests:jarWithCompileDependency1:1.0 generated by maven-surefire-plugin:test (default-test): m\target\test-classes\jarWithCompileDependency\project1\target\surefire-reports\*.xml
[windows-jdk8] Recording test results
[windows-jdk8] None of the test reports contained any result
[windows-jdk8] [withMaven] junitPublisher - Archive test results for Maven artifact org.apache.maven.shared.dependency-analyzer.tests:jarWithCompileDependency2:1.0 generated by maven-surefire-plugin:test (default-test): m\target\test-classes\jarWithCompileDependency\project2\target\surefire-reports\*.xml
[windows-jdk8] Recording test results
[windows-jdk8] None of the test reports contained any result
[windows-jdk8] [withMaven] junitPublisher - Archive test results for Maven artifact org.apache.maven.shared.dependency-analyzer.tests:java8methodreferences:1.0 generated by maven-surefire-plugin:test (default-test): m\target\test-classes\java8methodRefs\target\surefire-reports\*.xml
[windows-jdk8] Recording test results
[windows-jdk8] None of the test reports contained any result
[windows-jdk8] [withMaven] junitPublisher - Archive test results for Maven artifact org.apache.maven.shared.dependency-analyzer.tests:inlinedStaticReference:1.0 generated by maven-surefire-plugin:test (default-test): m\target\test-classes\inlinedStaticReference\target\surefire-reports\*.xml
[windows-jdk8] Recording test results
[windows-jdk8] None of the test reports contained any result
[windows-jdk8] [withMaven] junitPublisher - Archive test results for Maven artifact org.apache.maven.shared.dependency-analyzer.tests:typeUseAnnotationDependencyAnnotation:1.0 generated by maven-surefire-plugin:test (default-test): m\target\test-classes\typeUseAnnotationDependency\annotation\target\surefire-reports\*.xml
[windows-jdk8] Recording test results
[windows-jdk8] None of the test reports contained any result
[windows-jdk8] [withMaven] junitPublisher - Archive test results for Maven artifact org.apache.maven.shared.dependency-analyzer.tests:typeUseAnnotationDependencyUsage:1.0 generated by maven-surefire-plugin:test (default-test): m\target\test-classes\typeUseAnnotationDependency\usage\target\surefire-reports\*.xml
[windows-jdk8] Recording test results
[windows-jdk8] None of the test reports contained any result
[windows-jdk8] [withMaven] junitPublisher - Archive test results for Maven artifact org.apache.maven.its.dependency:test-module1:1.0 generated by maven-surefire-plugin:test (default-test): m\target\test-classes\multimoduleProject\module1\target\surefire-reports\*.xml
[windows-jdk8] Recording test results
[windows-jdk8] None of the test reports contained any result
[windows-jdk8] [withMaven] junitPublisher - Archive test results for Maven artifact org.apache.maven.its.dependency:test-module2:1.0 generated by maven-surefire-plugin:test (default-test): m\target\test-classes\multimoduleProject\module2\target\surefire-reports\*.xml
[windows-jdk8] Recording test results
[windows-jdk8] None of the test reports contained any result
[Pipeline] [windows-jdk8] // withMaven
[Pipeline] [windows-jdk8] cleanWs
[windows-jdk8] [WS-CLEANUP] Deleting project workspace...[WS-CLEANUP] done
[Pipeline] [windows-jdk8] }
[Pipeline] [windows-jdk8] // stage
[Pipeline] [windows-jdk8] }
[Pipeline] [windows-jdk8] // node
[Pipeline] [windows-jdk8] }
[Pipeline] // parallel
[Pipeline] stage
[Pipeline] { (Notifications)
[Pipeline] echo
Build result: UNSTABLE
[Pipeline] jiraIssueSelector
[Pipeline] emailext
Reply | Threaded
Open this post in threaded view
|

Build unstable in Jenkins: Maven TLP » maven-dependency-analyzer » MSHARED-674_Detect_Java_8_type_annotations #14

Apache Jenkins Server-2
See https://builds.apache.org/job/maven-box/job/maven-dependency-analyzer/job/MSHARED-674_Detect_Java_8_type_annotations/14/

No changes.

34 tests failed.
FAILED:  org.apache.maven.shared.dependency.analyzer.DefaultProjectDependencyAnalyzerTest.testJarWithXmlTransitiveDependency

Error Message:
null

Stack Trace:
java.lang.NullPointerException: null
        at org.apache.commons.lang3.SystemUtils.isJavaVersionAtLeast(SystemUtils.java:1626)
        at org.apache.maven.shared.dependency.analyzer.DefaultProjectDependencyAnalyzerTest.compileProject(DefaultProjectDependencyAnalyzerTest.java:342)
        at org.apache.maven.shared.dependency.analyzer.DefaultProjectDependencyAnalyzerTest.compileProject(DefaultProjectDependencyAnalyzerTest.java:337)
        at org.apache.maven.shared.dependency.analyzer.DefaultProjectDependencyAnalyzerTest.testJarWithXmlTransitiveDependency(DefaultProjectDependencyAnalyzerTest.java:262)


FAILED:  org.apache.maven.shared.dependency.analyzer.DefaultProjectDependencyAnalyzerTest.testJarWithNoDependencies

Error Message:
null

Stack Trace:
java.lang.NullPointerException: null
        at org.apache.commons.lang3.SystemUtils.isJavaVersionAtLeast(SystemUtils.java:1626)
        at org.apache.maven.shared.dependency.analyzer.DefaultProjectDependencyAnalyzerTest.compileProject(DefaultProjectDependencyAnalyzerTest.java:342)
        at org.apache.maven.shared.dependency.analyzer.DefaultProjectDependencyAnalyzerTest.compileProject(DefaultProjectDependencyAnalyzerTest.java:337)
        at org.apache.maven.shared.dependency.analyzer.DefaultProjectDependencyAnalyzerTest.testJarWithNoDependencies(DefaultProjectDependencyAnalyzerTest.java:111)


FAILED:  org.apache.maven.shared.dependency.analyzer.DefaultProjectDependencyAnalyzerTest.testPom

Error Message:
null

Stack Trace:
java.lang.NullPointerException: null
        at org.apache.commons.lang3.SystemUtils.isJavaVersionAtLeast(SystemUtils.java:1626)
        at org.apache.maven.shared.dependency.analyzer.DefaultProjectDependencyAnalyzerTest.compileProject(DefaultProjectDependencyAnalyzerTest.java:342)
        at org.apache.maven.shared.dependency.analyzer.DefaultProjectDependencyAnalyzerTest.compileProject(DefaultProjectDependencyAnalyzerTest.java:337)
        at org.apache.maven.shared.dependency.analyzer.DefaultProjectDependencyAnalyzerTest.testPom(DefaultProjectDependencyAnalyzerTest.java:97)


FAILED:  org.apache.maven.shared.dependency.analyzer.DefaultProjectDependencyAnalyzerTest.testForceDeclaredDependenciesUsage

Error Message:
null

Stack Trace:
java.lang.NullPointerException: null
        at org.apache.commons.lang3.SystemUtils.isJavaVersionAtLeast(SystemUtils.java:1626)
        at org.apache.maven.shared.dependency.analyzer.DefaultProjectDependencyAnalyzerTest.compileProject(DefaultProjectDependencyAnalyzerTest.java:342)
        at org.apache.maven.shared.dependency.analyzer.DefaultProjectDependencyAnalyzerTest.compileProject(DefaultProjectDependencyAnalyzerTest.java:337)
        at org.apache.maven.shared.dependency.analyzer.DefaultProjectDependencyAnalyzerTest.testForceDeclaredDependenciesUsage(DefaultProjectDependencyAnalyzerTest.java:198)


FAILED:  org.apache.maven.shared.dependency.analyzer.DefaultProjectDependencyAnalyzerTest.testJarWithTestDependency

Error Message:
null

Stack Trace:
java.lang.NullPointerException: null
        at org.apache.commons.lang3.SystemUtils.isJavaVersionAtLeast(SystemUtils.java:1626)
        at org.apache.maven.shared.dependency.analyzer.DefaultProjectDependencyAnalyzerTest.compileProject(DefaultProjectDependencyAnalyzerTest.java:342)
        at org.apache.maven.shared.dependency.analyzer.DefaultProjectDependencyAnalyzerTest.compileProject(DefaultProjectDependencyAnalyzerTest.java:337)
        at org.apache.maven.shared.dependency.analyzer.DefaultProjectDependencyAnalyzerTest.testJarWithTestDependency(DefaultProjectDependencyAnalyzerTest.java:232)


FAILED:  org.apache.maven.shared.dependency.analyzer.DefaultProjectDependencyAnalyzerTest.testJarWithCompileDependency

Error Message:
null

Stack Trace:
java.lang.NullPointerException: null
        at org.apache.commons.lang3.SystemUtils.isJavaVersionAtLeast(SystemUtils.java:1626)
        at org.apache.maven.shared.dependency.analyzer.DefaultProjectDependencyAnalyzerTest.compileProject(DefaultProjectDependencyAnalyzerTest.java:342)
        at org.apache.maven.shared.dependency.analyzer.DefaultProjectDependencyAnalyzerTest.compileProject(DefaultProjectDependencyAnalyzerTest.java:337)
        at org.apache.maven.shared.dependency.analyzer.DefaultProjectDependencyAnalyzerTest.testJarWithCompileDependency(DefaultProjectDependencyAnalyzerTest.java:174)


FAILED:  org.apache.maven.shared.dependency.analyzer.DefaultProjectDependencyAnalyzerTest.testJava8methodRefs

Error Message:
null

Stack Trace:
java.lang.NullPointerException: null
        at org.apache.commons.lang3.SystemUtils.isJavaVersionAtLeast(SystemUtils.java:1626)
        at org.apache.maven.shared.dependency.analyzer.DefaultProjectDependencyAnalyzerTest.testJava8methodRefs(DefaultProjectDependencyAnalyzerTest.java:125)


FAILED:  org.apache.maven.shared.dependency.analyzer.DefaultProjectDependencyAnalyzerTest.testInlinedStaticReference

Error Message:
null

Stack Trace:
java.lang.NullPointerException: null
        at org.apache.commons.lang3.SystemUtils.isJavaVersionAtLeast(SystemUtils.java:1626)
        at org.apache.maven.shared.dependency.analyzer.DefaultProjectDependencyAnalyzerTest.testInlinedStaticReference(DefaultProjectDependencyAnalyzerTest.java:150)


FAILED:  org.apache.maven.shared.dependency.analyzer.DefaultProjectDependencyAnalyzerTest.testTypeUseAnnotationDependency

Error Message:
null

Stack Trace:
java.lang.NullPointerException: null
        at org.apache.commons.lang3.SystemUtils.isJavaVersionAtLeast(SystemUtils.java:1626)
        at org.apache.maven.shared.dependency.analyzer.DefaultProjectDependencyAnalyzerTest.testTypeUseAnnotationDependency(DefaultProjectDependencyAnalyzerTest.java:310)


FAILED:  org.apache.maven.shared.dependency.analyzer.DefaultProjectDependencyAnalyzerTest.testMultimoduleProject

Error Message:
null

Stack Trace:
java.lang.NullPointerException: null
        at org.apache.commons.lang3.SystemUtils.isJavaVersionAtLeast(SystemUtils.java:1626)
        at org.apache.maven.shared.dependency.analyzer.DefaultProjectDependencyAnalyzerTest.compileProject(DefaultProjectDependencyAnalyzerTest.java:342)
        at org.apache.maven.shared.dependency.analyzer.DefaultProjectDependencyAnalyzerTest.compileProject(DefaultProjectDependencyAnalyzerTest.java:337)
        at org.apache.maven.shared.dependency.analyzer.DefaultProjectDependencyAnalyzerTest.testMultimoduleProject(DefaultProjectDependencyAnalyzerTest.java:280)


FAILED:  org.apache.maven.shared.dependency.analyzer.DefaultProjectDependencyAnalyzerTest.testJarWithXmlTransitiveDependency

Error Message:
Error compiling test project expected:<0> but was:<1>

Stack Trace:
junit.framework.AssertionFailedError: Error compiling test project expected:<0> but was:<1>
        at junit.framework.Assert.fail(Assert.java:57)
        at junit.framework.Assert.failNotEquals(Assert.java:329)
        at junit.framework.Assert.assertEquals(Assert.java:78)
        at junit.framework.Assert.assertEquals(Assert.java:234)
        at junit.framework.TestCase.assertEquals(TestCase.java:401)
        at org.apache.maven.shared.dependency.analyzer.DefaultProjectDependencyAnalyzerTest.compileProject(DefaultProjectDependencyAnalyzerTest.java:358)
        at org.apache.maven.shared.dependency.analyzer.DefaultProjectDependencyAnalyzerTest.compileProject(DefaultProjectDependencyAnalyzerTest.java:337)
        at org.apache.maven.shared.dependency.analyzer.DefaultProjectDependencyAnalyzerTest.testJarWithXmlTransitiveDependency(DefaultProjectDependencyAnalyzerTest.java:262)


FAILED:  org.apache.maven.shared.dependency.analyzer.DefaultProjectDependencyAnalyzerTest.testJarWithNoDependencies

Error Message:
Error compiling test project expected:<0> but was:<1>

Stack Trace:
junit.framework.AssertionFailedError: Error compiling test project expected:<0> but was:<1>
        at junit.framework.Assert.fail(Assert.java:57)
        at junit.framework.Assert.failNotEquals(Assert.java:329)
        at junit.framework.Assert.assertEquals(Assert.java:78)
        at junit.framework.Assert.assertEquals(Assert.java:234)
        at junit.framework.TestCase.assertEquals(TestCase.java:401)
        at org.apache.maven.shared.dependency.analyzer.DefaultProjectDependencyAnalyzerTest.compileProject(DefaultProjectDependencyAnalyzerTest.java:358)
        at org.apache.maven.shared.dependency.analyzer.DefaultProjectDependencyAnalyzerTest.compileProject(DefaultProjectDependencyAnalyzerTest.java:337)
        at org.apache.maven.shared.dependency.analyzer.DefaultProjectDependencyAnalyzerTest.testJarWithNoDependencies(DefaultProjectDependencyAnalyzerTest.java:111)


FAILED:  org.apache.maven.shared.dependency.analyzer.DefaultProjectDependencyAnalyzerTest.testPom

Error Message:
Error compiling test project expected:<0> but was:<1>

Stack Trace:
junit.framework.AssertionFailedError: Error compiling test project expected:<0> but was:<1>
        at junit.framework.Assert.fail(Assert.java:57)
        at junit.framework.Assert.failNotEquals(Assert.java:329)
        at junit.framework.Assert.assertEquals(Assert.java:78)
        at junit.framework.Assert.assertEquals(Assert.java:234)
        at junit.framework.TestCase.assertEquals(TestCase.java:401)
        at org.apache.maven.shared.dependency.analyzer.DefaultProjectDependencyAnalyzerTest.compileProject(DefaultProjectDependencyAnalyzerTest.java:358)
        at org.apache.maven.shared.dependency.analyzer.DefaultProjectDependencyAnalyzerTest.compileProject(DefaultProjectDependencyAnalyzerTest.java:337)
        at org.apache.maven.shared.dependency.analyzer.DefaultProjectDependencyAnalyzerTest.testPom(DefaultProjectDependencyAnalyzerTest.java:97)


FAILED:  org.apache.maven.shared.dependency.analyzer.DefaultProjectDependencyAnalyzerTest.testForceDeclaredDependenciesUsage

Error Message:
Error compiling test project expected:<0> but was:<1>

Stack Trace:
junit.framework.AssertionFailedError: Error compiling test project expected:<0> but was:<1>
        at junit.framework.Assert.fail(Assert.java:57)
        at junit.framework.Assert.failNotEquals(Assert.java:329)
        at junit.framework.Assert.assertEquals(Assert.java:78)
        at junit.framework.Assert.assertEquals(Assert.java:234)
        at junit.framework.TestCase.assertEquals(TestCase.java:401)
        at org.apache.maven.shared.dependency.analyzer.DefaultProjectDependencyAnalyzerTest.compileProject(DefaultProjectDependencyAnalyzerTest.java:358)
        at org.apache.maven.shared.dependency.analyzer.DefaultProjectDependencyAnalyzerTest.compileProject(DefaultProjectDependencyAnalyzerTest.java:337)
        at org.apache.maven.shared.dependency.analyzer.DefaultProjectDependencyAnalyzerTest.testForceDeclaredDependenciesUsage(DefaultProjectDependencyAnalyzerTest.java:198)


FAILED:  org.apache.maven.shared.dependency.analyzer.DefaultProjectDependencyAnalyzerTest.testJarWithTestDependency

Error Message:
Error compiling test project expected:<0> but was:<1>

Stack Trace:
junit.framework.AssertionFailedError: Error compiling test project expected:<0> but was:<1>
        at junit.framework.Assert.fail(Assert.java:57)
        at junit.framework.Assert.failNotEquals(Assert.java:329)
        at junit.framework.Assert.assertEquals(Assert.java:78)
        at junit.framework.Assert.assertEquals(Assert.java:234)
        at junit.framework.TestCase.assertEquals(TestCase.java:401)
        at org.apache.maven.shared.dependency.analyzer.DefaultProjectDependencyAnalyzerTest.compileProject(DefaultProjectDependencyAnalyzerTest.java:358)
        at org.apache.maven.shared.dependency.analyzer.DefaultProjectDependencyAnalyzerTest.compileProject(DefaultProjectDependencyAnalyzerTest.java:337)
        at org.apache.maven.shared.dependency.analyzer.DefaultProjectDependencyAnalyzerTest.testJarWithTestDependency(DefaultProjectDependencyAnalyzerTest.java:232)


FAILED:  org.apache.maven.shared.dependency.analyzer.DefaultProjectDependencyAnalyzerTest.testJarWithCompileDependency

Error Message:
Error compiling test project expected:<0> but was:<1>

Stack Trace:
junit.framework.AssertionFailedError: Error compiling test project expected:<0> but was:<1>
        at junit.framework.Assert.fail(Assert.java:57)
        at junit.framework.Assert.failNotEquals(Assert.java:329)
        at junit.framework.Assert.assertEquals(Assert.java:78)
        at junit.framework.Assert.assertEquals(Assert.java:234)
        at junit.framework.TestCase.assertEquals(TestCase.java:401)
        at org.apache.maven.shared.dependency.analyzer.DefaultProjectDependencyAnalyzerTest.compileProject(DefaultProjectDependencyAnalyzerTest.java:358)
        at org.apache.maven.shared.dependency.analyzer.DefaultProjectDependencyAnalyzerTest.compileProject(DefaultProjectDependencyAnalyzerTest.java:337)
        at org.apache.maven.shared.dependency.analyzer.DefaultProjectDependencyAnalyzerTest.testJarWithCompileDependency(DefaultProjectDependencyAnalyzerTest.java:174)


FAILED:  org.apache.maven.shared.dependency.analyzer.DefaultProjectDependencyAnalyzerTest.testMultimoduleProject

Error Message:
Error compiling test project expected:<0> but was:<1>

Stack Trace:
junit.framework.AssertionFailedError: Error compiling test project expected:<0> but was:<1>
        at junit.framework.Assert.fail(Assert.java:57)
        at junit.framework.Assert.failNotEquals(Assert.java:329)
        at junit.framework.Assert.assertEquals(Assert.java:78)
        at junit.framework.Assert.assertEquals(Assert.java:234)
        at junit.framework.TestCase.assertEquals(TestCase.java:401)
        at org.apache.maven.shared.dependency.analyzer.DefaultProjectDependencyAnalyzerTest.compileProject(DefaultProjectDependencyAnalyzerTest.java:358)
        at org.apache.maven.shared.dependency.analyzer.DefaultProjectDependencyAnalyzerTest.compileProject(DefaultProjectDependencyAnalyzerTest.java:337)
        at org.apache.maven.shared.dependency.analyzer.DefaultProjectDependencyAnalyzerTest.testMultimoduleProject(DefaultProjectDependencyAnalyzerTest.java:280)


FAILED:  org.apache.maven.shared.dependency.analyzer.DefaultProjectDependencyAnalyzerTest.testJarWithXmlTransitiveDependency

Error Message:
Error compiling test project expected:<0> but was:<1>

Stack Trace:
junit.framework.AssertionFailedError: Error compiling test project expected:<0> but was:<1>
        at junit.framework.Assert.fail(Assert.java:57)
        at junit.framework.Assert.failNotEquals(Assert.java:329)
        at junit.framework.Assert.assertEquals(Assert.java:78)
        at junit.framework.Assert.assertEquals(Assert.java:234)
        at junit.framework.TestCase.assertEquals(TestCase.java:401)
        at org.apache.maven.shared.dependency.analyzer.DefaultProjectDependencyAnalyzerTest.compileProject(DefaultProjectDependencyAnalyzerTest.java:358)
        at org.apache.maven.shared.dependency.analyzer.DefaultProjectDependencyAnalyzerTest.compileProject(DefaultProjectDependencyAnalyzerTest.java:337)
        at org.apache.maven.shared.dependency.analyzer.DefaultProjectDependencyAnalyzerTest.testJarWithXmlTransitiveDependency(DefaultProjectDependencyAnalyzerTest.java:262)


FAILED:  org.apache.maven.shared.dependency.analyzer.DefaultProjectDependencyAnalyzerTest.testJarWithNoDependencies

Error Message:
Error compiling test project expected:<0> but was:<1>

Stack Trace:
junit.framework.AssertionFailedError: Error compiling test project expected:<0> but was:<1>
        at junit.framework.Assert.fail(Assert.java:57)
        at junit.framework.Assert.failNotEquals(Assert.java:329)
        at junit.framework.Assert.assertEquals(Assert.java:78)
        at junit.framework.Assert.assertEquals(Assert.java:234)
        at junit.framework.TestCase.assertEquals(TestCase.java:401)
        at org.apache.maven.shared.dependency.analyzer.DefaultProjectDependencyAnalyzerTest.compileProject(DefaultProjectDependencyAnalyzerTest.java:358)
        at org.apache.maven.shared.dependency.analyzer.DefaultProjectDependencyAnalyzerTest.compileProject(DefaultProjectDependencyAnalyzerTest.java:337)
        at org.apache.maven.shared.dependency.analyzer.DefaultProjectDependencyAnalyzerTest.testJarWithNoDependencies(DefaultProjectDependencyAnalyzerTest.java:111)


FAILED:  org.apache.maven.shared.dependency.analyzer.DefaultProjectDependencyAnalyzerTest.testPom

Error Message:
Error compiling test project expected:<0> but was:<1>

Stack Trace:
junit.framework.AssertionFailedError: Error compiling test project expected:<0> but was:<1>
        at junit.framework.Assert.fail(Assert.java:57)
        at junit.framework.Assert.failNotEquals(Assert.java:329)
        at junit.framework.Assert.assertEquals(Assert.java:78)
        at junit.framework.Assert.assertEquals(Assert.java:234)
        at junit.framework.TestCase.assertEquals(TestCase.java:401)
        at org.apache.maven.shared.dependency.analyzer.DefaultProjectDependencyAnalyzerTest.compileProject(DefaultProjectDependencyAnalyzerTest.java:358)
        at org.apache.maven.shared.dependency.analyzer.DefaultProjectDependencyAnalyzerTest.compileProject(DefaultProjectDependencyAnalyzerTest.java:337)
        at org.apache.maven.shared.dependency.analyzer.DefaultProjectDependencyAnalyzerTest.testPom(DefaultProjectDependencyAnalyzerTest.java:97)


FAILED:  org.apache.maven.shared.dependency.analyzer.DefaultProjectDependencyAnalyzerTest.testForceDeclaredDependenciesUsage

Error Message:
Error compiling test project expected:<0> but was:<1>

Stack Trace:
junit.framework.AssertionFailedError: Error compiling test project expected:<0> but was:<1>
        at junit.framework.Assert.fail(Assert.java:57)
        at junit.framework.Assert.failNotEquals(Assert.java:329)
        at junit.framework.Assert.assertEquals(Assert.java:78)
        at junit.framework.Assert.assertEquals(Assert.java:234)
        at junit.framework.TestCase.assertEquals(TestCase.java:401)
        at org.apache.maven.shared.dependency.analyzer.DefaultProjectDependencyAnalyzerTest.compileProject(DefaultProjectDependencyAnalyzerTest.java:358)
        at org.apache.maven.shared.dependency.analyzer.DefaultProjectDependencyAnalyzerTest.compileProject(DefaultProjectDependencyAnalyzerTest.java:337)
        at org.apache.maven.shared.dependency.analyzer.DefaultProjectDependencyAnalyzerTest.testForceDeclaredDependenciesUsage(DefaultProjectDependencyAnalyzerTest.java:198)


FAILED:  org.apache.maven.shared.dependency.analyzer.DefaultProjectDependencyAnalyzerTest.testJarWithTestDependency

Error Message:
Error compiling test project expected:<0> but was:<1>

Stack Trace:
junit.framework.AssertionFailedError: Error compiling test project expected:<0> but was:<1>
        at junit.framework.Assert.fail(Assert.java:57)
        at junit.framework.Assert.failNotEquals(Assert.java:329)
        at junit.framework.Assert.assertEquals(Assert.java:78)
        at junit.framework.Assert.assertEquals(Assert.java:234)
        at junit.framework.TestCase.assertEquals(TestCase.java:401)
        at org.apache.maven.shared.dependency.analyzer.DefaultProjectDependencyAnalyzerTest.compileProject(DefaultProjectDependencyAnalyzerTest.java:358)
        at org.apache.maven.shared.dependency.analyzer.DefaultProjectDependencyAnalyzerTest.compileProject(DefaultProjectDependencyAnalyzerTest.java:337)
        at org.apache.maven.shared.dependency.analyzer.DefaultProjectDependencyAnalyzerTest.testJarWithTestDependency(DefaultProjectDependencyAnalyzerTest.java:232)


FAILED:  org.apache.maven.shared.dependency.analyzer.DefaultProjectDependencyAnalyzerTest.testJarWithCompileDependency

Error Message:
Error compiling test project expected:<0> but was:<1>

Stack Trace:
junit.framework.AssertionFailedError: Error compiling test project expected:<0> but was:<1>
        at junit.framework.Assert.fail(Assert.java:57)
        at junit.framework.Assert.failNotEquals(Assert.java:329)
        at junit.framework.Assert.assertEquals(Assert.java:78)
        at junit.framework.Assert.assertEquals(Assert.java:234)
        at junit.framework.TestCase.assertEquals(TestCase.java:401)
        at org.apache.maven.shared.dependency.analyzer.DefaultProjectDependencyAnalyzerTest.compileProject(DefaultProjectDependencyAnalyzerTest.java:358)
        at org.apache.maven.shared.dependency.analyzer.DefaultProjectDependencyAnalyzerTest.compileProject(DefaultProjectDependencyAnalyzerTest.java:337)
        at org.apache.maven.shared.dependency.analyzer.DefaultProjectDependencyAnalyzerTest.testJarWithCompileDependency(DefaultProjectDependencyAnalyzerTest.java:174)


FAILED:  org.apache.maven.shared.dependency.analyzer.DefaultProjectDependencyAnalyzerTest.testMultimoduleProject

Error Message:
Error compiling test project expected:<0> but was:<1>

Stack Trace:
junit.framework.AssertionFailedError: Error compiling test project expected:<0> but was:<1>
        at junit.framework.Assert.fail(Assert.java:57)
        at junit.framework.Assert.failNotEquals(Assert.java:329)
        at junit.framework.Assert.assertEquals(Assert.java:78)
        at junit.framework.Assert.assertEquals(Assert.java:234)
        at junit.framework.TestCase.assertEquals(TestCase.java:401)
        at org.apache.maven.shared.dependency.analyzer.DefaultProjectDependencyAnalyzerTest.compileProject(DefaultProjectDependencyAnalyzerTest.java:358)
        at org.apache.maven.shared.dependency.analyzer.DefaultProjectDependencyAnalyzerTest.compileProject(DefaultProjectDependencyAnalyzerTest.java:337)
        at org.apache.maven.shared.dependency.analyzer.DefaultProjectDependencyAnalyzerTest.testMultimoduleProject(DefaultProjectDependencyAnalyzerTest.java:280)


FAILED:  org.apache.maven.shared.dependency.analyzer.DefaultProjectDependencyAnalyzerTest.testJarWithXmlTransitiveDependency

Error Message:
null

Stack Trace:
java.lang.NullPointerException: null
        at org.apache.commons.lang3.SystemUtils.isJavaVersionAtLeast(SystemUtils.java:1626)
        at org.apache.maven.shared.dependency.analyzer.DefaultProjectDependencyAnalyzerTest.compileProject(DefaultProjectDependencyAnalyzerTest.java:342)
        at org.apache.maven.shared.dependency.analyzer.DefaultProjectDependencyAnalyzerTest.compileProject(DefaultProjectDependencyAnalyzerTest.java:337)
        at org.apache.maven.shared.dependency.analyzer.DefaultProjectDependencyAnalyzerTest.testJarWithXmlTransitiveDependency(DefaultProjectDependencyAnalyzerTest.java:262)


FAILED:  org.apache.maven.shared.dependency.analyzer.DefaultProjectDependencyAnalyzerTest.testJarWithNoDependencies

Error Message:
null

Stack Trace:
java.lang.NullPointerException: null
        at org.apache.commons.lang3.SystemUtils.isJavaVersionAtLeast(SystemUtils.java:1626)
        at org.apache.maven.shared.dependency.analyzer.DefaultProjectDependencyAnalyzerTest.compileProject(DefaultProjectDependencyAnalyzerTest.java:342)
        at org.apache.maven.shared.dependency.analyzer.DefaultProjectDependencyAnalyzerTest.compileProject(DefaultProjectDependencyAnalyzerTest.java:337)
        at org.apache.maven.shared.dependency.analyzer.DefaultProjectDependencyAnalyzerTest.testJarWithNoDependencies(DefaultProjectDependencyAnalyzerTest.java:111)


FAILED:  org.apache.maven.shared.dependency.analyzer.DefaultProjectDependencyAnalyzerTest.testPom

Error Message:
null

Stack Trace:
java.lang.NullPointerException: null
        at org.apache.commons.lang3.SystemUtils.isJavaVersionAtLeast(SystemUtils.java:1626)
        at org.apache.maven.shared.dependency.analyzer.DefaultProjectDependencyAnalyzerTest.compileProject(DefaultProjectDependencyAnalyzerTest.java:342)
        at org.apache.maven.shared.dependency.analyzer.DefaultProjectDependencyAnalyzerTest.compileProject(DefaultProjectDependencyAnalyzerTest.java:337)
        at org.apache.maven.shared.dependency.analyzer.DefaultProjectDependencyAnalyzerTest.testPom(DefaultProjectDependencyAnalyzerTest.java:97)


FAILED:  org.apache.maven.shared.dependency.analyzer.DefaultProjectDependencyAnalyzerTest.testForceDeclaredDependenciesUsage

Error Message:
null

Stack Trace:
java.lang.NullPointerException: null
        at org.apache.commons.lang3.SystemUtils.isJavaVersionAtLeast(SystemUtils.java:1626)
        at org.apache.maven.shared.dependency.analyzer.DefaultProjectDependencyAnalyzerTest.compileProject(DefaultProjectDependencyAnalyzerTest.java:342)
        at org.apache.maven.shared.dependency.analyzer.DefaultProjectDependencyAnalyzerTest.compileProject(DefaultProjectDependencyAnalyzerTest.java:337)
        at org.apache.maven.shared.dependency.analyzer.DefaultProjectDependencyAnalyzerTest.testForceDeclaredDependenciesUsage(DefaultProjectDependencyAnalyzerTest.java:198)


FAILED:  org.apache.maven.shared.dependency.analyzer.DefaultProjectDependencyAnalyzerTest.testJarWithTestDependency

Error Message:
null

Stack Trace:
java.lang.NullPointerException: null
        at org.apache.commons.lang3.SystemUtils.isJavaVersionAtLeast(SystemUtils.java:1626)
        at org.apache.maven.shared.dependency.analyzer.DefaultProjectDependencyAnalyzerTest.compileProject(DefaultProjectDependencyAnalyzerTest.java:342)
        at org.apache.maven.shared.dependency.analyzer.DefaultProjectDependencyAnalyzerTest.compileProject(DefaultProjectDependencyAnalyzerTest.java:337)
        at org.apache.maven.shared.dependency.analyzer.DefaultProjectDependencyAnalyzerTest.testJarWithTestDependency(DefaultProjectDependencyAnalyzerTest.java:232)


FAILED:  org.apache.maven.shared.dependency.analyzer.DefaultProjectDependencyAnalyzerTest.testJarWithCompileDependency

Error Message:
null

Stack Trace:
java.lang.NullPointerException: null
        at org.apache.commons.lang3.SystemUtils.isJavaVersionAtLeast(SystemUtils.java:1626)
        at org.apache.maven.shared.dependency.analyzer.DefaultProjectDependencyAnalyzerTest.compileProject(DefaultProjectDependencyAnalyzerTest.java:342)
        at org.apache.maven.shared.dependency.analyzer.DefaultProjectDependencyAnalyzerTest.compileProject(DefaultProjectDependencyAnalyzerTest.java:337)
        at org.apache.maven.shared.dependency.analyzer.DefaultProjectDependencyAnalyzerTest.testJarWithCompileDependency(DefaultProjectDependencyAnalyzerTest.java:174)


FAILED:  org.apache.maven.shared.dependency.analyzer.DefaultProjectDependencyAnalyzerTest.testJava8methodRefs

Error Message:
null

Stack Trace:
java.lang.NullPointerException: null
        at org.apache.commons.lang3.SystemUtils.isJavaVersionAtLeast(SystemUtils.java:1626)
        at org.apache.maven.shared.dependency.analyzer.DefaultProjectDependencyAnalyzerTest.testJava8methodRefs(DefaultProjectDependencyAnalyzerTest.java:125)


FAILED:  org.apache.maven.shared.dependency.analyzer.DefaultProjectDependencyAnalyzerTest.testInlinedStaticReference

Error Message:
null

Stack Trace:
java.lang.NullPointerException: null
        at org.apache.commons.lang3.SystemUtils.isJavaVersionAtLeast(SystemUtils.java:1626)
        at org.apache.maven.shared.dependency.analyzer.DefaultProjectDependencyAnalyzerTest.testInlinedStaticReference(DefaultProjectDependencyAnalyzerTest.java:150)


FAILED:  org.apache.maven.shared.dependency.analyzer.DefaultProjectDependencyAnalyzerTest.testTypeUseAnnotationDependency

Error Message:
null

Stack Trace:
java.lang.NullPointerException: null
        at org.apache.commons.lang3.SystemUtils.isJavaVersionAtLeast(SystemUtils.java:1626)
        at org.apache.maven.shared.dependency.analyzer.DefaultProjectDependencyAnalyzerTest.testTypeUseAnnotationDependency(DefaultProjectDependencyAnalyzerTest.java:310)


FAILED:  org.apache.maven.shared.dependency.analyzer.DefaultProjectDependencyAnalyzerTest.testMultimoduleProject

Error Message:
null

Stack Trace:
java.lang.NullPointerException: null
        at org.apache.commons.lang3.SystemUtils.isJavaVersionAtLeast(SystemUtils.java:1626)
        at org.apache.maven.shared.dependency.analyzer.DefaultProjectDependencyAnalyzerTest.compileProject(DefaultProjectDependencyAnalyzerTest.java:342)
        at org.apache.maven.shared.dependency.analyzer.DefaultProjectDependencyAnalyzerTest.compileProject(DefaultProjectDependencyAnalyzerTest.java:337)
        at org.apache.maven.shared.dependency.analyzer.DefaultProjectDependencyAnalyzerTest.testMultimoduleProject(DefaultProjectDependencyAnalyzerTest.java:280)




Build log:
[...truncated 2.02 MB...]
[windows-jdk9] [INFO] Downloading from central: https://repo.maven.apache.org/maven2/org/parboiled/parboiled-java/1.1.4/parboiled-java-1.1.4.jar
[windows-jdk9] [INFO] Downloaded from central: https://repo.maven.apache.org/maven2/org/apache/maven/doxia/doxia-module-markdown/1.7/doxia-module-markdown-1.7.jar (15 kB at 42 kB/s)
[windows-jdk9] [INFO] Downloading from central: https://repo.maven.apache.org/maven2/org/parboiled/parboiled-core/1.1.4/parboiled-core-1.1.4.jar
[windows-jdk9] [INFO] Downloaded from central: https://repo.maven.apache.org/maven2/org/pegdown/pegdown/1.2.1/pegdown-1.2.1.jar (59 kB at 147 kB/s)
[windows-jdk9] [INFO] Downloading from central: https://repo.maven.apache.org/maven2/org/ow2/asm/asm/4.1/asm-4.1.jar
[windows-jdk9] [INFO] Downloaded from central: https://repo.maven.apache.org/maven2/org/parboiled/parboiled-core/1.1.4/parboiled-core-1.1.4.jar (185 kB at 450 kB/s)
[windows-jdk9] [INFO] Downloading from central: https://repo.maven.apache.org/maven2/org/ow2/asm/asm-tree/4.1/asm-tree-4.1.jar
[windows-jdk9] [INFO] Downloaded from central: https://repo.maven.apache.org/maven2/org/parboiled/parboiled-java/1.1.4/parboiled-java-1.1.4.jar (73 kB at 173 kB/s)
[windows-jdk9] [INFO] Downloading from central: https://repo.maven.apache.org/maven2/org/ow2/asm/asm-analysis/4.1/asm-analysis-4.1.jar
[windows-jdk9] [INFO] Downloaded from central: https://repo.maven.apache.org/maven2/org/apache/maven/doxia/doxia-module-fml/1.7/doxia-module-fml-1.7.jar (39 kB at 88 kB/s)
[windows-jdk9] [INFO] Downloading from central: https://repo.maven.apache.org/maven2/org/ow2/asm/asm-util/4.1/asm-util-4.1.jar
[windows-jdk9] [INFO] Downloaded from central: https://repo.maven.apache.org/maven2/org/apache/maven/doxia/doxia-module-xdoc/1.7/doxia-module-xdoc-1.7.jar (37 kB at 83 kB/s)
[windows-jdk9] [INFO] Downloading from central: https://repo.maven.apache.org/maven2/javax/servlet/servlet-api/2.5/servlet-api-2.5.jar
[windows-jdk9] [INFO] Downloaded from central: https://repo.maven.apache.org/maven2/javax/servlet/servlet-api/2.5/servlet-api-2.5.jar (105 kB at 215 kB/s)
[windows-jdk9] [INFO] Downloading from central: https://repo.maven.apache.org/maven2/org/apache/maven/doxia/doxia-decoration-model/1.7.1/doxia-decoration-model-1.7.1.jar
[windows-jdk9] [INFO] Downloaded from central: https://repo.maven.apache.org/maven2/org/apache/maven/doxia/doxia-decoration-model/1.7.1/doxia-decoration-model-1.7.1.jar (61 kB at 106 kB/s)
[windows-jdk9] [INFO] Downloading from central: https://repo.maven.apache.org/maven2/org/apache/maven/doxia/doxia-site-renderer/1.7.1/doxia-site-renderer-1.7.1.jar
[windows-jdk9] [INFO] Downloaded from central: https://repo.maven.apache.org/maven2/org/ow2/asm/asm-tree/4.1/asm-tree-4.1.jar (22 kB at 36 kB/s)
[windows-jdk9] [INFO] Downloading from central: https://repo.maven.apache.org/maven2/org/apache/maven/doxia/doxia-skin-model/1.7.1/doxia-skin-model-1.7.1.jar
[windows-jdk9] [INFO] Downloaded from central: https://repo.maven.apache.org/maven2/org/apache/maven/doxia/doxia-site-renderer/1.7.1/doxia-site-renderer-1.7.1.jar (63 kB at 99 kB/s)
[windows-jdk9] [INFO] Downloading from central: https://repo.maven.apache.org/maven2/org/codehaus/plexus/plexus-velocity/1.2/plexus-velocity-1.2.jar
[windows-jdk9] [INFO] Downloaded from central: https://repo.maven.apache.org/maven2/org/ow2/asm/asm-analysis/4.1/asm-analysis-4.1.jar (20 kB at 31 kB/s)
[windows-jdk9] [INFO] Downloading from central: https://repo.maven.apache.org/maven2/org/apache/velocity/velocity-tools/2.0/velocity-tools-2.0.jar
[windows-jdk9] [INFO] Downloaded from central: https://repo.maven.apache.org/maven2/org/ow2/asm/asm-util/4.1/asm-util-4.1.jar (38 kB at 56 kB/s)
[windows-jdk9] [INFO] Downloading from central: https://repo.maven.apache.org/maven2/commons-beanutils/commons-beanutils/1.7.0/commons-beanutils-1.7.0.jar
[windows-jdk9] [INFO] Downloaded from central: https://repo.maven.apache.org/maven2/org/apache/velocity/velocity-tools/2.0/velocity-tools-2.0.jar (347 kB at 513 kB/s)
[windows-jdk9] [INFO] Downloading from central: https://repo.maven.apache.org/maven2/commons-digester/commons-digester/1.8/commons-digester-1.8.jar
[windows-jdk9] [INFO] Downloaded from central: https://repo.maven.apache.org/maven2/commons-beanutils/commons-beanutils/1.7.0/commons-beanutils-1.7.0.jar (189 kB at 270 kB/s)
[windows-jdk9] [INFO] Downloading from central: https://repo.maven.apache.org/maven2/commons-chain/commons-chain/1.1/commons-chain-1.1.jar
[windows-jdk9] [INFO] Downloaded from central: https://repo.maven.apache.org/maven2/org/codehaus/plexus/plexus-velocity/1.2/plexus-velocity-1.2.jar (8.1 kB at 11 kB/s)
[windows-jdk9] [INFO] Downloading from central: https://repo.maven.apache.org/maven2/commons-logging/commons-logging/1.1/commons-logging-1.1.jar
[windows-jdk9] [INFO] Downloaded from central: https://repo.maven.apache.org/maven2/commons-chain/commons-chain/1.1/commons-chain-1.1.jar (90 kB at 124 kB/s)
[windows-jdk9] [INFO] Downloading from central: https://repo.maven.apache.org/maven2/commons-validator/commons-validator/1.3.1/commons-validator-1.3.1.jar
[windows-jdk9] [INFO] Downloaded from central: https://repo.maven.apache.org/maven2/commons-digester/commons-digester/1.8/commons-digester-1.8.jar (144 kB at 193 kB/s)
[windows-jdk9] [INFO] Downloading from central: https://repo.maven.apache.org/maven2/dom4j/dom4j/1.1/dom4j-1.1.jar
[windows-jdk9] [INFO] Downloaded from central: https://repo.maven.apache.org/maven2/commons-logging/commons-logging/1.1/commons-logging-1.1.jar (53 kB at 70 kB/s)
[windows-jdk9] [INFO] Downloading from central: https://repo.maven.apache.org/maven2/sslext/sslext/1.2-0/sslext-1.2-0.jar
[windows-jdk9] [INFO] Downloaded from central: https://repo.maven.apache.org/maven2/org/apache/maven/doxia/doxia-skin-model/1.7.1/doxia-skin-model-1.7.1.jar (16 kB at 21 kB/s)
[windows-jdk9] [INFO] Downloading from central: https://repo.maven.apache.org/maven2/org/apache/struts/struts-core/1.3.8/struts-core-1.3.8.jar
[windows-jdk9] [INFO] Downloaded from central: https://repo.maven.apache.org/maven2/commons-validator/commons-validator/1.3.1/commons-validator-1.3.1.jar (139 kB at 178 kB/s)
[windows-jdk9] [INFO] Downloading from central: https://repo.maven.apache.org/maven2/antlr/antlr/2.7.2/antlr-2.7.2.jar
[windows-jdk9] [INFO] Downloaded from central: https://repo.maven.apache.org/maven2/antlr/antlr/2.7.2/antlr-2.7.2.jar (358 kB at 440 kB/s)
[windows-jdk9] [INFO] Downloading from central: https://repo.maven.apache.org/maven2/org/apache/struts/struts-taglib/1.3.8/struts-taglib-1.3.8.jar
[windows-jdk9] [INFO] Downloaded from central: https://repo.maven.apache.org/maven2/dom4j/dom4j/1.1/dom4j-1.1.jar (457 kB at 556 kB/s)
[windows-jdk9] [INFO] Downloading from central: https://repo.maven.apache.org/maven2/org/apache/struts/struts-tiles/1.3.8/struts-tiles-1.3.8.jar
[windows-jdk9] [INFO] Downloaded from central: https://repo.maven.apache.org/maven2/org/apache/struts/struts-core/1.3.8/struts-core-1.3.8.jar (329 kB at 395 kB/s)
[windows-jdk9] [INFO] Downloading from central: https://repo.maven.apache.org/maven2/org/apache/maven/doxia/doxia-integration-tools/1.7.1/doxia-integration-tools-1.7.1.jar
[windows-jdk9] [INFO] Downloaded from central: https://repo.maven.apache.org/maven2/org/ow2/asm/asm/4.1/asm-4.1.jar (47 kB at 56 kB/s)
[windows-jdk9] [INFO] Downloading from central: https://repo.maven.apache.org/maven2/org/apache/maven/wagon/wagon-provider-api/1.0/wagon-provider-api-1.0.jar
[windows-jdk9] [INFO] Downloaded from central: https://repo.maven.apache.org/maven2/org/apache/maven/wagon/wagon-provider-api/1.0/wagon-provider-api-1.0.jar (53 kB at 58 kB/s)
[windows-jdk9] [INFO] Downloading from central: https://repo.maven.apache.org/maven2/org/mortbay/jetty/jetty/6.1.25/jetty-6.1.25.jar
[windows-jdk9] [INFO] Downloaded from central: https://repo.maven.apache.org/maven2/sslext/sslext/1.2-0/sslext-1.2-0.jar (26 kB at 28 kB/s)
[windows-jdk9] [INFO] Downloading from central: https://repo.maven.apache.org/maven2/org/mortbay/jetty/servlet-api/2.5-20081211/servlet-api-2.5-20081211.jar
[windows-jdk9] [INFO] Downloaded from central: https://repo.maven.apache.org/maven2/org/apache/struts/struts-taglib/1.3.8/struts-taglib-1.3.8.jar (252 kB at 268 kB/s)
[windows-jdk9] [INFO] Downloading from central: https://repo.maven.apache.org/maven2/org/mortbay/jetty/jetty-util/6.1.25/jetty-util-6.1.25.jar
[windows-jdk9] [INFO] Downloaded from central: https://repo.maven.apache.org/maven2/org/apache/struts/struts-tiles/1.3.8/struts-tiles-1.3.8.jar (120 kB at 124 kB/s)
[windows-jdk9] [INFO] Downloading from central: https://repo.maven.apache.org/maven2/org/apache/commons/commons-lang3/3.4/commons-lang3-3.4.jar
[windows-jdk9] [INFO] Downloaded from central: https://repo.maven.apache.org/maven2/org/mortbay/jetty/jetty-util/6.1.25/jetty-util-6.1.25.jar (177 kB at 178 kB/s)
[windows-jdk9] [INFO] Downloading from central: https://repo.maven.apache.org/maven2/commons-io/commons-io/1.4/commons-io-1.4.jar
[windows-jdk9] [INFO] Downloaded from central: https://repo.maven.apache.org/maven2/org/mortbay/jetty/servlet-api/2.5-20081211/servlet-api-2.5-20081211.jar (134 kB at 135 kB/s)
[windows-jdk9] [INFO] Downloaded from central: https://repo.maven.apache.org/maven2/org/mortbay/jetty/jetty/6.1.25/jetty-6.1.25.jar (539 kB at 534 kB/s)
[windows-jdk9] [INFO] Downloaded from central: https://repo.maven.apache.org/maven2/org/apache/commons/commons-lang3/3.4/commons-lang3-3.4.jar (435 kB at 429 kB/s)
[windows-jdk9] [INFO] Downloaded from central: https://repo.maven.apache.org/maven2/commons-io/commons-io/1.4/commons-io-1.4.jar (109 kB at 106 kB/s)
[windows-jdk9] [INFO] Downloaded from central: https://repo.maven.apache.org/maven2/org/apache/maven/doxia/doxia-integration-tools/1.7.1/doxia-integration-tools-1.7.1.jar (47 kB at 39 kB/s)
[windows-jdk9] [INFO]
[windows-jdk9] [INFO] --- maven-checkstyle-plugin:2.15:check (checkstyle-check) @ maven-dependency-analyzer ---
[windows-jdk9] [INFO] Downloading from central: https://repo.maven.apache.org/maven2/org/apache/maven/reporting/maven-reporting-impl/2.3/maven-reporting-impl-2.3.pom
[windows-jdk9] [INFO] Downloaded from central: https://repo.maven.apache.org/maven2/org/apache/maven/reporting/maven-reporting-impl/2.3/maven-reporting-impl-2.3.pom (5.0 kB at 208 kB/s)
[windows-jdk9] [INFO] Downloading from central: https://repo.maven.apache.org/maven2/org/apache/maven/shared/maven-shared-utils/0.6/maven-shared-utils-0.6.pom
[windows-jdk9] [INFO] Downloaded from central: https://repo.maven.apache.org/maven2/org/apache/maven/shared/maven-shared-utils/0.6/maven-shared-utils-0.6.pom (4.9 kB at 195 kB/s)
[windows-jdk9] [INFO] Downloading from central: https://repo.maven.apache.org/maven2/org/apache/maven/shared/maven-shared-resources/2/maven-shared-resources-2.pom
[windows-jdk9] [INFO] Downloaded from central: https://repo.maven.apache.org/maven2/org/apache/maven/shared/maven-shared-resources/2/maven-shared-resources-2.pom (3.0 kB at 129 kB/s)
[windows-jdk9] [INFO] Downloading from central: https://repo.maven.apache.org/maven2/org/apache/maven/doxia/doxia-sink-api/1.4/doxia-sink-api-1.4.pom
[windows-jdk9] [INFO] Downloaded from central: https://repo.maven.apache.org/maven2/org/apache/maven/doxia/doxia-sink-api/1.4/doxia-sink-api-1.4.pom (1.5 kB at 33 kB/s)
[windows-jdk9] [INFO] Downloading from central: https://repo.maven.apache.org/maven2/org/apache/maven/doxia/doxia/1.4/doxia-1.4.pom
[windows-jdk9] [INFO] Downloaded from central: https://repo.maven.apache.org/maven2/org/apache/maven/doxia/doxia/1.4/doxia-1.4.pom (18 kB at 641 kB/s)
[windows-jdk9] [INFO] Downloading from central: https://repo.maven.apache.org/maven2/org/apache/maven/doxia/doxia-logging-api/1.4/doxia-logging-api-1.4.pom
[windows-jdk9] [INFO] Downloaded from central: https://repo.maven.apache.org/maven2/org/apache/maven/doxia/doxia-logging-api/1.4/doxia-logging-api-1.4.pom (1.5 kB at 61 kB/s)
[windows-jdk9] [INFO] Downloading from central: https://repo.maven.apache.org/maven2/org/apache/maven/doxia/doxia-decoration-model/1.4/doxia-decoration-model-1.4.pom
[windows-jdk9] [INFO] Downloaded from central: https://repo.maven.apache.org/maven2/org/apache/maven/doxia/doxia-decoration-model/1.4/doxia-decoration-model-1.4.pom (2.7 kB at 28 kB/s)
[windows-jdk9] [INFO] Downloading from central: https://repo.maven.apache.org/maven2/org/apache/maven/doxia/doxia-sitetools/1.4/doxia-sitetools-1.4.pom
[windows-jdk9] [INFO] Downloaded from central: https://repo.maven.apache.org/maven2/org/apache/maven/doxia/doxia-sitetools/1.4/doxia-sitetools-1.4.pom (17 kB at 780 kB/s)
[windows-jdk9] [INFO] Downloading from central: https://repo.maven.apache.org/maven2/org/codehaus/plexus/plexus-utils/3.0.10/plexus-utils-3.0.10.pom
[windows-jdk9] [INFO] Downloaded from central: https://repo.maven.apache.org/maven2/org/codehaus/plexus/plexus-utils/3.0.10/plexus-utils-3.0.10.pom (3.1 kB at 131 kB/s)
[windows-jdk9] [INFO] Downloading from central: https://repo.maven.apache.org/maven2/org/apache/maven/doxia/doxia-site-renderer/1.4/doxia-site-renderer-1.4.pom
[windows-jdk9] [INFO] Downloaded from central: https://repo.maven.apache.org/maven2/org/apache/maven/doxia/doxia-site-renderer/1.4/doxia-site-renderer-1.4.pom (6.1 kB at 291 kB/s)
[windows-jdk9] [INFO] Downloading from central: https://repo.maven.apache.org/maven2/org/apache/maven/doxia/doxia-core/1.4/doxia-core-1.4.pom
[windows-jdk9] [INFO] Downloaded from central: https://repo.maven.apache.org/maven2/org/apache/maven/doxia/doxia-core/1.4/doxia-core-1.4.pom (4.1 kB at 163 kB/s)
[windows-jdk9] [INFO] Downloading from central: https://repo.maven.apache.org/maven2/org/apache/maven/doxia/doxia-module-xhtml/1.4/doxia-module-xhtml-1.4.pom
[windows-jdk9] [INFO] Downloaded from central: https://repo.maven.apache.org/maven2/org/apache/maven/doxia/doxia-module-xhtml/1.4/doxia-module-xhtml-1.4.pom (1.6 kB at 63 kB/s)
[windows-jdk9] [INFO] Downloading from central: https://repo.maven.apache.org/maven2/org/apache/maven/doxia/doxia-modules/1.4/doxia-modules-1.4.pom
[windows-jdk9] [INFO] Downloaded from central: https://repo.maven.apache.org/maven2/org/apache/maven/doxia/doxia-modules/1.4/doxia-modules-1.4.pom (2.6 kB at 109 kB/s)
[windows-jdk9] [INFO] Downloading from central: https://repo.maven.apache.org/maven2/org/apache/maven/doxia/doxia-module-fml/1.4/doxia-module-fml-1.4.pom
[windows-jdk9] [INFO] Downloaded from central: https://repo.maven.apache.org/maven2/org/apache/maven/doxia/doxia-module-fml/1.4/doxia-module-fml-1.4.pom (4.8 kB at 155 kB/s)
[windows-jdk9] [INFO] Downloading from central: https://repo.maven.apache.org/maven2/org/apache/maven/doxia/doxia-integration-tools/1.6/doxia-integration-tools-1.6.pom
[windows-jdk9] [INFO] Downloaded from central: https://repo.maven.apache.org/maven2/org/apache/maven/doxia/doxia-integration-tools/1.6/doxia-integration-tools-1.6.pom (7.0 kB at 302 kB/s)
[windows-jdk9] [INFO] Downloading from central: https://repo.maven.apache.org/maven2/org/apache/maven/doxia/doxia-tools/3/doxia-tools-3.pom
[windows-jdk9] [INFO] Downloaded from central: https://repo.maven.apache.org/maven2/org/apache/maven/doxia/doxia-tools/3/doxia-tools-3.pom (9.9 kB at 382 kB/s)
[windows-jdk9] [INFO] Downloading from central: https://repo.maven.apache.org/maven2/org/apache/maven/doxia/doxia-logging-api/1.6/doxia-logging-api-1.6.pom
[windows-jdk9] [INFO] Downloaded from central: https://repo.maven.apache.org/maven2/org/apache/maven/doxia/doxia-logging-api/1.6/doxia-logging-api-1.6.pom (1.5 kB at 22 kB/s)
[windows-jdk9] [INFO] Downloading from central: https://repo.maven.apache.org/maven2/org/apache/maven/doxia/doxia/1.6/doxia-1.6.pom
[windows-jdk9] [INFO] Downloaded from central: https://repo.maven.apache.org/maven2/org/apache/maven/doxia/doxia/1.6/doxia-1.6.pom (19 kB at 316 kB/s)
[windows-jdk9] [INFO] Downloading from central: https://repo.maven.apache.org/maven2/org/apache/maven/doxia/doxia-decoration-model/1.6/doxia-decoration-model-1.6.pom
[windows-jdk9] [INFO] Downloaded from central: https://repo.maven.apache.org/maven2/org/apache/maven/doxia/doxia-decoration-model/1.6/doxia-decoration-model-1.6.pom (3.0 kB at 91 kB/s)
[windows-jdk9] [INFO] Downloading from central: https://repo.maven.apache.org/maven2/org/apache/maven/doxia/doxia-sitetools/1.6/doxia-sitetools-1.6.pom
[windows-jdk9] [INFO] Downloaded from central: https://repo.maven.apache.org/maven2/org/apache/maven/doxia/doxia-sitetools/1.6/doxia-sitetools-1.6.pom (18 kB at 688 kB/s)
[windows-jdk9] [INFO] Downloading from central: https://repo.maven.apache.org/maven2/org/codehaus/plexus/plexus-resources/1.0.1/plexus-resources-1.0.1.pom
[windows-jdk9] [INFO] Downloaded from central: https://repo.maven.apache.org/maven2/org/codehaus/plexus/plexus-resources/1.0.1/plexus-resources-1.0.1.pom (1.3 kB at 45 kB/s)
[windows-jdk9] [INFO] Downloading from central: https://repo.maven.apache.org/maven2/org/codehaus/plexus/plexus-velocity/1.1.8/plexus-velocity-1.1.8.pom
[windows-jdk9] [INFO] Downloaded from central: https://repo.maven.apache.org/maven2/org/codehaus/plexus/plexus-velocity/1.1.8/plexus-velocity-1.1.8.pom (1.9 kB at 66 kB/s)
[windows-jdk9] [INFO] Downloading from central: https://repo.maven.apache.org/maven2/com/puppycrawl/tools/checkstyle/6.1.1/checkstyle-6.1.1.pom
[windows-jdk9] [INFO] Downloaded from central: https://repo.maven.apache.org/maven2/com/puppycrawl/tools/checkstyle/6.1.1/checkstyle-6.1.1.pom (30 kB at 822 kB/s)
[windows-jdk9] [INFO] Downloading from central: https://repo.maven.apache.org/maven2/org/sonatype/oss/oss-parent/7/oss-parent-7.pom
[windows-jdk9] [INFO] Downloaded from central: https://repo.maven.apache.org/maven2/org/sonatype/oss/oss-parent/7/oss-parent-7.pom (4.8 kB at 219 kB/s)
[windows-jdk9] [INFO] Downloading from central: https://repo.maven.apache.org/maven2/antlr/antlr/2.7.7/antlr-2.7.7.pom
[windows-jdk9] [INFO] Downloaded from central: https://repo.maven.apache.org/maven2/antlr/antlr/2.7.7/antlr-2.7.7.pom (632 B at 30 kB/s)
[windows-jdk9] [INFO] Downloading from central: https://repo.maven.apache.org/maven2/org/antlr/antlr4-runtime/4.3/antlr4-runtime-4.3.pom
[windows-jdk9] [INFO] Downloaded from central: https://repo.maven.apache.org/maven2/org/antlr/antlr4-runtime/4.3/antlr4-runtime-4.3.pom (4.8 kB at 208 kB/s)
[windows-jdk9] [INFO] Downloading from central: https://repo.maven.apache.org/maven2/org/antlr/antlr4-master/4.3/antlr4-master-4.3.pom
[windows-jdk9] [INFO] Downloaded from central: https://repo.maven.apache.org/maven2/org/antlr/antlr4-master/4.3/antlr4-master-4.3.pom (7.9 kB at 233 kB/s)
[windows-jdk9] [INFO] Downloading from central: https://repo.maven.apache.org/maven2/org/abego/treelayout/org.abego.treelayout.core/1.0.1/org.abego.treelayout.core-1.0.1.pom
[windows-jdk9] [INFO] Downloaded from central: https://repo.maven.apache.org/maven2/org/abego/treelayout/org.abego.treelayout.core/1.0.1/org.abego.treelayout.core-1.0.1.pom (3.1 kB at 115 kB/s)
[windows-jdk9] [INFO] Downloading from central: https://repo.maven.apache.org/maven2/org/antlr/antlr4-annotations/4.3/antlr4-annotations-4.3.pom
[windows-jdk9] [INFO] Downloaded from central: https://repo.maven.apache.org/maven2/org/antlr/antlr4-annotations/4.3/antlr4-annotations-4.3.pom (1.3 kB at 27 kB/s)
[windows-jdk9] [INFO] Downloading from central: https://repo.maven.apache.org/maven2/commons-beanutils/commons-beanutils-core/1.8.3/commons-beanutils-core-1.8.3.pom
[windows-jdk9] [INFO] Downloaded from central: https://repo.maven.apache.org/maven2/commons-beanutils/commons-beanutils-core/1.8.3/commons-beanutils-core-1.8.3.pom (1.6 kB at 66 kB/s)
[windows-jdk9] [INFO] Downloading from central: https://repo.maven.apache.org/maven2/com/google/guava/guava/18.0/guava-18.0.pom
[windows-jdk9] [INFO] Downloaded from central: https://repo.maven.apache.org/maven2/com/google/guava/guava/18.0/guava-18.0.pom (5.7 kB at 227 kB/s)
[windows-jdk9] [INFO] Downloading from central: https://repo.maven.apache.org/maven2/com/google/guava/guava-parent/18.0/guava-parent-18.0.pom
[windows-jdk9] [INFO] Downloaded from central: https://repo.maven.apache.org/maven2/com/google/guava/guava-parent/18.0/guava-parent-18.0.pom (7.7 kB at 320 kB/s)
[windows-jdk9] [INFO] Downloading from central: https://repo.maven.apache.org/maven2/org/apache/maven/reporting/maven-reporting-impl/2.3/maven-reporting-impl-2.3.jar
[windows-jdk9] [INFO] Downloading from central: https://repo.maven.apache.org/maven2/org/apache/maven/shared/maven-shared-utils/0.6/maven-shared-utils-0.6.jar
[windows-jdk9] [INFO] Downloading from central: https://repo.maven.apache.org/maven2/xerces/xercesImpl/2.9.1/xercesImpl-2.9.1.jar
[windows-jdk9] [INFO] Downloading from central: https://repo.maven.apache.org/maven2/xml-apis/xml-apis/1.3.04/xml-apis-1.3.04.jar
[windows-jdk9] [INFO] Downloading from central: https://repo.maven.apache.org/maven2/commons-digester/commons-digester/1.6/commons-digester-1.6.jar
[windows-jdk9] [INFO] Downloaded from central: https://repo.maven.apache.org/maven2/xml-apis/xml-apis/1.3.04/xml-apis-1.3.04.jar (194 kB at 879 kB/s)
[windows-jdk9] [INFO] Downloading from central: https://repo.maven.apache.org/maven2/commons-logging/commons-logging/1.0.4/commons-logging-1.0.4.jar
[windows-jdk9] [INFO] Downloaded from central: https://repo.maven.apache.org/maven2/xerces/xercesImpl/2.9.1/xercesImpl-2.9.1.jar (1.2 MB at 5.5 MB/s)
[windows-jdk9] [INFO] Downloading from central: https://repo.maven.apache.org/maven2/org/apache/maven/shared/maven-shared-resources/2/maven-shared-resources-2.jar
[windows-jdk9] [INFO] Downloaded from central: https://repo.maven.apache.org/maven2/commons-digester/commons-digester/1.6/commons-digester-1.6.jar (168 kB at 685 kB/s)
[windows-jdk9] [INFO] Downloaded from central: https://repo.maven.apache.org/maven2/commons-logging/commons-logging/1.0.4/commons-logging-1.0.4.jar (38 kB at 155 kB/s)
[windows-jdk9] [INFO] Downloading from central: https://repo.maven.apache.org/maven2/org/apache/maven/doxia/doxia-sink-api/1.4/doxia-sink-api-1.4.jar
[windows-jdk9] [INFO] Downloading from central: https://repo.maven.apache.org/maven2/org/apache/maven/doxia/doxia-logging-api/1.4/doxia-logging-api-1.4.jar
[windows-jdk9] [INFO] Downloaded from central: https://repo.maven.apache.org/maven2/org/apache/maven/shared/maven-shared-utils/0.6/maven-shared-utils-0.6.jar (165 kB at 628 kB/s)
[windows-jdk9] [INFO] Downloading from central: https://repo.maven.apache.org/maven2/org/apache/maven/doxia/doxia-decoration-model/1.4/doxia-decoration-model-1.4.jar
[windows-jdk9] [INFO] Downloaded from central: https://repo.maven.apache.org/maven2/org/apache/maven/reporting/maven-reporting-impl/2.3/maven-reporting-impl-2.3.jar (18 kB at 53 kB/s)
[windows-jdk9] [INFO] Downloading from central: https://repo.maven.apache.org/maven2/org/apache/maven/doxia/doxia-site-renderer/1.4/doxia-site-renderer-1.4.jar
[windows-jdk9] [INFO] Downloaded from central: https://repo.maven.apache.org/maven2/org/apache/maven/doxia/doxia-sink-api/1.4/doxia-sink-api-1.4.jar (11 kB at 32 kB/s)
[windows-jdk9] [INFO] Downloading from central: https://repo.maven.apache.org/maven2/org/apache/maven/doxia/doxia-module-xhtml/1.4/doxia-module-xhtml-1.4.jar
[windows-jdk9] [INFO] Downloaded from central: https://repo.maven.apache.org/maven2/org/apache/maven/doxia/doxia-decoration-model/1.4/doxia-decoration-model-1.4.jar (61 kB at 169 kB/s)
[windows-jdk9] [INFO] Downloading from central: https://repo.maven.apache.org/maven2/org/apache/maven/doxia/doxia-module-fml/1.4/doxia-module-fml-1.4.jar
[windows-jdk9] [INFO] Downloaded from central: https://repo.maven.apache.org/maven2/org/apache/maven/doxia/doxia-logging-api/1.4/doxia-logging-api-1.4.jar (11 kB at 31 kB/s)
[windows-jdk9] [INFO] Downloading from central: https://repo.maven.apache.org/maven2/org/apache/maven/doxia/doxia-integration-tools/1.6/doxia-integration-tools-1.6.jar
[windows-jdk9] [INFO] Downloaded from central: https://repo.maven.apache.org/maven2/org/apache/maven/doxia/doxia-site-renderer/1.4/doxia-site-renderer-1.4.jar (53 kB at 144 kB/s)
[windows-jdk9] [INFO] Downloading from central: https://repo.maven.apache.org/maven2/org/codehaus/plexus/plexus-resources/1.0.1/plexus-resources-1.0.1.jar
[windows-jdk9] [INFO] Downloaded from central: https://repo.maven.apache.org/maven2/org/apache/maven/doxia/doxia-module-xhtml/1.4/doxia-module-xhtml-1.4.jar (15 kB at 29 kB/s)
[windows-jdk9] [INFO] Downloading from central: https://repo.maven.apache.org/maven2/org/codehaus/plexus/plexus-interpolation/1.21/plexus-interpolation-1.21.jar
[windows-jdk9] [INFO] Downloaded from central: https://repo.maven.apache.org/maven2/org/apache/maven/doxia/doxia-module-fml/1.4/doxia-module-fml-1.4.jar (38 kB at 67 kB/s)
[windows-jdk9] [INFO] Downloading from central: https://repo.maven.apache.org/maven2/org/codehaus/plexus/plexus-velocity/1.1.8/plexus-velocity-1.1.8.jar
[windows-jdk9] [INFO] Downloaded from central: https://repo.maven.apache.org/maven2/org/apache/maven/shared/maven-shared-resources/2/maven-shared-resources-2.jar (13 kB at 23 kB/s)
[windows-jdk9] [INFO] Downloading from central: https://repo.maven.apache.org/maven2/com/puppycrawl/tools/checkstyle/6.1.1/checkstyle-6.1.1.jar
[windows-jdk9] [INFO] Downloaded from central: https://repo.maven.apache.org/maven2/org/codehaus/plexus/plexus-interpolation/1.21/plexus-interpolation-1.21.jar (62 kB at 109 kB/s)
[windows-jdk9] [INFO] Downloading from central: https://repo.maven.apache.org/maven2/antlr/antlr/2.7.7/antlr-2.7.7.jar
[windows-jdk9] [INFO] Downloaded from central: https://repo.maven.apache.org/maven2/org/apache/maven/doxia/doxia-integration-tools/1.6/doxia-integration-tools-1.6.jar (45 kB at 64 kB/s)
[windows-jdk9] [INFO] Downloading from central: https://repo.maven.apache.org/maven2/org/antlr/antlr4-runtime/4.3/antlr4-runtime-4.3.jar
[windows-jdk9] [INFO] Downloaded from central: https://repo.maven.apache.org/maven2/org/codehaus/plexus/plexus-resources/1.0.1/plexus-resources-1.0.1.jar (22 kB at 31 kB/s)
[windows-jdk9] [INFO] Downloading from central: https://repo.maven.apache.org/maven2/org/abego/treelayout/org.abego.treelayout.core/1.0.1/org.abego.treelayout.core-1.0.1.jar
[windows-jdk9] [INFO] Downloaded from central: https://repo.maven.apache.org/maven2/org/codehaus/plexus/plexus-velocity/1.1.8/plexus-velocity-1.1.8.jar (7.9 kB at 11 kB/s)
[windows-jdk9] [INFO] Downloading from central: https://repo.maven.apache.org/maven2/org/antlr/antlr4-annotations/4.3/antlr4-annotations-4.3.jar
[windows-jdk9] [INFO] Downloaded from central: https://repo.maven.apache.org/maven2/antlr/antlr/2.7.7/antlr-2.7.7.jar (445 kB at 623 kB/s)
[windows-jdk9] [INFO] Downloading from central: https://repo.maven.apache.org/maven2/commons-beanutils/commons-beanutils-core/1.8.3/commons-beanutils-core-1.8.3.jar
[windows-jdk9] [INFO] Downloaded from central: https://repo.maven.apache.org/maven2/org/antlr/antlr4-runtime/4.3/antlr4-runtime-4.3.jar (345 kB at 462 kB/s)
[windows-jdk9] [INFO] Downloading from central: https://repo.maven.apache.org/maven2/com/google/guava/guava/18.0/guava-18.0.jar
[windows-jdk9] [INFO] Downloaded from central: https://repo.maven.apache.org/maven2/com/puppycrawl/tools/checkstyle/6.1.1/checkstyle-6.1.1.jar (1.0 MB at 1.4 MB/s)
[windows-jdk9] [INFO] Downloaded from central: https://repo.maven.apache.org/maven2/commons-beanutils/commons-beanutils-core/1.8.3/commons-beanutils-core-1.8.3.jar (207 kB at 272 kB/s)
[windows-jdk9] [INFO] Downloaded from central: https://repo.maven.apache.org/maven2/org/antlr/antlr4-annotations/4.3/antlr4-annotations-4.3.jar (10 kB at 12 kB/s)
[windows-jdk9] [INFO] Downloaded from central: https://repo.maven.apache.org/maven2/com/google/guava/guava/18.0/guava-18.0.jar (2.3 MB at 2.6 MB/s)
[windows-jdk9] [INFO] Downloaded from central: https://repo.maven.apache.org/maven2/org/abego/treelayout/org.abego.treelayout.core/1.0.1/org.abego.treelayout.core-1.0.1.jar (26 kB at 29 kB/s)
[windows-jdk9] [INFO] ------------------------------------------------------------------------
[windows-jdk9] [INFO] BUILD SUCCESS
[windows-jdk9] [INFO] ------------------------------------------------------------------------
[windows-jdk9] [INFO] Total time: 02:42 min
[windows-jdk9] [INFO] Finished at: 2018-09-14T06:50:22-07:00
[windows-jdk9] [INFO] Final Memory: 33M/109M
[windows-jdk9] [INFO] ------------------------------------------------------------------------
[windows-jdk9] [WARNING] The requested profile "run-its" could not be activated because it does not exist.
[windows-jdk9] [INFO] [jenkins-event-spy] Generated F:\jenkins\jenkins-slave\workspace\ect_Java_8_type_annotations-6YYONV5DHF2W5ZWSYDAVULES2GVBCB4HSDLCM5SIO3LMNDK77BNQ@tmp\withMaven9561ac72\maven-spy-20180914-064739-6573777607235915941793.log
[Pipeline] [windows-jdk9] }
[Pipeline] [windows-jdk9] // dir
[Pipeline] [windows-jdk9] }
[windows-jdk9] [withMaven] junitPublisher - Archive test results for Maven artifact org.apache.maven.shared:maven-dependency-analyzer:1.8-SNAPSHOT generated by maven-surefire-plugin:test (default-test): m\target\surefire-reports\*.xml
[windows-jdk9] Recording test results
[windows-jdk9] [withMaven] junitPublisher - Archive test results for Maven artifact org.apache.maven.shared.dependency-analyzer.tests:jarWithXercesDependencies:1.0 generated by maven-surefire-plugin:test (default-test): m\target\test-classes\jarWithXmlTransitiveDependency\target\surefire-reports\*.xml
[windows-jdk9] Recording test results
[windows-jdk9] None of the test reports contained any result
[windows-jdk9] [withMaven] junitPublisher - Archive test results for Maven artifact org.apache.maven.shared.dependency-analyzer.tests:jarWithNoDependencies:1.0 generated by maven-surefire-plugin:test (default-test): m\target\test-classes\jarWithNoDependencies\target\surefire-reports\*.xml
[windows-jdk9] Recording test results
[windows-jdk9] None of the test reports contained any result
[windows-jdk9] [withMaven] junitPublisher - Archive test results for Maven artifact org.apache.maven.shared.dependency-analyzer.tests:jarWithTestDependency1:1.0 generated by maven-surefire-plugin:test (default-test): m\target\test-classes\jarWithTestDependency\project1\target\surefire-reports\*.xml
[windows-jdk9] Recording test results
[windows-jdk9] None of the test reports contained any result
[windows-jdk9] [withMaven] junitPublisher - Archive test results for Maven artifact org.apache.maven.shared.dependency-analyzer.tests:jarWithTestDependency2:1.0 generated by maven-surefire-plugin:test (default-test): m\target\test-classes\jarWithTestDependency\project2\target\surefire-reports\*.xml
[windows-jdk9] Recording test results
[windows-jdk9] None of the test reports contained any result
[windows-jdk9] [withMaven] junitPublisher - Archive test results for Maven artifact org.apache.maven.shared.dependency-analyzer.tests:jarWithTestDependency1:1.0 generated by maven-surefire-plugin:test (default-test): m\target\test-classes\jarWithTestDependency\project1\target\surefire-reports\*.xml
[windows-jdk9] Recording test results
[windows-jdk9] None of the test reports contained any result
[windows-jdk9] [withMaven] junitPublisher - Archive test results for Maven artifact org.apache.maven.shared.dependency-analyzer.tests:jarWithTestDependency2:1.0 generated by maven-surefire-plugin:test (default-test): m\target\test-classes\jarWithTestDependency\project2\target\surefire-reports\*.xml
[windows-jdk9] Recording test results
[windows-jdk9] None of the test reports contained any result
[windows-jdk9] [withMaven] junitPublisher - Archive test results for Maven artifact org.apache.maven.shared.dependency-analyzer.tests:jarWithCompileDependency1:1.0 generated by maven-surefire-plugin:test (default-test): m\target\test-classes\jarWithCompileDependency\project1\target\surefire-reports\*.xml
[windows-jdk9] Recording test results
[windows-jdk9] None of the test reports contained any result
[windows-jdk9] [withMaven] junitPublisher - Archive test results for Maven artifact org.apache.maven.shared.dependency-analyzer.tests:jarWithCompileDependency2:1.0 generated by maven-surefire-plugin:test (default-test): m\target\test-classes\jarWithCompileDependency\project2\target\surefire-reports\*.xml
[windows-jdk9] Recording test results
[windows-jdk9] None of the test reports contained any result
[windows-jdk9] [withMaven] junitPublisher - Archive test results for Maven artifact org.apache.maven.shared.dependency-analyzer.tests:java8methodreferences:1.0 generated by maven-surefire-plugin:test (default-test): m\target\test-classes\java8methodRefs\target\surefire-reports\*.xml
[windows-jdk9] Recording test results
[windows-jdk9] None of the test reports contained any result
[windows-jdk9] [withMaven] junitPublisher - Archive test results for Maven artifact org.apache.maven.shared.dependency-analyzer.tests:inlinedStaticReference:1.0 generated by maven-surefire-plugin:test (default-test): m\target\test-classes\inlinedStaticReference\target\surefire-reports\*.xml
[windows-jdk9] Recording test results
[windows-jdk9] None of the test reports contained any result
[windows-jdk9] [withMaven] junitPublisher - Archive test results for Maven artifact org.apache.maven.shared.dependency-analyzer.tests:typeUseAnnotationDependencyAnnotation:1.0 generated by maven-surefire-plugin:test (default-test): m\target\test-classes\typeUseAnnotationDependency\annotation\target\surefire-reports\*.xml
[windows-jdk9] Recording test results
[windows-jdk9] None of the test reports contained any result
[windows-jdk9] [withMaven] junitPublisher - Archive test results for Maven artifact org.apache.maven.shared.dependency-analyzer.tests:typeUseAnnotationDependencyUsage:1.0 generated by maven-surefire-plugin:test (default-test): m\target\test-classes\typeUseAnnotationDependency\usage\target\surefire-reports\*.xml
[windows-jdk9] Recording test results
[windows-jdk9] None of the test reports contained any result
[windows-jdk9] [withMaven] junitPublisher - Archive test results for Maven artifact org.apache.maven.its.dependency:test-module1:1.0 generated by maven-surefire-plugin:test (default-test): m\target\test-classes\multimoduleProject\module1\target\surefire-reports\*.xml
[windows-jdk9] Recording test results
[windows-jdk9] None of the test reports contained any result
[windows-jdk9] [withMaven] junitPublisher - Archive test results for Maven artifact org.apache.maven.its.dependency:test-module2:1.0 generated by maven-surefire-plugin:test (default-test): m\target\test-classes\multimoduleProject\module2\target\surefire-reports\*.xml
[windows-jdk9] Recording test results
[windows-jdk9] None of the test reports contained any result
[Pipeline] [windows-jdk9] // withMaven
[Pipeline] [windows-jdk9] cleanWs
[windows-jdk9] [WS-CLEANUP] Deleting project workspace...[WS-CLEANUP] done
[Pipeline] [windows-jdk9] }
[Pipeline] [windows-jdk9] // stage
[Pipeline] [windows-jdk9] }
[Pipeline] [windows-jdk9] // node
[Pipeline] [windows-jdk9] }
[Pipeline] // parallel
[Pipeline] stage
[Pipeline] { (Notifications)
[Pipeline] echo
Build result: UNSTABLE
[Pipeline] jiraIssueSelector
[Pipeline] emailext