Build unstable in Jenkins: Maven TLP » maven-changes-plugin » sslv2 #2

classic Classic list List threaded Threaded
1 message Options
Reply | Threaded
Open this post in threaded view
|

Build unstable in Jenkins: Maven TLP » maven-changes-plugin » sslv2 #2

Apache Jenkins Server-2
See https://builds.apache.org/job/maven-box/job/maven-changes-plugin/job/sslv2/2/

Changes:

* Upgrade httpcomponents to 4.2.3 (TLS)

8 tests failed.
FAILED:  org.apache.maven.plugins.jira.JiraUnicodeTestCase.linux-jdk7-m3.2.x_build / Build linux-jdk7-m3.2.x_build / testUnicodeReport

Error Message:
Couldn't resolve the skin.

Stack Trace:
org.apache.maven.plugin.MojoExecutionException: Couldn't resolve the skin.
        at org.apache.maven.plugins.jira.JiraUnicodeTestCase.testUnicodeReport(JiraUnicodeTestCase.java:75)
Caused by: org.apache.maven.shared.artifact.resolve.ArtifactResolverException: Failed to read artifact descriptor for org.apache.maven.skins:maven-default-skin:jar:1.0
        at org.apache.maven.plugins.jira.JiraUnicodeTestCase.testUnicodeReport(JiraUnicodeTestCase.java:75)
Caused by: org.sonatype.aether.resolution.ArtifactDescriptorException: Failed to read artifact descriptor for org.apache.maven.skins:maven-default-skin:jar:1.0
        at org.apache.maven.plugins.jira.JiraUnicodeTestCase.testUnicodeReport(JiraUnicodeTestCase.java:75)
Caused by: org.sonatype.aether.resolution.ArtifactResolutionException: Could not transfer artifact org.apache.maven.skins:maven-default-skin:pom:1.0 from central (https://repo.maven.apache.org/maven2): Received fatal alert: protocol_version
        at org.apache.maven.plugins.jira.JiraUnicodeTestCase.testUnicodeReport(JiraUnicodeTestCase.java:75)
Caused by: org.sonatype.aether.transfer.ArtifactTransferException: Could not transfer artifact org.apache.maven.skins:maven-default-skin:pom:1.0 from central (https://repo.maven.apache.org/maven2): Received fatal alert: protocol_version
        at org.apache.maven.plugins.jira.JiraUnicodeTestCase.testUnicodeReport(JiraUnicodeTestCase.java:75)
Caused by: org.apache.maven.wagon.TransferFailedException: Received fatal alert: protocol_version
Caused by: javax.net.ssl.SSLException: Received fatal alert: protocol_version


FAILED:  org.apache.maven.plugins.jira.JiraUnicodeTestCase.windows-jdk7-m3.5.x_build / Build windows-jdk7-m3.5.x_build / testUnicodeReport

Error Message:
Couldn't resolve the skin.

Stack Trace:
org.apache.maven.plugin.MojoExecutionException: Couldn't resolve the skin.
        at org.apache.maven.plugins.jira.JiraUnicodeTestCase.testUnicodeReport(JiraUnicodeTestCase.java:75)
Caused by: org.apache.maven.shared.artifact.resolve.ArtifactResolverException: Failed to read artifact descriptor for org.apache.maven.skins:maven-default-skin:jar:1.0
        at org.apache.maven.plugins.jira.JiraUnicodeTestCase.testUnicodeReport(JiraUnicodeTestCase.java:75)
Caused by: org.sonatype.aether.resolution.ArtifactDescriptorException: Failed to read artifact descriptor for org.apache.maven.skins:maven-default-skin:jar:1.0
        at org.apache.maven.plugins.jira.JiraUnicodeTestCase.testUnicodeReport(JiraUnicodeTestCase.java:75)
Caused by: org.sonatype.aether.resolution.ArtifactResolutionException: Could not transfer artifact org.apache.maven.skins:maven-default-skin:pom:1.0 from central (https://repo.maven.apache.org/maven2): Received fatal alert: protocol_version
        at org.apache.maven.plugins.jira.JiraUnicodeTestCase.testUnicodeReport(JiraUnicodeTestCase.java:75)
Caused by: org.sonatype.aether.transfer.ArtifactTransferException: Could not transfer artifact org.apache.maven.skins:maven-default-skin:pom:1.0 from central (https://repo.maven.apache.org/maven2): Received fatal alert: protocol_version
        at org.apache.maven.plugins.jira.JiraUnicodeTestCase.testUnicodeReport(JiraUnicodeTestCase.java:75)
Caused by: org.apache.maven.wagon.TransferFailedException: Received fatal alert: protocol_version
Caused by: javax.net.ssl.SSLException: Received fatal alert: protocol_version


FAILED:  org.apache.maven.plugins.jira.JiraUnicodeTestCase.windows-jdk7-m3.3.x_build / Build windows-jdk7-m3.3.x_build / testUnicodeReport

Error Message:
Couldn't resolve the skin.

Stack Trace:
org.apache.maven.plugin.MojoExecutionException: Couldn't resolve the skin.
        at org.apache.maven.plugins.jira.JiraUnicodeTestCase.testUnicodeReport(JiraUnicodeTestCase.java:75)
Caused by: org.apache.maven.shared.artifact.resolve.ArtifactResolverException: Failed to read artifact descriptor for org.apache.maven.skins:maven-default-skin:jar:1.0
        at org.apache.maven.plugins.jira.JiraUnicodeTestCase.testUnicodeReport(JiraUnicodeTestCase.java:75)
Caused by: org.sonatype.aether.resolution.ArtifactDescriptorException: Failed to read artifact descriptor for org.apache.maven.skins:maven-default-skin:jar:1.0
        at org.apache.maven.plugins.jira.JiraUnicodeTestCase.testUnicodeReport(JiraUnicodeTestCase.java:75)
Caused by: org.sonatype.aether.resolution.ArtifactResolutionException: Could not transfer artifact org.apache.maven.skins:maven-default-skin:pom:1.0 from central (https://repo.maven.apache.org/maven2): Received fatal alert: protocol_version
        at org.apache.maven.plugins.jira.JiraUnicodeTestCase.testUnicodeReport(JiraUnicodeTestCase.java:75)
Caused by: org.sonatype.aether.transfer.ArtifactTransferException: Could not transfer artifact org.apache.maven.skins:maven-default-skin:pom:1.0 from central (https://repo.maven.apache.org/maven2): Received fatal alert: protocol_version
        at org.apache.maven.plugins.jira.JiraUnicodeTestCase.testUnicodeReport(JiraUnicodeTestCase.java:75)
Caused by: org.apache.maven.wagon.TransferFailedException: Received fatal alert: protocol_version
Caused by: javax.net.ssl.SSLException: Received fatal alert: protocol_version


FAILED:  org.apache.maven.plugins.jira.JiraUnicodeTestCase.windows-jdk7-m3.2.x_build / Build windows-jdk7-m3.2.x_build / testUnicodeReport

Error Message:
Couldn't resolve the skin.

Stack Trace:
org.apache.maven.plugin.MojoExecutionException: Couldn't resolve the skin.
        at org.apache.maven.plugins.jira.JiraUnicodeTestCase.testUnicodeReport(JiraUnicodeTestCase.java:75)
Caused by: org.apache.maven.shared.artifact.resolve.ArtifactResolverException: Failed to read artifact descriptor for org.apache.maven.skins:maven-default-skin:jar:1.0
        at org.apache.maven.plugins.jira.JiraUnicodeTestCase.testUnicodeReport(JiraUnicodeTestCase.java:75)
Caused by: org.sonatype.aether.resolution.ArtifactDescriptorException: Failed to read artifact descriptor for org.apache.maven.skins:maven-default-skin:jar:1.0
        at org.apache.maven.plugins.jira.JiraUnicodeTestCase.testUnicodeReport(JiraUnicodeTestCase.java:75)
Caused by: org.sonatype.aether.resolution.ArtifactResolutionException: Could not transfer artifact org.apache.maven.skins:maven-default-skin:pom:1.0 from central (https://repo.maven.apache.org/maven2): Received fatal alert: protocol_version
        at org.apache.maven.plugins.jira.JiraUnicodeTestCase.testUnicodeReport(JiraUnicodeTestCase.java:75)
Caused by: org.sonatype.aether.transfer.ArtifactTransferException: Could not transfer artifact org.apache.maven.skins:maven-default-skin:pom:1.0 from central (https://repo.maven.apache.org/maven2): Received fatal alert: protocol_version
        at org.apache.maven.plugins.jira.JiraUnicodeTestCase.testUnicodeReport(JiraUnicodeTestCase.java:75)
Caused by: org.apache.maven.wagon.TransferFailedException: Received fatal alert: protocol_version
Caused by: javax.net.ssl.SSLException: Received fatal alert: protocol_version


FAILED:  org.apache.maven.plugins.jira.JiraUnicodeTestCase.windows-jdk7-m3.6.x_build / Build windows-jdk7-m3.6.x_build / testUnicodeReport

Error Message:
Couldn't resolve the skin.

Stack Trace:
org.apache.maven.plugin.MojoExecutionException: Couldn't resolve the skin.
        at org.apache.maven.plugins.jira.JiraUnicodeTestCase.testUnicodeReport(JiraUnicodeTestCase.java:75)
Caused by: org.apache.maven.shared.artifact.resolve.ArtifactResolverException: Failed to read artifact descriptor for org.apache.maven.skins:maven-default-skin:jar:1.0
        at org.apache.maven.plugins.jira.JiraUnicodeTestCase.testUnicodeReport(JiraUnicodeTestCase.java:75)
Caused by: org.sonatype.aether.resolution.ArtifactDescriptorException: Failed to read artifact descriptor for org.apache.maven.skins:maven-default-skin:jar:1.0
        at org.apache.maven.plugins.jira.JiraUnicodeTestCase.testUnicodeReport(JiraUnicodeTestCase.java:75)
Caused by: org.sonatype.aether.resolution.ArtifactResolutionException: Could not transfer artifact org.apache.maven.skins:maven-default-skin:pom:1.0 from central (https://repo.maven.apache.org/maven2): Received fatal alert: protocol_version
        at org.apache.maven.plugins.jira.JiraUnicodeTestCase.testUnicodeReport(JiraUnicodeTestCase.java:75)
Caused by: org.sonatype.aether.transfer.ArtifactTransferException: Could not transfer artifact org.apache.maven.skins:maven-default-skin:pom:1.0 from central (https://repo.maven.apache.org/maven2): Received fatal alert: protocol_version
        at org.apache.maven.plugins.jira.JiraUnicodeTestCase.testUnicodeReport(JiraUnicodeTestCase.java:75)
Caused by: org.apache.maven.wagon.TransferFailedException: Received fatal alert: protocol_version
Caused by: javax.net.ssl.SSLException: Received fatal alert: protocol_version


FAILED:  org.apache.maven.plugins.jira.JiraUnicodeTestCase.linux-jdk7-m3.5.x_build / Build linux-jdk7-m3.5.x_build / testUnicodeReport

Error Message:
Couldn't resolve the skin.

Stack Trace:
org.apache.maven.plugin.MojoExecutionException: Couldn't resolve the skin.
        at org.apache.maven.plugins.jira.JiraUnicodeTestCase.testUnicodeReport(JiraUnicodeTestCase.java:75)
Caused by: org.apache.maven.shared.artifact.resolve.ArtifactResolverException: Failed to read artifact descriptor for org.apache.maven.skins:maven-default-skin:jar:1.0
        at org.apache.maven.plugins.jira.JiraUnicodeTestCase.testUnicodeReport(JiraUnicodeTestCase.java:75)
Caused by: org.sonatype.aether.resolution.ArtifactDescriptorException: Failed to read artifact descriptor for org.apache.maven.skins:maven-default-skin:jar:1.0
        at org.apache.maven.plugins.jira.JiraUnicodeTestCase.testUnicodeReport(JiraUnicodeTestCase.java:75)
Caused by: org.sonatype.aether.resolution.ArtifactResolutionException: Could not transfer artifact org.apache.maven.skins:maven-default-skin:pom:1.0 from central (https://repo.maven.apache.org/maven2): Received fatal alert: protocol_version
        at org.apache.maven.plugins.jira.JiraUnicodeTestCase.testUnicodeReport(JiraUnicodeTestCase.java:75)
Caused by: org.sonatype.aether.transfer.ArtifactTransferException: Could not transfer artifact org.apache.maven.skins:maven-default-skin:pom:1.0 from central (https://repo.maven.apache.org/maven2): Received fatal alert: protocol_version
        at org.apache.maven.plugins.jira.JiraUnicodeTestCase.testUnicodeReport(JiraUnicodeTestCase.java:75)
Caused by: org.apache.maven.wagon.TransferFailedException: Received fatal alert: protocol_version
Caused by: javax.net.ssl.SSLException: Received fatal alert: protocol_version


FAILED:  org.apache.maven.plugins.jira.JiraUnicodeTestCase.linux-jdk7-m3.3.x_build / Build linux-jdk7-m3.3.x_build / testUnicodeReport

Error Message:
Couldn't resolve the skin.

Stack Trace:
org.apache.maven.plugin.MojoExecutionException: Couldn't resolve the skin.
        at org.apache.maven.plugins.jira.JiraUnicodeTestCase.testUnicodeReport(JiraUnicodeTestCase.java:75)
Caused by: org.apache.maven.shared.artifact.resolve.ArtifactResolverException: Failed to read artifact descriptor for org.apache.maven.skins:maven-default-skin:jar:1.0
        at org.apache.maven.plugins.jira.JiraUnicodeTestCase.testUnicodeReport(JiraUnicodeTestCase.java:75)
Caused by: org.sonatype.aether.resolution.ArtifactDescriptorException: Failed to read artifact descriptor for org.apache.maven.skins:maven-default-skin:jar:1.0
        at org.apache.maven.plugins.jira.JiraUnicodeTestCase.testUnicodeReport(JiraUnicodeTestCase.java:75)
Caused by: org.sonatype.aether.resolution.ArtifactResolutionException: Could not transfer artifact org.apache.maven.skins:maven-default-skin:pom:1.0 from central (https://repo.maven.apache.org/maven2): Received fatal alert: protocol_version
        at org.apache.maven.plugins.jira.JiraUnicodeTestCase.testUnicodeReport(JiraUnicodeTestCase.java:75)
Caused by: org.sonatype.aether.transfer.ArtifactTransferException: Could not transfer artifact org.apache.maven.skins:maven-default-skin:pom:1.0 from central (https://repo.maven.apache.org/maven2): Received fatal alert: protocol_version
        at org.apache.maven.plugins.jira.JiraUnicodeTestCase.testUnicodeReport(JiraUnicodeTestCase.java:75)
Caused by: org.apache.maven.wagon.TransferFailedException: Received fatal alert: protocol_version
Caused by: javax.net.ssl.SSLException: Received fatal alert: protocol_version


FAILED:  org.apache.maven.plugins.jira.JiraUnicodeTestCase.linux-jdk7-m3.6.x_build / Build linux-jdk7-m3.6.x_build / testUnicodeReport

Error Message:
Couldn't resolve the skin.

Stack Trace:
org.apache.maven.plugin.MojoExecutionException: Couldn't resolve the skin.
        at org.apache.maven.plugins.jira.JiraUnicodeTestCase.testUnicodeReport(JiraUnicodeTestCase.java:75)
Caused by: org.apache.maven.shared.artifact.resolve.ArtifactResolverException: Failed to read artifact descriptor for org.apache.maven.skins:maven-default-skin:jar:1.0
        at org.apache.maven.plugins.jira.JiraUnicodeTestCase.testUnicodeReport(JiraUnicodeTestCase.java:75)
Caused by: org.sonatype.aether.resolution.ArtifactDescriptorException: Failed to read artifact descriptor for org.apache.maven.skins:maven-default-skin:jar:1.0
        at org.apache.maven.plugins.jira.JiraUnicodeTestCase.testUnicodeReport(JiraUnicodeTestCase.java:75)
Caused by: org.sonatype.aether.resolution.ArtifactResolutionException: Could not transfer artifact org.apache.maven.skins:maven-default-skin:pom:1.0 from central (https://repo.maven.apache.org/maven2): Received fatal alert: protocol_version
        at org.apache.maven.plugins.jira.JiraUnicodeTestCase.testUnicodeReport(JiraUnicodeTestCase.java:75)
Caused by: org.sonatype.aether.transfer.ArtifactTransferException: Could not transfer artifact org.apache.maven.skins:maven-default-skin:pom:1.0 from central (https://repo.maven.apache.org/maven2): Received fatal alert: protocol_version
        at org.apache.maven.plugins.jira.JiraUnicodeTestCase.testUnicodeReport(JiraUnicodeTestCase.java:75)
Caused by: org.apache.maven.wagon.TransferFailedException: Received fatal alert: protocol_version
Caused by: javax.net.ssl.SSLException: Received fatal alert: protocol_version




Build log:
[...truncated 5180 lines...]
[WS-CLEANUP] Deleting project workspace...
[WS-CLEANUP] Deferred wipeout is used...
[withMaven] invokerPublisher - Archive invoker results for Maven artifact MavenArtifact{org.apache.maven.plugins:maven-changes-plugin:maven-plugin:3.0.0-SNAPSHOT(version: 3.0.0-SNAPSHOT, snapshot:false) } generated by PluginInvocation{org.apache.maven.plugins:maven-invoker-plugin:3.1.0@integration-test  integration-test}: linux-jdk8-m3.6.x_build/target/invoker-reports/*.xml
[withMaven] openTasksPublisher - Scan Tasks for Maven artifact org.apache.maven.plugins:maven-changes-plugin:maven-plugin:3.0.0-SNAPSHOT in source directory windows-jdk11-m3.6.x_build\src\main\java
[TASKS] Scanning folder 'f:\jenkins\jenkins-slave\workspace\n-box_maven-changes-plugin_sslv2@2@2' for files matching the pattern 'windows-jdk11-m3.6.x_build\src\main\java\**\*' - excludes: null
[TASKS] Found 48 files to scan for tasks
[TASKS] Found 4 open tasks.
Skipping warnings blame since pipelines do not have an SCM link.%n
[TASKS] Computing warning deltas based on reference build #1
[withMaven] invokerPublisher - Archive invoker results for Maven artifact MavenArtifact{org.apache.maven.plugins:maven-changes-plugin:maven-plugin:3.0.0-SNAPSHOT(version: 3.0.0-SNAPSHOT, snapshot:false) } generated by PluginInvocation{org.apache.maven.plugins:maven-invoker-plugin:3.1.0@integration-test  integration-test}: windows-jdk11-m3.6.x_build\target\invoker-reports\*.xml
[WS-CLEANUP] done
[withMaven] openTasksPublisher - Scan Tasks for Maven artifact org.apache.maven.plugins:maven-changes-plugin:maven-plugin:3.0.0-SNAPSHOT in source directory windows-jdk8-m3.6.x_build\src\main\java
[TASKS] Scanning folder 'f:\jenkins\jenkins-slave\workspace\n-box_maven-changes-plugin_sslv2@3' for files matching the pattern 'windows-jdk8-m3.6.x_build\src\main\java\**\*' - excludes: null
[TASKS] Found 48 files to scan for tasks
[TASKS] Found 4 open tasks.
Skipping warnings blame since pipelines do not have an SCM link.%n
[TASKS] Computing warning deltas based on reference build #1
[withMaven] invokerPublisher - Archive invoker results for Maven artifact MavenArtifact{org.apache.maven.plugins:maven-changes-plugin:maven-plugin:3.0.0-SNAPSHOT(version: 3.0.0-SNAPSHOT, snapshot:false) } generated by PluginInvocation{org.apache.maven.plugins:maven-invoker-plugin:3.1.0@integration-test  integration-test}: windows-jdk8-m3.6.x_build\target\invoker-reports\*.xml
[withMaven] openTasksPublisher - Scan Tasks for Maven artifact org.apache.maven.plugins:maven-changes-plugin:maven-plugin:3.0.0-SNAPSHOT in source directory windows-jdk7-m3.3.x_build\src\main\java
[TASKS] Scanning folder 'f:\jenkins\jenkins-slave\workspace\n-box_maven-changes-plugin_sslv2@2@2' for files matching the pattern 'windows-jdk7-m3.3.x_build\src\main\java\**\*' - excludes: null
[TASKS] Found 48 files to scan for tasks
[TASKS] Found 4 open tasks.
Skipping warnings blame since pipelines do not have an SCM link.%n
[TASKS] Computing warning deltas based on reference build #1
[withMaven] invokerPublisher - Archive invoker results for Maven artifact MavenArtifact{org.apache.maven.plugins:maven-changes-plugin:maven-plugin:3.0.0-SNAPSHOT(version: 3.0.0-SNAPSHOT, snapshot:false) } generated by PluginInvocation{org.apache.maven.plugins:maven-invoker-plugin:3.1.0@integration-test  integration-test}: windows-jdk7-m3.3.x_build\target\invoker-reports\*.xml
[withMaven] openTasksPublisher - Scan Tasks for Maven artifact org.apache.maven.plugins:maven-changes-plugin:maven-plugin:3.0.0-SNAPSHOT in source directory windows-jdk7-m3.2.x_build\src\main\java
[TASKS] Scanning folder 'f:\jenkins\jenkins-slave\workspace\n-box_maven-changes-plugin_sslv2@3' for files matching the pattern 'windows-jdk7-m3.2.x_build\src\main\java\**\*' - excludes: null
[TASKS] Found 48 files to scan for tasks
[TASKS] Found 4 open tasks.
Skipping warnings blame since pipelines do not have an SCM link.%n
[TASKS] Computing warning deltas based on reference build #1
[withMaven] invokerPublisher - Archive invoker results for Maven artifact MavenArtifact{org.apache.maven.plugins:maven-changes-plugin:maven-plugin:3.0.0-SNAPSHOT(version: 3.0.0-SNAPSHOT, snapshot:false) } generated by PluginInvocation{org.apache.maven.plugins:maven-invoker-plugin:3.1.0@integration-test  integration-test}: windows-jdk7-m3.2.x_build\target\invoker-reports\*.xml
[withMaven] openTasksPublisher - Scan Tasks for Maven artifact org.apache.maven.plugins:maven-changes-plugin:maven-plugin:3.0.0-SNAPSHOT in source directory windows-jdk7-m3.6.x_build\src\main\java
[Pipeline] }
[Pipeline] // stage
[Pipeline] }
[Pipeline] // ws
[Pipeline] }
[TASKS] Scanning folder 'f:\jenkins\jenkins-slave\workspace\n-box_maven-changes-plugin_sslv2@2@2' for files matching the pattern 'windows-jdk7-m3.6.x_build\src\main\java\**\*' - excludes: null
[TASKS] Found 48 files to scan for tasks
[TASKS] Found 4 open tasks.
Skipping warnings blame since pipelines do not have an SCM link.%n
[TASKS] Computing warning deltas based on reference build #1
[Pipeline] // node
[Pipeline] }
[withMaven] invokerPublisher - Archive invoker results for Maven artifact MavenArtifact{org.apache.maven.plugins:maven-changes-plugin:maven-plugin:3.0.0-SNAPSHOT(version: 3.0.0-SNAPSHOT, snapshot:false) } generated by PluginInvocation{org.apache.maven.plugins:maven-invoker-plugin:3.1.0@integration-test  integration-test}: windows-jdk7-m3.6.x_build\target\invoker-reports\*.xml
[withMaven] artifactsPublisher - Archive artifact linux-jdk7-m3.5.x_build/pom.xml under org/apache/maven/plugins/maven-changes-plugin/3.0.0-SNAPSHOT/maven-changes-plugin-3.0.0-SNAPSHOT.pom
[withMaven] artifactsPublisher - Archive artifact linux-jdk7-m3.3.x_build/pom.xml under org/apache/maven/plugins/maven-changes-plugin/3.0.0-SNAPSHOT/maven-changes-plugin-3.0.0-SNAPSHOT.pom
[withMaven] Publishers: Generated Artifacts Publisher: 150 ms, Junit Publisher: 408 ms, Open Task Scanner Publisher: 126 ms, Invoker Publisher: 2508 ms, Pipeline Graph Publisher: 2 ms
[Pipeline] // withMaven
[Pipeline] cleanWs
[WS-CLEANUP] Deleting project workspace...
[WS-CLEANUP] Deferred wipeout is used...
[withMaven] artifactsPublisher - Archive artifact linux-jdk7-m3.5.x_build/target/maven-changes-plugin-3.0.0-SNAPSHOT.jar under org/apache/maven/plugins/maven-changes-plugin/3.0.0-SNAPSHOT/maven-changes-plugin-3.0.0-SNAPSHOT.jar
[withMaven] artifactsPublisher - Archive artifact linux-jdk7-m3.3.x_build/target/maven-changes-plugin-3.0.0-SNAPSHOT.jar under org/apache/maven/plugins/maven-changes-plugin/3.0.0-SNAPSHOT/maven-changes-plugin-3.0.0-SNAPSHOT.jar
[WS-CLEANUP] done
[Pipeline] }
[Pipeline] // stage
[Pipeline] }
[Pipeline] // ws
[Pipeline] }
[Pipeline] // node
[Pipeline] }
[INFO]
[INFO] --- maven-invoker-plugin:3.1.0:verify (integration-test) @ maven-changes-plugin ---
[INFO] -------------------------------------------------
[INFO] Build Summary:
[INFO]   Passed: 13, Failed: 0, Errors: 0, Skipped: 0
[INFO] -------------------------------------------------
[INFO] ------------------------------------------------------------------------
[INFO] BUILD SUCCESS
[INFO] ------------------------------------------------------------------------
[INFO] Total time:  02:55 min
[INFO] Finished at: 2020-02-10T00:24:08Z
[INFO] ------------------------------------------------------------------------
[INFO] [jenkins-event-spy] Generated /home/jenkins/jenkins-slave/workspace/n-box_maven-changes-plugin_sslv2@2@tmp/withMavenc8087c5b/maven-spy-20200210-002112-271889592546602853002.log
[withMaven] Publishers: Generated Artifacts Publisher: 151 ms, Junit Publisher: 753 ms, Open Task Scanner Publisher: 135 ms, Invoker Publisher: 3143 ms, Pipeline Graph Publisher: 1 ms
[Pipeline] // withMaven
[Pipeline] cleanWs
[WS-CLEANUP] Deleting project workspace...
[WS-CLEANUP] Deferred wipeout is used...
[WS-CLEANUP] done
[Pipeline] }
[Pipeline] // stage
[Pipeline] }
[withMaven] Publishers: Generated Artifacts Publisher: 1147 ms, Junit Publisher: 15610 ms, Open Task Scanner Publisher: 856 ms, Dependencies Fingerprint Publisher: 1 ms, Invoker Publisher: 58044 ms, Pipeline Graph Publisher: 1 ms
[Pipeline] // ws
[Pipeline] }
[Pipeline] // node
[Pipeline] }
[withMaven] junitPublisher - Archive test results for Maven artifact org.apache.maven.plugins:maven-changes-plugin:maven-plugin:3.0.0-SNAPSHOT generated by maven-surefire-plugin:test (default-test): linux-jdk7-m3.5.x_build/target/surefire-reports/*.xml
Recording test results
[withMaven] junitPublisher - Archive test results for Maven artifact org.apache.maven.plugins:maven-changes-plugin:maven-plugin:3.0.0-SNAPSHOT generated by maven-surefire-plugin:test (default-test): linux-jdk7-m3.3.x_build/target/surefire-reports/*.xml
Recording test results
[withMaven] Publishers: Generated Artifacts Publisher: 151 ms, Junit Publisher: 1643 ms, Open Task Scanner Publisher: 140 ms, Invoker Publisher: 2628 ms
[withMaven] Publishers: Generated Artifacts Publisher: 160 ms, Junit Publisher: 1157 ms, Open Task Scanner Publisher: 293 ms, Invoker Publisher: 2982 ms, Pipeline Graph Publisher: 1 ms
[Pipeline] // withMaven
[Pipeline] cleanWs
[Pipeline] // withMaven
[WS-CLEANUP] Deleting project workspace...
[WS-CLEANUP] Deferred wipeout is used...
[Pipeline] cleanWs
[WS-CLEANUP] Deleting project workspace...
[WS-CLEANUP] Deferred wipeout is used...
[WS-CLEANUP] done
[WS-CLEANUP] done
[Pipeline] }
[Pipeline] }
[withMaven] Publishers: Generated Artifacts Publisher: 147 ms, Junit Publisher: 2556 ms, Open Task Scanner Publisher: 158 ms, Invoker Publisher: 10610 ms, Pipeline Graph Publisher: 16 ms
[withMaven] Publishers: Generated Artifacts Publisher: 151 ms, Junit Publisher: 2111 ms, Open Task Scanner Publisher: 147 ms, Dependencies Fingerprint Publisher: 1 ms, Invoker Publisher: 11025 ms, Pipeline Graph Publisher: 16 ms
[Pipeline] // stage
[withMaven] openTasksPublisher - Scan Tasks for Maven artifact org.apache.maven.plugins:maven-changes-plugin:maven-plugin:3.0.0-SNAPSHOT in source directory linux-jdk7-m3.5.x_build/src/main/java
[TASKS] Scanning folder '/home/jenkins/jenkins-slave/workspace/n-box_maven-changes-plugin_sslv2@2' for files matching the pattern 'linux-jdk7-m3.5.x_build/src/main/java/**/*' - excludes: null
[TASKS] Found 48 files to scan for tasks
[TASKS] Found 4 open tasks.
Skipping warnings blame since pipelines do not have an SCM link.%n
[TASKS] Computing warning deltas based on reference build #1
[withMaven] invokerPublisher - Archive invoker results for Maven artifact MavenArtifact{org.apache.maven.plugins:maven-changes-plugin:maven-plugin:3.0.0-SNAPSHOT(version: 3.0.0-SNAPSHOT, snapshot:false) } generated by PluginInvocation{org.apache.maven.plugins:maven-invoker-plugin:3.1.0@integration-test  integration-test}: linux-jdk7-m3.5.x_build/target/invoker-reports/*.xml
[Pipeline] // stage
[Pipeline] // withMaven
[Pipeline] // withMaven
[Pipeline] // withMaven
[Pipeline] }
[Pipeline] }
[Pipeline] cleanWs
[Pipeline] cleanWs
[Pipeline] }
[WS-CLEANUP] Deleting project workspace...
[WS-CLEANUP] Deferred wipeout is used...
[Pipeline] cleanWs
[WS-CLEANUP] Deleting project workspace...
[WS-CLEANUP] Deferred wipeout is used...
[WS-CLEANUP] done
[WS-CLEANUP] done
[Pipeline] // ws
[Pipeline] // ws
[Pipeline] // dir
[Pipeline] }
[Pipeline] }
[Pipeline] }
[Pipeline] }
[Pipeline] }
[Pipeline] // node
[Pipeline] // node
[Pipeline] // stage
[Pipeline] // stage
[Pipeline] }
[Pipeline] }
[Pipeline] }
[Pipeline] }
[Pipeline] // ws
[withMaven] openTasksPublisher - Scan Tasks for Maven artifact org.apache.maven.plugins:maven-changes-plugin:maven-plugin:3.0.0-SNAPSHOT in source directory linux-jdk7-m3.3.x_build/src/main/java
[Pipeline] // ws
[Pipeline] }
[Pipeline] }
[Pipeline] // node
[Pipeline] // node
[Pipeline] }
[Pipeline] }
[TASKS] Scanning folder '/home/jenkins/jenkins-slave/workspace/n-box_maven-changes-plugin_sslv2@2' for files matching the pattern 'linux-jdk7-m3.3.x_build/src/main/java/**/*' - excludes: null
[TASKS] Found 48 files to scan for tasks
[TASKS] Found 4 open tasks.
Skipping warnings blame since pipelines do not have an SCM link.%n
[TASKS] Computing warning deltas based on reference build #1
[withMaven] invokerPublisher - Archive invoker results for Maven artifact MavenArtifact{org.apache.maven.plugins:maven-changes-plugin:maven-plugin:3.0.0-SNAPSHOT(version: 3.0.0-SNAPSHOT, snapshot:false) } generated by PluginInvocation{org.apache.maven.plugins:maven-invoker-plugin:3.1.0@integration-test  integration-test}: linux-jdk7-m3.3.x_build/target/invoker-reports/*.xml
[withMaven] artifactsPublisher - Archive artifact linux-jdk7-m3.6.x_build/pom.xml under org/apache/maven/plugins/maven-changes-plugin/3.0.0-SNAPSHOT/maven-changes-plugin-3.0.0-SNAPSHOT.pom
[withMaven] artifactsPublisher - Archive artifact linux-jdk7-m3.6.x_build/target/maven-changes-plugin-3.0.0-SNAPSHOT.jar under org/apache/maven/plugins/maven-changes-plugin/3.0.0-SNAPSHOT/maven-changes-plugin-3.0.0-SNAPSHOT.jar
[withMaven] junitPublisher - Archive test results for Maven artifact org.apache.maven.plugins:maven-changes-plugin:maven-plugin:3.0.0-SNAPSHOT generated by maven-surefire-plugin:test (default-test): linux-jdk7-m3.6.x_build/target/surefire-reports/*.xml
Recording test results
[withMaven] Publishers: Generated Artifacts Publisher: 3506 ms, Junit Publisher: 8936 ms, Open Task Scanner Publisher: 924 ms, Dependencies Fingerprint Publisher: 1 ms, Invoker Publisher: 19362 ms, Pipeline Graph Publisher: 1 ms
[withMaven] openTasksPublisher - Scan Tasks for Maven artifact org.apache.maven.plugins:maven-changes-plugin:maven-plugin:3.0.0-SNAPSHOT in source directory linux-jdk7-m3.6.x_build/src/main/java
[Pipeline] // withMaven
[Pipeline] cleanWs
[TASKS] Scanning folder '/home/jenkins/jenkins-slave/workspace/n-box_maven-changes-plugin_sslv2@2' for files matching the pattern 'linux-jdk7-m3.6.x_build/src/main/java/**/*' - excludes: null
[TASKS] Found 48 files to scan for tasks
[TASKS] Found 4 open tasks.
Skipping warnings blame since pipelines do not have an SCM link.%n
[TASKS] Computing warning deltas based on reference build #1
[WS-CLEANUP] Deleting project workspace...
[WS-CLEANUP] Deferred wipeout is used...
[WS-CLEANUP] Deleting project workspace...
[WS-CLEANUP] Deferred wipeout is used...
[WS-CLEANUP] done
[Pipeline] }
[Pipeline] // stage
[Pipeline] }
[Pipeline] // ws
[withMaven] Publishers: Generated Artifacts Publisher: 1142 ms, Junit Publisher: 70502 ms, Open Task Scanner Publisher: 913 ms, Dependencies Fingerprint Publisher: 1 ms, Invoker Publisher: 12545 ms, Pipeline Graph Publisher: 1 ms
[Pipeline] }
[withMaven] invokerPublisher - Archive invoker results for Maven artifact MavenArtifact{org.apache.maven.plugins:maven-changes-plugin:maven-plugin:3.0.0-SNAPSHOT(version: 3.0.0-SNAPSHOT, snapshot:false) } generated by PluginInvocation{org.apache.maven.plugins:maven-invoker-plugin:3.1.0@integration-test  integration-test}: linux-jdk7-m3.6.x_build/target/invoker-reports/*.xml
[Pipeline] // node
[Pipeline] }
[WS-CLEANUP] done
[Pipeline] }
[Pipeline] // stage
[Pipeline] }
[Pipeline] // ws
[Pipeline] }
[Pipeline] // withMaven
[Pipeline] // node
[Pipeline] }
[Pipeline] cleanWs
[WS-CLEANUP] Deleting project workspace...
[WS-CLEANUP] Deferred wipeout is used...
[WS-CLEANUP] done
[Pipeline] }
[Pipeline] // stage
[Pipeline] }
[Pipeline] // ws
[Pipeline] }
[Pipeline] // node
[Pipeline] }
[withMaven] Publishers: Generated Artifacts Publisher: 3786 ms, Junit Publisher: 17654 ms, Open Task Scanner Publisher: 876 ms, Dependencies Fingerprint Publisher: 1 ms, Invoker Publisher: 13605 ms, Pipeline Graph Publisher: 1 ms
[Pipeline] // withMaven
[Pipeline] cleanWs
[WS-CLEANUP] Deleting project workspace...
[WS-CLEANUP] Deferred wipeout is used...
[WS-CLEANUP] done
[Pipeline] }
[Pipeline] // stage
[Pipeline] }
[Pipeline] // ws
[Pipeline] }
[Pipeline] // node
[Pipeline] }
[withMaven] Publishers: Generated Artifacts Publisher: 1318 ms, Junit Publisher: 9482 ms, Open Task Scanner Publisher: 911 ms, Dependencies Fingerprint Publisher: 1 ms, Invoker Publisher: 13395 ms, Pipeline Graph Publisher: 1 ms
[Pipeline] // withMaven
[Pipeline] cleanWs
[WS-CLEANUP] Deleting project workspace...
[WS-CLEANUP] Deferred wipeout is used...
[WS-CLEANUP] done
[Pipeline] }
[Pipeline] // stage
[Pipeline] }
[Pipeline] // ws
[Pipeline] }
[Pipeline] // node
[Pipeline] }
[Pipeline] // parallel
[Pipeline] stage
[Pipeline] { (Notifications)
[Pipeline] echo
Build result: UNSTABLE
[Pipeline] jiraIssueSelector
[Pipeline] echo
The authors of changes [slachiewicz].
[Pipeline] echo
Sending email ...
[Pipeline] emailext