Build unstable in Jenkins: Maven TLP » maven-changes-plugin » ssl #5

classic Classic list List threaded Threaded
1 message Options
Reply | Threaded
Open this post in threaded view
|

Build unstable in Jenkins: Maven TLP » maven-changes-plugin » ssl #5

Apache Jenkins Server-2
See https://builds.apache.org/job/maven-box/job/maven-changes-plugin/job/ssl/5/

Changes:

* and http-client

8 tests failed.
FAILED:  org.apache.maven.plugins.jira.JiraUnicodeTestCase.windows-jdk7-m3.3.x_build / Build windows-jdk7-m3.3.x_build / testUnicodeReport

Error Message:
Couldn't resolve the skin.

Stack Trace:
org.apache.maven.plugin.MojoExecutionException: Couldn't resolve the skin.
        at org.apache.maven.plugins.jira.JiraUnicodeTestCase.testUnicodeReport(JiraUnicodeTestCase.java:75)
Caused by: org.apache.maven.shared.transfer.artifact.resolve.ArtifactResolverException: Failed to read artifact descriptor for org.apache.maven.skins:maven-default-skin:jar:1.0
        at org.apache.maven.plugins.jira.JiraUnicodeTestCase.testUnicodeReport(JiraUnicodeTestCase.java:75)
Caused by: org.sonatype.aether.resolution.ArtifactDescriptorException: Failed to read artifact descriptor for org.apache.maven.skins:maven-default-skin:jar:1.0
        at org.apache.maven.plugins.jira.JiraUnicodeTestCase.testUnicodeReport(JiraUnicodeTestCase.java:75)
Caused by: org.sonatype.aether.resolution.ArtifactResolutionException: Could not transfer artifact org.apache.maven.skins:maven-default-skin:pom:1.0 from/to central (https://repo.maven.apache.org/maven2): Received fatal alert: protocol_version
        at org.apache.maven.plugins.jira.JiraUnicodeTestCase.testUnicodeReport(JiraUnicodeTestCase.java:75)
Caused by: org.sonatype.aether.transfer.ArtifactTransferException: Could not transfer artifact org.apache.maven.skins:maven-default-skin:pom:1.0 from/to central (https://repo.maven.apache.org/maven2): Received fatal alert: protocol_version
Caused by: org.apache.maven.wagon.TransferFailedException: Received fatal alert: protocol_version
Caused by: javax.net.ssl.SSLException: Received fatal alert: protocol_version


FAILED:  org.apache.maven.plugins.jira.JiraUnicodeTestCase.linux-jdk7-m3.3.x_build / Build linux-jdk7-m3.3.x_build / testUnicodeReport

Error Message:
Couldn't resolve the skin.

Stack Trace:
org.apache.maven.plugin.MojoExecutionException: Couldn't resolve the skin.
        at org.apache.maven.plugins.jira.JiraUnicodeTestCase.testUnicodeReport(JiraUnicodeTestCase.java:75)
Caused by: org.apache.maven.shared.transfer.artifact.resolve.ArtifactResolverException: Failed to read artifact descriptor for org.apache.maven.skins:maven-default-skin:jar:1.0
        at org.apache.maven.plugins.jira.JiraUnicodeTestCase.testUnicodeReport(JiraUnicodeTestCase.java:75)
Caused by: org.sonatype.aether.resolution.ArtifactDescriptorException: Failed to read artifact descriptor for org.apache.maven.skins:maven-default-skin:jar:1.0
        at org.apache.maven.plugins.jira.JiraUnicodeTestCase.testUnicodeReport(JiraUnicodeTestCase.java:75)
Caused by: org.sonatype.aether.resolution.ArtifactResolutionException: Could not transfer artifact org.apache.maven.skins:maven-default-skin:pom:1.0 from/to central (https://repo.maven.apache.org/maven2): Received fatal alert: protocol_version
        at org.apache.maven.plugins.jira.JiraUnicodeTestCase.testUnicodeReport(JiraUnicodeTestCase.java:75)
Caused by: org.sonatype.aether.transfer.ArtifactTransferException: Could not transfer artifact org.apache.maven.skins:maven-default-skin:pom:1.0 from/to central (https://repo.maven.apache.org/maven2): Received fatal alert: protocol_version
Caused by: org.apache.maven.wagon.TransferFailedException: Received fatal alert: protocol_version
Caused by: javax.net.ssl.SSLException: Received fatal alert: protocol_version


FAILED:  org.apache.maven.plugins.jira.JiraUnicodeTestCase.windows-jdk7-m3.2.x_build / Build windows-jdk7-m3.2.x_build / testUnicodeReport

Error Message:
Couldn't resolve the skin.

Stack Trace:
org.apache.maven.plugin.MojoExecutionException: Couldn't resolve the skin.
        at org.apache.maven.plugins.jira.JiraUnicodeTestCase.testUnicodeReport(JiraUnicodeTestCase.java:75)
Caused by: org.apache.maven.shared.transfer.artifact.resolve.ArtifactResolverException: Failed to read artifact descriptor for org.apache.maven.skins:maven-default-skin:jar:1.0
        at org.apache.maven.plugins.jira.JiraUnicodeTestCase.testUnicodeReport(JiraUnicodeTestCase.java:75)
Caused by: org.sonatype.aether.resolution.ArtifactDescriptorException: Failed to read artifact descriptor for org.apache.maven.skins:maven-default-skin:jar:1.0
        at org.apache.maven.plugins.jira.JiraUnicodeTestCase.testUnicodeReport(JiraUnicodeTestCase.java:75)
Caused by: org.sonatype.aether.resolution.ArtifactResolutionException: Could not transfer artifact org.apache.maven.skins:maven-default-skin:pom:1.0 from/to central (https://repo.maven.apache.org/maven2): Received fatal alert: protocol_version
        at org.apache.maven.plugins.jira.JiraUnicodeTestCase.testUnicodeReport(JiraUnicodeTestCase.java:75)
Caused by: org.sonatype.aether.transfer.ArtifactTransferException: Could not transfer artifact org.apache.maven.skins:maven-default-skin:pom:1.0 from/to central (https://repo.maven.apache.org/maven2): Received fatal alert: protocol_version
Caused by: org.apache.maven.wagon.TransferFailedException: Received fatal alert: protocol_version
Caused by: javax.net.ssl.SSLException: Received fatal alert: protocol_version


FAILED:  org.apache.maven.plugins.jira.JiraUnicodeTestCase.windows-jdk7-m3.5.x_build / Build windows-jdk7-m3.5.x_build / testUnicodeReport

Error Message:
Couldn't resolve the skin.

Stack Trace:
org.apache.maven.plugin.MojoExecutionException: Couldn't resolve the skin.
        at org.apache.maven.plugins.jira.JiraUnicodeTestCase.testUnicodeReport(JiraUnicodeTestCase.java:75)
Caused by: org.apache.maven.shared.transfer.artifact.resolve.ArtifactResolverException: Failed to read artifact descriptor for org.apache.maven.skins:maven-default-skin:jar:1.0
        at org.apache.maven.plugins.jira.JiraUnicodeTestCase.testUnicodeReport(JiraUnicodeTestCase.java:75)
Caused by: org.sonatype.aether.resolution.ArtifactDescriptorException: Failed to read artifact descriptor for org.apache.maven.skins:maven-default-skin:jar:1.0
        at org.apache.maven.plugins.jira.JiraUnicodeTestCase.testUnicodeReport(JiraUnicodeTestCase.java:75)
Caused by: org.sonatype.aether.resolution.ArtifactResolutionException: Could not transfer artifact org.apache.maven.skins:maven-default-skin:pom:1.0 from/to central (https://repo.maven.apache.org/maven2): Received fatal alert: protocol_version
        at org.apache.maven.plugins.jira.JiraUnicodeTestCase.testUnicodeReport(JiraUnicodeTestCase.java:75)
Caused by: org.sonatype.aether.transfer.ArtifactTransferException: Could not transfer artifact org.apache.maven.skins:maven-default-skin:pom:1.0 from/to central (https://repo.maven.apache.org/maven2): Received fatal alert: protocol_version
Caused by: org.apache.maven.wagon.TransferFailedException: Received fatal alert: protocol_version
Caused by: javax.net.ssl.SSLException: Received fatal alert: protocol_version


FAILED:  org.apache.maven.plugins.jira.JiraUnicodeTestCase.windows-jdk7-m3.6.x_build / Build windows-jdk7-m3.6.x_build / testUnicodeReport

Error Message:
Couldn't resolve the skin.

Stack Trace:
org.apache.maven.plugin.MojoExecutionException: Couldn't resolve the skin.
        at org.apache.maven.plugins.jira.JiraUnicodeTestCase.testUnicodeReport(JiraUnicodeTestCase.java:75)
Caused by: org.apache.maven.shared.transfer.artifact.resolve.ArtifactResolverException: Failed to read artifact descriptor for org.apache.maven.skins:maven-default-skin:jar:1.0
        at org.apache.maven.plugins.jira.JiraUnicodeTestCase.testUnicodeReport(JiraUnicodeTestCase.java:75)
Caused by: org.sonatype.aether.resolution.ArtifactDescriptorException: Failed to read artifact descriptor for org.apache.maven.skins:maven-default-skin:jar:1.0
        at org.apache.maven.plugins.jira.JiraUnicodeTestCase.testUnicodeReport(JiraUnicodeTestCase.java:75)
Caused by: org.sonatype.aether.resolution.ArtifactResolutionException: Could not transfer artifact org.apache.maven.skins:maven-default-skin:pom:1.0 from/to central (https://repo.maven.apache.org/maven2): Received fatal alert: protocol_version
        at org.apache.maven.plugins.jira.JiraUnicodeTestCase.testUnicodeReport(JiraUnicodeTestCase.java:75)
Caused by: org.sonatype.aether.transfer.ArtifactTransferException: Could not transfer artifact org.apache.maven.skins:maven-default-skin:pom:1.0 from/to central (https://repo.maven.apache.org/maven2): Received fatal alert: protocol_version
Caused by: org.apache.maven.wagon.TransferFailedException: Received fatal alert: protocol_version
Caused by: javax.net.ssl.SSLException: Received fatal alert: protocol_version


FAILED:  org.apache.maven.plugins.jira.JiraUnicodeTestCase.linux-jdk7-m3.6.x_build / Build linux-jdk7-m3.6.x_build / testUnicodeReport

Error Message:
Couldn't resolve the skin.

Stack Trace:
org.apache.maven.plugin.MojoExecutionException: Couldn't resolve the skin.
        at org.apache.maven.plugins.jira.JiraUnicodeTestCase.testUnicodeReport(JiraUnicodeTestCase.java:75)
Caused by: org.apache.maven.shared.transfer.artifact.resolve.ArtifactResolverException: Failed to read artifact descriptor for org.apache.maven.skins:maven-default-skin:jar:1.0
        at org.apache.maven.plugins.jira.JiraUnicodeTestCase.testUnicodeReport(JiraUnicodeTestCase.java:75)
Caused by: org.sonatype.aether.resolution.ArtifactDescriptorException: Failed to read artifact descriptor for org.apache.maven.skins:maven-default-skin:jar:1.0
        at org.apache.maven.plugins.jira.JiraUnicodeTestCase.testUnicodeReport(JiraUnicodeTestCase.java:75)
Caused by: org.sonatype.aether.resolution.ArtifactResolutionException: Could not transfer artifact org.apache.maven.skins:maven-default-skin:pom:1.0 from/to central (https://repo.maven.apache.org/maven2): Received fatal alert: protocol_version
        at org.apache.maven.plugins.jira.JiraUnicodeTestCase.testUnicodeReport(JiraUnicodeTestCase.java:75)
Caused by: org.sonatype.aether.transfer.ArtifactTransferException: Could not transfer artifact org.apache.maven.skins:maven-default-skin:pom:1.0 from/to central (https://repo.maven.apache.org/maven2): Received fatal alert: protocol_version
Caused by: org.apache.maven.wagon.TransferFailedException: Received fatal alert: protocol_version
Caused by: javax.net.ssl.SSLException: Received fatal alert: protocol_version


FAILED:  org.apache.maven.plugins.jira.JiraUnicodeTestCase.linux-jdk7-m3.5.x_build / Build linux-jdk7-m3.5.x_build / testUnicodeReport

Error Message:
Couldn't resolve the skin.

Stack Trace:
org.apache.maven.plugin.MojoExecutionException: Couldn't resolve the skin.
        at org.apache.maven.plugins.jira.JiraUnicodeTestCase.testUnicodeReport(JiraUnicodeTestCase.java:75)
Caused by: org.apache.maven.shared.transfer.artifact.resolve.ArtifactResolverException: Failed to read artifact descriptor for org.apache.maven.skins:maven-default-skin:jar:1.0
        at org.apache.maven.plugins.jira.JiraUnicodeTestCase.testUnicodeReport(JiraUnicodeTestCase.java:75)
Caused by: org.sonatype.aether.resolution.ArtifactDescriptorException: Failed to read artifact descriptor for org.apache.maven.skins:maven-default-skin:jar:1.0
        at org.apache.maven.plugins.jira.JiraUnicodeTestCase.testUnicodeReport(JiraUnicodeTestCase.java:75)
Caused by: org.sonatype.aether.resolution.ArtifactResolutionException: Could not transfer artifact org.apache.maven.skins:maven-default-skin:pom:1.0 from/to central (https://repo.maven.apache.org/maven2): Received fatal alert: protocol_version
        at org.apache.maven.plugins.jira.JiraUnicodeTestCase.testUnicodeReport(JiraUnicodeTestCase.java:75)
Caused by: org.sonatype.aether.transfer.ArtifactTransferException: Could not transfer artifact org.apache.maven.skins:maven-default-skin:pom:1.0 from/to central (https://repo.maven.apache.org/maven2): Received fatal alert: protocol_version
Caused by: org.apache.maven.wagon.TransferFailedException: Received fatal alert: protocol_version
Caused by: javax.net.ssl.SSLException: Received fatal alert: protocol_version


FAILED:  org.apache.maven.plugins.jira.JiraUnicodeTestCase.linux-jdk7-m3.2.x_build / Build linux-jdk7-m3.2.x_build / testUnicodeReport

Error Message:
Couldn't resolve the skin.

Stack Trace:
org.apache.maven.plugin.MojoExecutionException: Couldn't resolve the skin.
        at org.apache.maven.plugins.jira.JiraUnicodeTestCase.testUnicodeReport(JiraUnicodeTestCase.java:75)
Caused by: org.apache.maven.shared.transfer.artifact.resolve.ArtifactResolverException: Failed to read artifact descriptor for org.apache.maven.skins:maven-default-skin:jar:1.0
        at org.apache.maven.plugins.jira.JiraUnicodeTestCase.testUnicodeReport(JiraUnicodeTestCase.java:75)
Caused by: org.sonatype.aether.resolution.ArtifactDescriptorException: Failed to read artifact descriptor for org.apache.maven.skins:maven-default-skin:jar:1.0
        at org.apache.maven.plugins.jira.JiraUnicodeTestCase.testUnicodeReport(JiraUnicodeTestCase.java:75)
Caused by: org.sonatype.aether.resolution.ArtifactResolutionException: Could not transfer artifact org.apache.maven.skins:maven-default-skin:pom:1.0 from/to central (https://repo.maven.apache.org/maven2): Received fatal alert: protocol_version
        at org.apache.maven.plugins.jira.JiraUnicodeTestCase.testUnicodeReport(JiraUnicodeTestCase.java:75)
Caused by: org.sonatype.aether.transfer.ArtifactTransferException: Could not transfer artifact org.apache.maven.skins:maven-default-skin:pom:1.0 from/to central (https://repo.maven.apache.org/maven2): Received fatal alert: protocol_version
Caused by: org.apache.maven.wagon.TransferFailedException: Received fatal alert: protocol_version
Caused by: javax.net.ssl.SSLException: Received fatal alert: protocol_version




Build log:
[...truncated 5113 lines...]
[INFO]
[INFO] --- maven-invoker-plugin:3.1.0:verify (integration-test) @ maven-changes-plugin ---
[INFO] -------------------------------------------------
[INFO] Build Summary:
[INFO]   Passed: 13, Failed: 0, Errors: 0, Skipped: 0
[INFO] -------------------------------------------------
[INFO] ------------------------------------------------------------------------
[INFO] BUILD SUCCESS
[INFO] ------------------------------------------------------------------------
[INFO] Total time:  02:07 min
[INFO] Finished at: 2020-02-09T23:56:49Z
[INFO] ------------------------------------------------------------------------
[INFO] [jenkins-event-spy] Generated /home/jenkins/jenkins-slave/workspace/ven-box_maven-changes-plugin_ssl@2@tmp/withMaven1d123180/maven-spy-20200209-235441-52811047969735417401594.log
[withMaven] artifactsPublisher - Archive artifact linux-jdk8-m3.6.x_build/target/maven-changes-plugin-3.0.0-SNAPSHOT.jar under org/apache/maven/plugins/maven-changes-plugin/3.0.0-SNAPSHOT/maven-changes-plugin-3.0.0-SNAPSHOT.jar
[Pipeline] }
[Pipeline] // dir
[Pipeline] }
[withMaven] junitPublisher - Archive test results for Maven artifact org.apache.maven.plugins:maven-changes-plugin:maven-plugin:3.0.0-SNAPSHOT generated by maven-surefire-plugin:test (default-test): linux-jdk8-m3.6.x_build/target/surefire-reports/*.xml
Recording test results
[withMaven] Publishers: Generated Artifacts Publisher: 121 ms, Junit Publisher: 393 ms, Open Task Scanner Publisher: 150 ms, Invoker Publisher: 3779 ms, Pipeline Graph Publisher: 1 ms
[Pipeline] // withMaven
[Pipeline] cleanWs
[WS-CLEANUP] Deleting project workspace...
[WS-CLEANUP] Deferred wipeout is used...
[WS-CLEANUP] done
[withMaven] artifactsPublisher - Archive artifact linux-jdk11-m3.6.x_build/pom.xml under org/apache/maven/plugins/maven-changes-plugin/3.0.0-SNAPSHOT/maven-changes-plugin-3.0.0-SNAPSHOT.pom
[INFO] run post-build script verify.bsh
[INFO]           report-changes-interpolation/pom.xml ............. SUCCESS (11.0 s)
[INFO] Building: report-changes-system/pom.xml
[withMaven] artifactsPublisher - Archive artifact linux-jdk11-m3.6.x_build/target/maven-changes-plugin-3.0.0-SNAPSHOT.jar under org/apache/maven/plugins/maven-changes-plugin/3.0.0-SNAPSHOT/maven-changes-plugin-3.0.0-SNAPSHOT.jar
[withMaven] junitPublisher - Archive test results for Maven artifact org.apache.maven.plugins:maven-changes-plugin:maven-plugin:3.0.0-SNAPSHOT generated by maven-surefire-plugin:test (default-test): linux-jdk11-m3.6.x_build/target/surefire-reports/*.xml
Recording test results
[INFO] run post-build script verify.bsh
[INFO]           report-changes-interpolation/pom.xml ............. SUCCESS (11.3 s)
[INFO] Building: report-changes-system/pom.xml
[withMaven] openTasksPublisher - Scan Tasks for Maven artifact org.apache.maven.plugins:maven-changes-plugin:maven-plugin:3.0.0-SNAPSHOT in source directory linux-jdk8-m3.6.x_build/src/main/java
[TASKS] Scanning folder '/home/jenkins/jenkins-slave/workspace/ven-box_maven-changes-plugin_ssl@2' for files matching the pattern 'linux-jdk8-m3.6.x_build/src/main/java/**/*' - excludes: null
[TASKS] Found 48 files to scan for tasks
[TASKS] Found 4 open tasks.
Skipping warnings blame since pipelines do not have an SCM link.%n
[TASKS] Computing warning deltas based on reference build #4
[INFO] run post-build script verify.bsh
[INFO]           report-changes-system-noissuemanagement/pom.xml .. SUCCESS (11.1 s)
[INFO] Building: announce-generate/pom.xml
[withMaven] invokerPublisher - Archive invoker results for Maven artifact MavenArtifact{org.apache.maven.plugins:maven-changes-plugin:maven-plugin:3.0.0-SNAPSHOT(version: 3.0.0-SNAPSHOT, snapshot:false) } generated by PluginInvocation{org.apache.maven.plugins:maven-invoker-plugin:3.1.0@integration-test  integration-test}: linux-jdk8-m3.6.x_build/target/invoker-reports/*.xml
[INFO] run post-build script verify.bsh
[INFO]           report-changes-system/pom.xml .................... SUCCESS (11.6 s)
[INFO] Building: report-changes-skip-snapshots/pom.xml
[INFO] run post-build script verify.bsh
[INFO]           report-changes-system/pom.xml .................... SUCCESS (11.4 s)
[INFO] Building: report-changes-skip-snapshots/pom.xml
[Pipeline] }
[Pipeline] // stage
[Pipeline] }
[Pipeline] // ws
[Pipeline] }
[Pipeline] // node
[Pipeline] }
[withMaven] openTasksPublisher - Scan Tasks for Maven artifact org.apache.maven.plugins:maven-changes-plugin:maven-plugin:3.0.0-SNAPSHOT in source directory linux-jdk11-m3.6.x_build/src/main/java
[TASKS] Scanning folder '/home/jenkins/jenkins-slave/workspace/ven-box_maven-changes-plugin_ssl@2' for files matching the pattern 'linux-jdk11-m3.6.x_build/src/main/java/**/*' - excludes: null
[TASKS] Found 48 files to scan for tasks
[TASKS] Found 4 open tasks.
Skipping warnings blame since pipelines do not have an SCM link.%n
[INFO] run post-build script verify.groovy
[INFO]           announce-generate/pom.xml ........................ SUCCESS (7.7 s)
[INFO] Building: report-aggregated-changes-generation/pom.xml
[TASKS] Computing warning deltas based on reference build #4
[withMaven] invokerPublisher - Archive invoker results for Maven artifact MavenArtifact{org.apache.maven.plugins:maven-changes-plugin:maven-plugin:3.0.0-SNAPSHOT(version: 3.0.0-SNAPSHOT, snapshot:false) } generated by PluginInvocation{org.apache.maven.plugins:maven-invoker-plugin:3.1.0@integration-test  integration-test}: linux-jdk11-m3.6.x_build/target/invoker-reports/*.xml
[INFO] run post-build script verify.groovy
[INFO]           report-changes-skip-snapshots/pom.xml ............ SUCCESS (8.8 s)
[INFO] Building: announce-generate-no-url/pom.xml
[withMaven] Publishers: Generated Artifacts Publisher: 2287 ms, Junit Publisher: 8603 ms, Open Task Scanner Publisher: 958 ms, Dependencies Fingerprint Publisher: 1 ms, Invoker Publisher: 11768 ms, Pipeline Graph Publisher: 1 ms
[Pipeline] // withMaven
[Pipeline] cleanWs
[WS-CLEANUP] Deleting project workspace...
[WS-CLEANUP] Deferred wipeout is used...
[WS-CLEANUP] done
[Pipeline] }
[Pipeline] // stage
[Pipeline] }
[Pipeline] // ws
[Pipeline] }
[Pipeline] // node
[Pipeline] }
[INFO] run post-build script verify.groovy
[INFO]           report-changes-skip-snapshots/pom.xml ............ SUCCESS (9.2 s)
[INFO] Building: announce-generate-no-url/pom.xml
[INFO]           announce-generate-no-url/pom.xml ................. SUCCESS (7.2 s)
[INFO] Building: announce-generate-no-issue-management/pom.xml
[INFO] run post-build script verify.groovy
[INFO]           report-aggregated-changes-generation/pom.xml ..... SUCCESS (12.5 s)
[INFO] Building: report-changes-interpolation/pom.xml
[withMaven] Publishers: Generated Artifacts Publisher: 1349 ms, Junit Publisher: 15425 ms, Open Task Scanner Publisher: 1057 ms, Dependencies Fingerprint Publisher: 1 ms, Invoker Publisher: 12098 ms, Pipeline Graph Publisher: 2 ms
[Pipeline] // withMaven
[Pipeline] cleanWs
[WS-CLEANUP] Deleting project workspace...
[WS-CLEANUP] Deferred wipeout is used...
[WS-CLEANUP] done
[Pipeline] }
[Pipeline] // stage
[Pipeline] }
[Pipeline] // ws
[Pipeline] }
[Pipeline] // node
[Pipeline] }
[INFO]           announce-generate-no-url/pom.xml ................. SUCCESS (7.0 s)
[INFO] Building: announce-generate-no-issue-management/pom.xml
[INFO]           announce-generate-no-issue-management/pom.xml .... SUCCESS (7.2 s)
[INFO]
[INFO] --- maven-checkstyle-plugin:3.0.0:check (checkstyle-check) @ maven-changes-plugin ---
[INFO]
[INFO] --- maven-invoker-plugin:3.1.0:verify (integration-test) @ maven-changes-plugin ---
[INFO] -------------------------------------------------
[INFO] Build Summary:
[INFO]   Passed: 13, Failed: 0, Errors: 0, Skipped: 0
[INFO] -------------------------------------------------
[INFO] ------------------------------------------------------------------------
[INFO] BUILD SUCCESS
[INFO] ------------------------------------------------------------------------
[INFO] Total time:  02:48 min
[INFO] Finished at: 2020-02-09T23:57:32Z
[INFO] ------------------------------------------------------------------------
[INFO] [jenkins-event-spy] Generated /home/jenkins/jenkins-slave/workspace/ven-box_maven-changes-plugin_ssl@3@2@tmp/withMavencccb82c1/maven-spy-20200209-235443-3343240962822657088952.log
[Pipeline] }
[Pipeline] // dir
[Pipeline] }
[INFO]           announce-generate-no-issue-management/pom.xml .... SUCCESS (7.5 s)
[INFO]
[INFO] --- maven-checkstyle-plugin:3.0.0:check (checkstyle-check) @ maven-changes-plugin ---
[withMaven] artifactsPublisher - Archive artifact linux-jdk7-m3.6.x_build/pom.xml under org/apache/maven/plugins/maven-changes-plugin/3.0.0-SNAPSHOT/maven-changes-plugin-3.0.0-SNAPSHOT.pom
[withMaven] artifactsPublisher - Archive artifact linux-jdk7-m3.6.x_build/target/maven-changes-plugin-3.0.0-SNAPSHOT.jar under org/apache/maven/plugins/maven-changes-plugin/3.0.0-SNAPSHOT/maven-changes-plugin-3.0.0-SNAPSHOT.jar
[withMaven] junitPublisher - Archive test results for Maven artifact org.apache.maven.plugins:maven-changes-plugin:maven-plugin:3.0.0-SNAPSHOT generated by maven-surefire-plugin:test (default-test): linux-jdk7-m3.6.x_build/target/surefire-reports/*.xml
Recording test results
[INFO] run post-build script verify.bsh
[INFO]           report-changes-interpolation/pom.xml ............. SUCCESS (11.7 s)
[INFO]
[INFO] --- maven-checkstyle-plugin:3.0.0:check (checkstyle-check) @ maven-changes-plugin ---
[INFO]
[INFO] --- maven-invoker-plugin:3.1.0:verify (integration-test) @ maven-changes-plugin ---
[INFO] -------------------------------------------------
[INFO] Build Summary:
[INFO]   Passed: 13, Failed: 0, Errors: 0, Skipped: 0
[INFO] -------------------------------------------------
[INFO] ------------------------------------------------------------------------
[INFO] BUILD SUCCESS
[INFO] ------------------------------------------------------------------------
[INFO] Total time: 02:57 min
[INFO] Finished at: 2020-02-09T23:57:38Z
[INFO] ------------------------------------------------------------------------
[INFO] [jenkins-event-spy] Generated /home/jenkins/jenkins-slave/workspace/ven-box_maven-changes-plugin_ssl@2@tmp/withMaven19bb39d1/maven-spy-20200209-235440-5114509158176949771817.log
[Pipeline] }
[INFO]
[INFO] --- maven-invoker-plugin:3.1.0:verify (integration-test) @ maven-changes-plugin ---
[INFO] -------------------------------------------------
[INFO] Build Summary:
[INFO]   Passed: 13, Failed: 0, Errors: 0, Skipped: 0
[INFO] -------------------------------------------------
[INFO] ------------------------------------------------------------------------
[INFO] BUILD SUCCESS
[INFO] ------------------------------------------------------------------------
[INFO] Total time: 02:56 min
[INFO] Finished at: 2020-02-09T23:57:37+00:00
[INFO] Final Memory: 64M/1754M
[INFO] ------------------------------------------------------------------------
[INFO] [jenkins-event-spy] Generated /home/jenkins/jenkins-slave/workspace/ven-box_maven-changes-plugin_ssl@2@tmp/withMavend327212b/maven-spy-20200209-235439-8616323392041068796648.log
[Pipeline] // dir
[Pipeline] }
[Pipeline] }
[Pipeline] // dir
[Pipeline] }
[withMaven] openTasksPublisher - Scan Tasks for Maven artifact org.apache.maven.plugins:maven-changes-plugin:maven-plugin:3.0.0-SNAPSHOT in source directory linux-jdk7-m3.6.x_build/src/main/java
[TASKS] Scanning folder '/home/jenkins/jenkins-slave/workspace/ven-box_maven-changes-plugin_ssl@3@2' for files matching the pattern 'linux-jdk7-m3.6.x_build/src/main/java/**/*' - excludes: null
[TASKS] Found 48 files to scan for tasks
[TASKS] Found 4 open tasks.
Skipping warnings blame since pipelines do not have an SCM link.%n
[TASKS] Computing warning deltas based on reference build #4
[withMaven] artifactsPublisher - Archive artifact linux-jdk7-m3.5.x_build/pom.xml under org/apache/maven/plugins/maven-changes-plugin/3.0.0-SNAPSHOT/maven-changes-plugin-3.0.0-SNAPSHOT.pom
[withMaven] artifactsPublisher - Archive artifact linux-jdk7-m3.5.x_build/target/maven-changes-plugin-3.0.0-SNAPSHOT.jar under org/apache/maven/plugins/maven-changes-plugin/3.0.0-SNAPSHOT/maven-changes-plugin-3.0.0-SNAPSHOT.jar
[withMaven] artifactsPublisher - Archive artifact linux-jdk7-m3.2.x_build/pom.xml under org/apache/maven/plugins/maven-changes-plugin/3.0.0-SNAPSHOT/maven-changes-plugin-3.0.0-SNAPSHOT.pom
[withMaven] invokerPublisher - Archive invoker results for Maven artifact MavenArtifact{org.apache.maven.plugins:maven-changes-plugin:maven-plugin:3.0.0-SNAPSHOT(version: 3.0.0-SNAPSHOT, snapshot:false) } generated by PluginInvocation{org.apache.maven.plugins:maven-invoker-plugin:3.1.0@integration-test  integration-test}: linux-jdk7-m3.6.x_build/target/invoker-reports/*.xml
[withMaven] artifactsPublisher - Archive artifact linux-jdk7-m3.2.x_build/target/maven-changes-plugin-3.0.0-SNAPSHOT.jar under org/apache/maven/plugins/maven-changes-plugin/3.0.0-SNAPSHOT/maven-changes-plugin-3.0.0-SNAPSHOT.jar
[withMaven] junitPublisher - Archive test results for Maven artifact org.apache.maven.plugins:maven-changes-plugin:maven-plugin:3.0.0-SNAPSHOT generated by maven-surefire-plugin:test (default-test): linux-jdk7-m3.5.x_build/target/surefire-reports/*.xml
Recording test results
[withMaven] junitPublisher - Archive test results for Maven artifact org.apache.maven.plugins:maven-changes-plugin:maven-plugin:3.0.0-SNAPSHOT generated by maven-surefire-plugin:test (default-test): linux-jdk7-m3.2.x_build/target/surefire-reports/*.xml
Recording test results
[withMaven] openTasksPublisher - Scan Tasks for Maven artifact org.apache.maven.plugins:maven-changes-plugin:maven-plugin:3.0.0-SNAPSHOT in source directory linux-jdk7-m3.5.x_build/src/main/java
[TASKS] Scanning folder '/home/jenkins/jenkins-slave/workspace/ven-box_maven-changes-plugin_ssl@2' for files matching the pattern 'linux-jdk7-m3.5.x_build/src/main/java/**/*' - excludes: null
[TASKS] Found 48 files to scan for tasks
[TASKS] Found 4 open tasks.
Skipping warnings blame since pipelines do not have an SCM link.%n
[TASKS] Computing warning deltas based on reference build #4
[withMaven] invokerPublisher - Archive invoker results for Maven artifact MavenArtifact{org.apache.maven.plugins:maven-changes-plugin:maven-plugin:3.0.0-SNAPSHOT(version: 3.0.0-SNAPSHOT, snapshot:false) } generated by PluginInvocation{org.apache.maven.plugins:maven-invoker-plugin:3.1.0@integration-test  integration-test}: linux-jdk7-m3.5.x_build/target/invoker-reports/*.xml
[withMaven] Publishers: Generated Artifacts Publisher: 1339 ms, Junit Publisher: 8652 ms, Open Task Scanner Publisher: 922 ms, Dependencies Fingerprint Publisher: 1 ms, Invoker Publisher: 18770 ms, Pipeline Graph Publisher: 1 ms
[withMaven] openTasksPublisher - Scan Tasks for Maven artifact org.apache.maven.plugins:maven-changes-plugin:maven-plugin:3.0.0-SNAPSHOT in source directory linux-jdk7-m3.2.x_build/src/main/java
[Pipeline] // withMaven
[Pipeline] cleanWs
[TASKS] Scanning folder '/home/jenkins/jenkins-slave/workspace/ven-box_maven-changes-plugin_ssl@2' for files matching the pattern 'linux-jdk7-m3.2.x_build/src/main/java/**/*' - excludes: null
[TASKS] Found 48 files to scan for tasks
[TASKS] Found 4 open tasks.
Skipping warnings blame since pipelines do not have an SCM link.%n
[TASKS] Computing warning deltas based on reference build #4
[WS-CLEANUP] Deleting project workspace...
[WS-CLEANUP] Deferred wipeout is used...
[WS-CLEANUP] done
[Pipeline] }
[Pipeline] // stage
[Pipeline] }
[Pipeline] // ws
[Pipeline] }
[Pipeline] // node
[Pipeline] }
[withMaven] invokerPublisher - Archive invoker results for Maven artifact MavenArtifact{org.apache.maven.plugins:maven-changes-plugin:maven-plugin:3.0.0-SNAPSHOT(version: 3.0.0-SNAPSHOT, snapshot:false) } generated by PluginInvocation{org.apache.maven.plugins:maven-invoker-plugin:3.1.0@integration-test  integration-test}: linux-jdk7-m3.2.x_build/target/invoker-reports/*.xml
[withMaven] Publishers: Generated Artifacts Publisher: 1202 ms, Junit Publisher: 10049 ms, Open Task Scanner Publisher: 903 ms, Dependencies Fingerprint Publisher: 1 ms, Invoker Publisher: 11344 ms, Pipeline Graph Publisher: 1 ms
[Pipeline] // withMaven
[Pipeline] cleanWs
[WS-CLEANUP] Deleting project workspace...
[WS-CLEANUP] Deferred wipeout is used...
[WS-CLEANUP] done
[Pipeline] }
[Pipeline] // stage
[Pipeline] }
[Pipeline] // ws
[Pipeline] }
[Pipeline] // node
[Pipeline] }
[withMaven] Publishers: Generated Artifacts Publisher: 2432 ms, Junit Publisher: 16486 ms, Open Task Scanner Publisher: 1219 ms, Dependencies Fingerprint Publisher: 1 ms, Invoker Publisher: 11686 ms
[Pipeline] // withMaven
[Pipeline] cleanWs
[WS-CLEANUP] Deleting project workspace...
[WS-CLEANUP] Deferred wipeout is used...
[WS-CLEANUP] done
[Pipeline] }
[Pipeline] // stage
[Pipeline] }
[Pipeline] // ws
[Pipeline] }
[Pipeline] // node
[Pipeline] }
[Pipeline] // parallel
[Pipeline] stage
[Pipeline] { (Notifications)
[Pipeline] echo
Build result: UNSTABLE
[Pipeline] jiraIssueSelector
[Pipeline] echo
The authors of changes [slachiewicz].
[Pipeline] echo
Sending email ...
[Pipeline] emailext