Build unstable in Jenkins: Maven TLP » maven-changes-plugin » ssl #2

classic Classic list List threaded Threaded
1 message Options
Reply | Threaded
Open this post in threaded view
|

Build unstable in Jenkins: Maven TLP » maven-changes-plugin » ssl #2

Apache Jenkins Server-2
See https://builds.apache.org/job/maven-box/job/maven-changes-plugin/job/ssl/2/

Changes:

* WIP Update to parent 34

8 tests failed.
FAILED:  org.apache.maven.plugins.jira.JiraUnicodeTestCase.windows-jdk7-m3.3.x_build / Build windows-jdk7-m3.3.x_build / testUnicodeReport

Error Message:
Couldn't resolve the skin.

Stack Trace:
org.apache.maven.plugin.MojoExecutionException: Couldn't resolve the skin.
        at org.apache.maven.plugins.jira.JiraUnicodeTestCase.testUnicodeReport(JiraUnicodeTestCase.java:75)
Caused by: org.apache.maven.shared.artifact.resolve.ArtifactResolverException: Failed to read artifact descriptor for org.apache.maven.skins:maven-default-skin:jar:1.0
        at org.apache.maven.plugins.jira.JiraUnicodeTestCase.testUnicodeReport(JiraUnicodeTestCase.java:75)
Caused by: org.sonatype.aether.resolution.ArtifactDescriptorException: Failed to read artifact descriptor for org.apache.maven.skins:maven-default-skin:jar:1.0
        at org.apache.maven.plugins.jira.JiraUnicodeTestCase.testUnicodeReport(JiraUnicodeTestCase.java:75)
Caused by: org.sonatype.aether.resolution.ArtifactResolutionException: Could not transfer artifact org.apache.maven.skins:maven-default-skin:pom:1.0 from central (https://repo.maven.apache.org/maven2): Received fatal alert: protocol_version
        at org.apache.maven.plugins.jira.JiraUnicodeTestCase.testUnicodeReport(JiraUnicodeTestCase.java:75)
Caused by: org.sonatype.aether.transfer.ArtifactTransferException: Could not transfer artifact org.apache.maven.skins:maven-default-skin:pom:1.0 from central (https://repo.maven.apache.org/maven2): Received fatal alert: protocol_version
        at org.apache.maven.plugins.jira.JiraUnicodeTestCase.testUnicodeReport(JiraUnicodeTestCase.java:75)
Caused by: org.apache.maven.wagon.TransferFailedException: Received fatal alert: protocol_version
Caused by: javax.net.ssl.SSLException: Received fatal alert: protocol_version


FAILED:  org.apache.maven.plugins.jira.JiraUnicodeTestCase.windows-jdk7-m3.2.x_build / Build windows-jdk7-m3.2.x_build / testUnicodeReport

Error Message:
Couldn't resolve the skin.

Stack Trace:
org.apache.maven.plugin.MojoExecutionException: Couldn't resolve the skin.
        at org.apache.maven.plugins.jira.JiraUnicodeTestCase.testUnicodeReport(JiraUnicodeTestCase.java:75)
Caused by: org.apache.maven.shared.artifact.resolve.ArtifactResolverException: Failed to read artifact descriptor for org.apache.maven.skins:maven-default-skin:jar:1.0
        at org.apache.maven.plugins.jira.JiraUnicodeTestCase.testUnicodeReport(JiraUnicodeTestCase.java:75)
Caused by: org.sonatype.aether.resolution.ArtifactDescriptorException: Failed to read artifact descriptor for org.apache.maven.skins:maven-default-skin:jar:1.0
        at org.apache.maven.plugins.jira.JiraUnicodeTestCase.testUnicodeReport(JiraUnicodeTestCase.java:75)
Caused by: org.sonatype.aether.resolution.ArtifactResolutionException: Could not transfer artifact org.apache.maven.skins:maven-default-skin:pom:1.0 from central (https://repo.maven.apache.org/maven2): Received fatal alert: protocol_version
        at org.apache.maven.plugins.jira.JiraUnicodeTestCase.testUnicodeReport(JiraUnicodeTestCase.java:75)
Caused by: org.sonatype.aether.transfer.ArtifactTransferException: Could not transfer artifact org.apache.maven.skins:maven-default-skin:pom:1.0 from central (https://repo.maven.apache.org/maven2): Received fatal alert: protocol_version
        at org.apache.maven.plugins.jira.JiraUnicodeTestCase.testUnicodeReport(JiraUnicodeTestCase.java:75)
Caused by: org.apache.maven.wagon.TransferFailedException: Received fatal alert: protocol_version
Caused by: javax.net.ssl.SSLException: Received fatal alert: protocol_version


FAILED:  org.apache.maven.plugins.jira.JiraUnicodeTestCase.linux-jdk7-m3.3.x_build / Build linux-jdk7-m3.3.x_build / testUnicodeReport

Error Message:
Couldn't resolve the skin.

Stack Trace:
org.apache.maven.plugin.MojoExecutionException: Couldn't resolve the skin.
        at org.apache.maven.plugins.jira.JiraUnicodeTestCase.testUnicodeReport(JiraUnicodeTestCase.java:75)
Caused by: org.apache.maven.shared.artifact.resolve.ArtifactResolverException: Failed to read artifact descriptor for org.apache.maven.skins:maven-default-skin:jar:1.0
        at org.apache.maven.plugins.jira.JiraUnicodeTestCase.testUnicodeReport(JiraUnicodeTestCase.java:75)
Caused by: org.sonatype.aether.resolution.ArtifactDescriptorException: Failed to read artifact descriptor for org.apache.maven.skins:maven-default-skin:jar:1.0
        at org.apache.maven.plugins.jira.JiraUnicodeTestCase.testUnicodeReport(JiraUnicodeTestCase.java:75)
Caused by: org.sonatype.aether.resolution.ArtifactResolutionException: Could not transfer artifact org.apache.maven.skins:maven-default-skin:pom:1.0 from central (https://repo.maven.apache.org/maven2): Received fatal alert: protocol_version
        at org.apache.maven.plugins.jira.JiraUnicodeTestCase.testUnicodeReport(JiraUnicodeTestCase.java:75)
Caused by: org.sonatype.aether.transfer.ArtifactTransferException: Could not transfer artifact org.apache.maven.skins:maven-default-skin:pom:1.0 from central (https://repo.maven.apache.org/maven2): Received fatal alert: protocol_version
        at org.apache.maven.plugins.jira.JiraUnicodeTestCase.testUnicodeReport(JiraUnicodeTestCase.java:75)
Caused by: org.apache.maven.wagon.TransferFailedException: Received fatal alert: protocol_version
Caused by: javax.net.ssl.SSLException: Received fatal alert: protocol_version


FAILED:  org.apache.maven.plugins.jira.JiraUnicodeTestCase.windows-jdk7-m3.6.x_build / Build windows-jdk7-m3.6.x_build / testUnicodeReport

Error Message:
Couldn't resolve the skin.

Stack Trace:
org.apache.maven.plugin.MojoExecutionException: Couldn't resolve the skin.
        at org.apache.maven.plugins.jira.JiraUnicodeTestCase.testUnicodeReport(JiraUnicodeTestCase.java:75)
Caused by: org.apache.maven.shared.artifact.resolve.ArtifactResolverException: Failed to read artifact descriptor for org.apache.maven.skins:maven-default-skin:jar:1.0
        at org.apache.maven.plugins.jira.JiraUnicodeTestCase.testUnicodeReport(JiraUnicodeTestCase.java:75)
Caused by: org.sonatype.aether.resolution.ArtifactDescriptorException: Failed to read artifact descriptor for org.apache.maven.skins:maven-default-skin:jar:1.0
        at org.apache.maven.plugins.jira.JiraUnicodeTestCase.testUnicodeReport(JiraUnicodeTestCase.java:75)
Caused by: org.sonatype.aether.resolution.ArtifactResolutionException: Could not transfer artifact org.apache.maven.skins:maven-default-skin:pom:1.0 from central (https://repo.maven.apache.org/maven2): Received fatal alert: protocol_version
        at org.apache.maven.plugins.jira.JiraUnicodeTestCase.testUnicodeReport(JiraUnicodeTestCase.java:75)
Caused by: org.sonatype.aether.transfer.ArtifactTransferException: Could not transfer artifact org.apache.maven.skins:maven-default-skin:pom:1.0 from central (https://repo.maven.apache.org/maven2): Received fatal alert: protocol_version
        at org.apache.maven.plugins.jira.JiraUnicodeTestCase.testUnicodeReport(JiraUnicodeTestCase.java:75)
Caused by: org.apache.maven.wagon.TransferFailedException: Received fatal alert: protocol_version
Caused by: javax.net.ssl.SSLException: Received fatal alert: protocol_version


FAILED:  org.apache.maven.plugins.jira.JiraUnicodeTestCase.windows-jdk7-m3.5.x_build / Build windows-jdk7-m3.5.x_build / testUnicodeReport

Error Message:
Couldn't resolve the skin.

Stack Trace:
org.apache.maven.plugin.MojoExecutionException: Couldn't resolve the skin.
        at org.apache.maven.plugins.jira.JiraUnicodeTestCase.testUnicodeReport(JiraUnicodeTestCase.java:75)
Caused by: org.apache.maven.shared.artifact.resolve.ArtifactResolverException: Failed to read artifact descriptor for org.apache.maven.skins:maven-default-skin:jar:1.0
        at org.apache.maven.plugins.jira.JiraUnicodeTestCase.testUnicodeReport(JiraUnicodeTestCase.java:75)
Caused by: org.sonatype.aether.resolution.ArtifactDescriptorException: Failed to read artifact descriptor for org.apache.maven.skins:maven-default-skin:jar:1.0
        at org.apache.maven.plugins.jira.JiraUnicodeTestCase.testUnicodeReport(JiraUnicodeTestCase.java:75)
Caused by: org.sonatype.aether.resolution.ArtifactResolutionException: Could not transfer artifact org.apache.maven.skins:maven-default-skin:pom:1.0 from central (https://repo.maven.apache.org/maven2): Received fatal alert: protocol_version
        at org.apache.maven.plugins.jira.JiraUnicodeTestCase.testUnicodeReport(JiraUnicodeTestCase.java:75)
Caused by: org.sonatype.aether.transfer.ArtifactTransferException: Could not transfer artifact org.apache.maven.skins:maven-default-skin:pom:1.0 from central (https://repo.maven.apache.org/maven2): Received fatal alert: protocol_version
        at org.apache.maven.plugins.jira.JiraUnicodeTestCase.testUnicodeReport(JiraUnicodeTestCase.java:75)
Caused by: org.apache.maven.wagon.TransferFailedException: Received fatal alert: protocol_version
Caused by: javax.net.ssl.SSLException: Received fatal alert: protocol_version


FAILED:  org.apache.maven.plugins.jira.JiraUnicodeTestCase.linux-jdk7-m3.6.x_build / Build linux-jdk7-m3.6.x_build / testUnicodeReport

Error Message:
Couldn't resolve the skin.

Stack Trace:
org.apache.maven.plugin.MojoExecutionException: Couldn't resolve the skin.
        at org.apache.maven.plugins.jira.JiraUnicodeTestCase.testUnicodeReport(JiraUnicodeTestCase.java:75)
Caused by: org.apache.maven.shared.artifact.resolve.ArtifactResolverException: Failed to read artifact descriptor for org.apache.maven.skins:maven-default-skin:jar:1.0
        at org.apache.maven.plugins.jira.JiraUnicodeTestCase.testUnicodeReport(JiraUnicodeTestCase.java:75)
Caused by: org.sonatype.aether.resolution.ArtifactDescriptorException: Failed to read artifact descriptor for org.apache.maven.skins:maven-default-skin:jar:1.0
        at org.apache.maven.plugins.jira.JiraUnicodeTestCase.testUnicodeReport(JiraUnicodeTestCase.java:75)
Caused by: org.sonatype.aether.resolution.ArtifactResolutionException: Could not transfer artifact org.apache.maven.skins:maven-default-skin:pom:1.0 from central (https://repo.maven.apache.org/maven2): Received fatal alert: protocol_version
        at org.apache.maven.plugins.jira.JiraUnicodeTestCase.testUnicodeReport(JiraUnicodeTestCase.java:75)
Caused by: org.sonatype.aether.transfer.ArtifactTransferException: Could not transfer artifact org.apache.maven.skins:maven-default-skin:pom:1.0 from central (https://repo.maven.apache.org/maven2): Received fatal alert: protocol_version
        at org.apache.maven.plugins.jira.JiraUnicodeTestCase.testUnicodeReport(JiraUnicodeTestCase.java:75)
Caused by: org.apache.maven.wagon.TransferFailedException: Received fatal alert: protocol_version
Caused by: javax.net.ssl.SSLException: Received fatal alert: protocol_version


FAILED:  org.apache.maven.plugins.jira.JiraUnicodeTestCase.linux-jdk7-m3.5.x_build / Build linux-jdk7-m3.5.x_build / testUnicodeReport

Error Message:
Couldn't resolve the skin.

Stack Trace:
org.apache.maven.plugin.MojoExecutionException: Couldn't resolve the skin.
        at org.apache.maven.plugins.jira.JiraUnicodeTestCase.testUnicodeReport(JiraUnicodeTestCase.java:75)
Caused by: org.apache.maven.shared.artifact.resolve.ArtifactResolverException: Failed to read artifact descriptor for org.apache.maven.skins:maven-default-skin:jar:1.0
        at org.apache.maven.plugins.jira.JiraUnicodeTestCase.testUnicodeReport(JiraUnicodeTestCase.java:75)
Caused by: org.sonatype.aether.resolution.ArtifactDescriptorException: Failed to read artifact descriptor for org.apache.maven.skins:maven-default-skin:jar:1.0
        at org.apache.maven.plugins.jira.JiraUnicodeTestCase.testUnicodeReport(JiraUnicodeTestCase.java:75)
Caused by: org.sonatype.aether.resolution.ArtifactResolutionException: Could not transfer artifact org.apache.maven.skins:maven-default-skin:pom:1.0 from central (https://repo.maven.apache.org/maven2): Received fatal alert: protocol_version
        at org.apache.maven.plugins.jira.JiraUnicodeTestCase.testUnicodeReport(JiraUnicodeTestCase.java:75)
Caused by: org.sonatype.aether.transfer.ArtifactTransferException: Could not transfer artifact org.apache.maven.skins:maven-default-skin:pom:1.0 from central (https://repo.maven.apache.org/maven2): Received fatal alert: protocol_version
        at org.apache.maven.plugins.jira.JiraUnicodeTestCase.testUnicodeReport(JiraUnicodeTestCase.java:75)
Caused by: org.apache.maven.wagon.TransferFailedException: Received fatal alert: protocol_version
Caused by: javax.net.ssl.SSLException: Received fatal alert: protocol_version


FAILED:  org.apache.maven.plugins.jira.JiraUnicodeTestCase.linux-jdk7-m3.2.x_build / Build linux-jdk7-m3.2.x_build / testUnicodeReport

Error Message:
Couldn't resolve the skin.

Stack Trace:
org.apache.maven.plugin.MojoExecutionException: Couldn't resolve the skin.
        at org.apache.maven.plugins.jira.JiraUnicodeTestCase.testUnicodeReport(JiraUnicodeTestCase.java:75)
Caused by: org.apache.maven.shared.artifact.resolve.ArtifactResolverException: Failed to read artifact descriptor for org.apache.maven.skins:maven-default-skin:jar:1.0
        at org.apache.maven.plugins.jira.JiraUnicodeTestCase.testUnicodeReport(JiraUnicodeTestCase.java:75)
Caused by: org.sonatype.aether.resolution.ArtifactDescriptorException: Failed to read artifact descriptor for org.apache.maven.skins:maven-default-skin:jar:1.0
        at org.apache.maven.plugins.jira.JiraUnicodeTestCase.testUnicodeReport(JiraUnicodeTestCase.java:75)
Caused by: org.sonatype.aether.resolution.ArtifactResolutionException: Could not transfer artifact org.apache.maven.skins:maven-default-skin:pom:1.0 from central (https://repo.maven.apache.org/maven2): Received fatal alert: protocol_version
        at org.apache.maven.plugins.jira.JiraUnicodeTestCase.testUnicodeReport(JiraUnicodeTestCase.java:75)
Caused by: org.sonatype.aether.transfer.ArtifactTransferException: Could not transfer artifact org.apache.maven.skins:maven-default-skin:pom:1.0 from central (https://repo.maven.apache.org/maven2): Received fatal alert: protocol_version
        at org.apache.maven.plugins.jira.JiraUnicodeTestCase.testUnicodeReport(JiraUnicodeTestCase.java:75)
Caused by: org.apache.maven.wagon.TransferFailedException: Received fatal alert: protocol_version
Caused by: javax.net.ssl.SSLException: Received fatal alert: protocol_version




Build log:
[...truncated 5273 lines...]
[Pipeline] }
[Pipeline] // ws
[Pipeline] }
[Pipeline] // node
[Pipeline] }
[withMaven] junitPublisher - Archive test results for Maven artifact org.apache.maven.plugins:maven-changes-plugin:maven-plugin:3.0.0-SNAPSHOT generated by maven-surefire-plugin:test (default-test): linux-jdk8-m3.6.x_build/target/surefire-reports/*.xml
Recording test results
[INFO]           announce-generate-inconsistent-issue-management/pom.xml SUCCESS (6.7 s)
[INFO] Building: report-changes-system-noissuemanagement/pom.xml
[INFO] run post-build script verify.bsh
[INFO]           announcement-generate-custom-template/pom.xml .... SUCCESS (8.4 s)
[INFO] Building: report-changes-interpolation/pom.xml
[INFO] run post-build script verify.groovy
[INFO]           report-aggregated-changes-generation/pom.xml ..... SUCCESS (8.8 s)
[INFO]
[INFO] --- maven-checkstyle-plugin:3.0.0:check (checkstyle-check) @ maven-changes-plugin ---
[INFO] run post-build script verify.bsh
[INFO]           report-changes-interpolation/pom.xml ............. SUCCESS (11.2 s)
[INFO] Building: report-changes-system/pom.xml
[INFO]
[INFO] --- maven-invoker-plugin:3.2.1:verify (integration-test) @ maven-changes-plugin ---
[INFO] -------------------------------------------------
[INFO] Build Summary:
[INFO]   Passed: 13, Failed: 0, Errors: 0, Skipped: 0
[INFO] -------------------------------------------------
[INFO] ------------------------------------------------------------------------
[INFO] BUILD SUCCESS
[INFO] ------------------------------------------------------------------------
[INFO] Total time:  02:14 min
[INFO] Finished at: 2020-02-09T21:10:55Z
[INFO] ------------------------------------------------------------------------
[INFO] [jenkins-event-spy] Generated /home/jenkins/jenkins-slave/workspace/ven-box_maven-changes-plugin_ssl@2@tmp/withMaven13d29a46/maven-spy-20200209-210841-29510408939096873561463.log
[Pipeline] }
[Pipeline] // dir
[Pipeline] }
[withMaven] openTasksPublisher - Scan Tasks for Maven artifact org.apache.maven.plugins:maven-changes-plugin:maven-plugin:3.0.0-SNAPSHOT in source directory linux-jdk8-m3.6.x_build/src/main/java
[TASKS] Scanning folder '/home/jenkins/jenkins-slave/workspace/ven-box_maven-changes-plugin_ssl@2' for files matching the pattern 'linux-jdk8-m3.6.x_build/src/main/java/**/*' - excludes: null
[TASKS] Found 48 files to scan for tasks
[TASKS] Found 4 open tasks.
Skipping warnings blame since pipelines do not have an SCM link.%n
[TASKS] Computing warning deltas based on reference build #1
[withMaven] artifactsPublisher - Archive artifact linux-jdk11-m3.6.x_build/pom.xml under org/apache/maven/plugins/maven-changes-plugin/3.0.0-SNAPSHOT/maven-changes-plugin-3.0.0-SNAPSHOT.pom
[withMaven] invokerPublisher - Archive invoker results for Maven artifact MavenArtifact{org.apache.maven.plugins:maven-changes-plugin:maven-plugin:3.0.0-SNAPSHOT(version: 3.0.0-SNAPSHOT, snapshot:false) } generated by PluginInvocation{org.apache.maven.plugins:maven-invoker-plugin:3.2.1@integration-test  integration-test}: linux-jdk8-m3.6.x_build/target/invoker-reports/*.xml
[withMaven] artifactsPublisher - Archive artifact linux-jdk11-m3.6.x_build/target/maven-changes-plugin-3.0.0-SNAPSHOT.jar under org/apache/maven/plugins/maven-changes-plugin/3.0.0-SNAPSHOT/maven-changes-plugin-3.0.0-SNAPSHOT.jar
[withMaven] junitPublisher - Archive test results for Maven artifact org.apache.maven.plugins:maven-changes-plugin:maven-plugin:3.0.0-SNAPSHOT generated by maven-surefire-plugin:test (default-test): linux-jdk11-m3.6.x_build/target/surefire-reports/*.xml
Recording test results
[INFO] run post-build script verify.bsh
[INFO]           report-changes-system-noissuemanagement/pom.xml .. SUCCESS (11.4 s)
[INFO] Building: announce-generate/pom.xml
[INFO] run post-build script verify.bsh
[INFO]           report-changes-interpolation/pom.xml ............. SUCCESS (11.7 s)
[INFO] Building: report-changes-system/pom.xml
[INFO] run post-build script verify.bsh
[INFO]           report-changes-system/pom.xml .................... SUCCESS (12.1 s)
[INFO] Building: report-changes-skip-snapshots/pom.xml
[INFO] run post-build script verify.groovy
[INFO]           announce-generate/pom.xml ........................ SUCCESS (7.7 s)
[INFO] Building: report-aggregated-changes-generation/pom.xml
[withMaven] openTasksPublisher - Scan Tasks for Maven artifact org.apache.maven.plugins:maven-changes-plugin:maven-plugin:3.0.0-SNAPSHOT in source directory linux-jdk11-m3.6.x_build/src/main/java
[TASKS] Scanning folder '/home/jenkins/jenkins-slave/workspace/ven-box_maven-changes-plugin_ssl@2' for files matching the pattern 'linux-jdk11-m3.6.x_build/src/main/java/**/*' - excludes: null
[TASKS] Found 48 files to scan for tasks
[TASKS] Found 4 open tasks.
Skipping warnings blame since pipelines do not have an SCM link.%n
[TASKS] Computing warning deltas based on reference build #1
[withMaven] invokerPublisher - Archive invoker results for Maven artifact MavenArtifact{org.apache.maven.plugins:maven-changes-plugin:maven-plugin:3.0.0-SNAPSHOT(version: 3.0.0-SNAPSHOT, snapshot:false) } generated by PluginInvocation{org.apache.maven.plugins:maven-invoker-plugin:3.2.1@integration-test  integration-test}: linux-jdk11-m3.6.x_build/target/invoker-reports/*.xml
[withMaven] Publishers: Generated Artifacts Publisher: 1289 ms, Junit Publisher: 9295 ms, Open Task Scanner Publisher: 908 ms, Dependencies Fingerprint Publisher: 1 ms, Invoker Publisher: 11593 ms, Pipeline Graph Publisher: 1 ms
[Pipeline] // withMaven
[Pipeline] cleanWs
[WS-CLEANUP] Deleting project workspace...
[WS-CLEANUP] Deferred wipeout is used...
[WS-CLEANUP] done
[Pipeline] }
[Pipeline] // stage
[Pipeline] }
[Pipeline] // ws
[Pipeline] }
[Pipeline] // node
[Pipeline] }
[INFO] run post-build script verify.groovy
[INFO]           report-changes-skip-snapshots/pom.xml ............ SUCCESS (8.7 s)
[INFO] Building: announce-generate-no-url/pom.xml
[INFO] run post-build script verify.bsh
[INFO]           report-changes-system/pom.xml .................... SUCCESS (11.7 s)
[INFO] Building: report-changes-skip-snapshots/pom.xml
[INFO]           announce-generate-no-url/pom.xml ................. SUCCESS (7.1 s)
[INFO] Building: announce-generate-no-issue-management/pom.xml
[INFO] run post-build script verify.groovy
[INFO]           report-aggregated-changes-generation/pom.xml ..... SUCCESS (12.6 s)
[INFO] Building: report-changes-interpolation/pom.xml
[INFO] run post-build script verify.groovy
[INFO]           report-changes-skip-snapshots/pom.xml ............ SUCCESS (8.9 s)
[INFO] Building: announce-generate-no-url/pom.xml
[withMaven] Publishers: Generated Artifacts Publisher: 1269 ms, Junit Publisher: 8526 ms, Open Task Scanner Publisher: 870 ms, Invoker Publisher: 11367 ms
[Pipeline] // withMaven
[Pipeline] cleanWs
[WS-CLEANUP] Deleting project workspace...
[WS-CLEANUP] Deferred wipeout is used...
[WS-CLEANUP] done
[Pipeline] }
[Pipeline] // stage
[Pipeline] }
[Pipeline] // ws
[Pipeline] }
[Pipeline] // node
[Pipeline] }
[INFO]           announce-generate-no-issue-management/pom.xml .... SUCCESS (7.2 s)
[INFO]
[INFO] --- maven-checkstyle-plugin:3.0.0:check (checkstyle-check) @ maven-changes-plugin ---
[INFO]           announce-generate-no-url/pom.xml ................. SUCCESS (7.1 s)
[INFO] Building: announce-generate-no-issue-management/pom.xml
[INFO]
[INFO] --- maven-invoker-plugin:3.2.1:verify (integration-test) @ maven-changes-plugin ---
[INFO] -------------------------------------------------
[INFO] Build Summary:
[INFO]   Passed: 13, Failed: 0, Errors: 0, Skipped: 0
[INFO] -------------------------------------------------
[INFO] ------------------------------------------------------------------------
[INFO] BUILD SUCCESS
[INFO] ------------------------------------------------------------------------
[INFO] Total time:  02:47 min
[INFO] Finished at: 2020-02-09T21:11:34Z
[INFO] ------------------------------------------------------------------------
[INFO] run post-build script verify.bsh
[INFO]           report-changes-interpolation/pom.xml ............. SUCCESS (11.1 s)
[INFO]
[INFO] --- maven-checkstyle-plugin:3.0.0:check (checkstyle-check) @ maven-changes-plugin ---
[INFO] [jenkins-event-spy] Generated /home/jenkins/jenkins-slave/workspace/ven-box_maven-changes-plugin_ssl@2@2@tmp/withMaven1dcd2f40/maven-spy-20200209-210846-8701063347981109946456.log
[Pipeline] }
[Pipeline] // dir
[Pipeline] }
[withMaven] artifactsPublisher - Archive artifact linux-jdk7-m3.6.x_build/pom.xml under org/apache/maven/plugins/maven-changes-plugin/3.0.0-SNAPSHOT/maven-changes-plugin-3.0.0-SNAPSHOT.pom
[withMaven] artifactsPublisher - Archive artifact linux-jdk7-m3.6.x_build/target/maven-changes-plugin-3.0.0-SNAPSHOT.jar under org/apache/maven/plugins/maven-changes-plugin/3.0.0-SNAPSHOT/maven-changes-plugin-3.0.0-SNAPSHOT.jar
[withMaven] junitPublisher - Archive test results for Maven artifact org.apache.maven.plugins:maven-changes-plugin:maven-plugin:3.0.0-SNAPSHOT generated by maven-surefire-plugin:test (default-test): linux-jdk7-m3.6.x_build/target/surefire-reports/*.xml
Recording test results
[INFO]           announce-generate-no-issue-management/pom.xml .... SUCCESS (7.5 s)
[INFO]
[INFO] --- maven-checkstyle-plugin:3.0.0:check (checkstyle-check) @ maven-changes-plugin ---
[INFO]
[INFO] --- maven-invoker-plugin:3.2.1:verify (integration-test) @ maven-changes-plugin ---
[INFO] -------------------------------------------------
[INFO] Build Summary:
[INFO]   Passed: 13, Failed: 0, Errors: 0, Skipped: 0
[INFO] -------------------------------------------------
[INFO] ------------------------------------------------------------------------
[INFO] BUILD SUCCESS
[INFO] ------------------------------------------------------------------------
[INFO] Total time: 02:50 min
[INFO] Finished at: 2020-02-09T21:11:36+00:00
[INFO] Final Memory: 59M/1773M
[INFO] ------------------------------------------------------------------------
[INFO] [jenkins-event-spy] Generated /home/jenkins/jenkins-slave/workspace/ven-box_maven-changes-plugin_ssl@2@tmp/withMavena05c5754/maven-spy-20200209-210845-5634743479597527855350.log
[Pipeline] }
[INFO]
[INFO] --- maven-invoker-plugin:3.2.1:verify (integration-test) @ maven-changes-plugin ---
[INFO] -------------------------------------------------
[INFO] Build Summary:
[INFO]   Passed: 13, Failed: 0, Errors: 0, Skipped: 0
[INFO] -------------------------------------------------
[INFO] ------------------------------------------------------------------------
[INFO] BUILD SUCCESS
[INFO] ------------------------------------------------------------------------
[INFO] Total time: 02:56 min
[INFO] Finished at: 2020-02-09T21:11:42Z
[INFO] ------------------------------------------------------------------------
[INFO] [jenkins-event-spy] Generated /home/jenkins/jenkins-slave/workspace/ven-box_maven-changes-plugin_ssl@3@tmp/withMaven53c47cce/maven-spy-20200209-210845-9897151257603529960648.log
[Pipeline] // dir
[Pipeline] }
[Pipeline] }
[Pipeline] // dir
[Pipeline] }
[withMaven] openTasksPublisher - Scan Tasks for Maven artifact org.apache.maven.plugins:maven-changes-plugin:maven-plugin:3.0.0-SNAPSHOT in source directory linux-jdk7-m3.6.x_build/src/main/java
[TASKS] Scanning folder '/home/jenkins/jenkins-slave/workspace/ven-box_maven-changes-plugin_ssl@2@2' for files matching the pattern 'linux-jdk7-m3.6.x_build/src/main/java/**/*' - excludes: null
[TASKS] Found 48 files to scan for tasks
[TASKS] Found 4 open tasks.
Skipping warnings blame since pipelines do not have an SCM link.%n
[TASKS] Computing warning deltas based on reference build #1
[withMaven] artifactsPublisher - Archive artifact linux-jdk7-m3.5.x_build/pom.xml under org/apache/maven/plugins/maven-changes-plugin/3.0.0-SNAPSHOT/maven-changes-plugin-3.0.0-SNAPSHOT.pom
[withMaven] artifactsPublisher - Archive artifact linux-jdk7-m3.5.x_build/target/maven-changes-plugin-3.0.0-SNAPSHOT.jar under org/apache/maven/plugins/maven-changes-plugin/3.0.0-SNAPSHOT/maven-changes-plugin-3.0.0-SNAPSHOT.jar
[withMaven] artifactsPublisher - Archive artifact linux-jdk7-m3.2.x_build/pom.xml under org/apache/maven/plugins/maven-changes-plugin/3.0.0-SNAPSHOT/maven-changes-plugin-3.0.0-SNAPSHOT.pom
[withMaven] invokerPublisher - Archive invoker results for Maven artifact MavenArtifact{org.apache.maven.plugins:maven-changes-plugin:maven-plugin:3.0.0-SNAPSHOT(version: 3.0.0-SNAPSHOT, snapshot:false) } generated by PluginInvocation{org.apache.maven.plugins:maven-invoker-plugin:3.2.1@integration-test  integration-test}: linux-jdk7-m3.6.x_build/target/invoker-reports/*.xml
[withMaven] artifactsPublisher - Archive artifact linux-jdk7-m3.2.x_build/target/maven-changes-plugin-3.0.0-SNAPSHOT.jar under org/apache/maven/plugins/maven-changes-plugin/3.0.0-SNAPSHOT/maven-changes-plugin-3.0.0-SNAPSHOT.jar
[withMaven] junitPublisher - Archive test results for Maven artifact org.apache.maven.plugins:maven-changes-plugin:maven-plugin:3.0.0-SNAPSHOT generated by maven-surefire-plugin:test (default-test): linux-jdk7-m3.5.x_build/target/surefire-reports/*.xml
Recording test results
[withMaven] junitPublisher - Archive test results for Maven artifact org.apache.maven.plugins:maven-changes-plugin:maven-plugin:3.0.0-SNAPSHOT generated by maven-surefire-plugin:test (default-test): linux-jdk7-m3.2.x_build/target/surefire-reports/*.xml
Recording test results
[withMaven] openTasksPublisher - Scan Tasks for Maven artifact org.apache.maven.plugins:maven-changes-plugin:maven-plugin:3.0.0-SNAPSHOT in source directory linux-jdk7-m3.5.x_build/src/main/java
[TASKS] Scanning folder '/home/jenkins/jenkins-slave/workspace/ven-box_maven-changes-plugin_ssl@3' for files matching the pattern 'linux-jdk7-m3.5.x_build/src/main/java/**/*' - excludes: null
[TASKS] Found 48 files to scan for tasks
[TASKS] Found 4 open tasks.
Skipping warnings blame since pipelines do not have an SCM link.%n
[TASKS] Computing warning deltas based on reference build #1
[withMaven] invokerPublisher - Archive invoker results for Maven artifact MavenArtifact{org.apache.maven.plugins:maven-changes-plugin:maven-plugin:3.0.0-SNAPSHOT(version: 3.0.0-SNAPSHOT, snapshot:false) } generated by PluginInvocation{org.apache.maven.plugins:maven-invoker-plugin:3.2.1@integration-test  integration-test}: linux-jdk7-m3.5.x_build/target/invoker-reports/*.xml
[withMaven] Publishers: Generated Artifacts Publisher: 1274 ms, Junit Publisher: 8667 ms, Open Task Scanner Publisher: 921 ms, Dependencies Fingerprint Publisher: 1 ms, Invoker Publisher: 18487 ms, Pipeline Graph Publisher: 1 ms
[withMaven] openTasksPublisher - Scan Tasks for Maven artifact org.apache.maven.plugins:maven-changes-plugin:maven-plugin:3.0.0-SNAPSHOT in source directory linux-jdk7-m3.2.x_build/src/main/java
[Pipeline] // withMaven
[Pipeline] cleanWs
[TASKS] Scanning folder '/home/jenkins/jenkins-slave/workspace/ven-box_maven-changes-plugin_ssl@2' for files matching the pattern 'linux-jdk7-m3.2.x_build/src/main/java/**/*' - excludes: null
[TASKS] Found 48 files to scan for tasks
[TASKS] Found 4 open tasks.
Skipping warnings blame since pipelines do not have an SCM link.%n
[TASKS] Computing warning deltas based on reference build #1
[WS-CLEANUP] Deleting project workspace...
[WS-CLEANUP] Deferred wipeout is used...
[WS-CLEANUP] done
[Pipeline] }
[Pipeline] // stage
[Pipeline] }
[Pipeline] // ws
[Pipeline] }
[Pipeline] // node
[Pipeline] }
[withMaven] invokerPublisher - Archive invoker results for Maven artifact MavenArtifact{org.apache.maven.plugins:maven-changes-plugin:maven-plugin:3.0.0-SNAPSHOT(version: 3.0.0-SNAPSHOT, snapshot:false) } generated by PluginInvocation{org.apache.maven.plugins:maven-invoker-plugin:3.2.1@integration-test  integration-test}: linux-jdk7-m3.2.x_build/target/invoker-reports/*.xml
[withMaven] Publishers: Generated Artifacts Publisher: 1229 ms, Junit Publisher: 8553 ms, Open Task Scanner Publisher: 925 ms, Dependencies Fingerprint Publisher: 1 ms, Invoker Publisher: 12466 ms, Pipeline Graph Publisher: 1 ms
[Pipeline] // withMaven
[Pipeline] cleanWs
[WS-CLEANUP] Deleting project workspace...
[WS-CLEANUP] Deferred wipeout is used...
[WS-CLEANUP] done
[Pipeline] }
[Pipeline] // stage
[Pipeline] }
[Pipeline] // ws
[Pipeline] }
[Pipeline] // node
[Pipeline] }
[withMaven] Publishers: Generated Artifacts Publisher: 1273 ms, Junit Publisher: 17587 ms, Open Task Scanner Publisher: 1234 ms, Dependencies Fingerprint Publisher: 1 ms, Invoker Publisher: 11883 ms, Pipeline Graph Publisher: 9 ms
[Pipeline] // withMaven
[Pipeline] cleanWs
[WS-CLEANUP] Deleting project workspace...
[WS-CLEANUP] Deferred wipeout is used...
[WS-CLEANUP] done
[Pipeline] }
[Pipeline] // stage
[Pipeline] }
[Pipeline] // ws
[Pipeline] }
[Pipeline] // node
[Pipeline] }
[Pipeline] // parallel
[Pipeline] stage
[Pipeline] { (Notifications)
[Pipeline] echo
Build result: UNSTABLE
[Pipeline] jiraIssueSelector
[Pipeline] echo
The authors of changes [slachiewicz].
[Pipeline] echo
Sending email ...
[Pipeline] emailext