Build unstable in Jenkins: Maven TLP » maven-changes-plugin » master #25

classic Classic list List threaded Threaded
4 messages Options
Reply | Threaded
Open this post in threaded view
|

Build unstable in Jenkins: Maven TLP » maven-changes-plugin » master #25

Apache Jenkins Server-2
See https://builds.apache.org/job/maven-box/job/maven-changes-plugin/job/master/25/

Changes:

* H30 is having issues
* H23 has issues.
* GitHub emails should not trigger notifier which otherwise breaks the
* Revert "GitHub emails should not trigger notifier which otherwise breaks
* H40 is unstable
* GitHub emails should not trigger notifier which otherwise breaks the
* send email if authors exist
* fixed Scripts not permitted to use staticMethod
* H24 in unstable

12 tests failed.
FAILED:  org.apache.maven.plugins.jira.JiraUnicodeTestCase.linux-jdk8-m3.6.x_build / Build linux-jdk8-m3.6.x_build / testUnicodeReport

Error Message:
Couldn't resolve the skin.

Stack Trace:
org.apache.maven.plugin.MojoExecutionException: Couldn't resolve the skin.
        at org.apache.maven.plugins.jira.JiraUnicodeTestCase.testUnicodeReport(JiraUnicodeTestCase.java:75)
Caused by: org.apache.maven.shared.artifact.resolve.ArtifactResolverException: Failed to read artifact descriptor for org.apache.maven.skins:maven-default-skin:jar:1.0
        at org.apache.maven.plugins.jira.JiraUnicodeTestCase.testUnicodeReport(JiraUnicodeTestCase.java:75)
Caused by: org.sonatype.aether.resolution.ArtifactDescriptorException: Failed to read artifact descriptor for org.apache.maven.skins:maven-default-skin:jar:1.0
        at org.apache.maven.plugins.jira.JiraUnicodeTestCase.testUnicodeReport(JiraUnicodeTestCase.java:75)
Caused by: org.sonatype.aether.resolution.ArtifactResolutionException: Could not transfer artifact org.apache.maven.skins:maven-default-skin:pom:1.0 from central (http://repo1.maven.org/maven2): Failed to transfer file: http://repo1.maven.org/maven2/org/apache/maven/skins/maven-default-skin/1.0/maven-default-skin-1.0.pom. Return code is: 501
        at org.apache.maven.plugins.jira.JiraUnicodeTestCase.testUnicodeReport(JiraUnicodeTestCase.java:75)
Caused by: org.sonatype.aether.transfer.ArtifactTransferException: Could not transfer artifact org.apache.maven.skins:maven-default-skin:pom:1.0 from central (http://repo1.maven.org/maven2): Failed to transfer file: http://repo1.maven.org/maven2/org/apache/maven/skins/maven-default-skin/1.0/maven-default-skin-1.0.pom. Return code is: 501
        at org.apache.maven.plugins.jira.JiraUnicodeTestCase.testUnicodeReport(JiraUnicodeTestCase.java:75)
Caused by: org.apache.maven.wagon.TransferFailedException: Failed to transfer file: http://repo1.maven.org/maven2/org/apache/maven/skins/maven-default-skin/1.0/maven-default-skin-1.0.pom. Return code is: 501


FAILED:  org.apache.maven.plugins.jira.JiraUnicodeTestCase.linux-jdk7-m3.2.x_build / Build linux-jdk7-m3.2.x_build / testUnicodeReport

Error Message:
Couldn't resolve the skin.

Stack Trace:
org.apache.maven.plugin.MojoExecutionException: Couldn't resolve the skin.
        at org.apache.maven.plugins.jira.JiraUnicodeTestCase.testUnicodeReport(JiraUnicodeTestCase.java:75)
Caused by: org.apache.maven.shared.artifact.resolve.ArtifactResolverException: Failed to read artifact descriptor for org.apache.maven.skins:maven-default-skin:jar:1.0
        at org.apache.maven.plugins.jira.JiraUnicodeTestCase.testUnicodeReport(JiraUnicodeTestCase.java:75)
Caused by: org.sonatype.aether.resolution.ArtifactDescriptorException: Failed to read artifact descriptor for org.apache.maven.skins:maven-default-skin:jar:1.0
        at org.apache.maven.plugins.jira.JiraUnicodeTestCase.testUnicodeReport(JiraUnicodeTestCase.java:75)
Caused by: org.sonatype.aether.resolution.ArtifactResolutionException: Could not transfer artifact org.apache.maven.skins:maven-default-skin:pom:1.0 from central (http://repo1.maven.org/maven2): Failed to transfer file: http://repo1.maven.org/maven2/org/apache/maven/skins/maven-default-skin/1.0/maven-default-skin-1.0.pom. Return code is: 501
        at org.apache.maven.plugins.jira.JiraUnicodeTestCase.testUnicodeReport(JiraUnicodeTestCase.java:75)
Caused by: org.sonatype.aether.transfer.ArtifactTransferException: Could not transfer artifact org.apache.maven.skins:maven-default-skin:pom:1.0 from central (http://repo1.maven.org/maven2): Failed to transfer file: http://repo1.maven.org/maven2/org/apache/maven/skins/maven-default-skin/1.0/maven-default-skin-1.0.pom. Return code is: 501
        at org.apache.maven.plugins.jira.JiraUnicodeTestCase.testUnicodeReport(JiraUnicodeTestCase.java:75)
Caused by: org.apache.maven.wagon.TransferFailedException: Failed to transfer file: http://repo1.maven.org/maven2/org/apache/maven/skins/maven-default-skin/1.0/maven-default-skin-1.0.pom. Return code is: 501


FAILED:  org.apache.maven.plugins.jira.JiraUnicodeTestCase.linux-jdk11-m3.6.x_build / Build linux-jdk11-m3.6.x_build / testUnicodeReport

Error Message:
Couldn't resolve the skin.

Stack Trace:
org.apache.maven.plugin.MojoExecutionException: Couldn't resolve the skin.
        at org.apache.maven.plugins.jira.JiraUnicodeTestCase.testUnicodeReport(JiraUnicodeTestCase.java:75)
Caused by: org.apache.maven.shared.artifact.resolve.ArtifactResolverException: Failed to read artifact descriptor for org.apache.maven.skins:maven-default-skin:jar:1.0
        at org.apache.maven.plugins.jira.JiraUnicodeTestCase.testUnicodeReport(JiraUnicodeTestCase.java:75)
Caused by: org.sonatype.aether.resolution.ArtifactDescriptorException: Failed to read artifact descriptor for org.apache.maven.skins:maven-default-skin:jar:1.0
        at org.apache.maven.plugins.jira.JiraUnicodeTestCase.testUnicodeReport(JiraUnicodeTestCase.java:75)
Caused by: org.sonatype.aether.resolution.ArtifactResolutionException: Could not transfer artifact org.apache.maven.skins:maven-default-skin:pom:1.0 from central (http://repo1.maven.org/maven2): Failed to transfer file: http://repo1.maven.org/maven2/org/apache/maven/skins/maven-default-skin/1.0/maven-default-skin-1.0.pom. Return code is: 501
        at org.apache.maven.plugins.jira.JiraUnicodeTestCase.testUnicodeReport(JiraUnicodeTestCase.java:75)
Caused by: org.sonatype.aether.transfer.ArtifactTransferException: Could not transfer artifact org.apache.maven.skins:maven-default-skin:pom:1.0 from central (http://repo1.maven.org/maven2): Failed to transfer file: http://repo1.maven.org/maven2/org/apache/maven/skins/maven-default-skin/1.0/maven-default-skin-1.0.pom. Return code is: 501
        at org.apache.maven.plugins.jira.JiraUnicodeTestCase.testUnicodeReport(JiraUnicodeTestCase.java:75)
Caused by: org.apache.maven.wagon.TransferFailedException: Failed to transfer file: http://repo1.maven.org/maven2/org/apache/maven/skins/maven-default-skin/1.0/maven-default-skin-1.0.pom. Return code is: 501


FAILED:  org.apache.maven.plugins.jira.JiraUnicodeTestCase.linux-jdk7-m3.5.x_build / Build linux-jdk7-m3.5.x_build / testUnicodeReport

Error Message:
Couldn't resolve the skin.

Stack Trace:
org.apache.maven.plugin.MojoExecutionException: Couldn't resolve the skin.
        at org.apache.maven.plugins.jira.JiraUnicodeTestCase.testUnicodeReport(JiraUnicodeTestCase.java:75)
Caused by: org.apache.maven.shared.artifact.resolve.ArtifactResolverException: Failed to read artifact descriptor for org.apache.maven.skins:maven-default-skin:jar:1.0
        at org.apache.maven.plugins.jira.JiraUnicodeTestCase.testUnicodeReport(JiraUnicodeTestCase.java:75)
Caused by: org.sonatype.aether.resolution.ArtifactDescriptorException: Failed to read artifact descriptor for org.apache.maven.skins:maven-default-skin:jar:1.0
        at org.apache.maven.plugins.jira.JiraUnicodeTestCase.testUnicodeReport(JiraUnicodeTestCase.java:75)
Caused by: org.sonatype.aether.resolution.ArtifactResolutionException: Could not transfer artifact org.apache.maven.skins:maven-default-skin:pom:1.0 from central (http://repo1.maven.org/maven2): Failed to transfer file: http://repo1.maven.org/maven2/org/apache/maven/skins/maven-default-skin/1.0/maven-default-skin-1.0.pom. Return code is: 501
        at org.apache.maven.plugins.jira.JiraUnicodeTestCase.testUnicodeReport(JiraUnicodeTestCase.java:75)
Caused by: org.sonatype.aether.transfer.ArtifactTransferException: Could not transfer artifact org.apache.maven.skins:maven-default-skin:pom:1.0 from central (http://repo1.maven.org/maven2): Failed to transfer file: http://repo1.maven.org/maven2/org/apache/maven/skins/maven-default-skin/1.0/maven-default-skin-1.0.pom. Return code is: 501
        at org.apache.maven.plugins.jira.JiraUnicodeTestCase.testUnicodeReport(JiraUnicodeTestCase.java:75)
Caused by: org.apache.maven.wagon.TransferFailedException: Failed to transfer file: http://repo1.maven.org/maven2/org/apache/maven/skins/maven-default-skin/1.0/maven-default-skin-1.0.pom. Return code is: 501


FAILED:  org.apache.maven.plugins.jira.JiraUnicodeTestCase.linux-jdk7-m3.3.x_build / Build linux-jdk7-m3.3.x_build / testUnicodeReport

Error Message:
Couldn't resolve the skin.

Stack Trace:
org.apache.maven.plugin.MojoExecutionException: Couldn't resolve the skin.
        at org.apache.maven.plugins.jira.JiraUnicodeTestCase.testUnicodeReport(JiraUnicodeTestCase.java:75)
Caused by: org.apache.maven.shared.artifact.resolve.ArtifactResolverException: Failed to read artifact descriptor for org.apache.maven.skins:maven-default-skin:jar:1.0
        at org.apache.maven.plugins.jira.JiraUnicodeTestCase.testUnicodeReport(JiraUnicodeTestCase.java:75)
Caused by: org.sonatype.aether.resolution.ArtifactDescriptorException: Failed to read artifact descriptor for org.apache.maven.skins:maven-default-skin:jar:1.0
        at org.apache.maven.plugins.jira.JiraUnicodeTestCase.testUnicodeReport(JiraUnicodeTestCase.java:75)
Caused by: org.sonatype.aether.resolution.ArtifactResolutionException: Could not transfer artifact org.apache.maven.skins:maven-default-skin:pom:1.0 from central (http://repo1.maven.org/maven2): Failed to transfer file: http://repo1.maven.org/maven2/org/apache/maven/skins/maven-default-skin/1.0/maven-default-skin-1.0.pom. Return code is: 501
        at org.apache.maven.plugins.jira.JiraUnicodeTestCase.testUnicodeReport(JiraUnicodeTestCase.java:75)
Caused by: org.sonatype.aether.transfer.ArtifactTransferException: Could not transfer artifact org.apache.maven.skins:maven-default-skin:pom:1.0 from central (http://repo1.maven.org/maven2): Failed to transfer file: http://repo1.maven.org/maven2/org/apache/maven/skins/maven-default-skin/1.0/maven-default-skin-1.0.pom. Return code is: 501
        at org.apache.maven.plugins.jira.JiraUnicodeTestCase.testUnicodeReport(JiraUnicodeTestCase.java:75)
Caused by: org.apache.maven.wagon.TransferFailedException: Failed to transfer file: http://repo1.maven.org/maven2/org/apache/maven/skins/maven-default-skin/1.0/maven-default-skin-1.0.pom. Return code is: 501


FAILED:  org.apache.maven.plugins.jira.JiraUnicodeTestCase.linux-jdk7-m3.6.x_build / Build linux-jdk7-m3.6.x_build / testUnicodeReport

Error Message:
Couldn't resolve the skin.

Stack Trace:
org.apache.maven.plugin.MojoExecutionException: Couldn't resolve the skin.
        at org.apache.maven.plugins.jira.JiraUnicodeTestCase.testUnicodeReport(JiraUnicodeTestCase.java:75)
Caused by: org.apache.maven.shared.artifact.resolve.ArtifactResolverException: Failed to read artifact descriptor for org.apache.maven.skins:maven-default-skin:jar:1.0
        at org.apache.maven.plugins.jira.JiraUnicodeTestCase.testUnicodeReport(JiraUnicodeTestCase.java:75)
Caused by: org.sonatype.aether.resolution.ArtifactDescriptorException: Failed to read artifact descriptor for org.apache.maven.skins:maven-default-skin:jar:1.0
        at org.apache.maven.plugins.jira.JiraUnicodeTestCase.testUnicodeReport(JiraUnicodeTestCase.java:75)
Caused by: org.sonatype.aether.resolution.ArtifactResolutionException: Could not transfer artifact org.apache.maven.skins:maven-default-skin:pom:1.0 from central (http://repo1.maven.org/maven2): Failed to transfer file: http://repo1.maven.org/maven2/org/apache/maven/skins/maven-default-skin/1.0/maven-default-skin-1.0.pom. Return code is: 501
        at org.apache.maven.plugins.jira.JiraUnicodeTestCase.testUnicodeReport(JiraUnicodeTestCase.java:75)
Caused by: org.sonatype.aether.transfer.ArtifactTransferException: Could not transfer artifact org.apache.maven.skins:maven-default-skin:pom:1.0 from central (http://repo1.maven.org/maven2): Failed to transfer file: http://repo1.maven.org/maven2/org/apache/maven/skins/maven-default-skin/1.0/maven-default-skin-1.0.pom. Return code is: 501
        at org.apache.maven.plugins.jira.JiraUnicodeTestCase.testUnicodeReport(JiraUnicodeTestCase.java:75)
Caused by: org.apache.maven.wagon.TransferFailedException: Failed to transfer file: http://repo1.maven.org/maven2/org/apache/maven/skins/maven-default-skin/1.0/maven-default-skin-1.0.pom. Return code is: 501


FAILED:  org.apache.maven.plugins.jira.JiraUnicodeTestCase.windows-jdk7-m3.2.x_build / Build windows-jdk7-m3.2.x_build / testUnicodeReport

Error Message:
Couldn't resolve the skin.

Stack Trace:
org.apache.maven.plugin.MojoExecutionException: Couldn't resolve the skin.
        at org.apache.maven.plugins.jira.JiraUnicodeTestCase.testUnicodeReport(JiraUnicodeTestCase.java:75)
Caused by: org.apache.maven.shared.artifact.resolve.ArtifactResolverException: Failed to read artifact descriptor for org.apache.maven.skins:maven-default-skin:jar:1.0
        at org.apache.maven.plugins.jira.JiraUnicodeTestCase.testUnicodeReport(JiraUnicodeTestCase.java:75)
Caused by: org.sonatype.aether.resolution.ArtifactDescriptorException: Failed to read artifact descriptor for org.apache.maven.skins:maven-default-skin:jar:1.0
        at org.apache.maven.plugins.jira.JiraUnicodeTestCase.testUnicodeReport(JiraUnicodeTestCase.java:75)
Caused by: org.sonatype.aether.resolution.ArtifactResolutionException: Could not transfer artifact org.apache.maven.skins:maven-default-skin:pom:1.0 from central (http://repo1.maven.org/maven2): Failed to transfer file: http://repo1.maven.org/maven2/org/apache/maven/skins/maven-default-skin/1.0/maven-default-skin-1.0.pom. Return code is: 501
        at org.apache.maven.plugins.jira.JiraUnicodeTestCase.testUnicodeReport(JiraUnicodeTestCase.java:75)
Caused by: org.sonatype.aether.transfer.ArtifactTransferException: Could not transfer artifact org.apache.maven.skins:maven-default-skin:pom:1.0 from central (http://repo1.maven.org/maven2): Failed to transfer file: http://repo1.maven.org/maven2/org/apache/maven/skins/maven-default-skin/1.0/maven-default-skin-1.0.pom. Return code is: 501
        at org.apache.maven.plugins.jira.JiraUnicodeTestCase.testUnicodeReport(JiraUnicodeTestCase.java:75)
Caused by: org.apache.maven.wagon.TransferFailedException: Failed to transfer file: http://repo1.maven.org/maven2/org/apache/maven/skins/maven-default-skin/1.0/maven-default-skin-1.0.pom. Return code is: 501


FAILED:  org.apache.maven.plugins.jira.JiraUnicodeTestCase.windows-jdk7-m3.3.x_build / Build windows-jdk7-m3.3.x_build / testUnicodeReport

Error Message:
Couldn't resolve the skin.

Stack Trace:
org.apache.maven.plugin.MojoExecutionException: Couldn't resolve the skin.
        at org.apache.maven.plugins.jira.JiraUnicodeTestCase.testUnicodeReport(JiraUnicodeTestCase.java:75)
Caused by: org.apache.maven.shared.artifact.resolve.ArtifactResolverException: Failed to read artifact descriptor for org.apache.maven.skins:maven-default-skin:jar:1.0
        at org.apache.maven.plugins.jira.JiraUnicodeTestCase.testUnicodeReport(JiraUnicodeTestCase.java:75)
Caused by: org.sonatype.aether.resolution.ArtifactDescriptorException: Failed to read artifact descriptor for org.apache.maven.skins:maven-default-skin:jar:1.0
        at org.apache.maven.plugins.jira.JiraUnicodeTestCase.testUnicodeReport(JiraUnicodeTestCase.java:75)
Caused by: org.sonatype.aether.resolution.ArtifactResolutionException: Could not transfer artifact org.apache.maven.skins:maven-default-skin:pom:1.0 from central (http://repo1.maven.org/maven2): Failed to transfer file: http://repo1.maven.org/maven2/org/apache/maven/skins/maven-default-skin/1.0/maven-default-skin-1.0.pom. Return code is: 501
        at org.apache.maven.plugins.jira.JiraUnicodeTestCase.testUnicodeReport(JiraUnicodeTestCase.java:75)
Caused by: org.sonatype.aether.transfer.ArtifactTransferException: Could not transfer artifact org.apache.maven.skins:maven-default-skin:pom:1.0 from central (http://repo1.maven.org/maven2): Failed to transfer file: http://repo1.maven.org/maven2/org/apache/maven/skins/maven-default-skin/1.0/maven-default-skin-1.0.pom. Return code is: 501
        at org.apache.maven.plugins.jira.JiraUnicodeTestCase.testUnicodeReport(JiraUnicodeTestCase.java:75)
Caused by: org.apache.maven.wagon.TransferFailedException: Failed to transfer file: http://repo1.maven.org/maven2/org/apache/maven/skins/maven-default-skin/1.0/maven-default-skin-1.0.pom. Return code is: 501


FAILED:  org.apache.maven.plugins.jira.JiraUnicodeTestCase.windows-jdk8-m3.6.x_build / Build windows-jdk8-m3.6.x_build / testUnicodeReport

Error Message:
Couldn't resolve the skin.

Stack Trace:
org.apache.maven.plugin.MojoExecutionException: Couldn't resolve the skin.
        at org.apache.maven.plugins.jira.JiraUnicodeTestCase.testUnicodeReport(JiraUnicodeTestCase.java:75)
Caused by: org.apache.maven.shared.artifact.resolve.ArtifactResolverException: Failed to read artifact descriptor for org.apache.maven.skins:maven-default-skin:jar:1.0
        at org.apache.maven.plugins.jira.JiraUnicodeTestCase.testUnicodeReport(JiraUnicodeTestCase.java:75)
Caused by: org.sonatype.aether.resolution.ArtifactDescriptorException: Failed to read artifact descriptor for org.apache.maven.skins:maven-default-skin:jar:1.0
        at org.apache.maven.plugins.jira.JiraUnicodeTestCase.testUnicodeReport(JiraUnicodeTestCase.java:75)
Caused by: org.sonatype.aether.resolution.ArtifactResolutionException: Could not transfer artifact org.apache.maven.skins:maven-default-skin:pom:1.0 from central (http://repo1.maven.org/maven2): Failed to transfer file: http://repo1.maven.org/maven2/org/apache/maven/skins/maven-default-skin/1.0/maven-default-skin-1.0.pom. Return code is: 501
        at org.apache.maven.plugins.jira.JiraUnicodeTestCase.testUnicodeReport(JiraUnicodeTestCase.java:75)
Caused by: org.sonatype.aether.transfer.ArtifactTransferException: Could not transfer artifact org.apache.maven.skins:maven-default-skin:pom:1.0 from central (http://repo1.maven.org/maven2): Failed to transfer file: http://repo1.maven.org/maven2/org/apache/maven/skins/maven-default-skin/1.0/maven-default-skin-1.0.pom. Return code is: 501
        at org.apache.maven.plugins.jira.JiraUnicodeTestCase.testUnicodeReport(JiraUnicodeTestCase.java:75)
Caused by: org.apache.maven.wagon.TransferFailedException: Failed to transfer file: http://repo1.maven.org/maven2/org/apache/maven/skins/maven-default-skin/1.0/maven-default-skin-1.0.pom. Return code is: 501


FAILED:  org.apache.maven.plugins.jira.JiraUnicodeTestCase.windows-jdk11-m3.6.x_build / Build windows-jdk11-m3.6.x_build / testUnicodeReport

Error Message:
Couldn't resolve the skin.

Stack Trace:
org.apache.maven.plugin.MojoExecutionException: Couldn't resolve the skin.
        at org.apache.maven.plugins.jira.JiraUnicodeTestCase.testUnicodeReport(JiraUnicodeTestCase.java:75)
Caused by: org.apache.maven.shared.artifact.resolve.ArtifactResolverException: Failed to read artifact descriptor for org.apache.maven.skins:maven-default-skin:jar:1.0
        at org.apache.maven.plugins.jira.JiraUnicodeTestCase.testUnicodeReport(JiraUnicodeTestCase.java:75)
Caused by: org.sonatype.aether.resolution.ArtifactDescriptorException: Failed to read artifact descriptor for org.apache.maven.skins:maven-default-skin:jar:1.0
        at org.apache.maven.plugins.jira.JiraUnicodeTestCase.testUnicodeReport(JiraUnicodeTestCase.java:75)
Caused by: org.sonatype.aether.resolution.ArtifactResolutionException: Could not transfer artifact org.apache.maven.skins:maven-default-skin:pom:1.0 from central (http://repo1.maven.org/maven2): Failed to transfer file: http://repo1.maven.org/maven2/org/apache/maven/skins/maven-default-skin/1.0/maven-default-skin-1.0.pom. Return code is: 501
        at org.apache.maven.plugins.jira.JiraUnicodeTestCase.testUnicodeReport(JiraUnicodeTestCase.java:75)
Caused by: org.sonatype.aether.transfer.ArtifactTransferException: Could not transfer artifact org.apache.maven.skins:maven-default-skin:pom:1.0 from central (http://repo1.maven.org/maven2): Failed to transfer file: http://repo1.maven.org/maven2/org/apache/maven/skins/maven-default-skin/1.0/maven-default-skin-1.0.pom. Return code is: 501
        at org.apache.maven.plugins.jira.JiraUnicodeTestCase.testUnicodeReport(JiraUnicodeTestCase.java:75)
Caused by: org.apache.maven.wagon.TransferFailedException: Failed to transfer file: http://repo1.maven.org/maven2/org/apache/maven/skins/maven-default-skin/1.0/maven-default-skin-1.0.pom. Return code is: 501


FAILED:  org.apache.maven.plugins.jira.JiraUnicodeTestCase.windows-jdk7-m3.5.x_build / Build windows-jdk7-m3.5.x_build / testUnicodeReport

Error Message:
Couldn't resolve the skin.

Stack Trace:
org.apache.maven.plugin.MojoExecutionException: Couldn't resolve the skin.
        at org.apache.maven.plugins.jira.JiraUnicodeTestCase.testUnicodeReport(JiraUnicodeTestCase.java:75)
Caused by: org.apache.maven.shared.artifact.resolve.ArtifactResolverException: Failed to read artifact descriptor for org.apache.maven.skins:maven-default-skin:jar:1.0
        at org.apache.maven.plugins.jira.JiraUnicodeTestCase.testUnicodeReport(JiraUnicodeTestCase.java:75)
Caused by: org.sonatype.aether.resolution.ArtifactDescriptorException: Failed to read artifact descriptor for org.apache.maven.skins:maven-default-skin:jar:1.0
        at org.apache.maven.plugins.jira.JiraUnicodeTestCase.testUnicodeReport(JiraUnicodeTestCase.java:75)
Caused by: org.sonatype.aether.resolution.ArtifactResolutionException: Could not transfer artifact org.apache.maven.skins:maven-default-skin:pom:1.0 from central (http://repo1.maven.org/maven2): Failed to transfer file: http://repo1.maven.org/maven2/org/apache/maven/skins/maven-default-skin/1.0/maven-default-skin-1.0.pom. Return code is: 501
        at org.apache.maven.plugins.jira.JiraUnicodeTestCase.testUnicodeReport(JiraUnicodeTestCase.java:75)
Caused by: org.sonatype.aether.transfer.ArtifactTransferException: Could not transfer artifact org.apache.maven.skins:maven-default-skin:pom:1.0 from central (http://repo1.maven.org/maven2): Failed to transfer file: http://repo1.maven.org/maven2/org/apache/maven/skins/maven-default-skin/1.0/maven-default-skin-1.0.pom. Return code is: 501
        at org.apache.maven.plugins.jira.JiraUnicodeTestCase.testUnicodeReport(JiraUnicodeTestCase.java:75)
Caused by: org.apache.maven.wagon.TransferFailedException: Failed to transfer file: http://repo1.maven.org/maven2/org/apache/maven/skins/maven-default-skin/1.0/maven-default-skin-1.0.pom. Return code is: 501


FAILED:  org.apache.maven.plugins.jira.JiraUnicodeTestCase.windows-jdk7-m3.6.x_build / Build windows-jdk7-m3.6.x_build / testUnicodeReport

Error Message:
Couldn't resolve the skin.

Stack Trace:
org.apache.maven.plugin.MojoExecutionException: Couldn't resolve the skin.
        at org.apache.maven.plugins.jira.JiraUnicodeTestCase.testUnicodeReport(JiraUnicodeTestCase.java:75)
Caused by: org.apache.maven.shared.artifact.resolve.ArtifactResolverException: Failed to read artifact descriptor for org.apache.maven.skins:maven-default-skin:jar:1.0
        at org.apache.maven.plugins.jira.JiraUnicodeTestCase.testUnicodeReport(JiraUnicodeTestCase.java:75)
Caused by: org.sonatype.aether.resolution.ArtifactDescriptorException: Failed to read artifact descriptor for org.apache.maven.skins:maven-default-skin:jar:1.0
        at org.apache.maven.plugins.jira.JiraUnicodeTestCase.testUnicodeReport(JiraUnicodeTestCase.java:75)
Caused by: org.sonatype.aether.resolution.ArtifactResolutionException: Could not transfer artifact org.apache.maven.skins:maven-default-skin:pom:1.0 from central (http://repo1.maven.org/maven2): Failed to transfer file: http://repo1.maven.org/maven2/org/apache/maven/skins/maven-default-skin/1.0/maven-default-skin-1.0.pom. Return code is: 501
        at org.apache.maven.plugins.jira.JiraUnicodeTestCase.testUnicodeReport(JiraUnicodeTestCase.java:75)
Caused by: org.sonatype.aether.transfer.ArtifactTransferException: Could not transfer artifact org.apache.maven.skins:maven-default-skin:pom:1.0 from central (http://repo1.maven.org/maven2): Failed to transfer file: http://repo1.maven.org/maven2/org/apache/maven/skins/maven-default-skin/1.0/maven-default-skin-1.0.pom. Return code is: 501
        at org.apache.maven.plugins.jira.JiraUnicodeTestCase.testUnicodeReport(JiraUnicodeTestCase.java:75)
Caused by: org.apache.maven.wagon.TransferFailedException: Failed to transfer file: http://repo1.maven.org/maven2/org/apache/maven/skins/maven-default-skin/1.0/maven-default-skin-1.0.pom. Return code is: 501




Build log:
[...truncated 5098 lines...]
[INFO] run post-build script verify.bsh
[INFO]           report-changes-system\pom.xml .................... SUCCESS (6.4 s)
[INFO] Building: report-changes-system-noissuemanagement\pom.xml
[INFO] run post-build script verify.groovy
[INFO]           report-jira-invalid-issuemanagement\pom.xml ...... SUCCESS (5.5 s)
[INFO]
[INFO] --- maven-checkstyle-plugin:3.0.0:check (checkstyle-check) @ maven-changes-plugin ---
[INFO] run post-build script verify.bsh
[INFO]           report-changes-system-noissuemanagement\pom.xml .. SUCCESS (5.8 s)
[INFO] Building: report-jira-invalid-issuemanagement\pom.xml
[INFO] run post-build script verify.groovy
[INFO]           report-jira-invalid-issuemanagement\pom.xml ...... SUCCESS (5.4 s)
[INFO]
[INFO] --- maven-checkstyle-plugin:3.0.0:check (checkstyle-check) @ maven-changes-plugin ---
[INFO]
[INFO] --- maven-invoker-plugin:3.1.0:verify (integration-test) @ maven-changes-plugin ---
[INFO] -------------------------------------------------
[INFO] Build Summary:
[INFO]   Passed: 13, Failed: 0, Errors: 0, Skipped: 0
[INFO] -------------------------------------------------
[INFO] ------------------------------------------------------------------------
[INFO] BUILD SUCCESS
[INFO] ------------------------------------------------------------------------
[INFO] Total time: 02:06 min
[INFO] Finished at: 2020-02-08T13:20:37-08:00
[INFO] Final Memory: 74M/1257M
[INFO] ------------------------------------------------------------------------
[INFO] [jenkins-event-spy] Generated F:\jenkins\jenkins-slave\workspace\-box_maven-changes-plugin_master@2@tmp\withMaven1faee779\maven-spy-20200208-131829-9378659951105447616030.log
Picked up JAVA_TOOL_OPTIONS: -Dmaven.ext.class.path="f:\jenkins\jenkins-slave\workspace\-box_maven-changes-plugin_master@2@tmp\withMaven1faee779\pipeline-maven-spy.jar" -Dorg.jenkinsci.plugins.pipeline.maven.reportsFolder="f:\jenkins\jenkins-slave\workspace\-box_maven-changes-plugin_master@2@tmp\withMaven1faee779"
[Pipeline] }
[Pipeline] // dir
[Pipeline] }
[withMaven] artifactsPublisher - Archive artifact windows-jdk7-m3.3.x_build\pom.xml under org\apache\maven\plugins\maven-changes-plugin\3.0.0-SNAPSHOT\maven-changes-plugin-3.0.0-SNAPSHOT.pom
[withMaven] artifactsPublisher - Archive artifact windows-jdk7-m3.3.x_build\target\maven-changes-plugin-3.0.0-SNAPSHOT.jar under org\apache\maven\plugins\maven-changes-plugin\3.0.0-SNAPSHOT\maven-changes-plugin-3.0.0-SNAPSHOT.jar
[withMaven] junitPublisher - Archive test results for Maven artifact org.apache.maven.plugins:maven-changes-plugin:maven-plugin:3.0.0-SNAPSHOT generated by maven-surefire-plugin:test (default-test): windows-jdk7-m3.3.x_build\target\surefire-reports\*.xml
Recording test results
[withMaven] openTasksPublisher - Scan Tasks for Maven artifact org.apache.maven.plugins:maven-changes-plugin:maven-plugin:3.0.0-SNAPSHOT in source directory windows-jdk7-m3.3.x_build\src\main\java
[TASKS] Scanning folder 'f:\jenkins\jenkins-slave\workspace\-box_maven-changes-plugin_master@2' for files matching the pattern 'windows-jdk7-m3.3.x_build\src\main\java\**\*' - excludes: null
[TASKS] Found 48 files to scan for tasks
[TASKS] Found 4 open tasks.
Skipping warnings blame since pipelines do not have an SCM link.%n
[TASKS] Computing warning deltas based on reference build #24
[withMaven] invokerPublisher - Archive invoker results for Maven artifact MavenArtifact{org.apache.maven.plugins:maven-changes-plugin:maven-plugin:3.0.0-SNAPSHOT(version: 3.0.0-SNAPSHOT, snapshot:false) } generated by PluginInvocation{org.apache.maven.plugins:maven-invoker-plugin:3.1.0@integration-test  integration-test}: windows-jdk7-m3.3.x_build\target\invoker-reports\*.xml
[INFO] run post-build script verify.bsh
[INFO]           report-changes-system-noissuemanagement\pom.xml .. SUCCESS (7.2 s)
[INFO] Building: report-jira-invalid-issuemanagement\pom.xml
[INFO]
[INFO] --- maven-invoker-plugin:3.1.0:verify (integration-test) @ maven-changes-plugin ---
[INFO] -------------------------------------------------
[INFO] Build Summary:
[INFO]   Passed: 13, Failed: 0, Errors: 0, Skipped: 0
[INFO] -------------------------------------------------
[INFO] ------------------------------------------------------------------------
[INFO] BUILD SUCCESS
[INFO] ------------------------------------------------------------------------
[INFO] Total time:  01:58 min
[INFO] Finished at: 2020-02-08T13:20:39-08:00
[INFO] ------------------------------------------------------------------------
[INFO] [jenkins-event-spy] Generated F:\jenkins\jenkins-slave\workspace\-box_maven-changes-plugin_master@2@tmp\withMaven2960a036\maven-spy-20200208-131840-4208349806517194132458.log
Picked up JAVA_TOOL_OPTIONS: -Dmaven.ext.class.path="f:\jenkins\jenkins-slave\workspace\-box_maven-changes-plugin_master@2@tmp\withMaven2960a036\pipeline-maven-spy.jar" -Dorg.jenkinsci.plugins.pipeline.maven.reportsFolder="f:\jenkins\jenkins-slave\workspace\-box_maven-changes-plugin_master@2@tmp\withMaven2960a036"
[Pipeline] }
[Pipeline] // dir
[Pipeline] }
[withMaven] artifactsPublisher - Archive artifact windows-jdk8-m3.6.x_build\pom.xml under org\apache\maven\plugins\maven-changes-plugin\3.0.0-SNAPSHOT\maven-changes-plugin-3.0.0-SNAPSHOT.pom
[withMaven] artifactsPublisher - Archive artifact windows-jdk8-m3.6.x_build\target\maven-changes-plugin-3.0.0-SNAPSHOT.jar under org\apache\maven\plugins\maven-changes-plugin\3.0.0-SNAPSHOT\maven-changes-plugin-3.0.0-SNAPSHOT.jar
[withMaven] junitPublisher - Archive test results for Maven artifact org.apache.maven.plugins:maven-changes-plugin:maven-plugin:3.0.0-SNAPSHOT generated by maven-surefire-plugin:test (default-test): windows-jdk8-m3.6.x_build\target\surefire-reports\*.xml
Recording test results
[INFO] run post-build script verify.bsh
[INFO]           report-changes-system-noissuemanagement\pom.xml .. SUCCESS (7.4 s)
[INFO] Building: report-jira-invalid-issuemanagement\pom.xml
[withMaven] openTasksPublisher - Scan Tasks for Maven artifact org.apache.maven.plugins:maven-changes-plugin:maven-plugin:3.0.0-SNAPSHOT in source directory windows-jdk8-m3.6.x_build\src\main\java
[TASKS] Scanning folder 'f:\jenkins\jenkins-slave\workspace\-box_maven-changes-plugin_master@2' for files matching the pattern 'windows-jdk8-m3.6.x_build\src\main\java\**\*' - excludes: null
[TASKS] Found 48 files to scan for tasks
[TASKS] Found 4 open tasks.
Skipping warnings blame since pipelines do not have an SCM link.%n
[TASKS] Computing warning deltas based on reference build #24
[withMaven] invokerPublisher - Archive invoker results for Maven artifact MavenArtifact{org.apache.maven.plugins:maven-changes-plugin:maven-plugin:3.0.0-SNAPSHOT(version: 3.0.0-SNAPSHOT, snapshot:false) } generated by PluginInvocation{org.apache.maven.plugins:maven-invoker-plugin:3.1.0@integration-test  integration-test}: windows-jdk8-m3.6.x_build\target\invoker-reports\*.xml
[INFO] run post-build script verify.groovy
[INFO]           report-jira-invalid-issuemanagement\pom.xml ...... SUCCESS (5.6 s)
[INFO]
[INFO] --- maven-checkstyle-plugin:3.0.0:check (checkstyle-check) @ maven-changes-plugin ---
[withMaven] Publishers: Generated Artifacts Publisher: 127 ms, Junit Publisher: 527 ms, Open Task Scanner Publisher: 162 ms, Invoker Publisher: 3538 ms
[Pipeline] // withMaven
[Pipeline] cleanWs
[WS-CLEANUP] Deleting project workspace...
[WS-CLEANUP] Deferred wipeout is used...
[WS-CLEANUP] done
[Pipeline] }
[Pipeline] // stage
[Pipeline] }
[Pipeline] // ws
[Pipeline] }
[Pipeline] // node
[Pipeline] }
[withMaven] Publishers: Generated Artifacts Publisher: 174 ms, Junit Publisher: 1576 ms, Open Task Scanner Publisher: 154 ms, Invoker Publisher: 2259 ms, Pipeline Graph Publisher: 1 ms
[Pipeline] // withMaven
[Pipeline] cleanWs
[WS-CLEANUP] Deleting project workspace...
[WS-CLEANUP] Deferred wipeout is used...
[WS-CLEANUP] done
[Pipeline] }
[Pipeline] // stage
[Pipeline] }
[Pipeline] // ws
[Pipeline] }
[INFO]
[INFO] --- maven-invoker-plugin:3.1.0:verify (integration-test) @ maven-changes-plugin ---
[INFO] -------------------------------------------------
[INFO] Build Summary:
[INFO]   Passed: 13, Failed: 0, Errors: 0, Skipped: 0
[INFO] -------------------------------------------------
[INFO] ------------------------------------------------------------------------
[INFO] BUILD SUCCESS
[INFO] ------------------------------------------------------------------------
[INFO] Total time:  01:54 min
[INFO] Finished at: 2020-02-08T13:20:43-08:00
[INFO] ------------------------------------------------------------------------
[INFO] [jenkins-event-spy] Generated F:\jenkins\jenkins-slave\workspace\-box_maven-changes-plugin_master@3@2@tmp\withMaven179ae7b3\maven-spy-20200208-131848-8354080403264675254161.log
[Pipeline] // node
[Pipeline] }
[Pipeline] }
[Pipeline] // dir
[Pipeline] }
[withMaven] artifactsPublisher - Archive artifact windows-jdk11-m3.6.x_build\pom.xml under org\apache\maven\plugins\maven-changes-plugin\3.0.0-SNAPSHOT\maven-changes-plugin-3.0.0-SNAPSHOT.pom
[withMaven] artifactsPublisher - Archive artifact windows-jdk11-m3.6.x_build\target\maven-changes-plugin-3.0.0-SNAPSHOT.jar under org\apache\maven\plugins\maven-changes-plugin\3.0.0-SNAPSHOT\maven-changes-plugin-3.0.0-SNAPSHOT.jar
[INFO] run post-build script verify.groovy
[INFO]           report-jira-invalid-issuemanagement\pom.xml ...... SUCCESS (4.8 s)
[INFO]
[INFO] --- maven-checkstyle-plugin:3.0.0:check (checkstyle-check) @ maven-changes-plugin ---
[withMaven] junitPublisher - Archive test results for Maven artifact org.apache.maven.plugins:maven-changes-plugin:maven-plugin:3.0.0-SNAPSHOT generated by maven-surefire-plugin:test (default-test): windows-jdk11-m3.6.x_build\target\surefire-reports\*.xml
Recording test results
[withMaven] openTasksPublisher - Scan Tasks for Maven artifact org.apache.maven.plugins:maven-changes-plugin:maven-plugin:3.0.0-SNAPSHOT in source directory windows-jdk11-m3.6.x_build\src\main\java
[TASKS] Scanning folder 'f:\jenkins\jenkins-slave\workspace\-box_maven-changes-plugin_master@3@2' for files matching the pattern 'windows-jdk11-m3.6.x_build\src\main\java\**\*' - excludes: null
[TASKS] Found 48 files to scan for tasks
[TASKS] Found 4 open tasks.
Skipping warnings blame since pipelines do not have an SCM link.%n
[TASKS] Computing warning deltas based on reference build #24
[withMaven] invokerPublisher - Archive invoker results for Maven artifact MavenArtifact{org.apache.maven.plugins:maven-changes-plugin:maven-plugin:3.0.0-SNAPSHOT(version: 3.0.0-SNAPSHOT, snapshot:false) } generated by PluginInvocation{org.apache.maven.plugins:maven-invoker-plugin:3.1.0@integration-test  integration-test}: windows-jdk11-m3.6.x_build\target\invoker-reports\*.xml
[INFO] run post-build script verify.groovy
[INFO]           report-jira-invalid-issuemanagement\pom.xml ...... SUCCESS (4.9 s)
[INFO]
[INFO] --- maven-checkstyle-plugin:3.0.0:check (checkstyle-check) @ maven-changes-plugin ---
[INFO]
[INFO] --- maven-invoker-plugin:3.1.0:verify (integration-test) @ maven-changes-plugin ---
[INFO] -------------------------------------------------
[INFO] Build Summary:
[INFO]   Passed: 13, Failed: 0, Errors: 0, Skipped: 0
[INFO] -------------------------------------------------
[INFO] ------------------------------------------------------------------------
[INFO] BUILD SUCCESS
[INFO] ------------------------------------------------------------------------
[INFO] Total time: 02:06 min
[INFO] Finished at: 2020-02-08T13:20:45-08:00
[INFO] Final Memory: 61M/974M
[INFO] ------------------------------------------------------------------------
[INFO] [jenkins-event-spy] Generated F:\jenkins\jenkins-slave\workspace\-box_maven-changes-plugin_master@2@tmp\withMavene6d22e58\maven-spy-20200208-131839-4244689377523679059854.log
Picked up JAVA_TOOL_OPTIONS: -Dmaven.ext.class.path="f:\jenkins\jenkins-slave\workspace\-box_maven-changes-plugin_master@2@tmp\withMavene6d22e58\pipeline-maven-spy.jar" -Dorg.jenkinsci.plugins.pipeline.maven.reportsFolder="f:\jenkins\jenkins-slave\workspace\-box_maven-changes-plugin_master@2@tmp\withMavene6d22e58"
[Pipeline] }
[Pipeline] // dir
[Pipeline] }
[withMaven] artifactsPublisher - Archive artifact windows-jdk7-m3.5.x_build\pom.xml under org\apache\maven\plugins\maven-changes-plugin\3.0.0-SNAPSHOT\maven-changes-plugin-3.0.0-SNAPSHOT.pom
[withMaven] artifactsPublisher - Archive artifact windows-jdk7-m3.5.x_build\target\maven-changes-plugin-3.0.0-SNAPSHOT.jar under org\apache\maven\plugins\maven-changes-plugin\3.0.0-SNAPSHOT\maven-changes-plugin-3.0.0-SNAPSHOT.jar
[INFO]
[INFO] --- maven-invoker-plugin:3.1.0:verify (integration-test) @ maven-changes-plugin ---
[INFO] -------------------------------------------------
[INFO] Build Summary:
[INFO]   Passed: 13, Failed: 0, Errors: 0, Skipped: 0
[INFO] -------------------------------------------------
[INFO] ------------------------------------------------------------------------
[INFO] BUILD SUCCESS
[INFO] ------------------------------------------------------------------------
[INFO] Total time:  02:06 min
[INFO] Finished at: 2020-02-08T13:20:46-08:00
[INFO] ------------------------------------------------------------------------
[INFO] [jenkins-event-spy] Generated F:\jenkins\jenkins-slave\workspace\-box_maven-changes-plugin_master@3@2@tmp\withMaven9d26e488\maven-spy-20200208-131840-1338589699364411803112.log
Picked up JAVA_TOOL_OPTIONS: -Dmaven.ext.class.path="f:\jenkins\jenkins-slave\workspace\-box_maven-changes-plugin_master@3@2@tmp\withMaven9d26e488\pipeline-maven-spy.jar" -Dorg.jenkinsci.plugins.pipeline.maven.reportsFolder="f:\jenkins\jenkins-slave\workspace\-box_maven-changes-plugin_master@3@2@tmp\withMaven9d26e488"
[Pipeline] }
[Pipeline] // dir
[Pipeline] }
[withMaven] junitPublisher - Archive test results for Maven artifact org.apache.maven.plugins:maven-changes-plugin:maven-plugin:3.0.0-SNAPSHOT generated by maven-surefire-plugin:test (default-test): windows-jdk7-m3.5.x_build\target\surefire-reports\*.xml
Recording test results
[withMaven] artifactsPublisher - Archive artifact windows-jdk7-m3.6.x_build\pom.xml under org\apache\maven\plugins\maven-changes-plugin\3.0.0-SNAPSHOT\maven-changes-plugin-3.0.0-SNAPSHOT.pom
[withMaven] artifactsPublisher - Archive artifact windows-jdk7-m3.6.x_build\target\maven-changes-plugin-3.0.0-SNAPSHOT.jar under org\apache\maven\plugins\maven-changes-plugin\3.0.0-SNAPSHOT\maven-changes-plugin-3.0.0-SNAPSHOT.jar
[withMaven] junitPublisher - Archive test results for Maven artifact org.apache.maven.plugins:maven-changes-plugin:maven-plugin:3.0.0-SNAPSHOT generated by maven-surefire-plugin:test (default-test): windows-jdk7-m3.6.x_build\target\surefire-reports\*.xml
Recording test results
[withMaven] Publishers: Generated Artifacts Publisher: 140 ms, Junit Publisher: 420 ms, Open Task Scanner Publisher: 150 ms, Dependencies Fingerprint Publisher: 1 ms, Invoker Publisher: 3148 ms, Pipeline Graph Publisher: 1 ms
[withMaven] openTasksPublisher - Scan Tasks for Maven artifact org.apache.maven.plugins:maven-changes-plugin:maven-plugin:3.0.0-SNAPSHOT in source directory windows-jdk7-m3.5.x_build\src\main\java
[Pipeline] // withMaven
[TASKS] Scanning folder 'f:\jenkins\jenkins-slave\workspace\-box_maven-changes-plugin_master@2' for files matching the pattern 'windows-jdk7-m3.5.x_build\src\main\java\**\*' - excludes: null
[TASKS] Found 48 files to scan for tasks
[TASKS] Found 4 open tasks.
Skipping warnings blame since pipelines do not have an SCM link.%n
[TASKS] Computing warning deltas based on reference build #24
[withMaven] invokerPublisher - Archive invoker results for Maven artifact MavenArtifact{org.apache.maven.plugins:maven-changes-plugin:maven-plugin:3.0.0-SNAPSHOT(version: 3.0.0-SNAPSHOT, snapshot:false) } generated by PluginInvocation{org.apache.maven.plugins:maven-invoker-plugin:3.1.0@integration-test  integration-test}: windows-jdk7-m3.5.x_build\target\invoker-reports\*.xml
[withMaven] openTasksPublisher - Scan Tasks for Maven artifact org.apache.maven.plugins:maven-changes-plugin:maven-plugin:3.0.0-SNAPSHOT in source directory windows-jdk7-m3.6.x_build\src\main\java
[Pipeline] cleanWs
[WS-CLEANUP] Deleting project workspace...
[WS-CLEANUP] Deferred wipeout is used...
[TASKS] Scanning folder 'f:\jenkins\jenkins-slave\workspace\-box_maven-changes-plugin_master@3@2' for files matching the pattern 'windows-jdk7-m3.6.x_build\src\main\java\**\*' - excludes: null
[TASKS] Found 48 files to scan for tasks
[TASKS] Found 4 open tasks.
Skipping warnings blame since pipelines do not have an SCM link.%n
[TASKS] Computing warning deltas based on reference build #24
[WS-CLEANUP] done
[Pipeline] }
[withMaven] invokerPublisher - Archive invoker results for Maven artifact MavenArtifact{org.apache.maven.plugins:maven-changes-plugin:maven-plugin:3.0.0-SNAPSHOT(version: 3.0.0-SNAPSHOT, snapshot:false) } generated by PluginInvocation{org.apache.maven.plugins:maven-invoker-plugin:3.1.0@integration-test  integration-test}: windows-jdk7-m3.6.x_build\target\invoker-reports\*.xml
[Pipeline] // stage
[Pipeline] }
[Pipeline] // ws
[Pipeline] }
[Pipeline] // node
[Pipeline] }
[withMaven] Publishers: Generated Artifacts Publisher: 163 ms, Junit Publisher: 1276 ms, Open Task Scanner Publisher: 151 ms, Dependencies Fingerprint Publisher: 1 ms, Invoker Publisher: 2644 ms, Pipeline Graph Publisher: 1 ms
[Pipeline] // withMaven
[Pipeline] cleanWs
[WS-CLEANUP] Deleting project workspace...
[WS-CLEANUP] Deferred wipeout is used...
[WS-CLEANUP] done
[Pipeline] }
[Pipeline] // stage
[Pipeline] }
[Pipeline] // ws
[Pipeline] }
[Pipeline] // node
[Pipeline] }
[withMaven] Publishers: Generated Artifacts Publisher: 178 ms, Junit Publisher: 1474 ms, Open Task Scanner Publisher: 138 ms, Dependencies Fingerprint Publisher: 1 ms, Invoker Publisher: 2669 ms, Pipeline Graph Publisher: 1 ms
[Pipeline] // withMaven
[Pipeline] cleanWs
[WS-CLEANUP] Deleting project workspace...
[WS-CLEANUP] Deferred wipeout is used...
[WS-CLEANUP] done
[Pipeline] }
[Pipeline] // stage
[Pipeline] }
[Pipeline] // ws
[Pipeline] }
[Pipeline] // node
[Pipeline] }
[Pipeline] // parallel
[Pipeline] stage
[Pipeline] { (Notifications)
[Pipeline] echo
Build result: UNSTABLE
[Pipeline] jiraIssueSelector
[Pipeline] echo
The authors of changes [rfscholte, khmarbaise, tibordigana].
[Pipeline] echo
Sending email ...
[Pipeline] emailext
Reply | Threaded
Open this post in threaded view
|

Build failed in Jenkins: Maven TLP » maven-changes-plugin » master #26

Apache Jenkins Server-2
See https://builds.apache.org/job/maven-box/job/maven-changes-plugin/job/master/26/

Changes:

* Update link to Central (https)
* Use default configuration for Jenkins build

8 tests failed.
FAILED:  org.apache.maven.plugins.jira.JiraUnicodeTestCase.windows-jdk7-m3.3.x_build / Build windows-jdk7-m3.3.x_build / testUnicodeReport

Error Message:
Couldn't resolve the skin.

Stack Trace:
org.apache.maven.plugin.MojoExecutionException: Couldn't resolve the skin.
        at org.apache.maven.plugins.jira.JiraUnicodeTestCase.testUnicodeReport(JiraUnicodeTestCase.java:75)
Caused by: org.apache.maven.shared.artifact.resolve.ArtifactResolverException: Failed to read artifact descriptor for org.apache.maven.skins:maven-default-skin:jar:1.0
        at org.apache.maven.plugins.jira.JiraUnicodeTestCase.testUnicodeReport(JiraUnicodeTestCase.java:75)
Caused by: org.sonatype.aether.resolution.ArtifactDescriptorException: Failed to read artifact descriptor for org.apache.maven.skins:maven-default-skin:jar:1.0
        at org.apache.maven.plugins.jira.JiraUnicodeTestCase.testUnicodeReport(JiraUnicodeTestCase.java:75)
Caused by: org.sonatype.aether.resolution.ArtifactResolutionException: Could not transfer artifact org.apache.maven.skins:maven-default-skin:pom:1.0 from central (https://repo.maven.apache.org/maven2): Received fatal alert: protocol_version
        at org.apache.maven.plugins.jira.JiraUnicodeTestCase.testUnicodeReport(JiraUnicodeTestCase.java:75)
Caused by: org.sonatype.aether.transfer.ArtifactTransferException: Could not transfer artifact org.apache.maven.skins:maven-default-skin:pom:1.0 from central (https://repo.maven.apache.org/maven2): Received fatal alert: protocol_version
        at org.apache.maven.plugins.jira.JiraUnicodeTestCase.testUnicodeReport(JiraUnicodeTestCase.java:75)
Caused by: org.apache.maven.wagon.TransferFailedException: Received fatal alert: protocol_version
Caused by: javax.net.ssl.SSLException: Received fatal alert: protocol_version


FAILED:  org.apache.maven.plugins.jira.JiraUnicodeTestCase.windows-jdk7-m3.2.x_build / Build windows-jdk7-m3.2.x_build / testUnicodeReport

Error Message:
Couldn't resolve the skin.

Stack Trace:
org.apache.maven.plugin.MojoExecutionException: Couldn't resolve the skin.
        at org.apache.maven.plugins.jira.JiraUnicodeTestCase.testUnicodeReport(JiraUnicodeTestCase.java:75)
Caused by: org.apache.maven.shared.artifact.resolve.ArtifactResolverException: Failed to read artifact descriptor for org.apache.maven.skins:maven-default-skin:jar:1.0
        at org.apache.maven.plugins.jira.JiraUnicodeTestCase.testUnicodeReport(JiraUnicodeTestCase.java:75)
Caused by: org.sonatype.aether.resolution.ArtifactDescriptorException: Failed to read artifact descriptor for org.apache.maven.skins:maven-default-skin:jar:1.0
        at org.apache.maven.plugins.jira.JiraUnicodeTestCase.testUnicodeReport(JiraUnicodeTestCase.java:75)
Caused by: org.sonatype.aether.resolution.ArtifactResolutionException: Could not transfer artifact org.apache.maven.skins:maven-default-skin:pom:1.0 from central (https://repo.maven.apache.org/maven2): Received fatal alert: protocol_version
        at org.apache.maven.plugins.jira.JiraUnicodeTestCase.testUnicodeReport(JiraUnicodeTestCase.java:75)
Caused by: org.sonatype.aether.transfer.ArtifactTransferException: Could not transfer artifact org.apache.maven.skins:maven-default-skin:pom:1.0 from central (https://repo.maven.apache.org/maven2): Received fatal alert: protocol_version
        at org.apache.maven.plugins.jira.JiraUnicodeTestCase.testUnicodeReport(JiraUnicodeTestCase.java:75)
Caused by: org.apache.maven.wagon.TransferFailedException: Received fatal alert: protocol_version
Caused by: javax.net.ssl.SSLException: Received fatal alert: protocol_version


FAILED:  org.apache.maven.plugins.jira.JiraUnicodeTestCase.linux-jdk7-m3.6.x_build / Build linux-jdk7-m3.6.x_build / testUnicodeReport

Error Message:
Couldn't resolve the skin.

Stack Trace:
org.apache.maven.plugin.MojoExecutionException: Couldn't resolve the skin.
        at org.apache.maven.plugins.jira.JiraUnicodeTestCase.testUnicodeReport(JiraUnicodeTestCase.java:75)
Caused by: org.apache.maven.shared.artifact.resolve.ArtifactResolverException: Failed to read artifact descriptor for org.apache.maven.skins:maven-default-skin:jar:1.0
        at org.apache.maven.plugins.jira.JiraUnicodeTestCase.testUnicodeReport(JiraUnicodeTestCase.java:75)
Caused by: org.sonatype.aether.resolution.ArtifactDescriptorException: Failed to read artifact descriptor for org.apache.maven.skins:maven-default-skin:jar:1.0
        at org.apache.maven.plugins.jira.JiraUnicodeTestCase.testUnicodeReport(JiraUnicodeTestCase.java:75)
Caused by: org.sonatype.aether.resolution.ArtifactResolutionException: Could not transfer artifact org.apache.maven.skins:maven-default-skin:pom:1.0 from central (https://repo.maven.apache.org/maven2): Received fatal alert: protocol_version
        at org.apache.maven.plugins.jira.JiraUnicodeTestCase.testUnicodeReport(JiraUnicodeTestCase.java:75)
Caused by: org.sonatype.aether.transfer.ArtifactTransferException: Could not transfer artifact org.apache.maven.skins:maven-default-skin:pom:1.0 from central (https://repo.maven.apache.org/maven2): Received fatal alert: protocol_version
        at org.apache.maven.plugins.jira.JiraUnicodeTestCase.testUnicodeReport(JiraUnicodeTestCase.java:75)
Caused by: org.apache.maven.wagon.TransferFailedException: Received fatal alert: protocol_version
Caused by: javax.net.ssl.SSLException: Received fatal alert: protocol_version


FAILED:  org.apache.maven.plugins.jira.JiraUnicodeTestCase.windows-jdk7-m3.5.x_build / Build windows-jdk7-m3.5.x_build / testUnicodeReport

Error Message:
Couldn't resolve the skin.

Stack Trace:
org.apache.maven.plugin.MojoExecutionException: Couldn't resolve the skin.
        at org.apache.maven.plugins.jira.JiraUnicodeTestCase.testUnicodeReport(JiraUnicodeTestCase.java:75)
Caused by: org.apache.maven.shared.artifact.resolve.ArtifactResolverException: Failed to read artifact descriptor for org.apache.maven.skins:maven-default-skin:jar:1.0
        at org.apache.maven.plugins.jira.JiraUnicodeTestCase.testUnicodeReport(JiraUnicodeTestCase.java:75)
Caused by: org.sonatype.aether.resolution.ArtifactDescriptorException: Failed to read artifact descriptor for org.apache.maven.skins:maven-default-skin:jar:1.0
        at org.apache.maven.plugins.jira.JiraUnicodeTestCase.testUnicodeReport(JiraUnicodeTestCase.java:75)
Caused by: org.sonatype.aether.resolution.ArtifactResolutionException: Could not transfer artifact org.apache.maven.skins:maven-default-skin:pom:1.0 from central (https://repo.maven.apache.org/maven2): Received fatal alert: protocol_version
        at org.apache.maven.plugins.jira.JiraUnicodeTestCase.testUnicodeReport(JiraUnicodeTestCase.java:75)
Caused by: org.sonatype.aether.transfer.ArtifactTransferException: Could not transfer artifact org.apache.maven.skins:maven-default-skin:pom:1.0 from central (https://repo.maven.apache.org/maven2): Received fatal alert: protocol_version
        at org.apache.maven.plugins.jira.JiraUnicodeTestCase.testUnicodeReport(JiraUnicodeTestCase.java:75)
Caused by: org.apache.maven.wagon.TransferFailedException: Received fatal alert: protocol_version
Caused by: javax.net.ssl.SSLException: Received fatal alert: protocol_version


FAILED:  org.apache.maven.plugins.jira.JiraUnicodeTestCase.windows-jdk7-m3.6.x_build / Build windows-jdk7-m3.6.x_build / testUnicodeReport

Error Message:
Couldn't resolve the skin.

Stack Trace:
org.apache.maven.plugin.MojoExecutionException: Couldn't resolve the skin.
        at org.apache.maven.plugins.jira.JiraUnicodeTestCase.testUnicodeReport(JiraUnicodeTestCase.java:75)
Caused by: org.apache.maven.shared.artifact.resolve.ArtifactResolverException: Failed to read artifact descriptor for org.apache.maven.skins:maven-default-skin:jar:1.0
        at org.apache.maven.plugins.jira.JiraUnicodeTestCase.testUnicodeReport(JiraUnicodeTestCase.java:75)
Caused by: org.sonatype.aether.resolution.ArtifactDescriptorException: Failed to read artifact descriptor for org.apache.maven.skins:maven-default-skin:jar:1.0
        at org.apache.maven.plugins.jira.JiraUnicodeTestCase.testUnicodeReport(JiraUnicodeTestCase.java:75)
Caused by: org.sonatype.aether.resolution.ArtifactResolutionException: Could not transfer artifact org.apache.maven.skins:maven-default-skin:pom:1.0 from central (https://repo.maven.apache.org/maven2): Received fatal alert: protocol_version
        at org.apache.maven.plugins.jira.JiraUnicodeTestCase.testUnicodeReport(JiraUnicodeTestCase.java:75)
Caused by: org.sonatype.aether.transfer.ArtifactTransferException: Could not transfer artifact org.apache.maven.skins:maven-default-skin:pom:1.0 from central (https://repo.maven.apache.org/maven2): Received fatal alert: protocol_version
        at org.apache.maven.plugins.jira.JiraUnicodeTestCase.testUnicodeReport(JiraUnicodeTestCase.java:75)
Caused by: org.apache.maven.wagon.TransferFailedException: Received fatal alert: protocol_version
Caused by: javax.net.ssl.SSLException: Received fatal alert: protocol_version


FAILED:  org.apache.maven.plugins.jira.JiraUnicodeTestCase.linux-jdk7-m3.5.x_build / Build linux-jdk7-m3.5.x_build / testUnicodeReport

Error Message:
Couldn't resolve the skin.

Stack Trace:
org.apache.maven.plugin.MojoExecutionException: Couldn't resolve the skin.
        at org.apache.maven.plugins.jira.JiraUnicodeTestCase.testUnicodeReport(JiraUnicodeTestCase.java:75)
Caused by: org.apache.maven.shared.artifact.resolve.ArtifactResolverException: Failed to read artifact descriptor for org.apache.maven.skins:maven-default-skin:jar:1.0
        at org.apache.maven.plugins.jira.JiraUnicodeTestCase.testUnicodeReport(JiraUnicodeTestCase.java:75)
Caused by: org.sonatype.aether.resolution.ArtifactDescriptorException: Failed to read artifact descriptor for org.apache.maven.skins:maven-default-skin:jar:1.0
        at org.apache.maven.plugins.jira.JiraUnicodeTestCase.testUnicodeReport(JiraUnicodeTestCase.java:75)
Caused by: org.sonatype.aether.resolution.ArtifactResolutionException: Could not transfer artifact org.apache.maven.skins:maven-default-skin:pom:1.0 from central (https://repo.maven.apache.org/maven2): Received fatal alert: protocol_version
        at org.apache.maven.plugins.jira.JiraUnicodeTestCase.testUnicodeReport(JiraUnicodeTestCase.java:75)
Caused by: org.sonatype.aether.transfer.ArtifactTransferException: Could not transfer artifact org.apache.maven.skins:maven-default-skin:pom:1.0 from central (https://repo.maven.apache.org/maven2): Received fatal alert: protocol_version
        at org.apache.maven.plugins.jira.JiraUnicodeTestCase.testUnicodeReport(JiraUnicodeTestCase.java:75)
Caused by: org.apache.maven.wagon.TransferFailedException: Received fatal alert: protocol_version
Caused by: javax.net.ssl.SSLException: Received fatal alert: protocol_version


FAILED:  org.apache.maven.plugins.jira.JiraUnicodeTestCase.linux-jdk7-m3.2.x_build / Build linux-jdk7-m3.2.x_build / testUnicodeReport

Error Message:
Couldn't resolve the skin.

Stack Trace:
org.apache.maven.plugin.MojoExecutionException: Couldn't resolve the skin.
        at org.apache.maven.plugins.jira.JiraUnicodeTestCase.testUnicodeReport(JiraUnicodeTestCase.java:75)
Caused by: org.apache.maven.shared.artifact.resolve.ArtifactResolverException: Failed to read artifact descriptor for org.apache.maven.skins:maven-default-skin:jar:1.0
        at org.apache.maven.plugins.jira.JiraUnicodeTestCase.testUnicodeReport(JiraUnicodeTestCase.java:75)
Caused by: org.sonatype.aether.resolution.ArtifactDescriptorException: Failed to read artifact descriptor for org.apache.maven.skins:maven-default-skin:jar:1.0
        at org.apache.maven.plugins.jira.JiraUnicodeTestCase.testUnicodeReport(JiraUnicodeTestCase.java:75)
Caused by: org.sonatype.aether.resolution.ArtifactResolutionException: Could not transfer artifact org.apache.maven.skins:maven-default-skin:pom:1.0 from central (https://repo.maven.apache.org/maven2): Received fatal alert: protocol_version
        at org.apache.maven.plugins.jira.JiraUnicodeTestCase.testUnicodeReport(JiraUnicodeTestCase.java:75)
Caused by: org.sonatype.aether.transfer.ArtifactTransferException: Could not transfer artifact org.apache.maven.skins:maven-default-skin:pom:1.0 from central (https://repo.maven.apache.org/maven2): Received fatal alert: protocol_version
        at org.apache.maven.plugins.jira.JiraUnicodeTestCase.testUnicodeReport(JiraUnicodeTestCase.java:75)
Caused by: org.apache.maven.wagon.TransferFailedException: Received fatal alert: protocol_version
Caused by: javax.net.ssl.SSLException: Received fatal alert: protocol_version


FAILED:  org.apache.maven.plugins.jira.JiraUnicodeTestCase.linux-jdk7-m3.3.x_build / Build linux-jdk7-m3.3.x_build / testUnicodeReport

Error Message:
Couldn't resolve the skin.

Stack Trace:
org.apache.maven.plugin.MojoExecutionException: Couldn't resolve the skin.
        at org.apache.maven.plugins.jira.JiraUnicodeTestCase.testUnicodeReport(JiraUnicodeTestCase.java:75)
Caused by: org.apache.maven.shared.artifact.resolve.ArtifactResolverException: Failed to read artifact descriptor for org.apache.maven.skins:maven-default-skin:jar:1.0
        at org.apache.maven.plugins.jira.JiraUnicodeTestCase.testUnicodeReport(JiraUnicodeTestCase.java:75)
Caused by: org.sonatype.aether.resolution.ArtifactDescriptorException: Failed to read artifact descriptor for org.apache.maven.skins:maven-default-skin:jar:1.0
        at org.apache.maven.plugins.jira.JiraUnicodeTestCase.testUnicodeReport(JiraUnicodeTestCase.java:75)
Caused by: org.sonatype.aether.resolution.ArtifactResolutionException: Could not transfer artifact org.apache.maven.skins:maven-default-skin:pom:1.0 from central (https://repo.maven.apache.org/maven2): Received fatal alert: protocol_version
        at org.apache.maven.plugins.jira.JiraUnicodeTestCase.testUnicodeReport(JiraUnicodeTestCase.java:75)
Caused by: org.sonatype.aether.transfer.ArtifactTransferException: Could not transfer artifact org.apache.maven.skins:maven-default-skin:pom:1.0 from central (https://repo.maven.apache.org/maven2): Received fatal alert: protocol_version
        at org.apache.maven.plugins.jira.JiraUnicodeTestCase.testUnicodeReport(JiraUnicodeTestCase.java:75)
Caused by: org.apache.maven.wagon.TransferFailedException: Received fatal alert: protocol_version
Caused by: javax.net.ssl.SSLException: Received fatal alert: protocol_version




Build log:
[...truncated 6798 lines...]
Picked up JAVA_TOOL_OPTIONS: -Dmaven.ext.class.path="f:\jenkins\jenkins-slave\workspace\-box_maven-changes-plugin_master@2@2@tmp\withMavenee863763\pipeline-maven-spy.jar" -Dorg.jenkinsci.plugins.pipeline.maven.reportsFolder="f:\jenkins\jenkins-slave\workspace\-box_maven-changes-plugin_master@2@2@tmp\withMavenee863763"
[INFO] run post-build script verify.groovy
[INFO]           report-aggregated-changes-generation/pom.xml ..... SUCCESS (13.4 s)
[INFO] Building: announce-generate-inconsistent-issue-management/pom.xml
[INFO] run post-build script verify.groovy
[INFO]           report-aggregated-changes-generation/pom.xml ..... SUCCESS (12.1 s)
[INFO] Building: report-changes-interpolation/pom.xml
[Pipeline] // dir
[withMaven] openTasksPublisher - Scan Tasks for Maven artifact org.apache.maven.plugins:maven-changes-plugin:maven-plugin:3.0.0-SNAPSHOT in source directory linux-jdk8-m3.6.x_build/src/main/java
[TASKS] Scanning folder '/home/jenkins/jenkins-slave/workspace/_box_maven-changes-plugin_master@3@2' for files matching the pattern 'linux-jdk8-m3.6.x_build/src/main/java/**/*' - excludes: null
[TASKS] Found 48 files to scan for tasks
[TASKS] Found 4 open tasks.
Skipping warnings blame since pipelines do not have an SCM link.%n
[TASKS] Computing warning deltas based on reference build #25
[withMaven] invokerPublisher - Archive invoker results for Maven artifact MavenArtifact{org.apache.maven.plugins:maven-changes-plugin:maven-plugin:3.0.0-SNAPSHOT(version: 3.0.0-SNAPSHOT, snapshot:false) } generated by PluginInvocation{org.apache.maven.plugins:maven-invoker-plugin:3.1.0@integration-test  integration-test}: linux-jdk8-m3.6.x_build/target/invoker-reports/*.xml
[INFO] run post-build script verify.groovy
[INFO]           report-aggregated-changes-generation/pom.xml ..... SUCCESS (12.3 s)
[INFO] Building: report-changes-interpolation/pom.xml
[INFO]           announce-generate-inconsistent-issue-management/pom.xml SUCCESS (7.5 s)
[INFO] Building: announce-generate-no-url/pom.xml
[INFO] run post-build script verify.bsh
[INFO]           report-changes-interpolation/pom.xml ............. SUCCESS (11.0 s)
[INFO]
[INFO] --- maven-checkstyle-plugin:3.0.0:check (checkstyle-check) @ maven-changes-plugin ---
[INFO]           announce-generate-no-url/pom.xml ................. SUCCESS (7.4 s)
[INFO]
[INFO] --- maven-checkstyle-plugin:3.0.0:check (checkstyle-check) @ maven-changes-plugin ---
[INFO]
[INFO] --- maven-invoker-plugin:3.1.0:verify (integration-test) @ maven-changes-plugin ---
[INFO] -------------------------------------------------
[INFO] Build Summary:
[INFO]   Passed: 13, Failed: 0, Errors: 0, Skipped: 0
[INFO] -------------------------------------------------
[INFO] ------------------------------------------------------------------------
[INFO] BUILD SUCCESS
[INFO] ------------------------------------------------------------------------
[INFO] Total time: 02:48 min
[INFO] Finished at: 2020-02-09T21:35:26+00:00
[INFO] Final Memory: 59M/1772M
[INFO] ------------------------------------------------------------------------
[INFO] [jenkins-event-spy] Generated /home/jenkins/jenkins-slave/workspace/_box_maven-changes-plugin_master@2@tmp/withMavenea539ebb/maven-spy-20200209-213237-4871978813689546545180.log
[INFO] run post-build script verify.bsh
[INFO]           report-changes-interpolation/pom.xml ............. SUCCESS (11.6 s)
[INFO]
[INFO] --- maven-checkstyle-plugin:3.0.0:check (checkstyle-check) @ maven-changes-plugin ---
[INFO]
[INFO] --- maven-invoker-plugin:3.1.0:verify (integration-test) @ maven-changes-plugin ---
[INFO] -------------------------------------------------
[INFO] Build Summary:
[INFO]   Passed: 13, Failed: 0, Errors: 0, Skipped: 0
[INFO] -------------------------------------------------
[INFO] ------------------------------------------------------------------------
[INFO] BUILD SUCCESS
[INFO] ------------------------------------------------------------------------
[INFO] Total time: 02:58 min
[INFO] Finished at: 2020-02-09T21:35:31Z
[INFO] ------------------------------------------------------------------------
[INFO] [jenkins-event-spy] Generated /home/jenkins/jenkins-slave/workspace/_box_maven-changes-plugin_master@2@tmp/withMaven3d59db25/maven-spy-20200209-213231-9597181328420327242737.log
[INFO]
[INFO] --- maven-invoker-plugin:3.1.0:verify (integration-test) @ maven-changes-plugin ---
[INFO] -------------------------------------------------
[INFO] Build Summary:
[INFO]   Passed: 13, Failed: 0, Errors: 0, Skipped: 0
[INFO] -------------------------------------------------
[INFO] ------------------------------------------------------------------------
[INFO] BUILD SUCCESS
[INFO] ------------------------------------------------------------------------
[INFO] Total time: 02:52 min
[INFO] Finished at: 2020-02-09T21:35:32+00:00
[INFO] Final Memory: 59M/1773M
[INFO] ------------------------------------------------------------------------
[INFO] [jenkins-event-spy] Generated /home/jenkins/jenkins-slave/workspace/_box_maven-changes-plugin_master@3@2@tmp/withMavenc8ab2705/maven-spy-20200209-213239-3116963656364061400602.log
[Pipeline] }
[Pipeline] }
[withMaven] artifactsPublisher - Archive artifact windows-jdk7-m3.5.x_build\pom.xml under org\apache\maven\plugins\maven-changes-plugin\3.0.0-SNAPSHOT\maven-changes-plugin-3.0.0-SNAPSHOT.pom
[withMaven] artifactsPublisher - Archive artifact windows-jdk7-m3.5.x_build\target\maven-changes-plugin-3.0.0-SNAPSHOT.jar under org\apache\maven\plugins\maven-changes-plugin\3.0.0-SNAPSHOT\maven-changes-plugin-3.0.0-SNAPSHOT.jar
[Pipeline] // dir
[Pipeline] }
[Pipeline] }
[Pipeline] }
[Pipeline] }
[withMaven] junitPublisher - Archive test results for Maven artifact org.apache.maven.plugins:maven-changes-plugin:maven-plugin:3.0.0-SNAPSHOT generated by maven-surefire-plugin:test (default-test): windows-jdk7-m3.5.x_build\target\surefire-reports\*.xml
Recording test results
[Pipeline] // dir
[Pipeline] // dir
[Pipeline] // dir
[withMaven] artifactsPublisher - Archive artifact windows-jdk7-m3.6.x_build\pom.xml under org\apache\maven\plugins\maven-changes-plugin\3.0.0-SNAPSHOT\maven-changes-plugin-3.0.0-SNAPSHOT.pom
[withMaven] artifactsPublisher - Archive artifact windows-jdk7-m3.6.x_build\target\maven-changes-plugin-3.0.0-SNAPSHOT.jar under org\apache\maven\plugins\maven-changes-plugin\3.0.0-SNAPSHOT\maven-changes-plugin-3.0.0-SNAPSHOT.jar
[withMaven] openTasksPublisher - Scan Tasks for Maven artifact org.apache.maven.plugins:maven-changes-plugin:maven-plugin:3.0.0-SNAPSHOT in source directory linux-jdk7-m3.6.x_build/src/main/java
[withMaven] junitPublisher - Archive test results for Maven artifact org.apache.maven.plugins:maven-changes-plugin:maven-plugin:3.0.0-SNAPSHOT generated by maven-surefire-plugin:test (default-test): windows-jdk7-m3.6.x_build\target\surefire-reports\*.xml
Recording test results
[TASKS] Scanning folder '/home/jenkins/jenkins-slave/workspace/_box_maven-changes-plugin_master@2' for files matching the pattern 'linux-jdk7-m3.6.x_build/src/main/java/**/*' - excludes: null
[TASKS] Found 48 files to scan for tasks
[TASKS] Found 4 open tasks.
Skipping warnings blame since pipelines do not have an SCM link.%n
[TASKS] Computing warning deltas based on reference build #25
[withMaven] openTasksPublisher - Scan Tasks for Maven artifact org.apache.maven.plugins:maven-changes-plugin:maven-plugin:3.0.0-SNAPSHOT in source directory windows-jdk7-m3.5.x_build\src\main\java
[TASKS] Scanning folder 'f:\jenkins\jenkins-slave\workspace\-box_maven-changes-plugin_master@3' for files matching the pattern 'windows-jdk7-m3.5.x_build\src\main\java\**\*' - excludes: null
[TASKS] Found 48 files to scan for tasks
[TASKS] Found 4 open tasks.
Skipping warnings blame since pipelines do not have an SCM link.%n
[TASKS] Computing warning deltas based on reference build #25
[withMaven] invokerPublisher - Archive invoker results for Maven artifact MavenArtifact{org.apache.maven.plugins:maven-changes-plugin:maven-plugin:3.0.0-SNAPSHOT(version: 3.0.0-SNAPSHOT, snapshot:false) } generated by PluginInvocation{org.apache.maven.plugins:maven-invoker-plugin:3.1.0@integration-test  integration-test}: windows-jdk7-m3.5.x_build\target\invoker-reports\*.xml
[withMaven] openTasksPublisher - Scan Tasks for Maven artifact org.apache.maven.plugins:maven-changes-plugin:maven-plugin:3.0.0-SNAPSHOT in source directory windows-jdk7-m3.6.x_build\src\main\java
[Pipeline] }
[Pipeline] }
[Pipeline] }
[withMaven] invokerPublisher - Archive invoker results for Maven artifact MavenArtifact{org.apache.maven.plugins:maven-changes-plugin:maven-plugin:3.0.0-SNAPSHOT(version: 3.0.0-SNAPSHOT, snapshot:false) } generated by PluginInvocation{org.apache.maven.plugins:maven-invoker-plugin:3.1.0@integration-test  integration-test}: linux-jdk7-m3.6.x_build/target/invoker-reports/*.xml
[TASKS] Scanning folder 'f:\jenkins\jenkins-slave\workspace\-box_maven-changes-plugin_master@2@2' for files matching the pattern 'windows-jdk7-m3.6.x_build\src\main\java\**\*' - excludes: null
[TASKS] Found 48 files to scan for tasks
[TASKS] Found 4 open tasks.
Skipping warnings blame since pipelines do not have an SCM link.%n
[TASKS] Computing warning deltas based on reference build #25
[withMaven] invokerPublisher - Archive invoker results for Maven artifact MavenArtifact{org.apache.maven.plugins:maven-changes-plugin:maven-plugin:3.0.0-SNAPSHOT(version: 3.0.0-SNAPSHOT, snapshot:false) } generated by PluginInvocation{org.apache.maven.plugins:maven-invoker-plugin:3.1.0@integration-test  integration-test}: windows-jdk7-m3.6.x_build\target\invoker-reports\*.xml
[withMaven] artifactsPublisher - Archive artifact linux-jdk7-m3.5.x_build/pom.xml under org/apache/maven/plugins/maven-changes-plugin/3.0.0-SNAPSHOT/maven-changes-plugin-3.0.0-SNAPSHOT.pom
[withMaven] artifactsPublisher - Archive artifact linux-jdk7-m3.2.x_build/pom.xml under org/apache/maven/plugins/maven-changes-plugin/3.0.0-SNAPSHOT/maven-changes-plugin-3.0.0-SNAPSHOT.pom
[withMaven] artifactsPublisher - Archive artifact linux-jdk7-m3.3.x_build/pom.xml under org/apache/maven/plugins/maven-changes-plugin/3.0.0-SNAPSHOT/maven-changes-plugin-3.0.0-SNAPSHOT.pom
[withMaven] artifactsPublisher - Archive artifact linux-jdk7-m3.5.x_build/target/maven-changes-plugin-3.0.0-SNAPSHOT.jar under org/apache/maven/plugins/maven-changes-plugin/3.0.0-SNAPSHOT/maven-changes-plugin-3.0.0-SNAPSHOT.jar
[withMaven] artifactsPublisher - Archive artifact linux-jdk7-m3.2.x_build/target/maven-changes-plugin-3.0.0-SNAPSHOT.jar under org/apache/maven/plugins/maven-changes-plugin/3.0.0-SNAPSHOT/maven-changes-plugin-3.0.0-SNAPSHOT.jar
[withMaven] artifactsPublisher - Archive artifact linux-jdk7-m3.3.x_build/target/maven-changes-plugin-3.0.0-SNAPSHOT.jar under org/apache/maven/plugins/maven-changes-plugin/3.0.0-SNAPSHOT/maven-changes-plugin-3.0.0-SNAPSHOT.jar
[withMaven] junitPublisher - Archive test results for Maven artifact org.apache.maven.plugins:maven-changes-plugin:maven-plugin:3.0.0-SNAPSHOT generated by maven-surefire-plugin:test (default-test): linux-jdk7-m3.5.x_build/target/surefire-reports/*.xml
Recording test results
[withMaven] Publishers: Generated Artifacts Publisher: 139 ms, Junit Publisher: 833 ms, Open Task Scanner Publisher: 135 ms, Invoker Publisher: 3084 ms, Pipeline Graph Publisher: 1 ms
[Pipeline] // withMaven
[Pipeline] cleanWs
[WS-CLEANUP] Deleting project workspace...
[WS-CLEANUP] Deferred wipeout is used...
[withMaven] junitPublisher - Archive test results for Maven artifact org.apache.maven.plugins:maven-changes-plugin:maven-plugin:3.0.0-SNAPSHOT generated by maven-surefire-plugin:test (default-test): linux-jdk7-m3.3.x_build/target/surefire-reports/*.xml
Recording test results
[withMaven] junitPublisher - Archive test results for Maven artifact org.apache.maven.plugins:maven-changes-plugin:maven-plugin:3.0.0-SNAPSHOT generated by maven-surefire-plugin:test (default-test): linux-jdk7-m3.2.x_build/target/surefire-reports/*.xml
Recording test results
[WS-CLEANUP] done
[withMaven] Publishers: Generated Artifacts Publisher: 188 ms, Junit Publisher: 951 ms, Open Task Scanner Publisher: 141 ms, Dependencies Fingerprint Publisher: 1 ms, Invoker Publisher: 11217 ms, Pipeline Graph Publisher: 1 ms
[withMaven] Publishers: Generated Artifacts Publisher: 1257 ms, Junit Publisher: 8514 ms, Open Task Scanner Publisher: 919 ms, Invoker Publisher: 55770 ms, Pipeline Graph Publisher: 1 ms
[withMaven] openTasksPublisher - Scan Tasks for Maven artifact org.apache.maven.plugins:maven-changes-plugin:maven-plugin:3.0.0-SNAPSHOT in source directory linux-jdk7-m3.5.x_build/src/main/java
[TASKS] Scanning folder '/home/jenkins/jenkins-slave/workspace/_box_maven-changes-plugin_master@2' for files matching the pattern 'linux-jdk7-m3.5.x_build/src/main/java/**/*' - excludes: null
[TASKS] Found 48 files to scan for tasks
[TASKS] Found 4 open tasks.
Skipping warnings blame since pipelines do not have an SCM link.%n
[TASKS] Computing warning deltas based on reference build #25
[withMaven] invokerPublisher - Archive invoker results for Maven artifact MavenArtifact{org.apache.maven.plugins:maven-changes-plugin:maven-plugin:3.0.0-SNAPSHOT(version: 3.0.0-SNAPSHOT, snapshot:false) } generated by PluginInvocation{org.apache.maven.plugins:maven-invoker-plugin:3.1.0@integration-test  integration-test}: linux-jdk7-m3.5.x_build/target/invoker-reports/*.xml
[withMaven] openTasksPublisher - Scan Tasks for Maven artifact org.apache.maven.plugins:maven-changes-plugin:maven-plugin:3.0.0-SNAPSHOT in source directory linux-jdk7-m3.2.x_build/src/main/java
[TASKS] Scanning folder '/home/jenkins/jenkins-slave/workspace/_box_maven-changes-plugin_master@2' for files matching the pattern 'linux-jdk7-m3.2.x_build/src/main/java/**/*' - excludes: null
[TASKS] Found 48 files to scan for tasks
[TASKS] Found 4 open tasks.
Skipping warnings blame since pipelines do not have an SCM link.%n
[TASKS] Computing warning deltas based on reference build #25
[withMaven] invokerPublisher - Archive invoker results for Maven artifact MavenArtifact{org.apache.maven.plugins:maven-changes-plugin:maven-plugin:3.0.0-SNAPSHOT(version: 3.0.0-SNAPSHOT, snapshot:false) } generated by PluginInvocation{org.apache.maven.plugins:maven-invoker-plugin:3.1.0@integration-test  integration-test}: linux-jdk7-m3.2.x_build/target/invoker-reports/*.xml
[Pipeline] // withMaven
[Pipeline] // withMaven
[Pipeline] cleanWs
[Pipeline] }
[Pipeline] cleanWs
[WS-CLEANUP] Deleting project workspace...
[WS-CLEANUP] Deferred wipeout is used...
[WS-CLEANUP] done
[Pipeline] // stage
[Pipeline] }
[Pipeline] }
[Pipeline] // ws
[Pipeline] // stage
[Pipeline] }
[Pipeline] }
[Pipeline] // node
[Pipeline] // ws
[Pipeline] }
[Pipeline] }
[withMaven] Publishers: Generated Artifacts Publisher: 1528 ms, Junit Publisher: 8626 ms, Open Task Scanner Publisher: 897 ms, Dependencies Fingerprint Publisher: 1 ms, Invoker Publisher: 15831 ms, Pipeline Graph Publisher: 1 ms
[Pipeline] // node
[Pipeline] }
[withMaven] openTasksPublisher - Scan Tasks for Maven artifact org.apache.maven.plugins:maven-changes-plugin:maven-plugin:3.0.0-SNAPSHOT in source directory linux-jdk7-m3.3.x_build/src/main/java
[Pipeline] // withMaven
[Pipeline] cleanWs
[TASKS] Scanning folder '/home/jenkins/jenkins-slave/workspace/_box_maven-changes-plugin_master@3@2' for files matching the pattern 'linux-jdk7-m3.3.x_build/src/main/java/**/*' - excludes: null
[TASKS] Found 48 files to scan for tasks
[TASKS] Found 4 open tasks.
Skipping warnings blame since pipelines do not have an SCM link.%n
[TASKS] Computing warning deltas based on reference build #25
[WS-CLEANUP] Deleting project workspace...
[WS-CLEANUP] Deferred wipeout is used...
[WS-CLEANUP] done
[Pipeline] }
[Pipeline] // stage
[Pipeline] }
[Pipeline] // ws
[Pipeline] }
[Pipeline] // node
[Pipeline] }
[withMaven] invokerPublisher - Archive invoker results for Maven artifact MavenArtifact{org.apache.maven.plugins:maven-changes-plugin:maven-plugin:3.0.0-SNAPSHOT(version: 3.0.0-SNAPSHOT, snapshot:false) } generated by PluginInvocation{org.apache.maven.plugins:maven-invoker-plugin:3.1.0@integration-test  integration-test}: linux-jdk7-m3.3.x_build/target/invoker-reports/*.xml
[withMaven] Publishers: Generated Artifacts Publisher: 1704 ms, Junit Publisher: 17203 ms, Open Task Scanner Publisher: 950 ms, Dependencies Fingerprint Publisher: 1 ms, Invoker Publisher: 11626 ms, Pipeline Graph Publisher: 2 ms
[Pipeline] // withMaven
[Pipeline] cleanWs
[WS-CLEANUP] Deleting project workspace...
[WS-CLEANUP] Deferred wipeout is used...
[WS-CLEANUP] done
[Pipeline] }
[Pipeline] // stage
[Pipeline] }
[Pipeline] // ws
[Pipeline] }
[Pipeline] // node
[Pipeline] }
[withMaven] Publishers: Generated Artifacts Publisher: 1697 ms, Junit Publisher: 25746 ms, Open Task Scanner Publisher: 1033 ms, Dependencies Fingerprint Publisher: 1 ms, Invoker Publisher: 11831 ms, Pipeline Graph Publisher: 1 ms
[Pipeline] // withMaven
[Pipeline] cleanWs
[WS-CLEANUP] Deleting project workspace...
[WS-CLEANUP] Deferred wipeout is used...
[WS-CLEANUP] done
[Pipeline] }
[Pipeline] // stage
[Pipeline] }
[Pipeline] // ws
[Pipeline] }
[Pipeline] // node
[Pipeline] }
[WS-CLEANUP] Deleting project workspace...
[WS-CLEANUP] Deferred wipeout is used...
[withMaven] Publishers: Generated Artifacts Publisher: 1256 ms, Junit Publisher: 52993 ms, Open Task Scanner Publisher: 865 ms, Dependencies Fingerprint Publisher: 1 ms, Invoker Publisher: 28676 ms, Pipeline Graph Publisher: 1 ms
[Pipeline] // withMaven
[WS-CLEANUP] done
[Pipeline] cleanWs
[Pipeline] }
[Pipeline] // stage
[Pipeline] }
[Pipeline] // ws
[Pipeline] }
[Pipeline] // node
[Pipeline] }
[WS-CLEANUP] Deleting project workspace...
[WS-CLEANUP] Deferred wipeout is used...
[WS-CLEANUP] done
[Pipeline] }
[Pipeline] // stage
[Pipeline] }
[Pipeline] // ws
[Pipeline] }
[Pipeline] // node
[Pipeline] }
[Pipeline] // parallel
[Pipeline] stage
[Pipeline] { (Notifications)
[Pipeline] echo
Build result: FAILURE
[Pipeline] jiraIssueSelector
[Pipeline] echo
The authors of changes [slachiewicz].
[Pipeline] echo
Sending email ...
[Pipeline] emailext
Reply | Threaded
Open this post in threaded view
|

Build unstable in Jenkins: Maven TLP » maven-changes-plugin » master #27

Apache Jenkins Server-2
See https://builds.apache.org/job/maven-box/job/maven-changes-plugin/job/master/27/

Changes:

* Revert "Use default configuration for Jenkins build"

8 tests failed.
FAILED:  org.apache.maven.plugins.jira.JiraUnicodeTestCase.windows-jdk7-m3.3.x_build / Build windows-jdk7-m3.3.x_build / testUnicodeReport

Error Message:
Couldn't resolve the skin.

Stack Trace:
org.apache.maven.plugin.MojoExecutionException: Couldn't resolve the skin.
        at org.apache.maven.plugins.jira.JiraUnicodeTestCase.testUnicodeReport(JiraUnicodeTestCase.java:75)
Caused by: org.apache.maven.shared.artifact.resolve.ArtifactResolverException: Failed to read artifact descriptor for org.apache.maven.skins:maven-default-skin:jar:1.0
        at org.apache.maven.plugins.jira.JiraUnicodeTestCase.testUnicodeReport(JiraUnicodeTestCase.java:75)
Caused by: org.sonatype.aether.resolution.ArtifactDescriptorException: Failed to read artifact descriptor for org.apache.maven.skins:maven-default-skin:jar:1.0
        at org.apache.maven.plugins.jira.JiraUnicodeTestCase.testUnicodeReport(JiraUnicodeTestCase.java:75)
Caused by: org.sonatype.aether.resolution.ArtifactResolutionException: Could not transfer artifact org.apache.maven.skins:maven-default-skin:pom:1.0 from central (https://repo.maven.apache.org/maven2): Received fatal alert: protocol_version
        at org.apache.maven.plugins.jira.JiraUnicodeTestCase.testUnicodeReport(JiraUnicodeTestCase.java:75)
Caused by: org.sonatype.aether.transfer.ArtifactTransferException: Could not transfer artifact org.apache.maven.skins:maven-default-skin:pom:1.0 from central (https://repo.maven.apache.org/maven2): Received fatal alert: protocol_version
        at org.apache.maven.plugins.jira.JiraUnicodeTestCase.testUnicodeReport(JiraUnicodeTestCase.java:75)
Caused by: org.apache.maven.wagon.TransferFailedException: Received fatal alert: protocol_version
Caused by: javax.net.ssl.SSLException: Received fatal alert: protocol_version


FAILED:  org.apache.maven.plugins.jira.JiraUnicodeTestCase.windows-jdk7-m3.5.x_build / Build windows-jdk7-m3.5.x_build / testUnicodeReport

Error Message:
Couldn't resolve the skin.

Stack Trace:
org.apache.maven.plugin.MojoExecutionException: Couldn't resolve the skin.
        at org.apache.maven.plugins.jira.JiraUnicodeTestCase.testUnicodeReport(JiraUnicodeTestCase.java:75)
Caused by: org.apache.maven.shared.artifact.resolve.ArtifactResolverException: Failed to read artifact descriptor for org.apache.maven.skins:maven-default-skin:jar:1.0
        at org.apache.maven.plugins.jira.JiraUnicodeTestCase.testUnicodeReport(JiraUnicodeTestCase.java:75)
Caused by: org.sonatype.aether.resolution.ArtifactDescriptorException: Failed to read artifact descriptor for org.apache.maven.skins:maven-default-skin:jar:1.0
        at org.apache.maven.plugins.jira.JiraUnicodeTestCase.testUnicodeReport(JiraUnicodeTestCase.java:75)
Caused by: org.sonatype.aether.resolution.ArtifactResolutionException: Could not transfer artifact org.apache.maven.skins:maven-default-skin:pom:1.0 from central (https://repo.maven.apache.org/maven2): Received fatal alert: protocol_version
        at org.apache.maven.plugins.jira.JiraUnicodeTestCase.testUnicodeReport(JiraUnicodeTestCase.java:75)
Caused by: org.sonatype.aether.transfer.ArtifactTransferException: Could not transfer artifact org.apache.maven.skins:maven-default-skin:pom:1.0 from central (https://repo.maven.apache.org/maven2): Received fatal alert: protocol_version
        at org.apache.maven.plugins.jira.JiraUnicodeTestCase.testUnicodeReport(JiraUnicodeTestCase.java:75)
Caused by: org.apache.maven.wagon.TransferFailedException: Received fatal alert: protocol_version
Caused by: javax.net.ssl.SSLException: Received fatal alert: protocol_version


FAILED:  org.apache.maven.plugins.jira.JiraUnicodeTestCase.windows-jdk7-m3.6.x_build / Build windows-jdk7-m3.6.x_build / testUnicodeReport

Error Message:
Couldn't resolve the skin.

Stack Trace:
org.apache.maven.plugin.MojoExecutionException: Couldn't resolve the skin.
        at org.apache.maven.plugins.jira.JiraUnicodeTestCase.testUnicodeReport(JiraUnicodeTestCase.java:75)
Caused by: org.apache.maven.shared.artifact.resolve.ArtifactResolverException: Failed to read artifact descriptor for org.apache.maven.skins:maven-default-skin:jar:1.0
        at org.apache.maven.plugins.jira.JiraUnicodeTestCase.testUnicodeReport(JiraUnicodeTestCase.java:75)
Caused by: org.sonatype.aether.resolution.ArtifactDescriptorException: Failed to read artifact descriptor for org.apache.maven.skins:maven-default-skin:jar:1.0
        at org.apache.maven.plugins.jira.JiraUnicodeTestCase.testUnicodeReport(JiraUnicodeTestCase.java:75)
Caused by: org.sonatype.aether.resolution.ArtifactResolutionException: Could not transfer artifact org.apache.maven.skins:maven-default-skin:pom:1.0 from central (https://repo.maven.apache.org/maven2): Received fatal alert: protocol_version
        at org.apache.maven.plugins.jira.JiraUnicodeTestCase.testUnicodeReport(JiraUnicodeTestCase.java:75)
Caused by: org.sonatype.aether.transfer.ArtifactTransferException: Could not transfer artifact org.apache.maven.skins:maven-default-skin:pom:1.0 from central (https://repo.maven.apache.org/maven2): Received fatal alert: protocol_version
        at org.apache.maven.plugins.jira.JiraUnicodeTestCase.testUnicodeReport(JiraUnicodeTestCase.java:75)
Caused by: org.apache.maven.wagon.TransferFailedException: Received fatal alert: protocol_version
Caused by: javax.net.ssl.SSLException: Received fatal alert: protocol_version


FAILED:  org.apache.maven.plugins.jira.JiraUnicodeTestCase.windows-jdk7-m3.2.x_build / Build windows-jdk7-m3.2.x_build / testUnicodeReport

Error Message:
Couldn't resolve the skin.

Stack Trace:
org.apache.maven.plugin.MojoExecutionException: Couldn't resolve the skin.
        at org.apache.maven.plugins.jira.JiraUnicodeTestCase.testUnicodeReport(JiraUnicodeTestCase.java:75)
Caused by: org.apache.maven.shared.artifact.resolve.ArtifactResolverException: Failed to read artifact descriptor for org.apache.maven.skins:maven-default-skin:jar:1.0
        at org.apache.maven.plugins.jira.JiraUnicodeTestCase.testUnicodeReport(JiraUnicodeTestCase.java:75)
Caused by: org.sonatype.aether.resolution.ArtifactDescriptorException: Failed to read artifact descriptor for org.apache.maven.skins:maven-default-skin:jar:1.0
        at org.apache.maven.plugins.jira.JiraUnicodeTestCase.testUnicodeReport(JiraUnicodeTestCase.java:75)
Caused by: org.sonatype.aether.resolution.ArtifactResolutionException: Could not transfer artifact org.apache.maven.skins:maven-default-skin:pom:1.0 from central (https://repo.maven.apache.org/maven2): Received fatal alert: protocol_version
        at org.apache.maven.plugins.jira.JiraUnicodeTestCase.testUnicodeReport(JiraUnicodeTestCase.java:75)
Caused by: org.sonatype.aether.transfer.ArtifactTransferException: Could not transfer artifact org.apache.maven.skins:maven-default-skin:pom:1.0 from central (https://repo.maven.apache.org/maven2): Received fatal alert: protocol_version
        at org.apache.maven.plugins.jira.JiraUnicodeTestCase.testUnicodeReport(JiraUnicodeTestCase.java:75)
Caused by: org.apache.maven.wagon.TransferFailedException: Received fatal alert: protocol_version
Caused by: javax.net.ssl.SSLException: Received fatal alert: protocol_version


FAILED:  org.apache.maven.plugins.jira.JiraUnicodeTestCase.linux-jdk7-m3.3.x_build / Build linux-jdk7-m3.3.x_build / testUnicodeReport

Error Message:
Couldn't resolve the skin.

Stack Trace:
org.apache.maven.plugin.MojoExecutionException: Couldn't resolve the skin.
        at org.apache.maven.plugins.jira.JiraUnicodeTestCase.testUnicodeReport(JiraUnicodeTestCase.java:75)
Caused by: org.apache.maven.shared.artifact.resolve.ArtifactResolverException: Failed to read artifact descriptor for org.apache.maven.skins:maven-default-skin:jar:1.0
        at org.apache.maven.plugins.jira.JiraUnicodeTestCase.testUnicodeReport(JiraUnicodeTestCase.java:75)
Caused by: org.sonatype.aether.resolution.ArtifactDescriptorException: Failed to read artifact descriptor for org.apache.maven.skins:maven-default-skin:jar:1.0
        at org.apache.maven.plugins.jira.JiraUnicodeTestCase.testUnicodeReport(JiraUnicodeTestCase.java:75)
Caused by: org.sonatype.aether.resolution.ArtifactResolutionException: Could not transfer artifact org.apache.maven.skins:maven-default-skin:pom:1.0 from central (https://repo.maven.apache.org/maven2): Received fatal alert: protocol_version
        at org.apache.maven.plugins.jira.JiraUnicodeTestCase.testUnicodeReport(JiraUnicodeTestCase.java:75)
Caused by: org.sonatype.aether.transfer.ArtifactTransferException: Could not transfer artifact org.apache.maven.skins:maven-default-skin:pom:1.0 from central (https://repo.maven.apache.org/maven2): Received fatal alert: protocol_version
        at org.apache.maven.plugins.jira.JiraUnicodeTestCase.testUnicodeReport(JiraUnicodeTestCase.java:75)
Caused by: org.apache.maven.wagon.TransferFailedException: Received fatal alert: protocol_version
Caused by: javax.net.ssl.SSLException: Received fatal alert: protocol_version


FAILED:  org.apache.maven.plugins.jira.JiraUnicodeTestCase.linux-jdk7-m3.6.x_build / Build linux-jdk7-m3.6.x_build / testUnicodeReport

Error Message:
Couldn't resolve the skin.

Stack Trace:
org.apache.maven.plugin.MojoExecutionException: Couldn't resolve the skin.
        at org.apache.maven.plugins.jira.JiraUnicodeTestCase.testUnicodeReport(JiraUnicodeTestCase.java:75)
Caused by: org.apache.maven.shared.artifact.resolve.ArtifactResolverException: Failed to read artifact descriptor for org.apache.maven.skins:maven-default-skin:jar:1.0
        at org.apache.maven.plugins.jira.JiraUnicodeTestCase.testUnicodeReport(JiraUnicodeTestCase.java:75)
Caused by: org.sonatype.aether.resolution.ArtifactDescriptorException: Failed to read artifact descriptor for org.apache.maven.skins:maven-default-skin:jar:1.0
        at org.apache.maven.plugins.jira.JiraUnicodeTestCase.testUnicodeReport(JiraUnicodeTestCase.java:75)
Caused by: org.sonatype.aether.resolution.ArtifactResolutionException: Could not transfer artifact org.apache.maven.skins:maven-default-skin:pom:1.0 from central (https://repo.maven.apache.org/maven2): Received fatal alert: protocol_version
        at org.apache.maven.plugins.jira.JiraUnicodeTestCase.testUnicodeReport(JiraUnicodeTestCase.java:75)
Caused by: org.sonatype.aether.transfer.ArtifactTransferException: Could not transfer artifact org.apache.maven.skins:maven-default-skin:pom:1.0 from central (https://repo.maven.apache.org/maven2): Received fatal alert: protocol_version
        at org.apache.maven.plugins.jira.JiraUnicodeTestCase.testUnicodeReport(JiraUnicodeTestCase.java:75)
Caused by: org.apache.maven.wagon.TransferFailedException: Received fatal alert: protocol_version
Caused by: javax.net.ssl.SSLException: Received fatal alert: protocol_version


FAILED:  org.apache.maven.plugins.jira.JiraUnicodeTestCase.linux-jdk7-m3.5.x_build / Build linux-jdk7-m3.5.x_build / testUnicodeReport

Error Message:
Couldn't resolve the skin.

Stack Trace:
org.apache.maven.plugin.MojoExecutionException: Couldn't resolve the skin.
        at org.apache.maven.plugins.jira.JiraUnicodeTestCase.testUnicodeReport(JiraUnicodeTestCase.java:75)
Caused by: org.apache.maven.shared.artifact.resolve.ArtifactResolverException: Failed to read artifact descriptor for org.apache.maven.skins:maven-default-skin:jar:1.0
        at org.apache.maven.plugins.jira.JiraUnicodeTestCase.testUnicodeReport(JiraUnicodeTestCase.java:75)
Caused by: org.sonatype.aether.resolution.ArtifactDescriptorException: Failed to read artifact descriptor for org.apache.maven.skins:maven-default-skin:jar:1.0
        at org.apache.maven.plugins.jira.JiraUnicodeTestCase.testUnicodeReport(JiraUnicodeTestCase.java:75)
Caused by: org.sonatype.aether.resolution.ArtifactResolutionException: Could not transfer artifact org.apache.maven.skins:maven-default-skin:pom:1.0 from central (https://repo.maven.apache.org/maven2): Received fatal alert: protocol_version
        at org.apache.maven.plugins.jira.JiraUnicodeTestCase.testUnicodeReport(JiraUnicodeTestCase.java:75)
Caused by: org.sonatype.aether.transfer.ArtifactTransferException: Could not transfer artifact org.apache.maven.skins:maven-default-skin:pom:1.0 from central (https://repo.maven.apache.org/maven2): Received fatal alert: protocol_version
        at org.apache.maven.plugins.jira.JiraUnicodeTestCase.testUnicodeReport(JiraUnicodeTestCase.java:75)
Caused by: org.apache.maven.wagon.TransferFailedException: Received fatal alert: protocol_version
Caused by: javax.net.ssl.SSLException: Received fatal alert: protocol_version


FAILED:  org.apache.maven.plugins.jira.JiraUnicodeTestCase.linux-jdk7-m3.2.x_build / Build linux-jdk7-m3.2.x_build / testUnicodeReport

Error Message:
Couldn't resolve the skin.

Stack Trace:
org.apache.maven.plugin.MojoExecutionException: Couldn't resolve the skin.
        at org.apache.maven.plugins.jira.JiraUnicodeTestCase.testUnicodeReport(JiraUnicodeTestCase.java:75)
Caused by: org.apache.maven.shared.artifact.resolve.ArtifactResolverException: Failed to read artifact descriptor for org.apache.maven.skins:maven-default-skin:jar:1.0
        at org.apache.maven.plugins.jira.JiraUnicodeTestCase.testUnicodeReport(JiraUnicodeTestCase.java:75)
Caused by: org.sonatype.aether.resolution.ArtifactDescriptorException: Failed to read artifact descriptor for org.apache.maven.skins:maven-default-skin:jar:1.0
        at org.apache.maven.plugins.jira.JiraUnicodeTestCase.testUnicodeReport(JiraUnicodeTestCase.java:75)
Caused by: org.sonatype.aether.resolution.ArtifactResolutionException: Could not transfer artifact org.apache.maven.skins:maven-default-skin:pom:1.0 from central (https://repo.maven.apache.org/maven2): Received fatal alert: protocol_version
        at org.apache.maven.plugins.jira.JiraUnicodeTestCase.testUnicodeReport(JiraUnicodeTestCase.java:75)
Caused by: org.sonatype.aether.transfer.ArtifactTransferException: Could not transfer artifact org.apache.maven.skins:maven-default-skin:pom:1.0 from central (https://repo.maven.apache.org/maven2): Received fatal alert: protocol_version
        at org.apache.maven.plugins.jira.JiraUnicodeTestCase.testUnicodeReport(JiraUnicodeTestCase.java:75)
Caused by: org.apache.maven.wagon.TransferFailedException: Received fatal alert: protocol_version
Caused by: javax.net.ssl.SSLException: Received fatal alert: protocol_version




Build log:
[...truncated 5111 lines...]
[INFO]           report-aggregated-changes-generation/pom.xml ..... SUCCESS (13.5 s)
[INFO] Building: report-changes-interpolation/pom.xml
[INFO] run post-build script verify.bsh
[INFO]           report-changes-interpolation/pom.xml ............. SUCCESS (11.4 s)
[INFO]
[INFO] --- maven-checkstyle-plugin:3.0.0:check (checkstyle-check) @ maven-changes-plugin ---
[INFO]           announce-generate-no-url/pom.xml ................. SUCCESS (6.9 s)
[INFO]
[INFO] --- maven-checkstyle-plugin:3.0.0:check (checkstyle-check) @ maven-changes-plugin ---
[INFO]           announce-generate-inconsistent-issue-management/pom.xml SUCCESS (7.0 s)
[INFO] Building: announce-generate-no-issue-management/pom.xml
[Pipeline] }
[withMaven] artifactsPublisher - Archive artifact windows-jdk7-m3.2.x_build\pom.xml under org\apache\maven\plugins\maven-changes-plugin\3.0.0-SNAPSHOT\maven-changes-plugin-3.0.0-SNAPSHOT.pom
[withMaven] artifactsPublisher - Archive artifact windows-jdk7-m3.2.x_build\target\maven-changes-plugin-3.0.0-SNAPSHOT.jar under org\apache\maven\plugins\maven-changes-plugin\3.0.0-SNAPSHOT\maven-changes-plugin-3.0.0-SNAPSHOT.jar
[withMaven] junitPublisher - Archive test results for Maven artifact org.apache.maven.plugins:maven-changes-plugin:maven-plugin:3.0.0-SNAPSHOT generated by maven-surefire-plugin:test (default-test): windows-jdk7-m3.2.x_build\target\surefire-reports\*.xml
Recording test results
[withMaven] openTasksPublisher - Scan Tasks for Maven artifact org.apache.maven.plugins:maven-changes-plugin:maven-plugin:3.0.0-SNAPSHOT in source directory linux-jdk11-m3.6.x_build/src/main/java
[TASKS] Scanning folder '/home/jenkins/jenkins-slave/workspace/_box_maven-changes-plugin_master@2@2' for files matching the pattern 'linux-jdk11-m3.6.x_build/src/main/java/**/*' - excludes: null
[TASKS] Found 48 files to scan for tasks
[TASKS] Found 4 open tasks.
Skipping warnings blame since pipelines do not have an SCM link.%n
[withMaven] openTasksPublisher - Scan Tasks for Maven artifact org.apache.maven.plugins:maven-changes-plugin:maven-plugin:3.0.0-SNAPSHOT in source directory windows-jdk7-m3.2.x_build\src\main\java
[TASKS] Computing warning deltas based on reference build #25
[TASKS] Scanning folder 'f:\jenkins\jenkins-slave\workspace\-box_maven-changes-plugin_master@3' for files matching the pattern 'windows-jdk7-m3.2.x_build\src\main\java\**\*' - excludes: null
[TASKS] Found 48 files to scan for tasks
[TASKS] Found 4 open tasks.
Skipping warnings blame since pipelines do not have an SCM link.%n
[TASKS] Computing warning deltas based on reference build #25
[withMaven] invokerPublisher - Archive invoker results for Maven artifact MavenArtifact{org.apache.maven.plugins:maven-changes-plugin:maven-plugin:3.0.0-SNAPSHOT(version: 3.0.0-SNAPSHOT, snapshot:false) } generated by PluginInvocation{org.apache.maven.plugins:maven-invoker-plugin:3.1.0@integration-test  integration-test}: windows-jdk7-m3.2.x_build\target\invoker-reports\*.xml
[withMaven] invokerPublisher - Archive invoker results for Maven artifact MavenArtifact{org.apache.maven.plugins:maven-changes-plugin:maven-plugin:3.0.0-SNAPSHOT(version: 3.0.0-SNAPSHOT, snapshot:false) } generated by PluginInvocation{org.apache.maven.plugins:maven-invoker-plugin:3.1.0@integration-test  integration-test}: linux-jdk11-m3.6.x_build/target/invoker-reports/*.xml
[INFO]
[INFO] --- maven-invoker-plugin:3.1.0:verify (integration-test) @ maven-changes-plugin ---
[INFO] -------------------------------------------------
[INFO] Build Summary:
[INFO]   Passed: 13, Failed: 0, Errors: 0, Skipped: 0
[INFO] -------------------------------------------------
[INFO] ------------------------------------------------------------------------
[INFO] BUILD SUCCESS
[INFO] ------------------------------------------------------------------------
[INFO] Total time: 02:51 min
[INFO] Finished at: 2020-02-09T23:17:55+00:00
[INFO] Final Memory: 85M/2583M
[INFO] ------------------------------------------------------------------------
[INFO] [jenkins-event-spy] Generated /home/jenkins/jenkins-slave/workspace/_box_maven-changes-plugin_master@2@tmp/withMaven9786418d/maven-spy-20200209-231504-2587638865996879881066.log
[Pipeline] }
[Pipeline] // dir
[Pipeline] }
[INFO]
[INFO] --- maven-invoker-plugin:3.1.0:verify (integration-test) @ maven-changes-plugin ---
[INFO] -------------------------------------------------
[INFO] Build Summary:
[INFO]   Passed: 13, Failed: 0, Errors: 0, Skipped: 0
[INFO] -------------------------------------------------
[INFO] ------------------------------------------------------------------------
[INFO] BUILD SUCCESS
[INFO] ------------------------------------------------------------------------
[INFO] Total time:  02:50 min
[INFO] Finished at: 2020-02-09T23:17:56Z
[INFO] ------------------------------------------------------------------------
[INFO] [jenkins-event-spy] Generated /home/jenkins/jenkins-slave/workspace/_box_maven-changes-plugin_master@2@tmp/withMavende28c824/maven-spy-20200209-231505-569880331565614009024.log
[withMaven] Publishers: Generated Artifacts Publisher: 147 ms, Junit Publisher: 436 ms, Open Task Scanner Publisher: 144 ms, Invoker Publisher: 2405 ms, Pipeline Graph Publisher: 1 ms
[Pipeline] // withMaven
[Pipeline] cleanWs
[WS-CLEANUP] Deleting project workspace...
[WS-CLEANUP] Deferred wipeout is used...
[WS-CLEANUP] done
[Pipeline] }
[Pipeline] // stage
[Pipeline] }
[Pipeline] // ws
[Pipeline] }
[Pipeline] }
[Pipeline] // node
[Pipeline] // dir
[Pipeline] }
[Pipeline] }
[withMaven] artifactsPublisher - Archive artifact linux-jdk7-m3.3.x_build/pom.xml under org/apache/maven/plugins/maven-changes-plugin/3.0.0-SNAPSHOT/maven-changes-plugin-3.0.0-SNAPSHOT.pom
[withMaven] Publishers: Generated Artifacts Publisher: 1369 ms, Junit Publisher: 8663 ms, Open Task Scanner Publisher: 29730 ms, Invoker Publisher: 12892 ms, Pipeline Graph Publisher: 1 ms
[withMaven] artifactsPublisher - Archive artifact linux-jdk7-m3.3.x_build/target/maven-changes-plugin-3.0.0-SNAPSHOT.jar under org/apache/maven/plugins/maven-changes-plugin/3.0.0-SNAPSHOT/maven-changes-plugin-3.0.0-SNAPSHOT.jar
[Pipeline] // withMaven
[Pipeline] cleanWs
[WS-CLEANUP] Deleting project workspace...
[WS-CLEANUP] Deferred wipeout is used...
[WS-CLEANUP] done
[Pipeline] }
[Pipeline] // stage
[Pipeline] }
[Pipeline] // ws
[Pipeline] }
[withMaven] junitPublisher - Archive test results for Maven artifact org.apache.maven.plugins:maven-changes-plugin:maven-plugin:3.0.0-SNAPSHOT generated by maven-surefire-plugin:test (default-test): linux-jdk7-m3.3.x_build/target/surefire-reports/*.xml
Recording test results
[Pipeline] // node
[Pipeline] }
[withMaven] artifactsPublisher - Archive artifact linux-jdk7-m3.6.x_build/pom.xml under org/apache/maven/plugins/maven-changes-plugin/3.0.0-SNAPSHOT/maven-changes-plugin-3.0.0-SNAPSHOT.pom
[withMaven] artifactsPublisher - Archive artifact linux-jdk7-m3.6.x_build/target/maven-changes-plugin-3.0.0-SNAPSHOT.jar under org/apache/maven/plugins/maven-changes-plugin/3.0.0-SNAPSHOT/maven-changes-plugin-3.0.0-SNAPSHOT.jar
[INFO]           announce-generate-no-issue-management/pom.xml .... SUCCESS (7.1 s)
[INFO]
[INFO] --- maven-checkstyle-plugin:3.0.0:check (checkstyle-check) @ maven-changes-plugin ---
[withMaven] junitPublisher - Archive test results for Maven artifact org.apache.maven.plugins:maven-changes-plugin:maven-plugin:3.0.0-SNAPSHOT generated by maven-surefire-plugin:test (default-test): linux-jdk7-m3.6.x_build/target/surefire-reports/*.xml
Recording test results
[INFO] run post-build script verify.bsh
[INFO]           report-changes-interpolation/pom.xml ............. SUCCESS (11.7 s)
[INFO]
[INFO] --- maven-checkstyle-plugin:3.0.0:check (checkstyle-check) @ maven-changes-plugin ---
[INFO]
[INFO] --- maven-invoker-plugin:3.1.0:verify (integration-test) @ maven-changes-plugin ---
[INFO] -------------------------------------------------
[INFO] Build Summary:
[INFO]   Passed: 13, Failed: 0, Errors: 0, Skipped: 0
[INFO] -------------------------------------------------
[INFO] ------------------------------------------------------------------------
[INFO] BUILD SUCCESS
[INFO] ------------------------------------------------------------------------
[INFO] Total time: 02:57 min
[INFO] Finished at: 2020-02-09T23:18:04+00:00
[INFO] Final Memory: 59M/1772M
[INFO] ------------------------------------------------------------------------
[INFO] [jenkins-event-spy] Generated /home/jenkins/jenkins-slave/workspace/_box_maven-changes-plugin_master@2@tmp/withMavenb7361712/maven-spy-20200209-231506-3642673705212938462535.log
[Pipeline] }
[INFO]
[INFO] --- maven-invoker-plugin:3.1.0:verify (integration-test) @ maven-changes-plugin ---
[INFO] -------------------------------------------------
[INFO] Build Summary:
[INFO]   Passed: 13, Failed: 0, Errors: 0, Skipped: 0
[INFO] -------------------------------------------------
[INFO] ------------------------------------------------------------------------
[INFO] BUILD SUCCESS
[INFO] ------------------------------------------------------------------------
[INFO] Total time: 02:58 min
[INFO] Finished at: 2020-02-09T23:18:06Z
[INFO] ------------------------------------------------------------------------
[INFO] [jenkins-event-spy] Generated /home/jenkins/jenkins-slave/workspace/_box_maven-changes-plugin_master@3@2@tmp/withMaven76a2c584/maven-spy-20200209-231507-7014918393710724565294.log
[Pipeline] // dir
[withMaven] Publishers: Generated Artifacts Publisher: 1484 ms, Junit Publisher: 47592 ms, Open Task Scanner Publisher: 853 ms, Dependencies Fingerprint Publisher: 1 ms, Invoker Publisher: 13783 ms, Pipeline Graph Publisher: 1 ms
[withMaven] openTasksPublisher - Scan Tasks for Maven artifact org.apache.maven.plugins:maven-changes-plugin:maven-plugin:3.0.0-SNAPSHOT in source directory linux-jdk7-m3.3.x_build/src/main/java
[TASKS] Scanning folder '/home/jenkins/jenkins-slave/workspace/_box_maven-changes-plugin_master@2' for files matching the pattern 'linux-jdk7-m3.3.x_build/src/main/java/**/*' - excludes: null
[TASKS] Found 48 files to scan for tasks
[TASKS] Found 4 open tasks.
Skipping warnings blame since pipelines do not have an SCM link.%n
[TASKS] Computing warning deltas based on reference build #25
[withMaven] invokerPublisher - Archive invoker results for Maven artifact MavenArtifact{org.apache.maven.plugins:maven-changes-plugin:maven-plugin:3.0.0-SNAPSHOT(version: 3.0.0-SNAPSHOT, snapshot:false) } generated by PluginInvocation{org.apache.maven.plugins:maven-invoker-plugin:3.1.0@integration-test  integration-test}: linux-jdk7-m3.3.x_build/target/invoker-reports/*.xml
[Pipeline] }
[Pipeline] }
[Pipeline] // withMaven
[Pipeline] // dir
[Pipeline] }
[Pipeline] cleanWs
[WS-CLEANUP] Deleting project workspace...
[WS-CLEANUP] Deferred wipeout is used...
[withMaven] openTasksPublisher - Scan Tasks for Maven artifact org.apache.maven.plugins:maven-changes-plugin:maven-plugin:3.0.0-SNAPSHOT in source directory linux-jdk7-m3.6.x_build/src/main/java
[WS-CLEANUP] done
[Pipeline] }
[TASKS] Scanning folder '/home/jenkins/jenkins-slave/workspace/_box_maven-changes-plugin_master@2' for files matching the pattern 'linux-jdk7-m3.6.x_build/src/main/java/**/*' - excludes: null
[TASKS] Found 48 files to scan for tasks
[TASKS] Found 4 open tasks.
Skipping warnings blame since pipelines do not have an SCM link.%n
[Pipeline] // stage
[TASKS] Computing warning deltas based on reference build #25
[Pipeline] }
[Pipeline] // ws
[Pipeline] }
[Pipeline] // node
[Pipeline] }
[withMaven] artifactsPublisher - Archive artifact linux-jdk7-m3.5.x_build/pom.xml under org/apache/maven/plugins/maven-changes-plugin/3.0.0-SNAPSHOT/maven-changes-plugin-3.0.0-SNAPSHOT.pom
[withMaven] artifactsPublisher - Archive artifact linux-jdk7-m3.5.x_build/target/maven-changes-plugin-3.0.0-SNAPSHOT.jar under org/apache/maven/plugins/maven-changes-plugin/3.0.0-SNAPSHOT/maven-changes-plugin-3.0.0-SNAPSHOT.jar
[withMaven] artifactsPublisher - Archive artifact linux-jdk7-m3.2.x_build/pom.xml under org/apache/maven/plugins/maven-changes-plugin/3.0.0-SNAPSHOT/maven-changes-plugin-3.0.0-SNAPSHOT.pom
[withMaven] artifactsPublisher - Archive artifact linux-jdk7-m3.2.x_build/target/maven-changes-plugin-3.0.0-SNAPSHOT.jar under org/apache/maven/plugins/maven-changes-plugin/3.0.0-SNAPSHOT/maven-changes-plugin-3.0.0-SNAPSHOT.jar
[withMaven] invokerPublisher - Archive invoker results for Maven artifact MavenArtifact{org.apache.maven.plugins:maven-changes-plugin:maven-plugin:3.0.0-SNAPSHOT(version: 3.0.0-SNAPSHOT, snapshot:false) } generated by PluginInvocation{org.apache.maven.plugins:maven-invoker-plugin:3.1.0@integration-test  integration-test}: linux-jdk7-m3.6.x_build/target/invoker-reports/*.xml
[withMaven] junitPublisher - Archive test results for Maven artifact org.apache.maven.plugins:maven-changes-plugin:maven-plugin:3.0.0-SNAPSHOT generated by maven-surefire-plugin:test (default-test): linux-jdk7-m3.5.x_build/target/surefire-reports/*.xml
Recording test results
[withMaven] junitPublisher - Archive test results for Maven artifact org.apache.maven.plugins:maven-changes-plugin:maven-plugin:3.0.0-SNAPSHOT generated by maven-surefire-plugin:test (default-test): linux-jdk7-m3.2.x_build/target/surefire-reports/*.xml
Recording test results
[withMaven] Publishers: Generated Artifacts Publisher: 1424 ms, Junit Publisher: 9537 ms, Open Task Scanner Publisher: 1097 ms, Dependencies Fingerprint Publisher: 1 ms, Invoker Publisher: 18818 ms, Pipeline Graph Publisher: 1 ms
[withMaven] openTasksPublisher - Scan Tasks for Maven artifact org.apache.maven.plugins:maven-changes-plugin:maven-plugin:3.0.0-SNAPSHOT in source directory linux-jdk7-m3.5.x_build/src/main/java
[Pipeline] // withMaven
[TASKS] Scanning folder '/home/jenkins/jenkins-slave/workspace/_box_maven-changes-plugin_master@3@2' for files matching the pattern 'linux-jdk7-m3.5.x_build/src/main/java/**/*' - excludes: null
[TASKS] Found 48 files to scan for tasks
[TASKS] Found 4 open tasks.
Skipping warnings blame since pipelines do not have an SCM link.%n
[TASKS] Computing warning deltas based on reference build #25
[withMaven] invokerPublisher - Archive invoker results for Maven artifact MavenArtifact{org.apache.maven.plugins:maven-changes-plugin:maven-plugin:3.0.0-SNAPSHOT(version: 3.0.0-SNAPSHOT, snapshot:false) } generated by PluginInvocation{org.apache.maven.plugins:maven-invoker-plugin:3.1.0@integration-test  integration-test}: linux-jdk7-m3.5.x_build/target/invoker-reports/*.xml
[Pipeline] cleanWs
[withMaven] Publishers: Generated Artifacts Publisher: 2665 ms, Junit Publisher: 16133 ms, Open Task Scanner Publisher: 1129 ms, Dependencies Fingerprint Publisher: 1 ms, Invoker Publisher: 18512 ms
[withMaven] openTasksPublisher - Scan Tasks for Maven artifact org.apache.maven.plugins:maven-changes-plugin:maven-plugin:3.0.0-SNAPSHOT in source directory linux-jdk7-m3.2.x_build/src/main/java
[WS-CLEANUP] Deleting project workspace...
[WS-CLEANUP] Deferred wipeout is used...
[Pipeline] // withMaven
[Pipeline] cleanWs
[TASKS] Scanning folder '/home/jenkins/jenkins-slave/workspace/_box_maven-changes-plugin_master@2' for files matching the pattern 'linux-jdk7-m3.2.x_build/src/main/java/**/*' - excludes: null
[TASKS] Found 48 files to scan for tasks
[TASKS] Found 4 open tasks.
Skipping warnings blame since pipelines do not have an SCM link.%n
[TASKS] Computing warning deltas based on reference build #25
[WS-CLEANUP] Deleting project workspace...
[WS-CLEANUP] Deferred wipeout is used...
[WS-CLEANUP] done
[Pipeline] }
[Pipeline] // stage
[Pipeline] }
[Pipeline] // ws
[Pipeline] }
[Pipeline] // node
[Pipeline] }
[withMaven] invokerPublisher - Archive invoker results for Maven artifact MavenArtifact{org.apache.maven.plugins:maven-changes-plugin:maven-plugin:3.0.0-SNAPSHOT(version: 3.0.0-SNAPSHOT, snapshot:false) } generated by PluginInvocation{org.apache.maven.plugins:maven-invoker-plugin:3.1.0@integration-test  integration-test}: linux-jdk7-m3.2.x_build/target/invoker-reports/*.xml
[WS-CLEANUP] done
[Pipeline] }
[Pipeline] // stage
[Pipeline] }
[Pipeline] // ws
[Pipeline] }
[Pipeline] // node
[Pipeline] }
[withMaven] Publishers: Generated Artifacts Publisher: 1256 ms, Junit Publisher: 9190 ms, Open Task Scanner Publisher: 928 ms, Invoker Publisher: 19242 ms, Pipeline Graph Publisher: 1 ms
[Pipeline] // withMaven
[Pipeline] cleanWs
[WS-CLEANUP] Deleting project workspace...
[WS-CLEANUP] Deferred wipeout is used...
[WS-CLEANUP] done
[Pipeline] }
[Pipeline] // stage
[Pipeline] }
[Pipeline] // ws
[Pipeline] }
[Pipeline] // node
[Pipeline] }
[withMaven] Publishers: Generated Artifacts Publisher: 1320 ms, Junit Publisher: 17842 ms, Open Task Scanner Publisher: 2864 ms, Dependencies Fingerprint Publisher: 1 ms, Invoker Publisher: 13863 ms, Pipeline Graph Publisher: 1 ms
[Pipeline] // withMaven
[Pipeline] cleanWs
[WS-CLEANUP] Deleting project workspace...
[WS-CLEANUP] Deferred wipeout is used...
[WS-CLEANUP] done
[Pipeline] }
[Pipeline] // stage
[Pipeline] }
[Pipeline] // ws
[Pipeline] }
[Pipeline] // node
[Pipeline] }
[Pipeline] // parallel
[Pipeline] stage
[Pipeline] { (Notifications)
[Pipeline] echo
Build result: UNSTABLE
[Pipeline] jiraIssueSelector
[Pipeline] echo
The authors of changes [slachiewicz].
[Pipeline] echo
Sending email ...
[Pipeline] emailext
Reply | Threaded
Open this post in threaded view
|

Build succeeded in Jenkins: Maven TLP » maven-changes-plugin » master #28

Apache Jenkins Server-2
See https://builds.apache.org/job/maven-box/job/maven-changes-plugin/job/master/28/

Changes:

* [MCHNGES-402] Upgrade Wagon to 2.4 and httpcomponents

All tests passed