Build unstable in Jenkins: Maven TLP » maven-assembly-plugin » MASSEMBLY-897 #1

classic Classic list List threaded Threaded
4 messages Options
Reply | Threaded
Open this post in threaded view
|

Build unstable in Jenkins: Maven TLP » maven-assembly-plugin » MASSEMBLY-897 #1

Apache Jenkins Server-2
See https://builds.apache.org/job/maven-box/job/maven-assembly-plugin/job/MASSEMBLY-897/1/

No changes.

All tests passed

Build log:
[...truncated 4.49 MB...]
[windows-jdk7-m3.2.x_build] [INFO]           projects\multimodule\two-levels-includeBaseDir-withSrc\pom.xml SUCCESS (13.3 s)
[windows-jdk7-m3.2.x_build] [INFO] Building: projects\repositories\basic-repository\pom.xml
[windows-jdk7-m3.3.x_build] [INFO] run post-build script verify.groovy
[windows-jdk7-m3.3.x_build] [INFO]           projects\multimodule\two-levels-includeBaseDir-withSrc\pom.xml SUCCESS (13.0 s)
[windows-jdk7-m3.3.x_build] [INFO] Building: projects\repositories\basic-repository\pom.xml
[windows-jdk7-m3.3.x_build] [INFO] run post-build script verify.bsh
[windows-jdk7-m3.3.x_build] [INFO]           projects\repositories\basic-repository\pom.xml ... SUCCESS (10.9 s)
[windows-jdk7-m3.3.x_build] [INFO] Building: projects\repositories\massembly-196\pom.xml
[windows-jdk7-m3.2.x_build] [INFO] run post-build script verify.bsh
[windows-jdk7-m3.2.x_build] [INFO]           projects\repositories\basic-repository\pom.xml ... SUCCESS (11.2 s)
[windows-jdk7-m3.2.x_build] [INFO] Building: projects\repositories\massembly-196\pom.xml
[windows-jdk7-m3.2.x_build] [INFO] run post-build script verify.bsh
[windows-jdk7-m3.2.x_build] [INFO]           projects\repositories\massembly-196\pom.xml ...... SUCCESS (17.0 s)
[windows-jdk7-m3.2.x_build] [INFO] Building: projects\repositories\massembly-855\pom.xml
[windows-jdk7-m3.3.x_build] [INFO] run post-build script verify.bsh
[windows-jdk7-m3.3.x_build] [INFO]           projects\repositories\massembly-196\pom.xml ...... SUCCESS (17.1 s)
[windows-jdk7-m3.3.x_build] [INFO] Building: projects\repositories\massembly-855\pom.xml
[windows-jdk7-m3.2.x_build] [INFO] run post-build script verify.bsh
[windows-jdk7-m3.2.x_build] [INFO]           projects\repositories\massembly-855\pom.xml ...... SUCCESS (6.4 s)
[windows-jdk7-m3.2.x_build] [INFO]
[windows-jdk7-m3.2.x_build] [INFO] --- maven-checkstyle-plugin:3.0.0:check (checkstyle-check) @ maven-assembly-plugin ---
[windows-jdk7-m3.2.x_build] [INFO] Downloading: https://repo.maven.apache.org/maven2/org/apache/maven/shared/maven-shared-resources/2/maven-shared-resources-2.pom
[windows-jdk7-m3.2.x_build] [INFO] Downloaded: https://repo.maven.apache.org/maven2/org/apache/maven/shared/maven-shared-resources/2/maven-shared-resources-2.pom (3 KB at 25.3 KB/sec)
[windows-jdk7-m3.2.x_build] [INFO] Downloading: https://repo.maven.apache.org/maven2/org/codehaus/plexus/plexus-utils/3.0.10/plexus-utils-3.0.10.pom
[windows-jdk7-m3.2.x_build] [INFO] Downloaded: https://repo.maven.apache.org/maven2/org/codehaus/plexus/plexus-utils/3.0.10/plexus-utils-3.0.10.pom (4 KB at 74.9 KB/sec)
[windows-jdk7-m3.2.x_build] [INFO] Downloading: https://repo.maven.apache.org/maven2/org/codehaus/plexus/plexus/3.3/plexus-3.3.pom
[windows-jdk7-m3.2.x_build] [INFO] Downloaded: https://repo.maven.apache.org/maven2/org/codehaus/plexus/plexus/3.3/plexus-3.3.pom (20 KB at 388.7 KB/sec)
[windows-jdk7-m3.2.x_build] [INFO] Downloading: https://repo.maven.apache.org/maven2/org/apache/maven/doxia/doxia-integration-tools/1.6/doxia-integration-tools-1.6.pom
[windows-jdk7-m3.2.x_build] [INFO] Downloaded: https://repo.maven.apache.org/maven2/org/apache/maven/doxia/doxia-integration-tools/1.6/doxia-integration-tools-1.6.pom (7 KB at 147.7 KB/sec)
[windows-jdk7-m3.2.x_build] [INFO] Downloading: https://repo.maven.apache.org/maven2/org/apache/maven/doxia/doxia-tools/3/doxia-tools-3.pom
[windows-jdk7-m3.2.x_build] [INFO] Downloaded: https://repo.maven.apache.org/maven2/org/apache/maven/doxia/doxia-tools/3/doxia-tools-3.pom (10 KB at 142.6 KB/sec)
[windows-jdk7-m3.2.x_build] [INFO] Downloading: https://repo.maven.apache.org/maven2/org/codehaus/plexus/plexus-resources/1.1.0/plexus-resources-1.1.0.pom
[windows-jdk7-m3.2.x_build] [INFO] Downloaded: https://repo.maven.apache.org/maven2/org/codehaus/plexus/plexus-resources/1.1.0/plexus-resources-1.1.0.pom (4 KB at 67.4 KB/sec)
[windows-jdk7-m3.2.x_build] [INFO] Downloading: https://repo.maven.apache.org/maven2/com/puppycrawl/tools/checkstyle/6.18/checkstyle-6.18.pom
[windows-jdk7-m3.2.x_build] [INFO] Downloaded: https://repo.maven.apache.org/maven2/com/puppycrawl/tools/checkstyle/6.18/checkstyle-6.18.pom (70 KB at 1195.9 KB/sec)
[windows-jdk7-m3.2.x_build] [INFO] Downloading: https://repo.maven.apache.org/maven2/antlr/antlr/2.7.7/antlr-2.7.7.pom
[windows-jdk7-m3.2.x_build] [INFO] Downloaded: https://repo.maven.apache.org/maven2/antlr/antlr/2.7.7/antlr-2.7.7.pom (632 B at 15.4 KB/sec)
[windows-jdk7-m3.2.x_build] [INFO] Downloading: https://repo.maven.apache.org/maven2/org/antlr/antlr4-runtime/4.5.3/antlr4-runtime-4.5.3.pom
[windows-jdk7-m3.2.x_build] [INFO] Downloaded: https://repo.maven.apache.org/maven2/org/antlr/antlr4-runtime/4.5.3/antlr4-runtime-4.5.3.pom (3 KB at 51.3 KB/sec)
[windows-jdk7-m3.2.x_build] [INFO] Downloading: https://repo.maven.apache.org/maven2/org/antlr/antlr4-master/4.5.3/antlr4-master-4.5.3.pom
[windows-jdk7-m3.2.x_build] [INFO] Downloaded: https://repo.maven.apache.org/maven2/org/antlr/antlr4-master/4.5.3/antlr4-master-4.5.3.pom (4 KB at 62.0 KB/sec)
[windows-jdk7-m3.2.x_build] [INFO] Downloading: https://repo.maven.apache.org/maven2/commons-beanutils/commons-beanutils/1.9.2/commons-beanutils-1.9.2.pom
[windows-jdk7-m3.2.x_build] [INFO] Downloaded: https://repo.maven.apache.org/maven2/commons-beanutils/commons-beanutils/1.9.2/commons-beanutils-1.9.2.pom (14 KB at 340.7 KB/sec)
[windows-jdk7-m3.2.x_build] [INFO] Downloading: https://repo.maven.apache.org/maven2/org/apache/commons/commons-parent/33/commons-parent-33.pom
[windows-jdk7-m3.2.x_build] [INFO] Downloaded: https://repo.maven.apache.org/maven2/org/apache/commons/commons-parent/33/commons-parent-33.pom (52 KB at 864.1 KB/sec)
[windows-jdk7-m3.2.x_build] [INFO] Downloading: https://repo.maven.apache.org/maven2/commons-cli/commons-cli/1.3.1/commons-cli-1.3.1.pom
[windows-jdk7-m3.2.x_build] [INFO] Downloaded: https://repo.maven.apache.org/maven2/commons-cli/commons-cli/1.3.1/commons-cli-1.3.1.pom (11 KB at 236.0 KB/sec)
[windows-jdk7-m3.2.x_build] [INFO] Downloading: https://repo.maven.apache.org/maven2/com/google/guava/guava/19.0/guava-19.0.pom
[windows-jdk7-m3.3.x_build] [INFO] run post-build script verify.bsh
[windows-jdk7-m3.3.x_build] [INFO]           projects\repositories\massembly-855\pom.xml ...... SUCCESS (6.5 s)
[windows-jdk7-m3.3.x_build] [INFO]
[windows-jdk7-m3.3.x_build] [INFO] --- maven-checkstyle-plugin:3.0.0:check (checkstyle-check) @ maven-assembly-plugin ---
[windows-jdk7-m3.3.x_build] [INFO] Downloading: https://repo.maven.apache.org/maven2/org/apache/maven/shared/maven-shared-resources/2/maven-shared-resources-2.pom
[windows-jdk7-m3.3.x_build] [INFO] Downloaded: https://repo.maven.apache.org/maven2/org/apache/maven/shared/maven-shared-resources/2/maven-shared-resources-2.pom (3 KB at 24.1 KB/sec)
[windows-jdk7-m3.3.x_build] [INFO] Downloading: https://repo.maven.apache.org/maven2/org/codehaus/plexus/plexus-utils/3.0.10/plexus-utils-3.0.10.pom
[windows-jdk7-m3.3.x_build] [INFO] Downloaded: https://repo.maven.apache.org/maven2/org/codehaus/plexus/plexus-utils/3.0.10/plexus-utils-3.0.10.pom (4 KB at 71.4 KB/sec)
[windows-jdk7-m3.3.x_build] [INFO] Downloading: https://repo.maven.apache.org/maven2/org/codehaus/plexus/plexus/3.3/plexus-3.3.pom
[windows-jdk7-m3.3.x_build] [INFO] Downloaded: https://repo.maven.apache.org/maven2/org/codehaus/plexus/plexus/3.3/plexus-3.3.pom (20 KB at 366.7 KB/sec)
[windows-jdk7-m3.3.x_build] [INFO] Downloading: https://repo.maven.apache.org/maven2/org/apache/maven/doxia/doxia-integration-tools/1.6/doxia-integration-tools-1.6.pom
[windows-jdk7-m3.3.x_build] [INFO] Downloaded: https://repo.maven.apache.org/maven2/org/apache/maven/doxia/doxia-integration-tools/1.6/doxia-integration-tools-1.6.pom (7 KB at 141.5 KB/sec)
[windows-jdk7-m3.3.x_build] [INFO] Downloading: https://repo.maven.apache.org/maven2/org/apache/maven/doxia/doxia-tools/3/doxia-tools-3.pom
[windows-jdk7-m3.3.x_build] [INFO] Downloaded: https://repo.maven.apache.org/maven2/org/apache/maven/doxia/doxia-tools/3/doxia-tools-3.pom (10 KB at 138.5 KB/sec)
[windows-jdk7-m3.3.x_build] [INFO] Downloading: https://repo.maven.apache.org/maven2/org/codehaus/plexus/plexus-resources/1.1.0/plexus-resources-1.1.0.pom
[windows-jdk7-m3.3.x_build] [INFO] Downloaded: https://repo.maven.apache.org/maven2/org/codehaus/plexus/plexus-resources/1.1.0/plexus-resources-1.1.0.pom (4 KB at 60.8 KB/sec)
[windows-jdk7-m3.3.x_build] [INFO] Downloading: https://repo.maven.apache.org/maven2/com/puppycrawl/tools/checkstyle/6.18/checkstyle-6.18.pom
[windows-jdk7-m3.3.x_build] [INFO] Downloaded: https://repo.maven.apache.org/maven2/com/puppycrawl/tools/checkstyle/6.18/checkstyle-6.18.pom (70 KB at 1195.9 KB/sec)
[windows-jdk7-m3.3.x_build] [INFO] Downloading: https://repo.maven.apache.org/maven2/antlr/antlr/2.7.7/antlr-2.7.7.pom
[windows-jdk7-m3.3.x_build] [INFO] Downloaded: https://repo.maven.apache.org/maven2/antlr/antlr/2.7.7/antlr-2.7.7.pom (632 B at 16.2 KB/sec)
[windows-jdk7-m3.3.x_build] [INFO] Downloading: https://repo.maven.apache.org/maven2/org/antlr/antlr4-runtime/4.5.3/antlr4-runtime-4.5.3.pom
[windows-jdk7-m3.3.x_build] [INFO] Downloaded: https://repo.maven.apache.org/maven2/org/antlr/antlr4-runtime/4.5.3/antlr4-runtime-4.5.3.pom (3 KB at 64.5 KB/sec)
[windows-jdk7-m3.3.x_build] [INFO] Downloading: https://repo.maven.apache.org/maven2/org/antlr/antlr4-master/4.5.3/antlr4-master-4.5.3.pom
[windows-jdk7-m3.3.x_build] [INFO] Downloaded: https://repo.maven.apache.org/maven2/org/antlr/antlr4-master/4.5.3/antlr4-master-4.5.3.pom (4 KB at 64.2 KB/sec)
[windows-jdk7-m3.3.x_build] [INFO] Downloading: https://repo.maven.apache.org/maven2/commons-beanutils/commons-beanutils/1.9.2/commons-beanutils-1.9.2.pom
[windows-jdk7-m3.3.x_build] [INFO] Downloaded: https://repo.maven.apache.org/maven2/commons-beanutils/commons-beanutils/1.9.2/commons-beanutils-1.9.2.pom (14 KB at 332.6 KB/sec)
[windows-jdk7-m3.3.x_build] [INFO] Downloading: https://repo.maven.apache.org/maven2/org/apache/commons/commons-parent/33/commons-parent-33.pom
[windows-jdk7-m3.3.x_build] [INFO] Downloaded: https://repo.maven.apache.org/maven2/org/apache/commons/commons-parent/33/commons-parent-33.pom (52 KB at 893.9 KB/sec)
[windows-jdk7-m3.3.x_build] [INFO] Downloading: https://repo.maven.apache.org/maven2/commons-cli/commons-cli/1.3.1/commons-cli-1.3.1.pom
[windows-jdk7-m3.3.x_build] [INFO] Downloaded: https://repo.maven.apache.org/maven2/commons-cli/commons-cli/1.3.1/commons-cli-1.3.1.pom (11 KB at 215.9 KB/sec)
[windows-jdk7-m3.3.x_build] [INFO] Downloading: https://repo.maven.apache.org/maven2/com/google/guava/guava/19.0/guava-19.0.pom
[windows-jdk7-m3.2.x_build] [INFO] Downloaded: https://repo.maven.apache.org/maven2/com/google/guava/guava/19.0/guava-19.0.pom (7 KB at 87.3 KB/sec)
[windows-jdk7-m3.2.x_build] [INFO] Downloading: https://repo.maven.apache.org/maven2/com/google/guava/guava-parent/19.0/guava-parent-19.0.pom
[windows-jdk7-m3.2.x_build] [INFO] Downloaded: https://repo.maven.apache.org/maven2/com/google/guava/guava-parent/19.0/guava-parent-19.0.pom (10 KB at 214.3 KB/sec)
[windows-jdk7-m3.2.x_build] [INFO] Downloading: https://repo.maven.apache.org/maven2/org/sonatype/oss/oss-parent/7/oss-parent-7.pom
[windows-jdk7-m3.2.x_build] [INFO] Downloaded: https://repo.maven.apache.org/maven2/org/sonatype/oss/oss-parent/7/oss-parent-7.pom (5 KB at 98.1 KB/sec)
[windows-jdk7-m3.2.x_build] [INFO] Downloading: https://repo.maven.apache.org/maven2/org/apache/maven/doxia/doxia-core/1.2/doxia-core-1.2.jar
[windows-jdk7-m3.2.x_build] [INFO] Downloading: https://repo.maven.apache.org/maven2/org/apache/maven/shared/maven-shared-resources/2/maven-shared-resources-2.jar
[windows-jdk7-m3.2.x_build] [INFO] Downloading: https://repo.maven.apache.org/maven2/commons-digester/commons-digester/1.6/commons-digester-1.6.jar
[windows-jdk7-m3.2.x_build] [INFO] Downloading: https://repo.maven.apache.org/maven2/org/apache/maven/doxia/doxia-integration-tools/1.6/doxia-integration-tools-1.6.jar
[windows-jdk7-m3.2.x_build] [INFO] Downloading: https://repo.maven.apache.org/maven2/commons-logging/commons-logging/1.0.4/commons-logging-1.0.4.jar
[windows-jdk7-m3.2.x_build] [INFO] Downloaded: https://repo.maven.apache.org/maven2/commons-logging/commons-logging/1.0.4/commons-logging-1.0.4.jar (38 KB at 417.1 KB/sec)
[windows-jdk7-m3.2.x_build] [INFO] Downloading: https://repo.maven.apache.org/maven2/commons-io/commons-io/1.4/commons-io-1.4.jar
[windows-jdk7-m3.2.x_build] [INFO] Downloaded: https://repo.maven.apache.org/maven2/commons-digester/commons-digester/1.6/commons-digester-1.6.jar (165 KB at 1041.1 KB/sec)
[windows-jdk7-m3.2.x_build] [INFO] Downloading: https://repo.maven.apache.org/maven2/org/codehaus/plexus/plexus-resources/1.1.0/plexus-resources-1.1.0.jar
[windows-jdk7-m3.2.x_build] [INFO] Downloaded: https://repo.maven.apache.org/maven2/commons-io/commons-io/1.4/commons-io-1.4.jar (107 KB at 608.5 KB/sec)
[windows-jdk7-m3.2.x_build] [INFO] Downloading: https://repo.maven.apache.org/maven2/com/puppycrawl/tools/checkstyle/6.18/checkstyle-6.18.jar
[windows-jdk7-m3.2.x_build] [INFO] Downloaded: https://repo.maven.apache.org/maven2/com/puppycrawl/tools/checkstyle/6.18/checkstyle-6.18.jar (1132 KB at 3469.8 KB/sec)
[windows-jdk7-m3.2.x_build] [INFO] Downloading: https://repo.maven.apache.org/maven2/antlr/antlr/2.7.7/antlr-2.7.7.jar
[windows-jdk7-m3.2.x_build] [INFO] Downloaded: https://repo.maven.apache.org/maven2/org/apache/maven/doxia/doxia-core/1.2/doxia-core-1.2.jar (151 KB at 422.8 KB/sec)
[windows-jdk7-m3.2.x_build] [INFO] Downloading: https://repo.maven.apache.org/maven2/org/antlr/antlr4-runtime/4.5.3/antlr4-runtime-4.5.3.jar
[windows-jdk7-m3.2.x_build] [INFO] Downloaded: https://repo.maven.apache.org/maven2/org/codehaus/plexus/plexus-resources/1.1.0/plexus-resources-1.1.0.jar (23 KB at 63.1 KB/sec)
[windows-jdk7-m3.2.x_build] [INFO] Downloading: https://repo.maven.apache.org/maven2/commons-beanutils/commons-beanutils/1.9.2/commons-beanutils-1.9.2.jar
[windows-jdk7-m3.2.x_build] [INFO] Downloaded: https://repo.maven.apache.org/maven2/antlr/antlr/2.7.7/antlr-2.7.7.jar (435 KB at 1042.8 KB/sec)
[windows-jdk7-m3.2.x_build] [INFO] Downloading: https://repo.maven.apache.org/maven2/commons-cli/commons-cli/1.3.1/commons-cli-1.3.1.jar
[windows-jdk7-m3.2.x_build] [INFO] Downloaded: https://repo.maven.apache.org/maven2/org/apache/maven/shared/maven-shared-resources/2/maven-shared-resources-2.jar (13 KB at 30.3 KB/sec)
[windows-jdk7-m3.2.x_build] [INFO] Downloading: https://repo.maven.apache.org/maven2/com/google/guava/guava/19.0/guava-19.0.jar
[windows-jdk7-m3.2.x_build] [INFO] Downloaded: https://repo.maven.apache.org/maven2/commons-beanutils/commons-beanutils/1.9.2/commons-beanutils-1.9.2.jar (229 KB at 531.1 KB/sec)
[windows-jdk7-m3.2.x_build] [INFO] Downloading: https://repo.maven.apache.org/maven2/commons-lang/commons-lang/2.1/commons-lang-2.1.jar
[windows-jdk7-m3.2.x_build] [INFO] Downloaded: https://repo.maven.apache.org/maven2/org/antlr/antlr4-runtime/4.5.3/antlr4-runtime-4.5.3.jar (296 KB at 675.4 KB/sec)
[windows-jdk7-m3.2.x_build] [INFO] Downloaded: https://repo.maven.apache.org/maven2/commons-lang/commons-lang/2.1/commons-lang-2.1.jar (203 KB at 420.9 KB/sec)
[windows-jdk7-m3.2.x_build] [INFO] Downloaded: https://repo.maven.apache.org/maven2/commons-cli/commons-cli/1.3.1/commons-cli-1.3.1.jar (52 KB at 106.7 KB/sec)
[windows-jdk7-m3.3.x_build] [INFO] Downloaded: https://repo.maven.apache.org/maven2/com/google/guava/guava/19.0/guava-19.0.pom (7 KB at 86.1 KB/sec)
[windows-jdk7-m3.3.x_build] [INFO] Downloading: https://repo.maven.apache.org/maven2/com/google/guava/guava-parent/19.0/guava-parent-19.0.pom
[windows-jdk7-m3.3.x_build] [INFO] Downloaded: https://repo.maven.apache.org/maven2/com/google/guava/guava-parent/19.0/guava-parent-19.0.pom (10 KB at 247.3 KB/sec)
[windows-jdk7-m3.3.x_build] [INFO] Downloading: https://repo.maven.apache.org/maven2/org/sonatype/oss/oss-parent/7/oss-parent-7.pom
[windows-jdk7-m3.3.x_build] [INFO] Downloaded: https://repo.maven.apache.org/maven2/org/sonatype/oss/oss-parent/7/oss-parent-7.pom (5 KB at 120.8 KB/sec)
[windows-jdk7-m3.3.x_build] [INFO] Downloading: https://repo.maven.apache.org/maven2/commons-digester/commons-digester/1.6/commons-digester-1.6.jar
[windows-jdk7-m3.3.x_build] [INFO] Downloading: https://repo.maven.apache.org/maven2/org/apache/maven/doxia/doxia-core/1.2/doxia-core-1.2.jar
[windows-jdk7-m3.3.x_build] [INFO] Downloading: https://repo.maven.apache.org/maven2/org/apache/maven/doxia/doxia-integration-tools/1.6/doxia-integration-tools-1.6.jar
[windows-jdk7-m3.3.x_build] [INFO] Downloading: https://repo.maven.apache.org/maven2/commons-logging/commons-logging/1.0.4/commons-logging-1.0.4.jar
[windows-jdk7-m3.3.x_build] [INFO] Downloading: https://repo.maven.apache.org/maven2/org/apache/maven/shared/maven-shared-resources/2/maven-shared-resources-2.jar
[windows-jdk7-m3.3.x_build] [INFO] Downloaded: https://repo.maven.apache.org/maven2/commons-digester/commons-digester/1.6/commons-digester-1.6.jar (165 KB at 2492.4 KB/sec)
[windows-jdk7-m3.3.x_build] [INFO] Downloading: https://repo.maven.apache.org/maven2/commons-io/commons-io/1.4/commons-io-1.4.jar
[windows-jdk7-m3.3.x_build] [INFO] Downloaded: https://repo.maven.apache.org/maven2/commons-logging/commons-logging/1.0.4/commons-logging-1.0.4.jar (38 KB at 371.2 KB/sec)
[windows-jdk7-m3.3.x_build] [INFO] Downloading: https://repo.maven.apache.org/maven2/org/codehaus/plexus/plexus-resources/1.1.0/plexus-resources-1.1.0.jar
[windows-jdk7-m3.3.x_build] [INFO] Downloaded: https://repo.maven.apache.org/maven2/org/apache/maven/shared/maven-shared-resources/2/maven-shared-resources-2.jar (13 KB at 86.7 KB/sec)
[windows-jdk7-m3.3.x_build] [INFO] Downloading: https://repo.maven.apache.org/maven2/com/puppycrawl/tools/checkstyle/6.18/checkstyle-6.18.jar
[windows-jdk7-m3.3.x_build] [INFO] Downloaded: https://repo.maven.apache.org/maven2/commons-io/commons-io/1.4/commons-io-1.4.jar (107 KB at 641.5 KB/sec)
[windows-jdk7-m3.3.x_build] [INFO] Downloading: https://repo.maven.apache.org/maven2/antlr/antlr/2.7.7/antlr-2.7.7.jar
[windows-jdk7-m3.3.x_build] [INFO] Downloaded: https://repo.maven.apache.org/maven2/org/apache/maven/doxia/doxia-core/1.2/doxia-core-1.2.jar (151 KB at 865.0 KB/sec)
[windows-jdk7-m3.3.x_build] [INFO] Downloading: https://repo.maven.apache.org/maven2/org/antlr/antlr4-runtime/4.5.3/antlr4-runtime-4.5.3.jar
[windows-jdk7-m3.3.x_build] [INFO] Downloaded: https://repo.maven.apache.org/maven2/antlr/antlr/2.7.7/antlr-2.7.7.jar (435 KB at 1767.7 KB/sec)
[windows-jdk7-m3.3.x_build] [INFO] Downloading: https://repo.maven.apache.org/maven2/commons-beanutils/commons-beanutils/1.9.2/commons-beanutils-1.9.2.jar
[windows-jdk7-m3.3.x_build] [INFO] Downloaded: https://repo.maven.apache.org/maven2/org/apache/maven/doxia/doxia-integration-tools/1.6/doxia-integration-tools-1.6.jar (44 KB at 130.9 KB/sec)
[windows-jdk7-m3.3.x_build] [INFO] Downloading: https://repo.maven.apache.org/maven2/commons-cli/commons-cli/1.3.1/commons-cli-1.3.1.jar
[windows-jdk7-m3.3.x_build] [INFO] Downloaded: https://repo.maven.apache.org/maven2/commons-beanutils/commons-beanutils/1.9.2/commons-beanutils-1.9.2.jar (229 KB at 426.9 KB/sec)
[windows-jdk7-m3.3.x_build] [INFO] Downloading: https://repo.maven.apache.org/maven2/com/google/guava/guava/19.0/guava-19.0.jar
[windows-jdk7-m3.3.x_build] [INFO] Downloaded: https://repo.maven.apache.org/maven2/commons-cli/commons-cli/1.3.1/commons-cli-1.3.1.jar (52 KB at 87.9 KB/sec)
[windows-jdk7-m3.3.x_build] [INFO] Downloading: https://repo.maven.apache.org/maven2/commons-lang/commons-lang/2.1/commons-lang-2.1.jar
[windows-jdk7-m3.3.x_build] [INFO] Downloaded: https://repo.maven.apache.org/maven2/com/puppycrawl/tools/checkstyle/6.18/checkstyle-6.18.jar (1132 KB at 1872.8 KB/sec)
[windows-jdk7-m3.3.x_build] [INFO] Downloaded: https://repo.maven.apache.org/maven2/org/codehaus/plexus/plexus-resources/1.1.0/plexus-resources-1.1.0.jar (23 KB at 36.1 KB/sec)
[windows-jdk7-m3.3.x_build] [INFO] Downloaded: https://repo.maven.apache.org/maven2/commons-lang/commons-lang/2.1/commons-lang-2.1.jar (203 KB at 320.0 KB/sec)
[windows-jdk7-m3.3.x_build] [INFO] Downloaded: https://repo.maven.apache.org/maven2/com/google/guava/guava/19.0/guava-19.0.jar (2255 KB at 3310.4 KB/sec)
[windows-jdk7-m3.3.x_build] [INFO] Downloaded: https://repo.maven.apache.org/maven2/org/antlr/antlr4-runtime/4.5.3/antlr4-runtime-4.5.3.jar (296 KB at 432.2 KB/sec)
[windows-jdk7-m3.2.x_build] [INFO] Downloaded: https://repo.maven.apache.org/maven2/org/apache/maven/doxia/doxia-integration-tools/1.6/doxia-integration-tools-1.6.jar (44 KB at 53.3 KB/sec)
[windows-jdk7-m3.2.x_build] [INFO] Downloaded: https://repo.maven.apache.org/maven2/com/google/guava/guava/19.0/guava-19.0.jar (2255 KB at 2482.8 KB/sec)
[windows-jdk7-m3.2.x_build] [INFO] There are 2 errors reported by Checkstyle 6.18 with config/maven_checks.xml ruleset.
[windows-jdk7-m3.3.x_build] [INFO] There are 2 errors reported by Checkstyle 6.18 with config/maven_checks.xml ruleset.
[windows-jdk7-m3.3.x_build] [INFO] Ignored 2 errors, 0 violation remaining.
[windows-jdk7-m3.3.x_build] [INFO]
[windows-jdk7-m3.3.x_build] [INFO] --- maven-invoker-plugin:3.1.0:verify (integration-test) @ maven-assembly-plugin ---
[windows-jdk7-m3.3.x_build] [INFO] -------------------------------------------------
[windows-jdk7-m3.3.x_build] [INFO] Build Summary:
[windows-jdk7-m3.3.x_build] [INFO]   Passed: 134, Failed: 1, Errors: 0, Skipped: 3
[windows-jdk7-m3.3.x_build] [INFO] -------------------------------------------------
[windows-jdk7-m3.3.x_build] [WARNING] The following builds failed:
[windows-jdk7-m3.3.x_build] [WARNING] *  projects\files\zipentrysize\pom.xml
[windows-jdk7-m3.3.x_build] [INFO] -------------------------------------------------
[windows-jdk7-m3.3.x_build] [WARNING] Ignoring that 1 build failed.
[windows-jdk7-m3.3.x_build] [INFO] ------------------------------------------------------------------------
[windows-jdk7-m3.3.x_build] [INFO] BUILD SUCCESS
[windows-jdk7-m3.3.x_build] [INFO] ------------------------------------------------------------------------
[windows-jdk7-m3.3.x_build] [INFO] Total time: 25:49 min
[windows-jdk7-m3.3.x_build] [INFO] Finished at: 2018-12-27T01:35:38-08:00
[windows-jdk7-m3.3.x_build] [INFO] Final Memory: 56M/669M
[windows-jdk7-m3.3.x_build] [INFO] ------------------------------------------------------------------------
[windows-jdk7-m3.3.x_build] [INFO] [jenkins-event-spy] Generated C:\Users\jenkins\AppData\Local\Temp\2\jenkins-maven-box-maven-assembly-plugin-MASSEMBLY-897-1@2@tmp\withMaven784c417a\maven-spy-20181227-010948-3605856936500501559900.log
[windows-jdk7-m3.3.x_build] Picked up JAVA_TOOL_OPTIONS: -Dmaven.ext.class.path="C:\Users\jenkins\AppData\Local\Temp\2\jenkins-maven-box-maven-assembly-plugin-MASSEMBLY-897-1@2@tmp\withMaven784c417a\pipeline-maven-spy.jar" -Dorg.jenkinsci.plugins.pipeline.maven.reportsFolder="C:\Users\jenkins\AppData\Local\Temp\2\jenkins-maven-box-maven-assembly-plugin-MASSEMBLY-897-1@2@tmp\withMaven784c417a"
[Pipeline] [windows-jdk7-m3.3.x_build] }
[windows-jdk7-m3.2.x_build] [INFO] Ignored 2 errors, 0 violation remaining.
[windows-jdk7-m3.2.x_build] [INFO]
[windows-jdk7-m3.2.x_build] [INFO] --- maven-invoker-plugin:3.1.0:verify (integration-test) @ maven-assembly-plugin ---
[windows-jdk7-m3.2.x_build] [INFO] -------------------------------------------------
[windows-jdk7-m3.2.x_build] [INFO] Build Summary:
[windows-jdk7-m3.2.x_build] [INFO]   Passed: 134, Failed: 1, Errors: 0, Skipped: 3
[windows-jdk7-m3.2.x_build] [INFO] -------------------------------------------------
[windows-jdk7-m3.2.x_build] [WARNING] The following builds failed:
[windows-jdk7-m3.2.x_build] [WARNING] *  projects\files\zipentrysize\pom.xml
[windows-jdk7-m3.2.x_build] [INFO] -------------------------------------------------
[windows-jdk7-m3.2.x_build] [WARNING] Ignoring that 1 build failed.
[windows-jdk7-m3.2.x_build] [INFO] ------------------------------------------------------------------------
[windows-jdk7-m3.2.x_build] [INFO] BUILD SUCCESS
[windows-jdk7-m3.2.x_build] [INFO] ------------------------------------------------------------------------
[windows-jdk7-m3.2.x_build] [INFO] Total time: 25:50 min
[windows-jdk7-m3.2.x_build] [INFO] Finished at: 2018-12-27T01:35:39-08:00
[Pipeline] [windows-jdk7-m3.3.x_build] // dir
[windows-jdk7-m3.2.x_build] [INFO] Final Memory: 53M/915M
[windows-jdk7-m3.2.x_build] [INFO] ------------------------------------------------------------------------
[windows-jdk7-m3.2.x_build] [INFO] [jenkins-event-spy] Generated C:\Users\jenkins\AppData\Local\Temp\2\jenkins-maven-box-maven-assembly-plugin-MASSEMBLY-897-1@tmp\withMaven747b8520\maven-spy-20181227-010948-178213374182088670981.log
[windows-jdk7-m3.2.x_build] Picked up JAVA_TOOL_OPTIONS: -Dmaven.ext.class.path="C:\Users\jenkins\AppData\Local\Temp\2\jenkins-maven-box-maven-assembly-plugin-MASSEMBLY-897-1@tmp\withMaven747b8520\pipeline-maven-spy.jar" -Dorg.jenkinsci.plugins.pipeline.maven.reportsFolder="C:\Users\jenkins\AppData\Local\Temp\2\jenkins-maven-box-maven-assembly-plugin-MASSEMBLY-897-1@tmp\withMaven747b8520"
[Pipeline] [windows-jdk7-m3.3.x_build] }
[windows-jdk7-m3.3.x_build] [withMaven] artifactsPublisher - Archive artifact windows-jdk7-m3.3.x_build\pom.xml under org\apache\maven\plugins\maven-assembly-plugin\3.1.1-SNAPSHOT\maven-assembly-plugin-3.1.1-SNAPSHOT.pom
[windows-jdk7-m3.3.x_build] [withMaven] artifactsPublisher - Archive artifact windows-jdk7-m3.3.x_build\target\maven-assembly-plugin-3.1.1-SNAPSHOT.jar under org\apache\maven\plugins\maven-assembly-plugin\3.1.1-SNAPSHOT\maven-assembly-plugin-3.1.1-SNAPSHOT.jar
[windows-jdk7-m3.3.x_build] [Fast Archiver] No prior successful build to compare, so performing full copy of artifacts
[windows-jdk7-m3.3.x_build] [withMaven] invokerPublisher - Archive invoker results for Maven artifact MavenArtifact{org.apache.maven.plugins:maven-assembly-plugin::3.1.1-SNAPSHOT(version: 3.1.1-SNAPSHOT, snapshot:false) } generated by PluginInvocation{org.apache.maven.plugins:maven-invoker-plugin:3.1.0@integration-test  integration-test}: windows-jdk7-m3.3.x_build\target\invoker-reports\*.xml
[windows-jdk7-m3.3.x_build] performing MavenInvokerRecorder, reportsFilenamePattern:'**/windows-jdk7-m3.3.x_build\target\invoker-reports/BUILD*.xml', invokerBuildDir:'**/windows-jdk7-m3.3.x_build\target\it'
[windows-jdk7-m3.3.x_build] Found reports:[C:\Users\jenkins\AppData\Local\Temp\2\jenkins-maven-box-maven-assembly-plugin-MASSEMBLY-897-1@2\windows-jdk7-m3.3.x_build\target\invoker-reports\BUILD-it-project-parent.xml, C:\Users\jenkins\AppData\Local\Temp\2\jenkins-maven-box-maven-assembly-plugin-MASSEMBLY-897-1@2\windows-jdk7-m3.3.x_build\target\invoker-reports\BUILD-projects_basic-features_ExecutionRoot.xml, C:\Users\jenkins\AppData\Local\Temp\2\jenkins-maven-box-maven-assembly-plugin-MASSEMBLY-897-1@2\windows-jdk7-m3.3.x_build\target\invoker-reports\BUILD-projects_basic-features_add-classpath.xml, C:\Users\jenkins\AppData\Local\Temp\2\jenkins-maven-box-maven-assembly-plugin-MASSEMBLY-897-1@2\windows-jdk7-m3.3.x_build\target\invoker-reports\BUILD-projects_basic-features_classpath-descriptor.xml, C:\Users\jenkins\AppData\Local\Temp\2\jenkins-maven-box-maven-assembly-plugin-MASSEMBLY-897-1@2\windows-jdk7-m3.3.x_build\target\invoker-reports\BUILD-projects_basic-features_descriptorDirectoryScan.xml, C:\Users\jenkins\AppData\Local\Temp\2\jenkins-maven-box-maven-assembly-plugin-MASSEMBLY-897-1@2\windows-jdk7-m3.3.x_build\target\invoker-reports\BUILD-projects_basic-features_file-copyIntoTopDir.xml, C:\Users\jenkins\AppData\Local\Temp\2\jenkins-maven-box-maven-assembly-plugin-MASSEMBLY-897-1@2\windows-jdk7-m3.3.x_build\target\invoker-reports\BUILD-projects_basic-features_file-sameName.xml, C:\Users\jenkins\AppData\Local\Temp\2\jenkins-maven-box-maven-assembly-plugin-MASSEMBLY-897-1@2\windows-jdk7-m3.3.x_build\target\invoker-reports\BUILD-projects_basic-features_formats-in-pom-win.xml, C:\Users\jenkins\AppData\Local\Temp\2\jenkins-maven-box-maven-assembly-plugin-MASSEMBLY-897-1@2\windows-jdk7-m3.3.x_build\target\invoker-reports\BUILD-projects_basic-features_formats.xml, C:\Users\jenkins\AppData\Local\Temp\2\jenkins-maven-box-maven-assembly-plugin-MASSEMBLY-897-1@2\windows-jdk7-m3.3.x_build\target\invoker-reports\BUILD-projects_basic-features_local-repo-interp.xml, C:\Users\jenkins\AppData\Local\Temp\2\jenkins-maven-box-maven-assembly-plugin-MASSEMBLY-897-1@2\windows-jdk7-m3.3.x_build\target\invoker-reports\BUILD-projects_basic-features_massembly-256-pomPropertiesInterp.xml, C:\Users\jenkins\AppData\Local\Temp\2\jenkins-maven-box-maven-assembly-plugin-MASSEMBLY-897-1@2\windows-jdk7-m3.3.x_build\target\invoker-reports\BUILD-projects_basic-features_massembly-351-projectPrefixInterp.xml, C:\Users\jenkins\AppData\Local\Temp\2\jenkins-maven-box-maven-assembly-plugin-MASSEMBLY-897-1@2\windows-jdk7-m3.3.x_build\target\invoker-reports\BUILD-projects_basic-features_outputFileNameMapping-simple.xml, C:\Users\jenkins\AppData\Local\Temp\2\jenkins-maven-box-maven-assembly-plugin-MASSEMBLY-897-1@2\windows-jdk7-m3.3.x_build\target\invoker-reports\BUILD-projects_basic-features_outputFileNameMapping-withArtifactBaseVersion.xml, C:\Users\jenkins\AppData\Local\Temp\2\jenkins-maven-box-maven-assembly-plugin-MASSEMBLY-897-1@2\windows-jdk7-m3.3.x_build\target\invoker-reports\BUILD-projects_basic-features_relative-project-paths.xml, C:\Users\jenkins\AppData\Local\Temp\2\jenkins-maven-box-maven-assembly-plugin-MASSEMBLY-897-1@2\windows-jdk7-m3.3.x_build\target\invoker-reports\BUILD-projects_basic-features_space_&_special_char.xml, C:\Users\jenkins\AppData\Local\Temp\2\jenkins-maven-box-maven-assembly-plugin-MASSEMBLY-897-1@2\windows-jdk7-m3.3.x_build\target\invoker-reports\BUILD-projects_bugs_massembly-190.xml, C:\Users\jenkins\AppData\Local\Temp\2\jenkins-maven-box-maven-assembly-plugin-MASSEMBLY-897-1@2\windows-jdk7-m3.3.x_build\target\invoker-reports\BUILD-projects_bugs_massembly-285.xml, C:\Users\jenkins\AppData\Local\Temp\2\jenkins-maven-box-maven-assembly-plugin-MASSEMBLY-897-1@2\windows-jdk7-m3.3.x_build\target\invoker-reports\BUILD-projects_bugs_massembly-306.xml, C:\Users\jenkins\AppData\Local\Temp\2\jenkins-maven-box-maven-assembly-plugin-MASSEMBLY-897-1@2\windows-jdk7-m3.3.x_build\target\invoker-reports\BUILD-projects_bugs_massembly-324.xml, C:\Users\jenkins\AppData\Local\Temp\2\jenkins-maven-box-maven-assembly-plugin-MASSEMBLY-897-1@2\windows-jdk7-m3.3.x_build\target\invoker-reports\BUILD-projects_bugs_massembly-375.xml, C:\Users\jenkins\AppData\Local\Temp\2\jenkins-maven-box-maven-assembly-plugin-MASSEMBLY-897-1@2\windows-jdk7-m3.3.x_build\target\invoker-reports\BUILD-projects_bugs_massembly-559.xml, C:\Users\jenkins\AppData\Local\Temp\2\jenkins-maven-box-maven-assembly-plugin-MASSEMBLY-897-1@2\windows-jdk7-m3.3.x_build\target\invoker-reports\BUILD-projects_bugs_massembly-580.xml, C:\Users\jenkins\AppData\Local\Temp\2\jenkins-maven-box-maven-assembly-plugin-MASSEMBLY-897-1@2\windows-jdk7-m3.3.x_build\target\invoker-reports\BUILD-projects_bugs_massembly-583.xml, C:\Users\jenkins\AppData\Local\Temp\2\jenkins-maven-box-maven-assembly-plugin-MASSEMBLY-897-1@2\windows-jdk7-m3.3.x_build\target\invoker-reports\BUILD-projects_bugs_massembly-730.xml, C:\Users\jenkins\AppData\Local\Temp\2\jenkins-maven-box-maven-assembly-plugin-MASSEMBLY-897-1@2\windows-jdk7-m3.3.x_build\target\invoker-reports\BUILD-projects_bugs_massembly-731.xml, C:\Users\jenkins\AppData\Local\Temp\2\jenkins-maven-box-maven-assembly-plugin-MASSEMBLY-897-1@2\windows-jdk7-m3.3.x_build\target\invoker-reports\BUILD-projects_bugs_massembly-732.xml, C:\Users\jenkins\AppData\Local\Temp\2\jenkins-maven-box-maven-assembly-plugin-MASSEMBLY-897-1@2\windows-jdk7-m3.3.x_build\target\invoker-reports\BUILD-projects_bugs_massembly-733.xml, C:\Users\jenkins\AppData\Local\Temp\2\jenkins-maven-box-maven-assembly-plugin-MASSEMBLY-897-1@2\windows-jdk7-m3.3.x_build\target\invoker-reports\BUILD-projects_bugs_massembly-737.xml, C:\Users\jenkins\AppData\Local\Temp\2\jenkins-maven-box-maven-assembly-plugin-MASSEMBLY-897-1@2\windows-jdk7-m3.3.x_build\target\invoker-reports\BUILD-projects_bugs_massembly-739.xml, C:\Users\jenkins\AppData\Local\Temp\2\jenkins-maven-box-maven-assembly-plugin-MASSEMBLY-897-1@2\windows-jdk7-m3.3.x_build\target\invoker-reports\BUILD-projects_bugs_massembly-743.xml, C:\Users\jenkins\AppData\Local\Temp\2\jenkins-maven-box-maven-assembly-plugin-MASSEMBLY-897-1@2\windows-jdk7-m3.3.x_build\target\invoker-reports\BUILD-projects_components_component-dependencySet.xml, C:\Users\jenkins\AppData\Local\Temp\2\jenkins-maven-box-maven-assembly-plugin-MASSEMBLY-897-1@2\windows-jdk7-m3.3.x_build\target\invoker-reports\BUILD-projects_components_component-moduleSet.xml, C:\Users\jenkins\AppData\Local\Temp\2\jenkins-maven-box-maven-assembly-plugin-MASSEMBLY-897-1@2\windows-jdk7-m3.3.x_build\target\invoker-reports\BUILD-projects_container-descriptors_configured-handler.xml, C:\Users\jenkins\AppData\Local\Temp\2\jenkins-maven-box-maven-assembly-plugin-MASSEMBLY-897-1@2\windows-jdk7-m3.3.x_build\target\invoker-reports\BUILD-projects_container-descriptors_custom-containerDescriptorHandler.xml, C:\Users\jenkins\AppData\Local\Temp\2\jenkins-maven-box-maven-assembly-plugin-MASSEMBLY-897-1@2\windows-jdk7-m3.3.x_build\target\invoker-reports\BUILD-projects_container-descriptors_custom-handler-withFileEntries.xml, C:\Users\jenkins\AppData\Local\Temp\2\jenkins-maven-box-maven-assembly-plugin-MASSEMBLY-897-1@2\windows-jdk7-m3.3.x_build\target\invoker-reports\BUILD-projects_container-descriptors_custom-handler-withMixedEntries.xml, C:\Users\jenkins\AppData\Local\Temp\2\jenkins-maven-box-maven-assembly-plugin-MASSEMBLY-897-1@2\windows-jdk7-m3.3.x_build\target\invoker-reports\BUILD-projects_container-descriptors_metaInf-services-aggregation.xml, C:\Users\jenkins\AppData\Local\Temp\2\jenkins-maven-box-maven-assembly-plugin-MASSEMBLY-897-1@2\windows-jdk7-m3.3.x_build\target\invoker-reports\BUILD-projects_container-descriptors_metaInf-spring-aggregation.xml, C:\Users\jenkins\AppData\Local\Temp\2\jenkins-maven-box-maven-assembly-plugin-MASSEMBLY-897-1@2\windows-jdk7-m3.3.x_build\target\invoker-reports\BUILD-projects_dependency-sets_dep-transfilter-wildcard-massembly544.xml, C:\Users\jenkins\AppData\Local\Temp\2\jenkins-maven-box-maven-assembly-plugin-MASSEMBLY-897-1@2\windows-jdk7-m3.3.x_build\target\invoker-reports\BUILD-projects_dependency-sets_dep-with-transitive-filter.xml, C:\Users\jenkins\AppData\Local\Temp\2\jenkins-maven-box-maven-assembly-plugin-MASSEMBLY-897-1@2\windows-jdk7-m3.3.x_build\target\invoker-reports\BUILD-projects_dependency-sets_depMgmt-override.xml, C:\Users\jenkins\AppData\Local\Temp\2\jenkins-maven-box-maven-assembly-plugin-MASSEMBLY-897-1@2\windows-jdk7-m3.3.x_build\target\invoker-reports\BUILD-projects_dependency-sets_depSet-artifactPomPropInterp.xml, C:\Users\jenkins\AppData\Local\Temp\2\jenkins-maven-box-maven-assembly-plugin-MASSEMBLY-897-1@2\windows-jdk7-m3.3.x_build\target\invoker-reports\BUILD-projects_dependency-sets_depSet-byDepVersion.xml, C:\Users\jenkins\AppData\Local\Temp\2\jenkins-maven-box-maven-assembly-plugin-MASSEMBLY-897-1@2\windows-jdk7-m3.3.x_build\target\invoker-reports\BUILD-projects_dependency-sets_depSet-enum-vs-wildcard.xml, C:\Users\jenkins\AppData\Local\Temp\2\jenkins-maven-box-maven-assembly-plugin-MASSEMBLY-897-1@2\windows-jdk7-m3.3.x_build\target\invoker-reports\BUILD-projects_dependency-sets_depSet-runtimeScope.xml, C:\Users\jenkins\AppData\Local\Temp\2\jenkins-maven-box-maven-assembly-plugin-MASSEMBLY-897-1@2\windows-jdk7-m3.3.x_build\target\invoker-reports\BUILD-projects_dependency-sets_depSet-unpacked-rdonly.xml, C:\Users\jenkins\AppData\Local\Temp\2\jenkins-maven-box-maven-assembly-plugin-MASSEMBLY-897-1@2\windows-jdk7-m3.3.x_build\target\invoker-reports\BUILD-projects_dependency-sets_dependencySet-matchScope.xml, C:\Users\jenkins\AppData\Local\Temp\2\jenkins-maven-box-maven-assembly-plugin-MASSEMBLY-897-1@2\windows-jdk7-m3.3.x_build\target\invoker-reports\BUILD-projects_dependency-sets_dependencySet-nonTransitive.xml, C:\Users\jenkins\AppData\Local\Temp\2\jenkins-maven-box-maven-assembly-plugin-MASSEMBLY-897-1@2\windows-jdk7-m3.3.x_build\target\invoker-reports\BUILD-projects_dependency-sets_dependencySet-notUnpacked.xml, C:\Users\jenkins\AppData\Local\Temp\2\jenkins-maven-box-maven-assembly-plugin-MASSEMBLY-897-1@2\windows-jdk7-m3.3.x_build\target\invoker-reports\BUILD-projects_dependency-sets_dependencySet-projectArtifactNotIncluded.xml, C:\Users\jenkins\AppData\Local\Temp\2\jenkins-maven-box-maven-assembly-plugin-MASSEMBLY-897-1@2\windows-jdk7-m3.3.x_build\target\invoker-reports\BUILD-projects_dependency-sets_dependencySet-unpacked-filtered.xml, C:\Users\jenkins\AppData\Local\Temp\2\jenkins-maven-box-maven-assembly-plugin-MASSEMBLY-897-1@2\windows-jdk7-m3.3.x_build\target\invoker-reports\BUILD-projects_dependency-sets_dependencySet-unpacked.xml, C:\Users\jenkins\AppData\Local\Temp\2\jenkins-maven-box-maven-assembly-plugin-MASSEMBLY-897-1@2\windows-jdk7-m3.3.x_build\target\invoker-reports\BUILD-projects_dependency-sets_dependencySet-unpackedExcludingMetaInf.xml, C:\Users\jenkins\AppData\Local\Temp\2\jenkins-maven-box-maven-assembly-plugin-MASSEMBLY-897-1@2\windows-jdk7-m3.3.x_build\target\invoker-reports\BUILD-projects_dependency-sets_dependencySet-unpackedSubsetsTwice.xml, C:\Users\jenkins\AppData\Local\Temp\2\jenkins-maven-box-maven-assembly-plugin-MASSEMBLY-897-1@2\windows-jdk7-m3.3.x_build\target\invoker-reports\BUILD-projects_dependency-sets_dependencySet-withExecutedProject.xml, C:\Users\jenkins\AppData\Local\Temp\2\jenkins-maven-box-maven-assembly-plugin-MASSEMBLY-897-1@2\windows-jdk7-m3.3.x_build\target\invoker-reports\BUILD-projects_dependency-sets_include-project-artifact.xml, C:\Users\jenkins\AppData\Local\Temp\2\jenkins-maven-box-maven-assembly-plugin-MASSEMBLY-897-1@2\windows-jdk7-m3.3.x_build\target\invoker-reports\BUILD-projects_dependency-sets_include-project-attachments.xml, C:\Users\jenkins\AppData\Local\Temp\2\jenkins-maven-box-maven-assembly-plugin-MASSEMBLY-897-1@2\windows-jdk7-m3.3.x_build\target\invoker-reports\BUILD-projects_dependency-sets_include-provided.xml, C:\Users\jenkins\AppData\Local\Temp\2\jenkins-maven-box-maven-assembly-plugin-MASSEMBLY-897-1@2\windows-jdk7-m3.3.x_build\target\invoker-reports\BUILD-projects_dependency-sets_including-pom-dependency.xml, C:\Users\jenkins\AppData\Local\Temp\2\jenkins-maven-box-maven-assembly-plugin-MASSEMBLY-897-1@2\windows-jdk7-m3.3.x_build\target\invoker-reports\BUILD-projects_dependency-sets_including-sar-dependency.xml, C:\Users\jenkins\AppData\Local\Temp\2\jenkins-maven-box-maven-assembly-plugin-MASSEMBLY-897-1@2\windows-jdk7-m3.3.x_build\target\invoker-reports\BUILD-projects_dependency-sets_massembly-201.xml, C:\Users\jenkins\AppData\Local\Temp\2\jenkins-maven-box-maven-assembly-plugin-MASSEMBLY-897-1@2\windows-jdk7-m3.3.x_build\target\invoker-reports\BUILD-projects_dependency-sets_massembly-232.xml, C:\Users\jenkins\AppData\Local\Temp\2\jenkins-maven-box-maven-assembly-plugin-MASSEMBLY-897-1@2\windows-jdk7-m3.3.x_build\target\invoker-reports\BUILD-projects_dependency-sets_massembly-235.xml, C:\Users\jenkins\AppData\Local\Temp\2\jenkins-maven-box-maven-assembly-plugin-MASSEMBLY-897-1@2\windows-jdk7-m3.3.x_build\target\invoker-reports\BUILD-projects_dependency-sets_massembly-345.xml, C:\Users\jenkins\AppData\Local\Temp\2\jenkins-maven-box-maven-assembly-plugin-MASSEMBLY-897-1@2\windows-jdk7-m3.3.x_build\target\invoker-reports\BUILD-projects_dependency-sets_massembly-395.xml, C:\Users\jenkins\AppData\Local\Temp\2\jenkins-maven-box-maven-assembly-plugin-MASSEMBLY-897-1@2\windows-jdk7-m3.3.x_build\target\invoker-reports\BUILD-projects_dependency-sets_massembly-619.xml, C:\Users\jenkins\AppData\Local\Temp\2\jenkins-maven-box-maven-assembly-plugin-MASSEMBLY-897-1@2\windows-jdk7-m3.3.x_build\target\invoker-reports\BUILD-projects_dependency-sets_massembly-675.xml, C:\Users\jenkins\AppData\Local\Temp\2\jenkins-maven-box-maven-assembly-plugin-MASSEMBLY-897-1@2\windows-jdk7-m3.3.x_build\target\invoker-reports\BUILD-projects_dependency-sets_massembly-99.xml, C:\Users\jenkins\AppData\Local\Temp\2\jenkins-maven-box-maven-assembly-plugin-MASSEMBLY-897-1@2\windows-jdk7-m3.3.x_build\target\invoker-reports\BUILD-projects_dependency-sets_mid-artifactId-wildcard-massembly570.xml, C:\Users\jenkins\AppData\Local\Temp\2\jenkins-maven-box-maven-assembly-plugin-MASSEMBLY-897-1@2\windows-jdk7-m3.3.x_build\target\invoker-reports\BUILD-projects_dependency-sets_multiple-wildcard-includes.xml, C:\Users\jenkins\AppData\Local\Temp\2\jenkins-maven-box-maven-assembly-plugin-MASSEMBLY-897-1@2\windows-jdk7-m3.3.x_build\target\invoker-reports\BUILD-projects_dependency-sets_outputFileNameMappingWithUnpack.xml, C:\Users\jenkins\AppData\Local\Temp\2\jenkins-maven-box-maven-assembly-plugin-MASSEMBLY-897-1@2\windows-jdk7-m3.3.x_build\target\invoker-reports\BUILD-projects_dependency-sets_unpack-deps-correct-dir.xml, C:\Users\jenkins\AppData\Local\Temp\2\jenkins-maven-box-maven-assembly-plugin-MASSEMBLY-897-1@2\windows-jdk7-m3.3.x_build\target\invoker-reports\BUILD-projects_dependency-sets_using-moduleSet-implied-depSet.xml, C:\Users\jenkins\AppData\Local\Temp\2\jenkins-maven-box-maven-assembly-plugin-MASSEMBLY-897-1@2\windows-jdk7-m3.3.x_build\target\invoker-reports\BUILD-projects_descriptor-refs_bin_jars-in-archive-root.xml, C:\Users\jenkins\AppData\Local\Temp\2\jenkins-maven-box-maven-assembly-plugin-MASSEMBLY-897-1@2\windows-jdk7-m3.3.x_build\target\invoker-reports\BUILD-projects_descriptor-refs_jar-with-dependencies_component-descriptors-merged.xml, C:\Users\jenkins\AppData\Local\Temp\2\jenkins-maven-box-maven-assembly-plugin-MASSEMBLY-897-1@2\windows-jdk7-m3.3.x_build\target\invoker-reports\BUILD-projects_descriptor-refs_jar-with-dependencies_deps-unpacked-to-root-dir.xml, C:\Users\jenkins\AppData\Local\Temp\2\jenkins-maven-box-maven-assembly-plugin-MASSEMBLY-897-1@2\windows-jdk7-m3.3.x_build\target\invoker-reports\BUILD-projects_descriptor-refs_jar-with-dependencies_no-target-dir.xml, C:\Users\jenkins\AppData\Local\Temp\2\jenkins-maven-box-maven-assembly-plugin-MASSEMBLY-897-1@2\windows-jdk7-m3.3.x_build\target\invoker-reports\BUILD-projects_descriptor-refs_project_multimodule-sources-copied.xml, C:\Users\jenkins\AppData\Local\Temp\2\jenkins-maven-box-maven-assembly-plugin-MASSEMBLY-897-1@2\windows-jdk7-m3.3.x_build\target\invoker-reports\BUILD-projects_descriptor-refs_project_no-target-dir-multimodule.xml, C:\Users\jenkins\AppData\Local\Temp\2\jenkins-maven-box-maven-assembly-plugin-MASSEMBLY-897-1@2\windows-jdk7-m3.3.x_build\target\invoker-reports\BUILD-projects_descriptor-refs_project_no-target-dir.xml, C:\Users\jenkins\AppData\Local\Temp\2\jenkins-maven-box-maven-assembly-plugin-MASSEMBLY-897-1@2\windows-jdk7-m3.3.x_build\target\invoker-reports\BUILD-projects_descriptor-refs_project_sources-copied.xml, C:\Users\jenkins\AppData\Local\Temp\2\jenkins-maven-box-maven-assembly-plugin-MASSEMBLY-897-1@2\windows-jdk7-m3.3.x_build\target\invoker-reports\BUILD-projects_descriptor-refs_src_no-target-dir.xml, C:\Users\jenkins\AppData\Local\Temp\2\jenkins-maven-box-maven-assembly-plugin-MASSEMBLY-897-1@2\windows-jdk7-m3.3.x_build\target\invoker-reports\BUILD-projects_descriptor-refs_src_src-dir-copied.xml, C:\Users\jenkins\AppData\Local\Temp\2\jenkins-maven-box-maven-assembly-plugin-MASSEMBLY-897-1@2\windows-jdk7-m3.3.x_build\target\invoker-reports\BUILD-projects_file-modes_file-set-fileMode.xml, C:\Users\jenkins\AppData\Local\Temp\2\jenkins-maven-box-maven-assembly-plugin-MASSEMBLY-897-1@2\windows-jdk7-m3.3.x_build\target\invoker-reports\BUILD-projects_file-modes_fileItem-fileMode.xml, C:\Users\jenkins\AppData\Local\Temp\2\jenkins-maven-box-maven-assembly-plugin-MASSEMBLY-897-1@2\windows-jdk7-m3.3.x_build\target\invoker-reports\BUILD-projects_file-sets_default-directory-unspecified.xml, C:\Users\jenkins\AppData\Local\Temp\2\jenkins-maven-box-maven-assembly-plugin-MASSEMBLY-897-1@2\windows-jdk7-m3.3.x_build\target\invoker-reports\BUILD-projects_file-sets_default-excludes-unspecified.xml, C:\Users\jenkins\AppData\Local\Temp\2\jenkins-maven-box-maven-assembly-plugin-MASSEMBLY-897-1@2\windows-jdk7-m3.3.x_build\target\invoker-reports\BUILD-projects_file-sets_dont-use-default-excludes.xml, C:\Users\jenkins\AppData\Local\Temp\2\jenkins-maven-box-maven-assembly-plugin-MASSEMBLY-897-1@2\windows-jdk7-m3.3.x_build\target\invoker-reports\BUILD-projects_file-sets_excludes-using-regex.xml, C:\Users\jenkins\AppData\Local\Temp\2\jenkins-maven-box-maven-assembly-plugin-MASSEMBLY-897-1@2\windows-jdk7-m3.3.x_build\target\invoker-reports\BUILD-projects_file-sets_excluding-svn-dirs.xml, C:\Users\jenkins\AppData\Local\Temp\2\jenkins-maven-box-maven-assembly-plugin-MASSEMBLY-897-1@2\windows-jdk7-m3.3.x_build\target\invoker-reports\BUILD-projects_file-sets_filtered-module-sources.xml, C:\Users\jenkins\AppData\Local\Temp\2\jenkins-maven-box-maven-assembly-plugin-MASSEMBLY-897-1@2\windows-jdk7-m3.3.x_build\target\invoker-reports\BUILD-projects_file-sets_filtered-multimodule.xml, C:\Users\jenkins\AppData\Local\Temp\2\jenkins-maven-box-maven-assembly-plugin-MASSEMBLY-897-1@2\windows-jdk7-m3.3.x_build\target\invoker-reports\BUILD-projects_file-sets_include-base-directory.xml, C:\Users\jenkins\AppData\Local\Temp\2\jenkins-maven-box-maven-assembly-plugin-MASSEMBLY-897-1@2\windows-jdk7-m3.3.x_build\target\invoker-reports\BUILD-projects_file-sets_include-parent-dir.xml, C:\Users\jenkins\AppData\Local\Temp\2\jenkins-maven-box-maven-assembly-plugin-MASSEMBLY-897-1@2\windows-jdk7-m3.3.x_build\target\invoker-reports\BUILD-projects_file-sets_massembly-665.xml, C:\Users\jenkins\AppData\Local\Temp\2\jenkins-maven-box-maven-assembly-plugin-MASSEMBLY-897-1@2\windows-jdk7-m3.3.x_build\target\invoker-reports\BUILD-projects_file-sets_multimodule-unix-lineEndings.xml, C:\Users\jenkins\AppData\Local\Temp\2\jenkins-maven-box-maven-assembly-plugin-MASSEMBLY-897-1@2\windows-jdk7-m3.3.x_build\target\invoker-reports\BUILD-projects_file-sets_multimodule-win-lineEndings.xml, C:\Users\jenkins\AppData\Local\Temp\2\jenkins-maven-box-maven-assembly-plugin-MASSEMBLY-897-1@2\windows-jdk7-m3.3.x_build\target\invoker-reports\BUILD-projects_file-sets_platformspecific-filesets.xml, C:\Users\jenkins\AppData\Local\Temp\2\jenkins-maven-box-maven-assembly-plugin-MASSEMBLY-897-1@2\windows-jdk7-m3.3.x_build\target\invoker-reports\BUILD-projects_file-sets_precedence-check.xml, C:\Users\jenkins\AppData\Local\Temp\2\jenkins-maven-box-maven-assembly-plugin-MASSEMBLY-897-1@2\windows-jdk7-m3.3.x_build\target\invoker-reports\BUILD-projects_file-sets_use-default-excludes.xml, C:\Users\jenkins\AppData\Local\Temp\2\jenkins-maven-box-maven-assembly-plugin-MASSEMBLY-897-1@2\windows-jdk7-m3.3.x_build\target\invoker-reports\BUILD-projects_files_filtered-sysprop.xml, C:\Users\jenkins\AppData\Local\Temp\2\jenkins-maven-box-maven-assembly-plugin-MASSEMBLY-897-1@2\windows-jdk7-m3.3.x_build\target\invoker-reports\BUILD-projects_files_multimodule-relativePath.xml, C:\Users\jenkins\AppData\Local\Temp\2\jenkins-maven-box-maven-assembly-plugin-MASSEMBLY-897-1@2\windows-jdk7-m3.3.x_build\target\invoker-reports\BUILD-projects_files_zipentrysize.xml, C:\Users\jenkins\AppData\Local\Temp\2\jenkins-maven-box-maven-assembly-plugin-MASSEMBLY-897-1@2\windows-jdk7-m3.3.x_build\target\invoker-reports\BUILD-projects_filtering-feature_fileset-to-tar-massembly-722.xml, C:\Users\jenkins\AppData\Local\Temp\2\jenkins-maven-box-maven-assembly-plugin-MASSEMBLY-897-1@2\windows-jdk7-m3.3.x_build\target\invoker-reports\BUILD-projects_filtering-feature_filter-comp-descriptor-path.xml, C:\Users\jenkins\AppData\Local\Temp\2\jenkins-maven-box-maven-assembly-plugin-MASSEMBLY-897-1@2\windows-jdk7-m3.3.x_build\target\invoker-reports\BUILD-projects_filtering-feature_filters-defined-in-build.xml, C:\Users\jenkins\AppData\Local\Temp\2\jenkins-maven-box-maven-assembly-plugin-MASSEMBLY-897-1@2\windows-jdk7-m3.3.x_build\target\invoker-reports\BUILD-projects_filtering-feature_filtersDefinedInAssemblyPluginConfig.xml, C:\Users\jenkins\AppData\Local\Temp\2\jenkins-maven-box-maven-assembly-plugin-MASSEMBLY-897-1@2\windows-jdk7-m3.3.x_build\target\invoker-reports\BUILD-projects_filtering-feature_massembly-736.xml, C:\Users\jenkins\AppData\Local\Temp\2\jenkins-maven-box-maven-assembly-plugin-MASSEMBLY-897-1@2\windows-jdk7-m3.3.x_build\target\invoker-reports\BUILD-projects_forking-tests_assembly-assembly-with-module-binaries.xml, C:\Users\jenkins\AppData\Local\Temp\2\jenkins-maven-box-maven-assembly-plugin-MASSEMBLY-897-1@2\windows-jdk7-m3.3.x_build\target\invoker-reports\BUILD-projects_forking-tests_assembly-attached-with-module-binaries.xml, C:\Users\jenkins\AppData\Local\Temp\2\jenkins-maven-box-maven-assembly-plugin-MASSEMBLY-897-1@2\windows-jdk7-m3.3.x_build\target\invoker-reports\BUILD-projects_mojo-configuration_archiver-ignorePermissions.xml, C:\Users\jenkins\AppData\Local\Temp\2\jenkins-maven-box-maven-assembly-plugin-MASSEMBLY-897-1@2\windows-jdk7-m3.3.x_build\target\invoker-reports\BUILD-projects_mojo-configuration_ignoreDirFormatExtensions.xml, C:\Users\jenkins\AppData\Local\Temp\2\jenkins-maven-box-maven-assembly-plugin-MASSEMBLY-897-1@2\windows-jdk7-m3.3.x_build\target\invoker-reports\BUILD-projects_mojo-configuration_manifest-with-customEntry.xml, C:\Users\jenkins\AppData\Local\Temp\2\jenkins-maven-box-maven-assembly-plugin-MASSEMBLY-897-1@2\windows-jdk7-m3.3.x_build\target\invoker-reports\BUILD-projects_mojo-configuration_manifest-with-mainClass.xml, C:\Users\jenkins\AppData\Local\Temp\2\jenkins-maven-box-maven-assembly-plugin-MASSEMBLY-897-1@2\windows-jdk7-m3.3.x_build\target\invoker-reports\BUILD-projects_mojo-configuration_massembly-291.xml, C:\Users\jenkins\AppData\Local\Temp\2\jenkins-maven-box-maven-assembly-plugin-MASSEMBLY-897-1@2\windows-jdk7-m3.3.x_build\target\invoker-reports\BUILD-projects_mojo-configuration_massembly-301.xml, C:\Users\jenkins\AppData\Local\Temp\2\jenkins-maven-box-maven-assembly-plugin-MASSEMBLY-897-1@2\windows-jdk7-m3.3.x_build\target\invoker-reports\BUILD-projects_mojo-configuration_no-appendAssemblyId-no-classifier.xml, C:\Users\jenkins\AppData\Local\Temp\2\jenkins-maven-box-maven-assembly-plugin-MASSEMBLY-897-1@2\windows-jdk7-m3.3.x_build\target\invoker-reports\BUILD-projects_mojo-configuration_skipAssemblyCLIPropertySet.xml, C:\Users\jenkins\AppData\Local\Temp\2\jenkins-maven-box-maven-assembly-plugin-MASSEMBLY-897-1@2\windows-jdk7-m3.3.x_build\target\invoker-reports\BUILD-projects_mojo-tests_single-in-one-project-hierarchy.xml, C:\Users\jenkins\AppData\Local\Temp\2\jenkins-maven-box-maven-assembly-plugin-MASSEMBLY-897-1@2\windows-jdk7-m3.3.x_build\target\invoker-reports\BUILD-projects_mojo-tests_single-twice-in-multimodule-hierarchy.xml, C:\Users\jenkins\AppData\Local\Temp\2\jenkins-maven-box-maven-assembly-plugin-MASSEMBLY-897-1@2\windows-jdk7-m3.3.x_build\target\invoker-reports\BUILD-projects_mojo-tests_single-twice-in-one-project-hierarchy.xml, C:\Users\jenkins\AppData\Local\Temp\2\jenkins-maven-box-maven-assembly-plugin-MASSEMBLY-897-1@2\windows-jdk7-m3.3.x_build\target\invoker-reports\BUILD-projects_multimodule_massembly-298.xml, C:\Users\jenkins\AppData\Local\Temp\2\jenkins-maven-box-maven-assembly-plugin-MASSEMBLY-897-1@2\windows-jdk7-m3.3.x_build\target\invoker-reports\BUILD-projects_multimodule_massembly-317.xml, C:\Users\jenkins\AppData\Local\Temp\2\jenkins-maven-box-maven-assembly-plugin-MASSEMBLY-897-1@2\windows-jdk7-m3.3.x_build\target\invoker-reports\BUILD-projects_multimodule_massembly-474.xml, C:\Users\jenkins\AppData\Local\Temp\2\jenkins-maven-box-maven-assembly-plugin-MASSEMBLY-897-1@2\windows-jdk7-m3.3.x_build\target\invoker-reports\BUILD-projects_multimodule_massembly-619.xml, C:\Users\jenkins\AppData\Local\Temp\2\jenkins-maven-box-maven-assembly-plugin-MASSEMBLY-897-1@2\windows-jdk7-m3.3.x_build\target\invoker-reports\BUILD-projects_multimodule_multimodule-binariesNotSource.xml, C:\Users\jenkins\AppData\Local\Temp\2\jenkins-maven-box-maven-assembly-plugin-MASSEMBLY-897-1@2\windows-jdk7-m3.3.x_build\target\invoker-reports\BUILD-projects_multimodule_multimodule-filteredFileSet.xml, C:\Users\jenkins\AppData\Local\Temp\2\jenkins-maven-box-maven-assembly-plugin-MASSEMBLY-897-1@2\windows-jdk7-m3.3.x_build\target\invoker-reports\BUILD-projects_multimodule_multimodule-modulePomPropInterp.xml, C:\Users\jenkins\AppData\Local\Temp\2\jenkins-maven-box-maven-assembly-plugin-MASSEMBLY-897-1@2\windows-jdk7-m3.3.x_build\target\invoker-reports\BUILD-projects_multimodule_multimodule-siblingParent_parent.xml, C:\Users\jenkins\AppData\Local\Temp\2\jenkins-maven-box-maven-assembly-plugin-MASSEMBLY-897-1@2\windows-jdk7-m3.3.x_build\target\invoker-reports\BUILD-projects_multimodule_multimodule-sourceNotBinaries.xml, C:\Users\jenkins\AppData\Local\Temp\2\jenkins-maven-box-maven-assembly-plugin-MASSEMBLY-897-1@2\windows-jdk7-m3.3.x_build\target\invoker-reports\BUILD-projects_multimodule_multimodule-wholeReactorFromChild.xml, C:\Users\jenkins\AppData\Local\Temp\2\jenkins-maven-box-maven-assembly-plugin-MASSEMBLY-897-1@2\windows-jdk7-m3.3.x_build\target\invoker-reports\BUILD-projects_multimodule_two-level-multimodule.xml, C:\Users\jenkins\AppData\Local\Temp\2\jenkins-maven-box-maven-assembly-plugin-MASSEMBLY-897-1@2\windows-jdk7-m3.3.x_build\target\invoker-reports\BUILD-projects_multimodule_two-levels-includeBaseDir-withBin.xml, C:\Users\jenkins\AppData\Local\Temp\2\jenkins-maven-box-maven-assembly-plugin-MASSEMBLY-897-1@2\windows-jdk7-m3.3.x_build\target\invoker-reports\BUILD-projects_multimodule_two-levels-includeBaseDir-withSrc.xml, C:\Users\jenkins\AppData\Local\Temp\2\jenkins-maven-box-maven-assembly-plugin-MASSEMBLY-897-1@2\windows-jdk7-m3.3.x_build\target\invoker-reports\BUILD-projects_repositories_basic-repository.xml, C:\Users\jenkins\AppData\Local\Temp\2\jenkins-maven-box-maven-assembly-plugin-MASSEMBLY-897-1@2\windows-jdk7-m3.3.x_build\target\invoker-reports\BUILD-projects_repositories_massembly-196.xml, C:\Users\jenkins\AppData\Local\Temp\2\jenkins-maven-box-maven-assembly-plugin-MASSEMBLY-897-1@2\windows-jdk7-m3.3.x_build\target\invoker-reports\BUILD-projects_repositories_massembly-855.xml]
[windows-jdk7-m3.3.x_build] Found logs:[C:\Users\jenkins\AppData\Local\Temp\2\jenkins-maven-box-maven-assembly-plugin-MASSEMBLY-897-1@2\windows-jdk7-m3.3.x_build\target\it\it-project-parent\build.log, C:\Users\jenkins\AppData\Local\Temp\2\jenkins-maven-box-maven-assembly-plugin-MASSEMBLY-897-1@2\windows-jdk7-m3.3.x_build\target\it\projects\basic-features\ExecutionRoot\build.log, C:\Users\jenkins\AppData\Local\Temp\2\jenkins-maven-box-maven-assembly-plugin-MASSEMBLY-897-1@2\windows-jdk7-m3.3.x_build\target\it\projects\basic-features\add-classpath\build.log, C:\Users\jenkins\AppData\Local\Temp\2\jenkins-maven-box-maven-assembly-plugin-MASSEMBLY-897-1@2\windows-jdk7-m3.3.x_build\target\it\projects\basic-features\classpath-descriptor\build.log, C:\Users\jenkins\AppData\Local\Temp\2\jenkins-maven-box-maven-assembly-plugin-MASSEMBLY-897-1@2\windows-jdk7-m3.3.x_build\target\it\projects\basic-features\descriptorDirectoryScan\build.log, C:\Users\jenkins\AppData\Local\Temp\2\jenkins-maven-box-maven-assembly-plugin-MASSEMBLY-897-1@2\windows-jdk7-m3.3.x_build\target\it\projects\basic-features\file-copyIntoTopDir\build.log, C:\Users\jenkins\AppData\Local\Temp\2\jenkins-maven-box-maven-assembly-plugin-MASSEMBLY-897-1@2\windows-jdk7-m3.3.x_build\target\it\projects\basic-features\file-sameName\build.log, C:\Users\jenkins\AppData\Local\Temp\2\jenkins-maven-box-maven-assembly-plugin-MASSEMBLY-897-1@2\windows-jdk7-m3.3.x_build\target\it\projects\basic-features\formats-in-pom-win\build.log, C:\Users\jenkins\AppData\Local\Temp\2\jenkins-maven-box-maven-assembly-plugin-MASSEMBLY-897-1@2\windows-jdk7-m3.3.x_build\target\it\projects\basic-features\formats\build.log, C:\Users\jenkins\AppData\Local\Temp\2\jenkins-maven-box-maven-assembly-plugin-MASSEMBLY-897-1@2\windows-jdk7-m3.3.x_build\target\it\projects\basic-features\local-repo-interp\build.log, C:\Users\jenkins\AppData\Local\Temp\2\jenkins-maven-box-maven-assembly-plugin-MASSEMBLY-897-1@2\windows-jdk7-m3.3.x_build\target\it\projects\basic-features\massembly-256-pomPropertiesInterp\build.log, C:\Users\jenkins\AppData\Local\Temp\2\jenkins-maven-box-maven-assembly-plugin-MASSEMBLY-897-1@2\windows-jdk7-m3.3.x_build\target\it\projects\basic-features\massembly-351-projectPrefixInterp\build.log, C:\Users\jenkins\AppData\Local\Temp\2\jenkins-maven-box-maven-assembly-plugin-MASSEMBLY-897-1@2\windows-jdk7-m3.3.x_build\target\it\projects\basic-features\outputFileNameMapping-simple\build.log, C:\Users\jenkins\AppData\Local\Temp\2\jenkins-maven-box-maven-assembly-plugin-MASSEMBLY-897-1@2\windows-jdk7-m3.3.x_build\target\it\projects\basic-features\outputFileNameMapping-withArtifactBaseVersion\build.log, C:\Users\jenkins\AppData\Local\Temp\2\jenkins-maven-box-maven-assembly-plugin-MASSEMBLY-897-1@2\windows-jdk7-m3.3.x_build\target\it\projects\basic-features\relative-project-paths\build.log, C:\Users\jenkins\AppData\Local\Temp\2\jenkins-maven-box-maven-assembly-plugin-MASSEMBLY-897-1@2\windows-jdk7-m3.3.x_build\target\it\projects\bugs\massembly-190\build.log, C:\Users\jenkins\AppData\Local\Temp\2\jenkins-maven-box-maven-assembly-plugin-MASSEMBLY-897-1@2\windows-jdk7-m3.3.x_build\target\it\projects\bugs\massembly-285\build.log, C:\Users\jenkins\AppData\Local\Temp\2\jenkins-maven-box-maven-assembly-plugin-MASSEMBLY-897-1@2\windows-jdk7-m3.3.x_build\target\it\projects\bugs\massembly-306\build.log, C:\Users\jenkins\AppData\Local\Temp\2\jenkins-maven-box-maven-assembly-plugin-MASSEMBLY-897-1@2\windows-jdk7-m3.3.x_build\target\it\projects\bugs\massembly-324\build.log, C:\Users\jenkins\AppData\Local\Temp\2\jenkins-maven-box-maven-assembly-plugin-MASSEMBLY-897-1@2\windows-jdk7-m3.3.x_build\target\it\projects\bugs\massembly-375\build.log, C:\Users\jenkins\AppData\Local\Temp\2\jenkins-maven-box-maven-assembly-plugin-MASSEMBLY-897-1@2\windows-jdk7-m3.3.x_build\target\it\projects\bugs\massembly-559\build.log, C:\Users\jenkins\AppData\Local\Temp\2\jenkins-maven-box-maven-assembly-plugin-MASSEMBLY-897-1@2\windows-jdk7-m3.3.x_build\target\it\projects\bugs\massembly-580\build.log, C:\Users\jenkins\AppData\Local\Temp\2\jenkins-maven-box-maven-assembly-plugin-MASSEMBLY-897-1@2\windows-jdk7-m3.3.x_build\target\it\projects\bugs\massembly-583\build.log, C:\Users\jenkins\AppData\Local\Temp\2\jenkins-maven-box-maven-assembly-plugin-MASSEMBLY-897-1@2\windows-jdk7-m3.3.x_build\target\it\projects\bugs\massembly-730\build.log, C:\Users\jenkins\AppData\Local\Temp\2\jenkins-maven-box-maven-assembly-plugin-MASSEMBLY-897-1@2\windows-jdk7-m3.3.x_build\target\it\projects\bugs\massembly-732\build.log, C:\Users\jenkins\AppData\Local\Temp\2\jenkins-maven-box-maven-assembly-plugin-MASSEMBLY-897-1@2\windows-jdk7-m3.3.x_build\target\it\projects\bugs\massembly-733\build.log, C:\Users\jenkins\AppData\Local\Temp\2\jenkins-maven-box-maven-assembly-plugin-MASSEMBLY-897-1@2\windows-jdk7-m3.3.x_build\target\it\projects\bugs\massembly-737\build.log, C:\Users\jenkins\AppData\Local\Temp\2\jenkins-maven-box-maven-assembly-plugin-MASSEMBLY-897-1@2\windows-jdk7-m3.3.x_build\target\it\projects\bugs\massembly-739\build.log, C:\Users\jenkins\AppData\Local\Temp\2\jenkins-maven-box-maven-assembly-plugin-MASSEMBLY-897-1@2\windows-jdk7-m3.3.x_build\target\it\projects\bugs\massembly-743\build.log, C:\Users\jenkins\AppData\Local\Temp\2\jenkins-maven-box-maven-assembly-plugin-MASSEMBLY-897-1@2\windows-jdk7-m3.3.x_build\target\it\projects\components\component-dependencySet\build.log, C:\Users\jenkins\AppData\Local\Temp\2\jenkins-maven-box-maven-assembly-plugin-MASSEMBLY-897-1@2\windows-jdk7-m3.3.x_build\target\it\projects\components\component-moduleSet\build.log, C:\Users\jenkins\AppData\Local\Temp\2\jenkins-maven-box-maven-assembly-plugin-MASSEMBLY-897-1@2\windows-jdk7-m3.3.x_build\target\it\projects\container-descriptors\configured-handler\build.log, C:\Users\jenkins\AppData\Local\Temp\2\jenkins-maven-box-maven-assembly-plugin-MASSEMBLY-897-1@2\windows-jdk7-m3.3.x_build\target\it\projects\container-descriptors\custom-containerDescriptorHandler\build.log, C:\Users\jenkins\AppData\Local\Temp\2\jenkins-maven-box-maven-assembly-plugin-MASSEMBLY-897-1@2\windows-jdk7-m3.3.x_build\target\it\projects\container-descriptors\custom-handler-withFileEntries\build.log, C:\Users\jenkins\AppData\Local\Temp\2\jenkins-maven-box-maven-assembly-plugin-MASSEMBLY-897-1@2\windows-jdk7-m3.3.x_build\target\it\projects\container-descriptors\custom-handler-withMixedEntries\build.log, C:\Users\jenkins\AppData\Local\Temp\2\jenkins-maven-box-maven-assembly-plugin-MASSEMBLY-897-1@2\windows-jdk7-m3.3.x_build\target\it\projects\container-descriptors\metaInf-services-aggregation\build.log, C:\Users\jenkins\AppData\Local\Temp\2\jenkins-maven-box-maven-assembly-plugin-MASSEMBLY-897-1@2\windows-jdk7-m3.3.x_build\target\it\projects\container-descriptors\metaInf-spring-aggregation\build.log, C:\Users\jenkins\AppData\Local\Temp\2\jenkins-maven-box-maven-assembly-plugin-MASSEMBLY-897-1@2\windows-jdk7-m3.3.x_build\target\it\projects\dependency-sets\dep-transfilter-wildcard-massembly544\build.log, C:\Users\jenkins\AppData\Local\Temp\2\jenkins-maven-box-maven-assembly-plugin-MASSEMBLY-897-1@2\windows-jdk7-m3.3.x_build\target\it\projects\dependency-sets\dep-with-transitive-filter\build.log, C:\Users\jenkins\AppData\Local\Temp\2\jenkins-maven-box-maven-assembly-plugin-MASSEMBLY-897-1@2\windows-jdk7-m3.3.x_build\target\it\projects\dependency-sets\depMgmt-override\build.log, C:\Users\jenkins\AppData\Local\Temp\2\jenkins-maven-box-maven-assembly-plugin-MASSEMBLY-897-1@2\windows-jdk7-m3.3.x_build\target\it\projects\dependency-sets\depSet-artifactPomPropInterp\build.log, C:\Users\jenkins\AppData\Local\Temp\2\jenkins-maven-box-maven-assembly-plugin-MASSEMBLY-897-1@2\windows-jdk7-m3.3.x_build\target\it\projects\dependency-sets\depSet-byDepVersion\build.log, C:\Users\jenkins\AppData\Local\Temp\2\jenkins-maven-box-maven-assembly-plugin-MASSEMBLY-897-1@2\windows-jdk7-m3.3.x_build\target\it\projects\dependency-sets\depSet-enum-vs-wildcard\build.log, C:\Users\jenkins\AppData\Local\Temp\2\jenkins-maven-box-maven-assembly-plugin-MASSEMBLY-897-1@2\windows-jdk7-m3.3.x_build\target\it\projects\dependency-sets\depSet-runtimeScope\build.log, C:\Users\jenkins\AppData\Local\Temp\2\jenkins-maven-box-maven-assembly-plugin-MASSEMBLY-897-1@2\windows-jdk7-m3.3.x_build\target\it\projects\dependency-sets\depSet-unpacked-rdonly\build.log, C:\Users\jenkins\AppData\Local\Temp\2\jenkins-maven-box-maven-assembly-plugin-MASSEMBLY-897-1@2\windows-jdk7-m3.3.x_build\target\it\projects\dependency-sets\dependencySet-matchScope\build.log, C:\Users\jenkins\AppData\Local\Temp\2\jenkins-maven-box-maven-assembly-plugin-MASSEMBLY-897-1@2\windows-jdk7-m3.3.x_build\target\it\projects\dependency-sets\dependencySet-nonTransitive\build.log, C:\Users\jenkins\AppData\Local\Temp\2\jenkins-maven-box-maven-assembly-plugin-MASSEMBLY-897-1@2\windows-jdk7-m3.3.x_build\target\it\projects\dependency-sets\dependencySet-notUnpacked\build.log, C:\Users\jenkins\AppData\Local\Temp\2\jenkins-maven-box-maven-assembly-plugin-MASSEMBLY-897-1@2\windows-jdk7-m3.3.x_build\target\it\projects\dependency-sets\dependencySet-projectArtifactNotIncluded\build.log, C:\Users\jenkins\AppData\Local\Temp\2\jenkins-maven-box-maven-assembly-plugin-MASSEMBLY-897-1@2\windows-jdk7-m3.3.x_build\target\it\projects\dependency-sets\dependencySet-unpacked-filtered\build.log, C:\Users\jenkins\AppData\Local\Temp\2\jenkins-maven-box-maven-assembly-plugin-MASSEMBLY-897-1@2\windows-jdk7-m3.3.x_build\target\it\projects\dependency-sets\dependencySet-unpackedExcludingMetaInf\build.log, C:\Users\jenkins\AppData\Local\Temp\2\jenkins-maven-box-maven-assembly-plugin-MASSEMBLY-897-1@2\windows-jdk7-m3.3.x_build\target\it\projects\dependency-sets\dependencySet-unpackedSubsetsTwice\build.log, C:\Users\jenkins\AppData\Local\Temp\2\jenkins-maven-box-maven-assembly-plugin-MASSEMBLY-897-1@2\windows-jdk7-m3.3.x_build\target\it\projects\dependency-sets\dependencySet-unpacked\build.log, C:\Users\jenkins\AppData\Local\Temp\2\jenkins-maven-box-maven-assembly-plugin-MASSEMBLY-897-1@2\windows-jdk7-m3.3.x_build\target\it\projects\dependency-sets\dependencySet-withExecutedProject\build.log, C:\Users\jenkins\AppData\Local\Temp\2\jenkins-maven-box-maven-assembly-plugin-MASSEMBLY-897-1@2\windows-jdk7-m3.3.x_build\target\it\projects\dependency-sets\include-project-artifact\build.log, C:\Users\jenkins\AppData\Local\Temp\2\jenkins-maven-box-maven-assembly-plugin-MASSEMBLY-897-1@2\windows-jdk7-m3.3.x_build\target\it\projects\dependency-sets\include-project-attachments\build.log, C:\Users\jenkins\AppData\Local\Temp\2\jenkins-maven-box-maven-assembly-plugin-MASSEMBLY-897-1@2\windows-jdk7-m3.3.x_build\target\it\projects\dependency-sets\include-provided\build.log, C:\Users\jenkins\AppData\Local\Temp\2\jenkins-maven-box-maven-assembly-plugin-MASSEMBLY-897-1@2\windows-jdk7-m3.3.x_build\target\it\projects\dependency-sets\including-pom-dependency\build.log, C:\Users\jenkins\AppData\Local\Temp\2\jenkins-maven-box-maven-assembly-plugin-MASSEMBLY-897-1@2\windows-jdk7-m3.3.x_build\target\it\projects\dependency-sets\including-sar-dependency\build.log, C:\Users\jenkins\AppData\Local\Temp\2\jenkins-maven-box-maven-assembly-plugin-MASSEMBLY-897-1@2\windows-jdk7-m3.3.x_build\target\it\projects\dependency-sets\massembly-201\build.log, C:\Users\jenkins\AppData\Local\Temp\2\jenkins-maven-box-maven-assembly-plugin-MASSEMBLY-897-1@2\windows-jdk7-m3.3.x_build\target\it\projects\dependency-sets\massembly-232\build.log, C:\Users\jenkins\AppData\Local\Temp\2\jenkins-maven-box-maven-assembly-plugin-MASSEMBLY-897-1@2\windows-jdk7-m3.3.x_build\target\it\projects\dependency-sets\massembly-235\build.log, C:\Users\jenkins\AppData\Local\Temp\2\jenkins-maven-box-maven-assembly-plugin-MASSEMBLY-897-1@2\windows-jdk7-m3.3.x_build\target\it\projects\dependency-sets\massembly-345\build.log, C:\Users\jenkins\AppData\Local\Temp\2\jenkins-maven-box-maven-assembly-plugin-MASSEMBLY-897-1@2\windows-jdk7-m3.3.x_build\target\it\projects\dependency-sets\massembly-395\build.log, C:\Users\jenkins\AppData\Local\Temp\2\jenkins-maven-box-maven-assembly-plugin-MASSEMBLY-897-1@2\windows-jdk7-m3.3.x_build\target\it\projects\dependency-sets\massembly-619\build.log, C:\Users\jenkins\AppData\Local\Temp\2\jenkins-maven-box-maven-assembly-plugin-MASSEMBLY-897-1@2\windows-jdk7-m3.3.x_build\target\it\projects\dependency-sets\massembly-675\build.log, C:\Users\jenkins\AppData\Local\Temp\2\jenkins-maven-box-maven-assembly-plugin-MASSEMBLY-897-1@2\windows-jdk7-m3.3.x_build\target\it\projects\dependency-sets\massembly-99\build.log, C:\Users\jenkins\AppData\Local\Temp\2\jenkins-maven-box-maven-assembly-plugin-MASSEMBLY-897-1@2\windows-jdk7-m3.3.x_build\target\it\projects\dependency-sets\mid-artifactId-wildcard-massembly570\build.log, C:\Users\jenkins\AppData\Local\Temp\2\jenkins-maven-box-maven-assembly-plugin-MASSEMBLY-897-1@2\windows-jdk7-m3.3.x_build\target\it\projects\dependency-sets\multiple-wildcard-includes\build.log, C:\Users\jenkins\AppData\Local\Temp\2\jenkins-maven-box-maven-assembly-plugin-MASSEMBLY-897-1@2\windows-jdk7-m3.3.x_build\target\it\projects\dependency-sets\outputFileNameMappingWithUnpack\build.log, C:\Users\jenkins\AppData\Local\Temp\2\jenkins-maven-box-maven-assembly-plugin-MASSEMBLY-897-1@2\windows-jdk7-m3.3.x_build\target\it\projects\dependency-sets\unpack-deps-correct-dir\build.log, C:\Users\jenkins\AppData\Local\Temp\2\jenkins-maven-box-maven-assembly-plugin-MASSEMBLY-897-1@2\windows-jdk7-m3.3.x_build\target\it\projects\dependency-sets\using-moduleSet-implied-depSet\build.log, C:\Users\jenkins\AppData\Local\Temp\2\jenkins-maven-box-maven-assembly-plugin-MASSEMBLY-897-1@2\windows-jdk7-m3.3.x_build\target\it\projects\descriptor-refs\bin\jars-in-archive-root\build.log, C:\Users\jenkins\AppData\Local\Temp\2\jenkins-maven-box-maven-assembly-plugin-MASSEMBLY-897-1@2\windows-jdk7-m3.3.x_build\target\it\projects\descriptor-refs\jar-with-dependencies\component-descriptors-merged\build.log, C:\Users\jenkins\AppData\Local\Temp\2\jenkins-maven-box-maven-assembly-plugin-MASSEMBLY-897-1@2\windows-jdk7-m3.3.x_build\target\it\projects\descriptor-refs\jar-with-dependencies\deps-unpacked-to-root-dir\build.log, C:\Users\jenkins\AppData\Local\Temp\2\jenkins-maven-box-maven-assembly-plugin-MASSEMBLY-897-1@2\windows-jdk7-m3.3.x_build\target\it\projects\descriptor-refs\jar-with-dependencies\no-target-dir\build.log, C:\Users\jenkins\AppData\Local\Temp\2\jenkins-maven-box-maven-assembly-plugin-MASSEMBLY-897-1@2\windows-jdk7-m3.3.x_build\target\it\projects\descriptor-refs\project\multimodule-sources-copied\build.log, C:\Users\jenkins\AppData\Local\Temp\2\jenkins-maven-box-maven-assembly-plugin-MASSEMBLY-897-1@2\windows-jdk7-m3.3.x_build\target\it\projects\descriptor-refs\project\no-target-dir-multimodule\build.log, C:\Users\jenkins\AppData\Local\Temp\2\jenkins-maven-box-maven-assembly-plugin-MASSEMBLY-897-1@2\windows-jdk7-m3.3.x_build\target\it\projects\descriptor-refs\project\no-target-dir\build.log, C:\Users\jenkins\AppData\Local\Temp\2\jenkins-maven-box-maven-assembly-plugin-MASSEMBLY-897-1@2\windows-jdk7-m3.3.x_build\target\it\projects\descriptor-refs\project\sources-copied\build.log, C:\Users\jenkins\AppData\Local\Temp\2\jenkins-maven-box-maven-assembly-plugin-MASSEMBLY-897-1@2\windows-jdk7-m3.3.x_build\target\it\projects\descriptor-refs\src\no-target-dir\build.log, C:\Users\jenkins\AppData\Local\Temp\2\jenkins-maven-box-maven-assembly-plugin-MASSEMBLY-897-1@2\windows-jdk7-m3.3.x_build\target\it\projects\descriptor-refs\src\src-dir-copied\build.log, C:\Users\jenkins\AppData\Local\Temp\2\jenkins-maven-box-maven-assembly-plugin-MASSEMBLY-897-1@2\windows-jdk7-m3.3.x_build\target\it\projects\file-modes\fileItem-fileMode\build.log, C:\Users\jenkins\AppData\Local\Temp\2\jenkins-maven-box-maven-assembly-plugin-MASSEMBLY-897-1@2\windows-jdk7-m3.3.x_build\target\it\projects\file-sets\default-directory-unspecified\build.log, C:\Users\jenkins\AppData\Local\Temp\2\jenkins-maven-box-maven-assembly-plugin-MASSEMBLY-897-1@2\windows-jdk7-m3.3.x_build\target\it\projects\file-sets\default-directory-unspecified\target\default-directory-unspecified-1.0-SNAPSHOT-src\build.log, C:\Users\jenkins\AppData\Local\Temp\2\jenkins-maven-box-maven-assembly-plugin-MASSEMBLY-897-1@2\windows-jdk7-m3.3.x_build\target\it\projects\file-sets\default-excludes-unspecified\build.log, C:\Users\jenkins\AppData\Local\Temp\2\jenkins-maven-box-maven-assembly-plugin-MASSEMBLY-897-1@2\windows-jdk7-m3.3.x_build\target\it\projects\file-sets\dont-use-default-excludes\build.log, C:\Users\jenkins\AppData\Local\Temp\2\jenkins-maven-box-maven-assembly-plugin-MASSEMBLY-897-1@2\windows-jdk7-m3.3.x_build\target\it\projects\file-sets\excludes-using-regex\build.log, C:\Users\jenkins\AppData\Local\Temp\2\jenkins-maven-box-maven-assembly-plugin-MASSEMBLY-897-1@2\windows-jdk7-m3.3.x_build\target\it\projects\file-sets\excluding-svn-dirs\build.log, C:\Users\jenkins\AppData\Local\Temp\2\jenkins-maven-box-maven-assembly-plugin-MASSEMBLY-897-1@2\windows-jdk7-m3.3.x_build\target\it\projects\file-sets\filtered-module-sources\build.log, C:\Users\jenkins\AppData\Local\Temp\2\jenkins-maven-box-maven-assembly-plugin-MASSEMBLY-897-1@2\windows-jdk7-m3.3.x_build\target\it\projects\file-sets\filtered-multimodule\build.log, C:\Users\jenkins\AppData\Local\Temp\2\jenkins-maven-box-maven-assembly-plugin-MASSEMBLY-897-1@2\windows-jdk7-m3.3.x_build\target\it\projects\file-sets\include-base-directory\build.log, C:\Users\jenkins\AppData\Local\Temp\2\jenkins-maven-box-maven-assembly-plugin-MASSEMBLY-897-1@2\windows-jdk7-m3.3.x_build\target\it\projects\file-sets\include-parent-dir\build.log, C:\Users\jenkins\AppData\Local\Temp\2\jenkins-maven-box-maven-assembly-plugin-MASSEMBLY-897-1@2\windows-jdk7-m3.3.x_build\target\it\projects\file-sets\include-parent-dir\child\target\child-1.0-SNAPSHOT-parent\build.log, C:\Users\jenkins\AppData\Local\Temp\2\jenkins-maven-box-maven-assembly-plugin-MASSEMBLY-897-1@2\windows-jdk7-m3.3.x_build\target\it\projects\file-sets\massembly-665\build.log, C:\Users\jenkins\AppData\Local\Temp\2\jenkins-maven-box-maven-assembly-plugin-MASSEMBLY-897-1@2\windows-jdk7-m3.3.x_build\target\it\projects\file-sets\multimodule-unix-lineEndings\build.log, C:\Users\jenkins\AppData\Local\Temp\2\jenkins-maven-box-maven-assembly-plugin-MASSEMBLY-897-1@2\windows-jdk7-m3.3.x_build\target\it\projects\file-sets\multimodule-win-lineEndings\build.log, C:\Users\jenkins\AppData\Local\Temp\2\jenkins-maven-box-maven-assembly-plugin-MASSEMBLY-897-1@2\windows-jdk7-m3.3.x_build\target\it\projects\file-sets\platformspecific-filesets\build.log, C:\Users\jenkins\AppData\Local\Temp\2\jenkins-maven-box-maven-assembly-plugin-MASSEMBLY-897-1@2\windows-jdk7-m3.3.x_build\target\it\projects\file-sets\precedence-check\build.log, C:\Users\jenkins\AppData\Local\Temp\2\jenkins-maven-box-maven-assembly-plugin-MASSEMBLY-897-1@2\windows-jdk7-m3.3.x_build\target\it\projects\file-sets\use-default-excludes\build.log, C:\Users\jenkins\AppData\Local\Temp\2\jenkins-maven-box-maven-assembly-plugin-MASSEMBLY-897-1@2\windows-jdk7-m3.3.x_build\target\it\projects\files\filtered-sysprop\build.log, C:\Users\jenkins\AppData\Local\Temp\2\jenkins-maven-box-maven-assembly-plugin-MASSEMBLY-897-1@2\windows-jdk7-m3.3.x_build\target\it\projects\files\multimodule-relativePath\build.log, C:\Users\jenkins\AppData\Local\Temp\2\jenkins-maven-box-maven-assembly-plugin-MASSEMBLY-897-1@2\windows-jdk7-m3.3.x_build\target\it\projects\files\zipentrysize\build.log, C:\Users\jenkins\AppData\Local\Temp\2\jenkins-maven-box-maven-assembly-plugin-MASSEMBLY-897-1@2\windows-jdk7-m3.3.x_build\target\it\projects\filtering-feature\fileset-to-tar-massembly-722\build.log, C:\Users\jenkins\AppData\Local\Temp\2\jenkins-maven-box-maven-assembly-plugin-MASSEMBLY-897-1@2\windows-jdk7-m3.3.x_build\target\it\projects\filtering-feature\filter-comp-descriptor-path\build.log, C:\Users\jenkins\AppData\Local\Temp\2\jenkins-maven-box-maven-assembly-plugin-MASSEMBLY-897-1@2\windows-jdk7-m3.3.x_build\target\it\projects\filtering-feature\filters-defined-in-build\build.log, C:\Users\jenkins\AppData\Local\Temp\2\jenkins-maven-box-maven-assembly-plugin-MASSEMBLY-897-1@2\windows-jdk7-m3.3.x_build\target\it\projects\filtering-feature\filtersDefinedInAssemblyPluginConfig\build.log, C:\Users\jenkins\AppData\Local\Temp\2\jenkins-maven-box-maven-assembly-plugin-MASSEMBLY-897-1@2\windows-jdk7-m3.3.x_build\target\it\projects\filtering-feature\massembly-736\build.log, C:\Users\jenkins\AppData\Local\Temp\2\jenkins-maven-box-maven-assembly-plugin-MASSEMBLY-897-1@2\windows-jdk7-m3.3.x_build\target\it\projects\forking-tests\assembly-assembly-with-module-binaries\build.log, C:\Users\jenkins\AppData\Local\Temp\2\jenkins-maven-box-maven-assembly-plugin-MASSEMBLY-897-1@2\windows-jdk7-m3.3.x_build\target\it\projects\forking-tests\assembly-attached-with-module-binaries\build.log, C:\Users\jenkins\AppData\Local\Temp\2\jenkins-maven-box-maven-assembly-plugin-MASSEMBLY-897-1@2\windows-jdk7-m3.3.x_build\target\it\projects\mojo-configuration\archiver-ignorePermissions\build.log, C:\Users\jenkins\AppData\Local\Temp\2\jenkins-maven-box-maven-assembly-plugin-MASSEMBLY-897-1@2\windows-jdk7-m3.3.x_build\target\it\projects\mojo-configuration\archiver-ignorePermissions\target\parent-1-bin\parent-1\build.log, C:\Users\jenkins\AppData\Local\Temp\2\jenkins-maven-box-maven-assembly-plugin-MASSEMBLY-897-1@2\windows-jdk7-m3.3.x_build\target\it\projects\mojo-configuration\ignoreDirFormatExtensions\build.log, C:\Users\jenkins\AppData\Local\Temp\2\jenkins-maven-box-maven-assembly-plugin-MASSEMBLY-897-1@2\windows-jdk7-m3.3.x_build\target\it\projects\mojo-configuration\ignoreDirFormatExtensions\target\ignoreDirFormatExtensions-1-src2.dir\build.log, C:\Users\jenkins\AppData\Local\Temp\2\jenkins-maven-box-maven-assembly-plugin-MASSEMBLY-897-1@2\windows-jdk7-m3.3.x_build\target\it\projects\mojo-configuration\ignoreDirFormatExtensions\target\ignoreDirFormatExtensions-1-src\build.log, C:\Users\jenkins\AppData\Local\Temp\2\jenkins-maven-box-maven-assembly-plugin-MASSEMBLY-897-1@2\windows-jdk7-m3.3.x_build\target\it\projects\mojo-configuration\manifest-with-customEntry\build.log, C:\Users\jenkins\AppData\Local\Temp\2\jenkins-maven-box-maven-assembly-plugin-MASSEMBLY-897-1@2\windows-jdk7-m3.3.x_build\target\it\projects\mojo-configuration\manifest-with-mainClass\build.log, C:\Users\jenkins\AppData\Local\Temp\2\jenkins-maven-box-maven-assembly-plugin-MASSEMBLY-897-1@2\windows-jdk7-m3.3.x_build\target\it\projects\mojo-configuration\massembly-291\build.log, C:\Users\jenkins\AppData\Local\Temp\2\jenkins-maven-box-maven-assembly-plugin-MASSEMBLY-897-1@2\windows-jdk7-m3.3.x_build\target\it\projects\mojo-configuration\massembly-301\build.log, C:\Users\jenkins\AppData\Local\Temp\2\jenkins-maven-box-maven-assembly-plugin-MASSEMBLY-897-1@2\windows-jdk7-m3.3.x_build\target\it\projects\mojo-configuration\no-appendAssemblyId-no-classifier\build.log, C:\Users\jenkins\AppData\Local\Temp\2\jenkins-maven-box-maven-assembly-plugin-MASSEMBLY-897-1@2\windows-jdk7-m3.3.x_build\target\it\projects\mojo-configuration\skipAssemblyCLIPropertySet\build.log, C:\Users\jenkins\AppData\Local\Temp\2\jenkins-maven-box-maven-assembly-plugin-MASSEMBLY-897-1@2\windows-jdk7-m3.3.x_build\target\it\projects\mojo-tests\single-in-one-project-hierarchy\build.log, C:\Users\jenkins\AppData\Local\Temp\2\jenkins-maven-box-maven-assembly-plugin-MASSEMBLY-897-1@2\windows-jdk7-m3.3.x_build\target\it\projects\mojo-tests\single-twice-in-multimodule-hierarchy\build.log, C:\Users\jenkins\AppData\Local\Temp\2\jenkins-maven-box-maven-assembly-plugin-MASSEMBLY-897-1@2\windows-jdk7-m3.3.x_build\target\it\projects\mojo-tests\single-twice-in-one-project-hierarchy\build.log, C:\Users\jenkins\AppData\Local\Temp\2\jenkins-maven-box-maven-assembly-plugin-MASSEMBLY-897-1@2\windows-jdk7-m3.3.x_build\target\it\projects\multimodule\massembly-298\build.log, C:\Users\jenkins\AppData\Local\Temp\2\jenkins-maven-box-maven-assembly-plugin-MASSEMBLY-897-1@2\windows-jdk7-m3.3.x_build\target\it\projects\multimodule\massembly-317\build.log, C:\Users\jenkins\AppData\Local\Temp\2\jenkins-maven-box-maven-assembly-plugin-MASSEMBLY-897-1@2\windows-jdk7-m3.3.x_build\target\it\projects\multimodule\massembly-474\build.log, C:\Users\jenkins\AppData\Local\Temp\2\jenkins-maven-box-maven-assembly-plugin-MASSEMBLY-897-1@2\windows-jdk7-m3.3.x_build\target\it\projects\multimodule\massembly-619\build.log, C:\Users\jenkins\AppData\Local\Temp\2\jenkins-maven-box-maven-assembly-plugin-MASSEMBLY-897-1@2\windows-jdk7-m3.3.x_build\target\it\projects\multimodule\multimodule-binariesNotSource\build.log, C:\Users\jenkins\AppData\Local\Temp\2\jenkins-maven-box-maven-assembly-plugin-MASSEMBLY-897-1@2\windows-jdk7-m3.3.x_build\target\it\projects\multimodule\multimodule-filteredFileSet\build.log, C:\Users\jenkins\AppData\Local\Temp\2\jenkins-maven-box-maven-assembly-plugin-MASSEMBLY-897-1@2\windows-jdk7-m3.3.x_build\target\it\projects\multimodule\multimodule-modulePomPropInterp\build.log, C:\Users\jenkins\AppData\Local\Temp\2\jenkins-maven-box-maven-assembly-plugin-MASSEMBLY-897-1@2\windows-jdk7-m3.3.x_build\target\it\projects\multimodule\multimodule-siblingParent\parent\build.log, C:\Users\jenkins\AppData\Local\Temp\2\jenkins-maven-box-maven-assembly-plugin-MASSEMBLY-897-1@2\windows-jdk7-m3.3.x_build\target\it\projects\multimodule\multimodule-sourceNotBinaries\build.log, C:\Users\jenkins\AppData\Local\Temp\2\jenkins-maven-box-maven-assembly-plugin-MASSEMBLY-897-1@2\windows-jdk7-m3.3.x_build\target\it\projects\multimodule\multimodule-wholeReactorFromChild\build.log, C:\Users\jenkins\AppData\Local\Temp\2\jenkins-maven-box-maven-assembly-plugin-MASSEMBLY-897-1@2\windows-jdk7-m3.3.x_build\target\it\projects\multimodule\two-level-multimodule\build.log, C:\Users\jenkins\AppData\Local\Temp\2\jenkins-maven-box-maven-assembly-plugin-MASSEMBLY-897-1@2\windows-jdk7-m3.3.x_build\target\it\projects\multimodule\two-levels-includeBaseDir-withBin\build.log, C:\Users\jenkins\AppData\Local\Temp\2\jenkins-maven-box-maven-assembly-plugin-MASSEMBLY-897-1@2\windows-jdk7-m3.3.x_build\target\it\projects\multimodule\two-levels-includeBaseDir-withSrc\build.log, C:\Users\jenkins\AppData\Local\Temp\2\jenkins-maven-box-maven-assembly-plugin-MASSEMBLY-897-1@2\windows-jdk7-m3.3.x_build\target\it\projects\repositories\basic-repository\build.log, C:\Users\jenkins\AppData\Local\Temp\2\jenkins-maven-box-maven-assembly-plugin-MASSEMBLY-897-1@2\windows-jdk7-m3.3.x_build\target\it\projects\repositories\massembly-196\build.log, C:\Users\jenkins\AppData\Local\Temp\2\jenkins-maven-box-maven-assembly-plugin-MASSEMBLY-897-1@2\windows-jdk7-m3.3.x_build\target\it\projects\repositories\massembly-855\build.log]
[windows-jdk7-m3.3.x_build] Finished parsing Maven Invoker results (found 138)
[windows-jdk7-m3.3.x_build] [withMaven] junitPublisher - Archive test results for Maven artifact org.apache.maven.plugins:maven-assembly-plugin:3.1.1-SNAPSHOT generated by maven-surefire-plugin:test (default-test): windows-jdk7-m3.3.x_build\target\surefire-reports\*.xml
[windows-jdk7-m3.3.x_build] Recording test results
[windows-jdk7-m3.3.x_build] [withMaven] openTasksPublisher - Scan Tasks for Maven artifact org.apache.maven.plugins:maven-assembly-plugin:3.1.1-SNAPSHOT in source directory windows-jdk7-m3.3.x_build\src\main\java
[windows-jdk7-m3.3.x_build] [TASKS] Scanning folder 'C:\Users\jenkins\AppData\Local\Temp\2\jenkins-maven-box-maven-assembly-plugin-MASSEMBLY-897-1@2' for files matching the pattern 'windows-jdk7-m3.3.x_build\src\main\java\**\*' - excludes: null
[windows-jdk7-m3.3.x_build] [TASKS] Found 71 files to scan for tasks
[windows-jdk7-m3.3.x_build] [TASKS] Found 14 open tasks.
[windows-jdk7-m3.3.x_build] Skipping warnings blame since pipelines do not have an SCM link.%n
[Pipeline] [windows-jdk7-m3.3.x_build] // withMaven
[Pipeline] [windows-jdk7-m3.3.x_build] cleanWs
[Pipeline] [windows-jdk7-m3.2.x_build] }
[Pipeline] [windows-jdk7-m3.2.x_build] // dir
[windows-jdk7-m3.3.x_build] [WS-CLEANUP] Deleting project workspace...[WS-CLEANUP] done
[Pipeline] [windows-jdk7-m3.2.x_build] }
[windows-jdk7-m3.2.x_build] [withMaven] artifactsPublisher - Archive artifact windows-jdk7-m3.2.x_build\pom.xml under org\apache\maven\plugins\maven-assembly-plugin\3.1.1-SNAPSHOT\maven-assembly-plugin-3.1.1-SNAPSHOT.pom
[windows-jdk7-m3.2.x_build] [withMaven] artifactsPublisher - Archive artifact windows-jdk7-m3.2.x_build\target\maven-assembly-plugin-3.1.1-SNAPSHOT.jar under org\apache\maven\plugins\maven-assembly-plugin\3.1.1-SNAPSHOT\maven-assembly-plugin-3.1.1-SNAPSHOT.jar
[windows-jdk7-m3.2.x_build] [Fast Archiver] No prior successful build to compare, so performing full copy of artifacts
[windows-jdk7-m3.2.x_build] [withMaven] invokerPublisher - Archive invoker results for Maven artifact MavenArtifact{org.apache.maven.plugins:maven-assembly-plugin::3.1.1-SNAPSHOT(version: 3.1.1-SNAPSHOT, snapshot:false) } generated by PluginInvocation{org.apache.maven.plugins:maven-invoker-plugin:3.1.0@integration-test  integration-test}: windows-jdk7-m3.2.x_build\target\invoker-reports\*.xml
[windows-jdk7-m3.2.x_build] performing MavenInvokerRecorder, reportsFilenamePattern:'**/windows-jdk7-m3.2.x_build\target\invoker-reports/BUILD*.xml', invokerBuildDir:'**/windows-jdk7-m3.2.x_build\target\it'
[windows-jdk7-m3.2.x_build] Found reports:[C:\Users\jenkins\AppData\Local\Temp\2\jenkins-maven-box-maven-assembly-plugin-MASSEMBLY-897-1\windows-jdk7-m3.2.x_build\target\invoker-reports\BUILD-it-project-parent.xml, C:\Users\jenkins\AppData\Local\Temp\2\jenkins-maven-box-maven-assembly-plugin-MASSEMBLY-897-1\windows-jdk7-m3.2.x_build\target\invoker-reports\BUILD-projects_basic-features_ExecutionRoot.xml, C:\Users\jenkins\AppData\Local\Temp\2\jenkins-maven-box-maven-assembly-plugin-MASSEMBLY-897-1\windows-jdk7-m3.2.x_build\target\invoker-reports\BUILD-projects_basic-features_add-classpath.xml, C:\Users\jenkins\AppData\Local\Temp\2\jenkins-maven-box-maven-assembly-plugin-MASSEMBLY-897-1\windows-jdk7-m3.2.x_build\target\invoker-reports\BUILD-projects_basic-features_classpath-descriptor.xml, C:\Users\jenkins\AppData\Local\Temp\2\jenkins-maven-box-maven-assembly-plugin-MASSEMBLY-897-1\windows-jdk7-m3.2.x_build\target\invoker-reports\BUILD-projects_basic-features_descriptorDirectoryScan.xml, C:\Users\jenkins\AppData\Local\Temp\2\jenkins-maven-box-maven-assembly-plugin-MASSEMBLY-897-1\windows-jdk7-m3.2.x_build\target\invoker-reports\BUILD-projects_basic-features_file-copyIntoTopDir.xml, C:\Users\jenkins\AppData\Local\Temp\2\jenkins-maven-box-maven-assembly-plugin-MASSEMBLY-897-1\windows-jdk7-m3.2.x_build\target\invoker-reports\BUILD-projects_basic-features_file-sameName.xml, C:\Users\jenkins\AppData\Local\Temp\2\jenkins-maven-box-maven-assembly-plugin-MASSEMBLY-897-1\windows-jdk7-m3.2.x_build\target\invoker-reports\BUILD-projects_basic-features_formats-in-pom-win.xml, C:\Users\jenkins\AppData\Local\Temp\2\jenkins-maven-box-maven-assembly-plugin-MASSEMBLY-897-1\windows-jdk7-m3.2.x_build\target\invoker-reports\BUILD-projects_basic-features_formats.xml, C:\Users\jenkins\AppData\Local\Temp\2\jenkins-maven-box-maven-assembly-plugin-MASSEMBLY-897-1\windows-jdk7-m3.2.x_build\target\invoker-reports\BUILD-projects_basic-features_local-repo-interp.xml, C:\Users\jenkins\AppData\Local\Temp\2\jenkins-maven-box-maven-assembly-plugin-MASSEMBLY-897-1\windows-jdk7-m3.2.x_build\target\invoker-reports\BUILD-projects_basic-features_massembly-256-pomPropertiesInterp.xml, C:\Users\jenkins\AppData\Local\Temp\2\jenkins-maven-box-maven-assembly-plugin-MASSEMBLY-897-1\windows-jdk7-m3.2.x_build\target\invoker-reports\BUILD-projects_basic-features_massembly-351-projectPrefixInterp.xml, C:\Users\jenkins\AppData\Local\Temp\2\jenkins-maven-box-maven-assembly-plugin-MASSEMBLY-897-1\windows-jdk7-m3.2.x_build\target\invoker-reports\BUILD-projects_basic-features_outputFileNameMapping-simple.xml, C:\Users\jenkins\AppData\Local\Temp\2\jenkins-maven-box-maven-assembly-plugin-MASSEMBLY-897-1\windows-jdk7-m3.2.x_build\target\invoker-reports\BUILD-projects_basic-features_outputFileNameMapping-withArtifactBaseVersion.xml, C:\Users\jenkins\AppData\Local\Temp\2\jenkins-maven-box-maven-assembly-plugin-MASSEMBLY-897-1\windows-jdk7-m3.2.x_build\target\invoker-reports\BUILD-projects_basic-features_relative-project-paths.xml, C:\Users\jenkins\AppData\Local\Temp\2\jenkins-maven-box-maven-assembly-plugin-MASSEMBLY-897-1\windows-jdk7-m3.2.x_build\target\invoker-reports\BUILD-projects_basic-features_space_&_special_char.xml, C:\Users\jenkins\AppData\Local\Temp\2\jenkins-maven-box-maven-assembly-plugin-MASSEMBLY-897-1\windows-jdk7-m3.2.x_build\target\invoker-reports\BUILD-projects_bugs_massembly-190.xml, C:\Users\jenkins\AppData\Local\Temp\2\jenkins-maven-box-maven-assembly-plugin-MASSEMBLY-897-1\windows-jdk7-m3.2.x_build\target\invoker-reports\BUILD-projects_bugs_massembly-285.xml, C:\Users\jenkins\AppData\Local\Temp\2\jenkins-maven-box-maven-assembly-plugin-MASSEMBLY-897-1\windows-jdk7-m3.2.x_build\target\invoker-reports\BUILD-projects_bugs_massembly-306.xml, C:\Users\jenkins\AppData\Local\Temp\2\jenkins-maven-box-maven-assembly-plugin-MASSEMBLY-897-1\windows-jdk7-m3.2.x_build\target\invoker-reports\BUILD-projects_bugs_massembly-324.xml, C:\Users\jenkins\AppData\Local\Temp\2\jenkins-maven-box-maven-assembly-plugin-MASSEMBLY-897-1\windows-jdk7-m3.2.x_build\target\invoker-reports\BUILD-projects_bugs_massembly-375.xml, C:\Users\jenkins\AppData\Local\Temp\2\jenkins-maven-box-maven-assembly-plugin-MASSEMBLY-897-1\windows-jdk7-m3.2.x_build\target\invoker-reports\BUILD-projects_bugs_massembly-559.xml, C:\Users\jenkins\AppData\Local\Temp\2\jenkins-maven-box-maven-assembly-plugin-MASSEMBLY-897-1\windows-jdk7-m3.2.x_build\target\invoker-reports\BUILD-projects_bugs_massembly-580.xml, C:\Users\jenkins\AppData\Local\Temp\2\jenkins-maven-box-maven-assembly-plugin-MASSEMBLY-897-1\windows-jdk7-m3.2.x_build\target\invoker-reports\BUILD-projects_bugs_massembly-583.xml, C:\Users\jenkins\AppData\Local\Temp\2\jenkins-maven-box-maven-assembly-plugin-MASSEMBLY-897-1\windows-jdk7-m3.2.x_build\target\invoker-reports\BUILD-projects_bugs_massembly-730.xml, C:\Users\jenkins\AppData\Local\Temp\2\jenkins-maven-box-maven-assembly-plugin-MASSEMBLY-897-1\windows-jdk7-m3.2.x_build\target\invoker-reports\BUILD-projects_bugs_massembly-731.xml, C:\Users\jenkins\AppData\Local\Temp\2\jenkins-maven-box-maven-assembly-plugin-MASSEMBLY-897-1\windows-jdk7-m3.2.x_build\target\invoker-reports\BUILD-projects_bugs_massembly-732.xml, C:\Users\jenkins\AppData\Local\Temp\2\jenkins-maven-box-maven-assembly-plugin-MASSEMBLY-897-1\windows-jdk7-m3.2.x_build\target\invoker-reports\BUILD-projects_bugs_massembly-733.xml, C:\Users\jenkins\AppData\Local\Temp\2\jenkins-maven-box-maven-assembly-plugin-MASSEMBLY-897-1\windows-jdk7-m3.2.x_build\target\invoker-reports\BUILD-projects_bugs_massembly-737.xml, C:\Users\jenkins\AppData\Local\Temp\2\jenkins-maven-box-maven-assembly-plugin-MASSEMBLY-897-1\windows-jdk7-m3.2.x_build\target\invoker-reports\BUILD-projects_bugs_massembly-739.xml, C:\Users\jenkins\AppData\Local\Temp\2\jenkins-maven-box-maven-assembly-plugin-MASSEMBLY-897-1\windows-jdk7-m3.2.x_build\target\invoker-reports\BUILD-projects_bugs_massembly-743.xml, C:\Users\jenkins\AppData\Local\Temp\2\jenkins-maven-box-maven-assembly-plugin-MASSEMBLY-897-1\windows-jdk7-m3.2.x_build\target\invoker-reports\BUILD-projects_components_component-dependencySet.xml, C:\Users\jenkins\AppData\Local\Temp\2\jenkins-maven-box-maven-assembly-plugin-MASSEMBLY-897-1\windows-jdk7-m3.2.x_build\target\invoker-reports\BUILD-projects_components_component-moduleSet.xml, C:\Users\jenkins\AppData\Local\Temp\2\jenkins-maven-box-maven-assembly-plugin-MASSEMBLY-897-1\windows-jdk7-m3.2.x_build\target\invoker-reports\BUILD-projects_container-descriptors_configured-handler.xml, C:\Users\jenkins\AppData\Local\Temp\2\jenkins-maven-box-maven-assembly-plugin-MASSEMBLY-897-1\windows-jdk7-m3.2.x_build\target\invoker-reports\BUILD-projects_container-descriptors_custom-containerDescriptorHandler.xml, C:\Users\jenkins\AppData\Local\Temp\2\jenkins-maven-box-maven-assembly-plugin-MASSEMBLY-897-1\windows-jdk7-m3.2.x_build\target\invoker-reports\BUILD-projects_container-descriptors_custom-handler-withFileEntries.xml, C:\Users\jenkins\AppData\Local\Temp\2\jenkins-maven-box-maven-assembly-plugin-MASSEMBLY-897-1\windows-jdk7-m3.2.x_build\target\invoker-reports\BUILD-projects_container-descriptors_custom-handler-withMixedEntries.xml, C:\Users\jenkins\AppData\Local\Temp\2\jenkins-maven-box-maven-assembly-plugin-MASSEMBLY-897-1\windows-jdk7-m3.2.x_build\target\invoker-reports\BUILD-projects_container-descriptors_metaInf-services-aggregation.xml, C:\Users\jenkins\AppData\Local\Temp\2\jenkins-maven-box-maven-assembly-plugin-MASSEMBLY-897-1\windows-jdk7-m3.2.x_build\target\invoker-reports\BUILD-projects_container-descriptors_metaInf-spring-aggregation.xml, C:\Users\jenkins\AppData\Local\Temp\2\jenkins-maven-box-maven-assembly-plugin-MASSEMBLY-897-1\windows-jdk7-m3.2.x_build\target\invoker-reports\BUILD-projects_dependency-sets_dep-transfilter-wildcard-massembly544.xml, C:\Users\jenkins\AppData\Local\Temp\2\jenkins-maven-box-maven-assembly-plugin-MASSEMBLY-897-1\windows-jdk7-m3.2.x_build\target\invoker-reports\BUILD-projects_dependency-sets_dep-with-transitive-filter.xml, C:\Users\jenkins\AppData\Local\Temp\2\jenkins-maven-box-maven-assembly-plugin-MASSEMBLY-897-1\windows-jdk7-m3.2.x_build\target\invoker-reports\BUILD-projects_dependency-sets_depMgmt-override.xml, C:\Users\jenkins\AppData\Local\Temp\2\jenkins-maven-box-maven-assembly-plugin-MASSEMBLY-897-1\windows-jdk7-m3.2.x_build\target\invoker-reports\BUILD-projects_dependency-sets_depSet-artifactPomPropInterp.xml, C:\Users\jenkins\AppData\Local\Temp\2\jenkins-maven-box-maven-assembly-plugin-MASSEMBLY-897-1\windows-jdk7-m3.2.x_build\target\invoker-reports\BUILD-projects_dependency-sets_depSet-byDepVersion.xml, C:\Users\jenkins\AppData\Local\Temp\2\jenkins-maven-box-maven-assembly-plugin-MASSEMBLY-897-1\windows-jdk7-m3.2.x_build\target\invoker-reports\BUILD-projects_dependency-sets_depSet-enum-vs-wildcard.xml, C:\Users\jenkins\AppData\Local\Temp\2\jenkins-maven-box-maven-assembly-plugin-MASSEMBLY-897-1\windows-jdk7-m3.2.x_build\target\invoker-reports\BUILD-projects_dependency-sets_depSet-runtimeScope.xml, C:\Users\jenkins\AppData\Local\Temp\2\jenkins-maven-box-maven-assembly-plugin-MASSEMBLY-897-1\windows-jdk7-m3.2.x_build\target\invoker-reports\BUILD-projects_dependency-sets_depSet-unpacked-rdonly.xml, C:\Users\jenkins\AppData\Local\Temp\2\jenkins-maven-box-maven-assembly-plugin-MASSEMBLY-897-1\windows-jdk7-m3.2.x_build\target\invoker-reports\BUILD-projects_dependency-sets_dependencySet-matchScope.xml, C:\Users\jenkins\AppData\Local\Temp\2\jenkins-maven-box-maven-assembly-plugin-MASSEMBLY-897-1\windows-jdk7-m3.2.x_build\target\invoker-reports\BUILD-projects_dependency-sets_dependencySet-nonTransitive.xml, C:\Users\jenkins\AppData\Local\Temp\2\jenkins-maven-box-maven-assembly-plugin-MASSEMBLY-897-1\windows-jdk7-m3.2.x_build\target\invoker-reports\BUILD-projects_dependency-sets_dependencySet-notUnpacked.xml, C:\Users\jenkins\AppData\Local\Temp\2\jenkins-maven-box-maven-assembly-plugin-MASSEMBLY-897-1\windows-jdk7-m3.2.x_build\target\invoker-reports\BUILD-projects_dependency-sets_dependencySet-projectArtifactNotIncluded.xml, C:\Users\jenkins\AppData\Local\Temp\2\jenkins-maven-box-maven-assembly-plugin-MASSEMBLY-897-1\windows-jdk7-m3.2.x_build\target\invoker-reports\BUILD-projects_dependency-sets_dependencySet-unpacked-filtered.xml, C:\Users\jenkins\AppData\Local\Temp\2\jenkins-maven-box-maven-assembly-plugin-MASSEMBLY-897-1\windows-jdk7-m3.2.x_build\target\invoker-reports\BUILD-projects_dependency-sets_dependencySet-unpacked.xml, C:\Users\jenkins\AppData\Local\Temp\2\jenkins-maven-box-maven-assembly-plugin-MASSEMBLY-897-1\windows-jdk7-m3.2.x_build\target\invoker-reports\BUILD-projects_dependency-sets_dependencySet-unpackedExcludingMetaInf.xml, C:\Users\jenkins\AppData\Local\Temp\2\jenkins-maven-box-maven-assembly-plugin-MASSEMBLY-897-1\windows-jdk7-m3.2.x_build\target\invoker-reports\BUILD-projects_dependency-sets_dependencySet-unpackedSubsetsTwice.xml, C:\Users\jenkins\AppData\Local\Temp\2\jenkins-maven-box-maven-assembly-plugin-MASSEMBLY-897-1\windows-jdk7-m3.2.x_build\target\invoker-reports\BUILD-projects_dependency-sets_dependencySet-withExecutedProject.xml, C:\Users\jenkins\AppData\Local\Temp\2\jenkins-maven-box-maven-assembly-plugin-MASSEMBLY-897-1\windows-jdk7-m3.2.x_build\target\invoker-reports\BUILD-projects_dependency-sets_include-project-artifact.xml, C:\Users\jenkins\AppData\Local\Temp\2\jenkins-maven-box-maven-assembly-plugin-MASSEMBLY-897-1\windows-jdk7-m3.2.x_build\target\invoker-reports\BUILD-projects_dependency-sets_include-project-attachments.xml, C:\Users\jenkins\AppData\Local\Temp\2\jenkins-maven-box-maven-assembly-plugin-MASSEMBLY-897-1\windows-jdk7-m3.2.x_build\target\invoker-reports\BUILD-projects_dependency-sets_include-provided.xml, C:\Users\jenkins\AppData\Local\Temp\2\jenkins-maven-box-maven-assembly-plugin-MASSEMBLY-897-1\windows-jdk7-m3.2.x_build\target\invoker-reports\BUILD-projects_dependency-sets_including-pom-dependency.xml, C:\Users\jenkins\AppData\Local\Temp\2\jenkins-maven-box-maven-assembly-plugin-MASSEMBLY-897-1\windows-jdk7-m3.2.x_build\target\invoker-reports\BUILD-projects_dependency-sets_including-sar-dependency.xml, C:\Users\jenkins\AppData\Local\Temp\2\jenkins-maven-box-maven-assembly-plugin-MASSEMBLY-897-1\windows-jdk7-m3.2.x_build\target\invoker-reports\BUILD-projects_dependency-sets_massembly-201.xml, C:\Users\jenkins\AppData\Local\Temp\2\jenkins-maven-box-maven-assembly-plugin-MASSEMBLY-897-1\windows-jdk7-m3.2.x_build\target\invoker-reports\BUILD-projects_dependency-sets_massembly-232.xml, C:\Users\jenkins\AppData\Local\Temp\2\jenkins-maven-box-maven-assembly-plugin-MASSEMBLY-897-1\windows-jdk7-m3.2.x_build\target\invoker-reports\BUILD-projects_dependency-sets_massembly-235.xml, C:\Users\jenkins\AppData\Local\Temp\2\jenkins-maven-box-maven-assembly-plugin-MASSEMBLY-897-1\windows-jdk7-m3.2.x_build\target\invoker-reports\BUILD-projects_dependency-sets_massembly-345.xml, C:\Users\jenkins\AppData\Local\Temp\2\jenkins-maven-box-maven-assembly-plugin-MASSEMBLY-897-1\windows-jdk7-m3.2.x_build\target\invoker-reports\BUILD-projects_dependency-sets_massembly-395.xml, C:\Users\jenkins\AppData\Local\Temp\2\jenkins-maven-box-maven-assembly-plugin-MASSEMBLY-897-1\windows-jdk7-m3.2.x_build\target\invoker-reports\BUILD-projects_dependency-sets_massembly-619.xml, C:\Users\jenkins\AppData\Local\Temp\2\jenkins-maven-box-maven-assembly-plugin-MASSEMBLY-897-1\windows-jdk7-m3.2.x_build\target\invoker-reports\BUILD-projects_dependency-sets_massembly-675.xml, C:\Users\jenkins\AppData\Local\Temp\2\jenkins-maven-box-maven-assembly-plugin-MASSEMBLY-897-1\windows-jdk7-m3.2.x_build\target\invoker-reports\BUILD-projects_dependency-sets_massembly-99.xml, C:\Users\jenkins\AppData\Local\Temp\2\jenkins-maven-box-maven-assembly-plugin-MASSEMBLY-897-1\windows-jdk7-m3.2.x_build\target\invoker-reports\BUILD-projects_dependency-sets_mid-artifactId-wildcard-massembly570.xml, C:\Users\jenkins\AppData\Local\Temp\2\jenkins-maven-box-maven-assembly-plugin-MASSEMBLY-897-1\windows-jdk7-m3.2.x_build\target\invoker-reports\BUILD-projects_dependency-sets_multiple-wildcard-includes.xml, C:\Users\jenkins\AppData\Local\Temp\2\jenkins-maven-box-maven-assembly-plugin-MASSEMBLY-897-1\windows-jdk7-m3.2.x_build\target\invoker-reports\BUILD-projects_dependency-sets_outputFileNameMappingWithUnpack.xml, C:\Users\jenkins\AppData\Local\Temp\2\jenkins-maven-box-maven-assembly-plugin-MASSEMBLY-897-1\windows-jdk7-m3.2.x_build\target\invoker-reports\BUILD-projects_dependency-sets_unpack-deps-correct-dir.xml, C:\Users\jenkins\AppData\Local\Temp\2\jenkins-maven-box-maven-assembly-plugin-MASSEMBLY-897-1\windows-jdk7-m3.2.x_build\target\invoker-reports\BUILD-projects_dependency-sets_using-moduleSet-implied-depSet.xml, C:\Users\jenkins\AppData\Local\Temp\2\jenkins-maven-box-maven-assembly-plugin-MASSEMBLY-897-1\windows-jdk7-m3.2.x_build\target\invoker-reports\BUILD-projects_descriptor-refs_bin_jars-in-archive-root.xml, C:\Users\jenkins\AppData\Local\Temp\2\jenkins-maven-box-maven-assembly-plugin-MASSEMBLY-897-1\windows-jdk7-m3.2.x_build\target\invoker-reports\BUILD-projects_descriptor-refs_jar-with-dependencies_component-descriptors-merged.xml, C:\Users\jenkins\AppData\Local\Temp\2\jenkins-maven-box-maven-assembly-plugin-MASSEMBLY-897-1\windows-jdk7-m3.2.x_build\target\invoker-reports\BUILD-projects_descriptor-refs_jar-with-dependencies_deps-unpacked-to-root-dir.xml, C:\Users\jenkins\AppData\Local\Temp\2\jenkins-maven-box-maven-assembly-plugin-MASSEMBLY-897-1\windows-jdk7-m3.2.x_build\target\invoker-reports\BUILD-projects_descriptor-refs_jar-with-dependencies_no-target-dir.xml, C:\Users\jenkins\AppData\Local\Temp\2\jenkins-maven-box-maven-assembly-plugin-MASSEMBLY-897-1\windows-jdk7-m3.2.x_build\target\invoker-reports\BUILD-projects_descriptor-refs_project_multimodule-sources-copied.xml, C:\Users\jenkins\AppData\Local\Temp\2\jenkins-maven-box-maven-assembly-plugin-MASSEMBLY-897-1\windows-jdk7-m3.2.x_build\target\invoker-reports\BUILD-projects_descriptor-refs_project_no-target-dir-multimodule.xml, C:\Users\jenkins\AppData\Local\Temp\2\jenkins-maven-box-maven-assembly-plugin-MASSEMBLY-897-1\windows-jdk7-m3.2.x_build\target\invoker-reports\BUILD-projects_descriptor-refs_project_no-target-dir.xml, C:\Users\jenkins\AppData\Local\Temp\2\jenkins-maven-box-maven-assembly-plugin-MASSEMBLY-897-1\windows-jdk7-m3.2.x_build\target\invoker-reports\BUILD-projects_descriptor-refs_project_sources-copied.xml, C:\Users\jenkins\AppData\Local\Temp\2\jenkins-maven-box-maven-assembly-plugin-MASSEMBLY-897-1\windows-jdk7-m3.2.x_build\target\invoker-reports\BUILD-projects_descriptor-refs_src_no-target-dir.xml, C:\Users\jenkins\AppData\Local\Temp\2\jenkins-maven-box-maven-assembly-plugin-MASSEMBLY-897-1\windows-jdk7-m3.2.x_build\target\invoker-reports\BUILD-projects_descriptor-refs_src_src-dir-copied.xml, C:\Users\jenkins\AppData\Local\Temp\2\jenkins-maven-box-maven-assembly-plugin-MASSEMBLY-897-1\windows-jdk7-m3.2.x_build\target\invoker-reports\BUILD-projects_file-modes_file-set-fileMode.xml, C:\Users\jenkins\AppData\Local\Temp\2\jenkins-maven-box-maven-assembly-plugin-MASSEMBLY-897-1\windows-jdk7-m3.2.x_build\target\invoker-reports\BUILD-projects_file-modes_fileItem-fileMode.xml, C:\Users\jenkins\AppData\Local\Temp\2\jenkins-maven-box-maven-assembly-plugin-MASSEMBLY-897-1\windows-jdk7-m3.2.x_build\target\invoker-reports\BUILD-projects_file-sets_default-directory-unspecified.xml, C:\Users\jenkins\AppData\Local\Temp\2\jenkins-maven-box-maven-assembly-plugin-MASSEMBLY-897-1\windows-jdk7-m3.2.x_build\target\invoker-reports\BUILD-projects_file-sets_default-excludes-unspecified.xml, C:\Users\jenkins\AppData\Local\Temp\2\jenkins-maven-box-maven-assembly-plugin-MASSEMBLY-897-1\windows-jdk7-m3.2.x_build\target\invoker-reports\BUILD-projects_file-sets_dont-use-default-excludes.xml, C:\Users\jenkins\AppData\Local\Temp\2\jenkins-maven-box-maven-assembly-plugin-MASSEMBLY-897-1\windows-jdk7-m3.2.x_build\target\invoker-reports\BUILD-projects_file-sets_excludes-using-regex.xml, C:\Users\jenkins\AppData\Local\Temp\2\jenkins-maven-box-maven-assembly-plugin-MASSEMBLY-897-1\windows-jdk7-m3.2.x_build\target\invoker-reports\BUILD-projects_file-sets_excluding-svn-dirs.xml, C:\Users\jenkins\AppData\Local\Temp\2\jenkins-maven-box-maven-assembly-plugin-MASSEMBLY-897-1\windows-jdk7-m3.2.x_build\target\invoker-reports\BUILD-projects_file-sets_filtered-module-sources.xml, C:\Users\jenkins\AppData\Local\Temp\2\jenkins-maven-box-maven-assembly-plugin-MASSEMBLY-897-1\windows-jdk7-m3.2.x_build\target\invoker-reports\BUILD-projects_file-sets_filtered-multimodule.xml, C:\Users\jenkins\AppData\Local\Temp\2\jenkins-maven-box-maven-assembly-plugin-MASSEMBLY-897-1\windows-jdk7-m3.2.x_build\target\invoker-reports\BUILD-projects_file-sets_include-base-directory.xml, C:\Users\jenkins\AppData\Local\Temp\2\jenkins-maven-box-maven-assembly-plugin-MASSEMBLY-897-1\windows-jdk7-m3.2.x_build\target\invoker-reports\BUILD-projects_file-sets_include-parent-dir.xml, C:\Users\jenkins\AppData\Local\Temp\2\jenkins-maven-box-maven-assembly-plugin-MASSEMBLY-897-1\windows-jdk7-m3.2.x_build\target\invoker-reports\BUILD-projects_file-sets_massembly-665.xml, C:\Users\jenkins\AppData\Local\Temp\2\jenkins-maven-box-maven-assembly-plugin-MASSEMBLY-897-1\windows-jdk7-m3.2.x_build\target\invoker-reports\BUILD-projects_file-sets_multimodule-unix-lineEndings.xml, C:\Users\jenkins\AppData\Local\Temp\2\jenkins-maven-box-maven-assembly-plugin-MASSEMBLY-897-1\windows-jdk7-m3.2.x_build\target\invoker-reports\BUILD-projects_file-sets_multimodule-win-lineEndings.xml, C:\Users\jenkins\AppData\Local\Temp\2\jenkins-maven-box-maven-assembly-plugin-MASSEMBLY-897-1\windows-jdk7-m3.2.x_build\target\invoker-reports\BUILD-projects_file-sets_platformspecific-filesets.xml, C:\Users\jenkins\AppData\Local\Temp\2\jenkins-maven-box-maven-assembly-plugin-MASSEMBLY-897-1\windows-jdk7-m3.2.x_build\target\invoker-reports\BUILD-projects_file-sets_precedence-check.xml, C:\Users\jenkins\AppData\Local\Temp\2\jenkins-maven-box-maven-assembly-plugin-MASSEMBLY-897-1\windows-jdk7-m3.2.x_build\target\invoker-reports\BUILD-projects_file-sets_use-default-excludes.xml, C:\Users\jenkins\AppData\Local\Temp\2\jenkins-maven-box-maven-assembly-plugin-MASSEMBLY-897-1\windows-jdk7-m3.2.x_build\target\invoker-reports\BUILD-projects_files_filtered-sysprop.xml, C:\Users\jenkins\AppData\Local\Temp\2\jenkins-maven-box-maven-assembly-plugin-MASSEMBLY-897-1\windows-jdk7-m3.2.x_build\target\invoker-reports\BUILD-projects_files_multimodule-relativePath.xml, C:\Users\jenkins\AppData\Local\Temp\2\jenkins-maven-box-maven-assembly-plugin-MASSEMBLY-897-1\windows-jdk7-m3.2.x_build\target\invoker-reports\BUILD-projects_files_zipentrysize.xml, C:\Users\jenkins\AppData\Local\Temp\2\jenkins-maven-box-maven-assembly-plugin-MASSEMBLY-897-1\windows-jdk7-m3.2.x_build\target\invoker-reports\BUILD-projects_filtering-feature_fileset-to-tar-massembly-722.xml, C:\Users\jenkins\AppData\Local\Temp\2\jenkins-maven-box-maven-assembly-plugin-MASSEMBLY-897-1\windows-jdk7-m3.2.x_build\target\invoker-reports\BUILD-projects_filtering-feature_filter-comp-descriptor-path.xml, C:\Users\jenkins\AppData\Local\Temp\2\jenkins-maven-box-maven-assembly-plugin-MASSEMBLY-897-1\windows-jdk7-m3.2.x_build\target\invoker-reports\BUILD-projects_filtering-feature_filters-defined-in-build.xml, C:\Users\jenkins\AppData\Local\Temp\2\jenkins-maven-box-maven-assembly-plugin-MASSEMBLY-897-1\windows-jdk7-m3.2.x_build\target\invoker-reports\BUILD-projects_filtering-feature_filtersDefinedInAssemblyPluginConfig.xml, C:\Users\jenkins\AppData\Local\Temp\2\jenkins-maven-box-maven-assembly-plugin-MASSEMBLY-897-1\windows-jdk7-m3.2.x_build\target\invoker-reports\BUILD-projects_filtering-feature_massembly-736.xml, C:\Users\jenkins\AppData\Local\Temp\2\jenkins-maven-box-maven-assembly-plugin-MASSEMBLY-897-1\windows-jdk7-m3.2.x_build\target\invoker-reports\BUILD-projects_forking-tests_assembly-assembly-with-module-binaries.xml, C:\Users\jenkins\AppData\Local\Temp\2\jenkins-maven-box-maven-assembly-plugin-MASSEMBLY-897-1\windows-jdk7-m3.2.x_build\target\invoker-reports\BUILD-projects_forking-tests_assembly-attached-with-module-binaries.xml, C:\Users\jenkins\AppData\Local\Temp\2\jenkins-maven-box-maven-assembly-plugin-MASSEMBLY-897-1\windows-jdk7-m3.2.x_build\target\invoker-reports\BUILD-projects_mojo-configuration_archiver-ignorePermissions.xml, C:\Users\jenkins\AppData\Local\Temp\2\jenkins-maven-box-maven-assembly-plugin-MASSEMBLY-897-1\windows-jdk7-m3.2.x_build\target\invoker-reports\BUILD-projects_mojo-configuration_ignoreDirFormatExtensions.xml, C:\Users\jenkins\AppData\Local\Temp\2\jenkins-maven-box-maven-assembly-plugin-MASSEMBLY-897-1\windows-jdk7-m3.2.x_build\target\invoker-reports\BUILD-projects_mojo-configuration_manifest-with-customEntry.xml, C:\Users\jenkins\AppData\Local\Temp\2\jenkins-maven-box-maven-assembly-plugin-MASSEMBLY-897-1\windows-jdk7-m3.2.x_build\target\invoker-reports\BUILD-projects_mojo-configuration_manifest-with-mainClass.xml, C:\Users\jenkins\AppData\Local\Temp\2\jenkins-maven-box-maven-assembly-plugin-MASSEMBLY-897-1\windows-jdk7-m3.2.x_build\target\invoker-reports\BUILD-projects_mojo-configuration_massembly-291.xml, C:\Users\jenkins\AppData\Local\Temp\2\jenkins-maven-box-maven-assembly-plugin-MASSEMBLY-897-1\windows-jdk7-m3.2.x_build\target\invoker-reports\BUILD-projects_mojo-configuration_massembly-301.xml, C:\Users\jenkins\AppData\Local\Temp\2\jenkins-maven-box-maven-assembly-plugin-MASSEMBLY-897-1\windows-jdk7-m3.2.x_build\target\invoker-reports\BUILD-projects_mojo-configuration_no-appendAssemblyId-no-classifier.xml, C:\Users\jenkins\AppData\Local\Temp\2\jenkins-maven-box-maven-assembly-plugin-MASSEMBLY-897-1\windows-jdk7-m3.2.x_build\target\invoker-reports\BUILD-projects_mojo-configuration_skipAssemblyCLIPropertySet.xml, C:\Users\jenkins\AppData\Local\Temp\2\jenkins-maven-box-maven-assembly-plugin-MASSEMBLY-897-1\windows-jdk7-m3.2.x_build\target\invoker-reports\BUILD-projects_mojo-tests_single-in-one-project-hierarchy.xml, C:\Users\jenkins\AppData\Local\Temp\2\jenkins-maven-box-maven-assembly-plugin-MASSEMBLY-897-1\windows-jdk7-m3.2.x_build\target\invoker-reports\BUILD-projects_mojo-tests_single-twice-in-multimodule-hierarchy.xml, C:\Users\jenkins\AppData\Local\Temp\2\jenkins-maven-box-maven-assembly-plugin-MASSEMBLY-897-1\windows-jdk7-m3.2.x_build\target\invoker-reports\BUILD-projects_mojo-tests_single-twice-in-one-project-hierarchy.xml, C:\Users\jenkins\AppData\Local\Temp\2\jenkins-maven-box-maven-assembly-plugin-MASSEMBLY-897-1\windows-jdk7-m3.2.x_build\target\invoker-reports\BUILD-projects_multimodule_massembly-298.xml, C:\Users\jenkins\AppData\Local\Temp\2\jenkins-maven-box-maven-assembly-plugin-MASSEMBLY-897-1\windows-jdk7-m3.2.x_build\target\invoker-reports\BUILD-projects_multimodule_massembly-317.xml, C:\Users\jenkins\AppData\Local\Temp\2\jenkins-maven-box-maven-assembly-plugin-MASSEMBLY-897-1\windows-jdk7-m3.2.x_build\target\invoker-reports\BUILD-projects_multimodule_massembly-474.xml, C:\Users\jenkins\AppData\Local\Temp\2\jenkins-maven-box-maven-assembly-plugin-MASSEMBLY-897-1\windows-jdk7-m3.2.x_build\target\invoker-reports\BUILD-projects_multimodule_massembly-619.xml, C:\Users\jenkins\AppData\Local\Temp\2\jenkins-maven-box-maven-assembly-plugin-MASSEMBLY-897-1\windows-jdk7-m3.2.x_build\target\invoker-reports\BUILD-projects_multimodule_multimodule-binariesNotSource.xml, C:\Users\jenkins\AppData\Local\Temp\2\jenkins-maven-box-maven-assembly-plugin-MASSEMBLY-897-1\windows-jdk7-m3.2.x_build\target\invoker-reports\BUILD-projects_multimodule_multimodule-filteredFileSet.xml, C:\Users\jenkins\AppData\Local\Temp\2\jenkins-maven-box-maven-assembly-plugin-MASSEMBLY-897-1\windows-jdk7-m3.2.x_build\target\invoker-reports\BUILD-projects_multimodule_multimodule-modulePomPropInterp.xml, C:\Users\jenkins\AppData\Local\Temp\2\jenkins-maven-box-maven-assembly-plugin-MASSEMBLY-897-1\windows-jdk7-m3.2.x_build\target\invoker-reports\BUILD-projects_multimodule_multimodule-siblingParent_parent.xml, C:\Users\jenkins\AppData\Local\Temp\2\jenkins-maven-box-maven-assembly-plugin-MASSEMBLY-897-1\windows-jdk7-m3.2.x_build\target\invoker-reports\BUILD-projects_multimodule_multimodule-sourceNotBinaries.xml, C:\Users\jenkins\AppData\Local\Temp\2\jenkins-maven-box-maven-assembly-plugin-MASSEMBLY-897-1\windows-jdk7-m3.2.x_build\target\invoker-reports\BUILD-projects_multimodule_multimodule-wholeReactorFromChild.xml, C:\Users\jenkins\AppData\Local\Temp\2\jenkins-maven-box-maven-assembly-plugin-MASSEMBLY-897-1\windows-jdk7-m3.2.x_build\target\invoker-reports\BUILD-projects_multimodule_two-level-multimodule.xml, C:\Users\jenkins\AppData\Local\Temp\2\jenkins-maven-box-maven-assembly-plugin-MASSEMBLY-897-1\windows-jdk7-m3.2.x_build\target\invoker-reports\BUILD-projects_multimodule_two-levels-includeBaseDir-withBin.xml, C:\Users\jenkins\AppData\Local\Temp\2\jenkins-maven-box-maven-assembly-plugin-MASSEMBLY-897-1\windows-jdk7-m3.2.x_build\target\invoker-reports\BUILD-projects_multimodule_two-levels-includeBaseDir-withSrc.xml, C:\Users\jenkins\AppData\Local\Temp\2\jenkins-maven-box-maven-assembly-plugin-MASSEMBLY-897-1\windows-jdk7-m3.2.x_build\target\invoker-reports\BUILD-projects_repositories_basic-repository.xml, C:\Users\jenkins\AppData\Local\Temp\2\jenkins-maven-box-maven-assembly-plugin-MASSEMBLY-897-1\windows-jdk7-m3.2.x_build\target\invoker-reports\BUILD-projects_repositories_massembly-196.xml, C:\Users\jenkins\AppData\Local\Temp\2\jenkins-maven-box-maven-assembly-plugin-MASSEMBLY-897-1\windows-jdk7-m3.2.x_build\target\invoker-reports\BUILD-projects_repositories_massembly-855.xml]
[windows-jdk7-m3.2.x_build] Found logs:[C:\Users\jenkins\AppData\Local\Temp\2\jenkins-maven-box-maven-assembly-plugin-MASSEMBLY-897-1\windows-jdk7-m3.2.x_build\target\it\it-project-parent\build.log, C:\Users\jenkins\AppData\Local\Temp\2\jenkins-maven-box-maven-assembly-plugin-MASSEMBLY-897-1\windows-jdk7-m3.2.x_build\target\it\projects\basic-features\ExecutionRoot\build.log, C:\Users\jenkins\AppData\Local\Temp\2\jenkins-maven-box-maven-assembly-plugin-MASSEMBLY-897-1\windows-jdk7-m3.2.x_build\target\it\projects\basic-features\add-classpath\build.log, C:\Users\jenkins\AppData\Local\Temp\2\jenkins-maven-box-maven-assembly-plugin-MASSEMBLY-897-1\windows-jdk7-m3.2.x_build\target\it\projects\basic-features\classpath-descriptor\build.log, C:\Users\jenkins\AppData\Local\Temp\2\jenkins-maven-box-maven-assembly-plugin-MASSEMBLY-897-1\windows-jdk7-m3.2.x_build\target\it\projects\basic-features\descriptorDirectoryScan\build.log, C:\Users\jenkins\AppData\Local\Temp\2\jenkins-maven-box-maven-assembly-plugin-MASSEMBLY-897-1\windows-jdk7-m3.2.x_build\target\it\projects\basic-features\file-copyIntoTopDir\build.log, C:\Users\jenkins\AppData\Local\Temp\2\jenkins-maven-box-maven-assembly-plugin-MASSEMBLY-897-1\windows-jdk7-m3.2.x_build\target\it\projects\basic-features\file-sameName\build.log, C:\Users\jenkins\AppData\Local\Temp\2\jenkins-maven-box-maven-assembly-plugin-MASSEMBLY-897-1\windows-jdk7-m3.2.x_build\target\it\projects\basic-features\formats-in-pom-win\build.log, C:\Users\jenkins\AppData\Local\Temp\2\jenkins-maven-box-maven-assembly-plugin-MASSEMBLY-897-1\windows-jdk7-m3.2.x_build\target\it\projects\basic-features\formats\build.log, C:\Users\jenkins\AppData\Local\Temp\2\jenkins-maven-box-maven-assembly-plugin-MASSEMBLY-897-1\windows-jdk7-m3.2.x_build\target\it\projects\basic-features\local-repo-interp\build.log, C:\Users\jenkins\AppData\Local\Temp\2\jenkins-maven-box-maven-assembly-plugin-MASSEMBLY-897-1\windows-jdk7-m3.2.x_build\target\it\projects\basic-features\massembly-256-pomPropertiesInterp\build.log, C:\Users\jenkins\AppData\Local\Temp\2\jenkins-maven-box-maven-assembly-plugin-MASSEMBLY-897-1\windows-jdk7-m3.2.x_build\target\it\projects\basic-features\massembly-351-projectPrefixInterp\build.log, C:\Users\jenkins\AppData\Local\Temp\2\jenkins-maven-box-maven-assembly-plugin-MASSEMBLY-897-1\windows-jdk7-m3.2.x_build\target\it\projects\basic-features\outputFileNameMapping-simple\build.log, C:\Users\jenkins\AppData\Local\Temp\2\jenkins-maven-box-maven-assembly-plugin-MASSEMBLY-897-1\windows-jdk7-m3.2.x_build\target\it\projects\basic-features\outputFileNameMapping-withArtifactBaseVersion\build.log, C:\Users\jenkins\AppData\Local\Temp\2\jenkins-maven-box-maven-assembly-plugin-MASSEMBLY-897-1\windows-jdk7-m3.2.x_build\target\it\projects\basic-features\relative-project-paths\build.log, C:\Users\jenkins\AppData\Local\Temp\2\jenkins-maven-box-maven-assembly-plugin-MASSEMBLY-897-1\windows-jdk7-m3.2.x_build\target\it\projects\bugs\massembly-190\build.log, C:\Users\jenkins\AppData\Local\Temp\2\jenkins-maven-box-maven-assembly-plugin-MASSEMBLY-897-1\windows-jdk7-m3.2.x_build\target\it\projects\bugs\massembly-285\build.log, C:\Users\jenkins\AppData\Local\Temp\2\jenkins-maven-box-maven-assembly-plugin-MASSEMBLY-897-1\windows-jdk7-m3.2.x_build\target\it\projects\bugs\massembly-306\build.log, C:\Users\jenkins\AppData\Local\Temp\2\jenkins-maven-box-maven-assembly-plugin-MASSEMBLY-897-1\windows-jdk7-m3.2.x_build\target\it\projects\bugs\massembly-324\build.log, C:\Users\jenkins\AppData\Local\Temp\2\jenkins-maven-box-maven-assembly-plugin-MASSEMBLY-897-1\windows-jdk7-m3.2.x_build\target\it\projects\bugs\massembly-375\build.log, C:\Users\jenkins\AppData\Local\Temp\2\jenkins-maven-box-maven-assembly-plugin-MASSEMBLY-897-1\windows-jdk7-m3.2.x_build\target\it\projects\bugs\massembly-559\build.log, C:\Users\jenkins\AppData\Local\Temp\2\jenkins-maven-box-maven-assembly-plugin-MASSEMBLY-897-1\windows-jdk7-m3.2.x_build\target\it\projects\bugs\massembly-580\build.log, C:\Users\jenkins\AppData\Local\Temp\2\jenkins-maven-box-maven-assembly-plugin-MASSEMBLY-897-1\windows-jdk7-m3.2.x_build\target\it\projects\bugs\massembly-583\build.log, C:\Users\jenkins\AppData\Local\Temp\2\jenkins-maven-box-maven-assembly-plugin-MASSEMBLY-897-1\windows-jdk7-m3.2.x_build\target\it\projects\bugs\massembly-730\build.log, C:\Users\jenkins\AppData\Local\Temp\2\jenkins-maven-box-maven-assembly-plugin-MASSEMBLY-897-1\windows-jdk7-m3.2.x_build\target\it\projects\bugs\massembly-732\build.log, C:\Users\jenkins\AppData\Local\Temp\2\jenkins-maven-box-maven-assembly-plugin-MASSEMBLY-897-1\windows-jdk7-m3.2.x_build\target\it\projects\bugs\massembly-733\build.log, C:\Users\jenkins\AppData\Local\Temp\2\jenkins-maven-box-maven-assembly-plugin-MASSEMBLY-897-1\windows-jdk7-m3.2.x_build\target\it\projects\bugs\massembly-737\build.log, C:\Users\jenkins\AppData\Local\Temp\2\jenkins-maven-box-maven-assembly-plugin-MASSEMBLY-897-1\windows-jdk7-m3.2.x_build\target\it\projects\bugs\massembly-739\build.log, C:\Users\jenkins\AppData\Local\Temp\2\jenkins-maven-box-maven-assembly-plugin-MASSEMBLY-897-1\windows-jdk7-m3.2.x_build\target\it\projects\bugs\massembly-743\build.log, C:\Users\jenkins\AppData\Local\Temp\2\jenkins-maven-box-maven-assembly-plugin-MASSEMBLY-897-1\windows-jdk7-m3.2.x_build\target\it\projects\components\component-dependencySet\build.log, C:\Users\jenkins\AppData\Local\Temp\2\jenkins-maven-box-maven-assembly-plugin-MASSEMBLY-897-1\windows-jdk7-m3.2.x_build\target\it\projects\components\component-moduleSet\build.log, C:\Users\jenkins\AppData\Local\Temp\2\jenkins-maven-box-maven-assembly-plugin-MASSEMBLY-897-1\windows-jdk7-m3.2.x_build\target\it\projects\container-descriptors\configured-handler\build.log, C:\Users\jenkins\AppData\Local\Temp\2\jenkins-maven-box-maven-assembly-plugin-MASSEMBLY-897-1\windows-jdk7-m3.2.x_build\target\it\projects\container-descriptors\custom-containerDescriptorHandler\build.log, C:\Users\jenkins\AppData\Local\Temp\2\jenkins-maven-box-maven-assembly-plugin-MASSEMBLY-897-1\windows-jdk7-m3.2.x_build\target\it\projects\container-descriptors\custom-handler-withFileEntries\build.log, C:\Users\jenkins\AppData\Local\Temp\2\jenkins-maven-box-maven-assembly-plugin-MASSEMBLY-897-1\windows-jdk7-m3.2.x_build\target\it\projects\container-descriptors\custom-handler-withMixedEntries\build.log, C:\Users\jenkins\AppData\Local\Temp\2\jenkins-maven-box-maven-assembly-plugin-MASSEMBLY-897-1\windows-jdk7-m3.2.x_build\target\it\projects\container-descriptors\metaInf-services-aggregation\build.log, C:\Users\jenkins\AppData\Local\Temp\2\jenkins-maven-box-maven-assembly-plugin-MASSEMBLY-897-1\windows-jdk7-m3.2.x_build\target\it\projects\container-descriptors\metaInf-spring-aggregation\build.log, C:\Users\jenkins\AppData\Local\Temp\2\jenkins-maven-box-maven-assembly-plugin-MASSEMBLY-897-1\windows-jdk7-m3.2.x_build\target\it\projects\dependency-sets\dep-transfilter-wildcard-massembly544\build.log, C:\Users\jenkins\AppData\Local\Temp\2\jenkins-maven-box-maven-assembly-plugin-MASSEMBLY-897-1\windows-jdk7-m3.2.x_build\target\it\projects\dependency-sets\dep-with-transitive-filter\build.log, C:\Users\jenkins\AppData\Local\Temp\2\jenkins-maven-box-maven-assembly-plugin-MASSEMBLY-897-1\windows-jdk7-m3.2.x_build\target\it\projects\dependency-sets\depMgmt-override\build.log, C:\Users\jenkins\AppData\Local\Temp\2\jenkins-maven-box-maven-assembly-plugin-MASSEMBLY-897-1\windows-jdk7-m3.2.x_build\target\it\projects\dependency-sets\depSet-artifactPomPropInterp\build.log, C:\Users\jenkins\AppData\Local\Temp\2\jenkins-maven-box-maven-assembly-plugin-MASSEMBLY-897-1\windows-jdk7-m3.2.x_build\target\it\projects\dependency-sets\depSet-byDepVersion\build.log, C:\Users\jenkins\AppData\Local\Temp\2\jenkins-maven-box-maven-assembly-plugin-MASSEMBLY-897-1\windows-jdk7-m3.2.x_build\target\it\projects\dependency-sets\depSet-enum-vs-wildcard\build.log, C:\Users\jenkins\AppData\Local\Temp\2\jenkins-maven-box-maven-assembly-plugin-MASSEMBLY-897-1\windows-jdk7-m3.2.x_build\target\it\projects\dependency-sets\depSet-runtimeScope\build.log, C:\Users\jenkins\AppData\Local\Temp\2\jenkins-maven-box-maven-assembly-plugin-MASSEMBLY-897-1\windows-jdk7-m3.2.x_build\target\it\projects\dependency-sets\depSet-unpacked-rdonly\build.log, C:\Users\jenkins\AppData\Local\Temp\2\jenkins-maven-box-maven-assembly-plugin-MASSEMBLY-897-1\windows-jdk7-m3.2.x_build\target\it\projects\dependency-sets\dependencySet-matchScope\build.log, C:\Users\jenkins\AppData\Local\Temp\2\jenkins-maven-box-maven-assembly-plugin-MASSEMBLY-897-1\windows-jdk7-m3.2.x_build\target\it\projects\dependency-sets\dependencySet-nonTransitive\build.log, C:\Users\jenkins\AppData\Local\Temp\2\jenkins-maven-box-maven-assembly-plugin-MASSEMBLY-897-1\windows-jdk7-m3.2.x_build\target\it\projects\dependency-sets\dependencySet-notUnpacked\build.log, C:\Users\jenkins\AppData\Local\Temp\2\jenkins-maven-box-maven-assembly-plugin-MASSEMBLY-897-1\windows-jdk7-m3.2.x_build\target\it\projects\dependency-sets\dependencySet-projectArtifactNotIncluded\build.log, C:\Users\jenkins\AppData\Local\Temp\2\jenkins-maven-box-maven-assembly-plugin-MASSEMBLY-897-1\windows-jdk7-m3.2.x_build\target\it\projects\dependency-sets\dependencySet-unpacked-filtered\build.log, C:\Users\jenkins\AppData\Local\Temp\2\jenkins-maven-box-maven-assembly-plugin-MASSEMBLY-897-1\windows-jdk7-m3.2.x_build\target\it\projects\dependency-sets\dependencySet-unpackedExcludingMetaInf\build.log, C:\Users\jenkins\AppData\Local\Temp\2\jenkins-maven-box-maven-assembly-plugin-MASSEMBLY-897-1\windows-jdk7-m3.2.x_build\target\it\projects\dependency-sets\dependencySet-unpackedSubsetsTwice\build.log, C:\Users\jenkins\AppData\Local\Temp\2\jenkins-maven-box-maven-assembly-plugin-MASSEMBLY-897-1\windows-jdk7-m3.2.x_build\target\it\projects\dependency-sets\dependencySet-unpacked\build.log, C:\Users\jenkins\AppData\Local\Temp\2\jenkins-maven-box-maven-assembly-plugin-MASSEMBLY-897-1\windows-jdk7-m3.2.x_build\target\it\projects\dependency-sets\dependencySet-withExecutedProject\build.log, C:\Users\jenkins\AppData\Local\Temp\2\jenkins-maven-box-maven-assembly-plugin-MASSEMBLY-897-1\windows-jdk7-m3.2.x_build\target\it\projects\dependency-sets\include-project-artifact\build.log, C:\Users\jenkins\AppData\Local\Temp\2\jenkins-maven-box-maven-assembly-plugin-MASSEMBLY-897-1\windows-jdk7-m3.2.x_build\target\it\projects\dependency-sets\include-project-attachments\build.log, C:\Users\jenkins\AppData\Local\Temp\2\jenkins-maven-box-maven-assembly-plugin-MASSEMBLY-897-1\windows-jdk7-m3.2.x_build\target\it\projects\dependency-sets\include-provided\build.log, C:\Users\jenkins\AppData\Local\Temp\2\jenkins-maven-box-maven-assembly-plugin-MASSEMBLY-897-1\windows-jdk7-m3.2.x_build\target\it\projects\dependency-sets\including-pom-dependency\build.log, C:\Users\jenkins\AppData\Local\Temp\2\jenkins-maven-box-maven-assembly-plugin-MASSEMBLY-897-1\windows-jdk7-m3.2.x_build\target\it\projects\dependency-sets\including-sar-dependency\build.log, C:\Users\jenkins\AppData\Local\Temp\2\jenkins-maven-box-maven-assembly-plugin-MASSEMBLY-897-1\windows-jdk7-m3.2.x_build\target\it\projects\dependency-sets\massembly-201\build.log, C:\Users\jenkins\AppData\Local\Temp\2\jenkins-maven-box-maven-assembly-plugin-MASSEMBLY-897-1\windows-jdk7-m3.2.x_build\target\it\projects\dependency-sets\massembly-232\build.log, C:\Users\jenkins\AppData\Local\Temp\2\jenkins-maven-box-maven-assembly-plugin-MASSEMBLY-897-1\windows-jdk7-m3.2.x_build\target\it\projects\dependency-sets\massembly-235\build.log, C:\Users\jenkins\AppData\Local\Temp\2\jenkins-maven-box-maven-assembly-plugin-MASSEMBLY-897-1\windows-jdk7-m3.2.x_build\target\it\projects\dependency-sets\massembly-345\build.log, C:\Users\jenkins\AppData\Local\Temp\2\jenkins-maven-box-maven-assembly-plugin-MASSEMBLY-897-1\windows-jdk7-m3.2.x_build\target\it\projects\dependency-sets\massembly-395\build.log, C:\Users\jenkins\AppData\Local\Temp\2\jenkins-maven-box-maven-assembly-plugin-MASSEMBLY-897-1\windows-jdk7-m3.2.x_build\target\it\projects\dependency-sets\massembly-619\build.log, C:\Users\jenkins\AppData\Local\Temp\2\jenkins-maven-box-maven-assembly-plugin-MASSEMBLY-897-1\windows-jdk7-m3.2.x_build\target\it\projects\dependency-sets\massembly-675\build.log, C:\Users\jenkins\AppData\Local\Temp\2\jenkins-maven-box-maven-assembly-plugin-MASSEMBLY-897-1\windows-jdk7-m3.2.x_build\target\it\projects\dependency-sets\massembly-99\build.log, C:\Users\jenkins\AppData\Local\Temp\2\jenkins-maven-box-maven-assembly-plugin-MASSEMBLY-897-1\windows-jdk7-m3.2.x_build\target\it\projects\dependency-sets\mid-artifactId-wildcard-massembly570\build.log, C:\Users\jenkins\AppData\Local\Temp\2\jenkins-maven-box-maven-assembly-plugin-MASSEMBLY-897-1\windows-jdk7-m3.2.x_build\target\it\projects\dependency-sets\multiple-wildcard-includes\build.log, C:\Users\jenkins\AppData\Local\Temp\2\jenkins-maven-box-maven-assembly-plugin-MASSEMBLY-897-1\windows-jdk7-m3.2.x_build\target\it\projects\dependency-sets\outputFileNameMappingWithUnpack\build.log, C:\Users\jenkins\AppData\Local\Temp\2\jenkins-maven-box-maven-assembly-plugin-MASSEMBLY-897-1\windows-jdk7-m3.2.x_build\target\it\projects\dependency-sets\unpack-deps-correct-dir\build.log, C:\Users\jenkins\AppData\Local\Temp\2\jenkins-maven-box-maven-assembly-plugin-MASSEMBLY-897-1\windows-jdk7-m3.2.x_build\target\it\projects\dependency-sets\using-moduleSet-implied-depSet\build.log, C:\Users\jenkins\AppData\Local\Temp\2\jenkins-maven-box-maven-assembly-plugin-MASSEMBLY-897-1\windows-jdk7-m3.2.x_build\target\it\projects\descriptor-refs\bin\jars-in-archive-root\build.log, C:\Users\jenkins\AppData\Local\Temp\2\jenkins-maven-box-maven-assembly-plugin-MASSEMBLY-897-1\windows-jdk7-m3.2.x_build\target\it\projects\descriptor-refs\jar-with-dependencies\component-descriptors-merged\build.log, C:\Users\jenkins\AppData\Local\Temp\2\jenkins-maven-box-maven-assembly-plugin-MASSEMBLY-897-1\windows-jdk7-m3.2.x_build\target\it\projects\descriptor-refs\jar-with-dependencies\deps-unpacked-to-root-dir\build.log, C:\Users\jenkins\AppData\Local\Temp\2\jenkins-maven-box-maven-assembly-plugin-MASSEMBLY-897-1\windows-jdk7-m3.2.x_build\target\it\projects\descriptor-refs\jar-with-dependencies\no-target-dir\build.log, C:\Users\jenkins\AppData\Local\Temp\2\jenkins-maven-box-maven-assembly-plugin-MASSEMBLY-897-1\windows-jdk7-m3.2.x_build\target\it\projects\descriptor-refs\project\multimodule-sources-copied\build.log, C:\Users\jenkins\AppData\Local\Temp\2\jenkins-maven-box-maven-assembly-plugin-MASSEMBLY-897-1\windows-jdk7-m3.2.x_build\target\it\projects\descriptor-refs\project\no-target-dir-multimodule\build.log, C:\Users\jenkins\AppData\Local\Temp\2\jenkins-maven-box-maven-assembly-plugin-MASSEMBLY-897-1\windows-jdk7-m3.2.x_build\target\it\projects\descriptor-refs\project\no-target-dir\build.log, C:\Users\jenkins\AppData\Local\Temp\2\jenkins-maven-box-maven-assembly-plugin-MASSEMBLY-897-1\windows-jdk7-m3.2.x_build\target\it\projects\descriptor-refs\project\sources-copied\build.log, C:\Users\jenkins\AppData\Local\Temp\2\jenkins-maven-box-maven-assembly-plugin-MASSEMBLY-897-1\windows-jdk7-m3.2.x_build\target\it\projects\descriptor-refs\src\no-target-dir\build.log, C:\Users\jenkins\AppData\Local\Temp\2\jenkins-maven-box-maven-assembly-plugin-MASSEMBLY-897-1\windows-jdk7-m3.2.x_build\target\it\projects\descriptor-refs\src\src-dir-copied\build.log, C:\Users\jenkins\AppData\Local\Temp\2\jenkins-maven-box-maven-assembly-plugin-MASSEMBLY-897-1\windows-jdk7-m3.2.x_build\target\it\projects\file-modes\fileItem-fileMode\build.log, C:\Users\jenkins\AppData\Local\Temp\2\jenkins-maven-box-maven-assembly-plugin-MASSEMBLY-897-1\windows-jdk7-m3.2.x_build\target\it\projects\file-sets\default-directory-unspecified\build.log, C:\Users\jenkins\AppData\Local\Temp\2\jenkins-maven-box-maven-assembly-plugin-MASSEMBLY-897-1\windows-jdk7-m3.2.x_build\target\it\projects\file-sets\default-directory-unspecified\target\default-directory-unspecified-1.0-SNAPSHOT-src\build.log, C:\Users\jenkins\AppData\Local\Temp\2\jenkins-maven-box-maven-assembly-plugin-MASSEMBLY-897-1\windows-jdk7-m3.2.x_build\target\it\projects\file-sets\default-excludes-unspecified\build.log, C:\Users\jenkins\AppData\Local\Temp\2\jenkins-maven-box-maven-assembly-plugin-MASSEMBLY-897-1\windows-jdk7-m3.2.x_build\target\it\projects\file-sets\dont-use-default-excludes\build.log, C:\Users\jenkins\AppData\Local\Temp\2\jenkins-maven-box-maven-assembly-plugin-MASSEMBLY-897-1\windows-jdk7-m3.2.x_build\target\it\projects\file-sets\excludes-using-regex\build.log, C:\Users\jenkins\AppData\Local\Temp\2\jenkins-maven-box-maven-assembly-plugin-MASSEMBLY-897-1\windows-jdk7-m3.2.x_build\target\it\projects\file-sets\excluding-svn-dirs\build.log, C:\Users\jenkins\AppData\Local\Temp\2\jenkins-maven-box-maven-assembly-plugin-MASSEMBLY-897-1\windows-jdk7-m3.2.x_build\target\it\projects\file-sets\filtered-module-sources\build.log, C:\Users\jenkins\AppData\Local\Temp\2\jenkins-maven-box-maven-assembly-plugin-MASSEMBLY-897-1\windows-jdk7-m3.2.x_build\target\it\projects\file-sets\filtered-multimodule\build.log, C:\Users\jenkins\AppData\Local\Temp\2\jenkins-maven-box-maven-assembly-plugin-MASSEMBLY-897-1\windows-jdk7-m3.2.x_build\target\it\projects\file-sets\include-base-directory\build.log, C:\Users\jenkins\AppData\Local\Temp\2\jenkins-maven-box-maven-assembly-plugin-MASSEMBLY-897-1\windows-jdk7-m3.2.x_build\target\it\projects\file-sets\include-parent-dir\build.log, C:\Users\jenkins\AppData\Local\Temp\2\jenkins-maven-box-maven-assembly-plugin-MASSEMBLY-897-1\windows-jdk7-m3.2.x_build\target\it\projects\file-sets\include-parent-dir\child\target\child-1.0-SNAPSHOT-parent\build.log, C:\Users\jenkins\AppData\Local\Temp\2\jenkins-maven-box-maven-assembly-plugin-MASSEMBLY-897-1\windows-jdk7-m3.2.x_build\target\it\projects\file-sets\massembly-665\build.log, C:\Users\jenkins\AppData\Local\Temp\2\jenkins-maven-box-maven-assembly-plugin-MASSEMBLY-897-1\windows-jdk7-m3.2.x_build\target\it\projects\file-sets\multimodule-unix-lineEndings\build.log, C:\Users\jenkins\AppData\Local\Temp\2\jenkins-maven-box-maven-assembly-plugin-MASSEMBLY-897-1\windows-jdk7-m3.2.x_build\target\it\projects\file-sets\multimodule-win-lineEndings\build.log, C:\Users\jenkins\AppData\Local\Temp\2\jenkins-maven-box-maven-assembly-plugin-MASSEMBLY-897-1\windows-jdk7-m3.2.x_build\target\it\projects\file-sets\platformspecific-filesets\build.log, C:\Users\jenkins\AppData\Local\Temp\2\jenkins-maven-box-maven-assembly-plugin-MASSEMBLY-897-1\windows-jdk7-m3.2.x_build\target\it\projects\file-sets\precedence-check\build.log, C:\Users\jenkins\AppData\Local\Temp\2\jenkins-maven-box-maven-assembly-plugin-MASSEMBLY-897-1\windows-jdk7-m3.2.x_build\target\it\projects\file-sets\use-default-excludes\build.log, C:\Users\jenkins\AppData\Local\Temp\2\jenkins-maven-box-maven-assembly-plugin-MASSEMBLY-897-1\windows-jdk7-m3.2.x_build\target\it\projects\files\filtered-sysprop\build.log, C:\Users\jenkins\AppData\Local\Temp\2\jenkins-maven-box-maven-assembly-plugin-MASSEMBLY-897-1\windows-jdk7-m3.2.x_build\target\it\projects\files\multimodule-relativePath\build.log, C:\Users\jenkins\AppData\Local\Temp\2\jenkins-maven-box-maven-assembly-plugin-MASSEMBLY-897-1\windows-jdk7-m3.2.x_build\target\it\projects\files\zipentrysize\build.log, C:\Users\jenkins\AppData\Local\Temp\2\jenkins-maven-box-maven-assembly-plugin-MASSEMBLY-897-1\windows-jdk7-m3.2.x_build\target\it\projects\filtering-feature\fileset-to-tar-massembly-722\build.log, C:\Users\jenkins\AppData\Local\Temp\2\jenkins-maven-box-maven-assembly-plugin-MASSEMBLY-897-1\windows-jdk7-m3.2.x_build\target\it\projects\filtering-feature\filter-comp-descriptor-path\build.log, C:\Users\jenkins\AppData\Local\Temp\2\jenkins-maven-box-maven-assembly-plugin-MASSEMBLY-897-1\windows-jdk7-m3.2.x_build\target\it\projects\filtering-feature\filters-defined-in-build\build.log, C:\Users\jenkins\AppData\Local\Temp\2\jenkins-maven-box-maven-assembly-plugin-MASSEMBLY-897-1\windows-jdk7-m3.2.x_build\target\it\projects\filtering-feature\filtersDefinedInAssemblyPluginConfig\build.log, C:\Users\jenkins\AppData\Local\Temp\2\jenkins-maven-box-maven-assembly-plugin-MASSEMBLY-897-1\windows-jdk7-m3.2.x_build\target\it\projects\filtering-feature\massembly-736\build.log, C:\Users\jenkins\AppData\Local\Temp\2\jenkins-maven-box-maven-assembly-plugin-MASSEMBLY-897-1\windows-jdk7-m3.2.x_build\target\it\projects\forking-tests\assembly-assembly-with-module-binaries\build.log, C:\Users\jenkins\AppData\Local\Temp\2\jenkins-maven-box-maven-assembly-plugin-MASSEMBLY-897-1\windows-jdk7-m3.2.x_build\target\it\projects\forking-tests\assembly-attached-with-module-binaries\build.log, C:\Users\jenkins\AppData\Local\Temp\2\jenkins-maven-box-maven-assembly-plugin-MASSEMBLY-897-1\windows-jdk7-m3.2.x_build\target\it\projects\mojo-configuration\archiver-ignorePermissions\build.log, C:\Users\jenkins\AppData\Local\Temp\2\jenkins-maven-box-maven-assembly-plugin-MASSEMBLY-897-1\windows-jdk7-m3.2.x_build\target\it\projects\mojo-configuration\archiver-ignorePermissions\target\parent-1-bin\parent-1\build.log, C:\Users\jenkins\AppData\Local\Temp\2\jenkins-maven-box-maven-assembly-plugin-MASSEMBLY-897-1\windows-jdk7-m3.2.x_build\target\it\projects\mojo-configuration\ignoreDirFormatExtensions\build.log, C:\Users\jenkins\AppData\Local\Temp\2\jenkins-maven-box-maven-assembly-plugin-MASSEMBLY-897-1\windows-jdk7-m3.2.x_build\target\it\projects\mojo-configuration\ignoreDirFormatExtensions\target\ignoreDirFormatExtensions-1-src2.dir\build.log, C:\Users\jenkins\AppData\Local\Temp\2\jenkins-maven-box-maven-assembly-plugin-MASSEMBLY-897-1\windows-jdk7-m3.2.x_build\target\it\projects\mojo-configuration\ignoreDirFormatExtensions\target\ignoreDirFormatExtensions-1-src\build.log, C:\Users\jenkins\AppData\Local\Temp\2\jenkins-maven-box-maven-assembly-plugin-MASSEMBLY-897-1\windows-jdk7-m3.2.x_build\target\it\projects\mojo-configuration\manifest-with-customEntry\build.log, C:\Users\jenkins\AppData\Local\Temp\2\jenkins-maven-box-maven-assembly-plugin-MASSEMBLY-897-1\windows-jdk7-m3.2.x_build\target\it\projects\mojo-configuration\manifest-with-mainClass\build.log, C:\Users\jenkins\AppData\Local\Temp\2\jenkins-maven-box-maven-assembly-plugin-MASSEMBLY-897-1\windows-jdk7-m3.2.x_build\target\it\projects\mojo-configuration\massembly-291\build.log, C:\Users\jenkins\AppData\Local\Temp\2\jenkins-maven-box-maven-assembly-plugin-MASSEMBLY-897-1\windows-jdk7-m3.2.x_build\target\it\projects\mojo-configuration\massembly-301\build.log, C:\Users\jenkins\AppData\Local\Temp\2\jenkins-maven-box-maven-assembly-plugin-MASSEMBLY-897-1\windows-jdk7-m3.2.x_build\target\it\projects\mojo-configuration\no-appendAssemblyId-no-classifier\build.log, C:\Users\jenkins\AppData\Local\Temp\2\jenkins-maven-box-maven-assembly-plugin-MASSEMBLY-897-1\windows-jdk7-m3.2.x_build\target\it\projects\mojo-configuration\skipAssemblyCLIPropertySet\build.log, C:\Users\jenkins\AppData\Local\Temp\2\jenkins-maven-box-maven-assembly-plugin-MASSEMBLY-897-1\windows-jdk7-m3.2.x_build\target\it\projects\mojo-tests\single-in-one-project-hierarchy\build.log, C:\Users\jenkins\AppData\Local\Temp\2\jenkins-maven-box-maven-assembly-plugin-MASSEMBLY-897-1\windows-jdk7-m3.2.x_build\target\it\projects\mojo-tests\single-twice-in-multimodule-hierarchy\build.log, C:\Users\jenkins\AppData\Local\Temp\2\jenkins-maven-box-maven-assembly-plugin-MASSEMBLY-897-1\windows-jdk7-m3.2.x_build\target\it\projects\mojo-tests\single-twice-in-one-project-hierarchy\build.log, C:\Users\jenkins\AppData\Local\Temp\2\jenkins-maven-box-maven-assembly-plugin-MASSEMBLY-897-1\windows-jdk7-m3.2.x_build\target\it\projects\multimodule\massembly-298\build.log, C:\Users\jenkins\AppData\Local\Temp\2\jenkins-maven-box-maven-assembly-plugin-MASSEMBLY-897-1\windows-jdk7-m3.2.x_build\target\it\projects\multimodule\massembly-317\build.log, C:\Users\jenkins\AppData\Local\Temp\2\jenkins-maven-box-maven-assembly-plugin-MASSEMBLY-897-1\windows-jdk7-m3.2.x_build\target\it\projects\multimodule\massembly-474\build.log, C:\Users\jenkins\AppData\Local\Temp\2\jenkins-maven-box-maven-assembly-plugin-MASSEMBLY-897-1\windows-jdk7-m3.2.x_build\target\it\projects\multimodule\massembly-619\build.log, C:\Users\jenkins\AppData\Local\Temp\2\jenkins-maven-box-maven-assembly-plugin-MASSEMBLY-897-1\windows-jdk7-m3.2.x_build\target\it\projects\multimodule\multimodule-binariesNotSource\build.log, C:\Users\jenkins\AppData\Local\Temp\2\jenkins-maven-box-maven-assembly-plugin-MASSEMBLY-897-1\windows-jdk7-m3.2.x_build\target\it\projects\multimodule\multimodule-filteredFileSet\build.log, C:\Users\jenkins\AppData\Local\Temp\2\jenkins-maven-box-maven-assembly-plugin-MASSEMBLY-897-1\windows-jdk7-m3.2.x_build\target\it\projects\multimodule\multimodule-modulePomPropInterp\build.log, C:\Users\jenkins\AppData\Local\Temp\2\jenkins-maven-box-maven-assembly-plugin-MASSEMBLY-897-1\windows-jdk7-m3.2.x_build\target\it\projects\multimodule\multimodule-siblingParent\parent\build.log, C:\Users\jenkins\AppData\Local\Temp\2\jenkins-maven-box-maven-assembly-plugin-MASSEMBLY-897-1\windows-jdk7-m3.2.x_build\target\it\projects\multimodule\multimodule-sourceNotBinaries\build.log, C:\Users\jenkins\AppData\Local\Temp\2\jenkins-maven-box-maven-assembly-plugin-MASSEMBLY-897-1\windows-jdk7-m3.2.x_build\target\it\projects\multimodule\multimodule-wholeReactorFromChild\build.log, C:\Users\jenkins\AppData\Local\Temp\2\jenkins-maven-box-maven-assembly-plugin-MASSEMBLY-897-1\windows-jdk7-m3.2.x_build\target\it\projects\multimodule\two-level-multimodule\build.log, C:\Users\jenkins\AppData\Local\Temp\2\jenkins-maven-box-maven-assembly-plugin-MASSEMBLY-897-1\windows-jdk7-m3.2.x_build\target\it\projects\multimodule\two-levels-includeBaseDir-withBin\build.log, C:\Users\jenkins\AppData\Local\Temp\2\jenkins-maven-box-maven-assembly-plugin-MASSEMBLY-897-1\windows-jdk7-m3.2.x_build\target\it\projects\multimodule\two-levels-includeBaseDir-withSrc\build.log, C:\Users\jenkins\AppData\Local\Temp\2\jenkins-maven-box-maven-assembly-plugin-MASSEMBLY-897-1\windows-jdk7-m3.2.x_build\target\it\projects\repositories\basic-repository\build.log, C:\Users\jenkins\AppData\Local\Temp\2\jenkins-maven-box-maven-assembly-plugin-MASSEMBLY-897-1\windows-jdk7-m3.2.x_build\target\it\projects\repositories\massembly-196\build.log, C:\Users\jenkins\AppData\Local\Temp\2\jenkins-maven-box-maven-assembly-plugin-MASSEMBLY-897-1\windows-jdk7-m3.2.x_build\target\it\projects\repositories\massembly-855\build.log]
[windows-jdk7-m3.2.x_build] Finished parsing Maven Invoker results (found 138)
[windows-jdk7-m3.2.x_build] [withMaven] junitPublisher - Archive test results for Maven artifact org.apache.maven.plugins:maven-assembly-plugin:3.1.1-SNAPSHOT generated by maven-surefire-plugin:test (default-test): windows-jdk7-m3.2.x_build\target\surefire-reports\*.xml
[windows-jdk7-m3.2.x_build] Recording test results
[windows-jdk7-m3.2.x_build] [withMaven] openTasksPublisher - Scan Tasks for Maven artifact org.apache.maven.plugins:maven-assembly-plugin:3.1.1-SNAPSHOT in source directory windows-jdk7-m3.2.x_build\src\main\java
[windows-jdk7-m3.2.x_build] [TASKS] Scanning folder 'C:\Users\jenkins\AppData\Local\Temp\2\jenkins-maven-box-maven-assembly-plugin-MASSEMBLY-897-1' for files matching the pattern 'windows-jdk7-m3.2.x_build\src\main\java\**\*' - excludes: null
[windows-jdk7-m3.2.x_build] [TASKS] Found 71 files to scan for tasks
[windows-jdk7-m3.2.x_build] [TASKS] Found 14 open tasks.
[windows-jdk7-m3.2.x_build] Skipping warnings blame since pipelines do not have an SCM link.%n
[Pipeline] [windows-jdk7-m3.2.x_build] // withMaven
[Pipeline] [windows-jdk7-m3.2.x_build] cleanWs
[Pipeline] [windows-jdk7-m3.3.x_build] }
[Pipeline] [windows-jdk7-m3.3.x_build] // stage
[Pipeline] [windows-jdk7-m3.3.x_build] }
[Pipeline] [windows-jdk7-m3.3.x_build] // ws
[windows-jdk7-m3.2.x_build] [WS-CLEANUP] Deleting project workspace...[WS-CLEANUP] done
[Pipeline] [windows-jdk7-m3.3.x_build] }
[Pipeline] [windows-jdk7-m3.3.x_build] // node
[Pipeline] [windows-jdk7-m3.3.x_build] }
[Pipeline] [windows-jdk7-m3.2.x_build] }
[Pipeline] [windows-jdk7-m3.2.x_build] // stage
[Pipeline] [windows-jdk7-m3.2.x_build] }
[Pipeline] [windows-jdk7-m3.2.x_build] // ws
[Pipeline] [windows-jdk7-m3.2.x_build] }
[Pipeline] [windows-jdk7-m3.2.x_build] // node
[Pipeline] [windows-jdk7-m3.2.x_build] }
[Pipeline] // parallel
[Pipeline] stage
[Pipeline] { (Notifications)
[Pipeline] echo
Build result: UNSTABLE
[Pipeline] jiraIssueSelector
Reply | Threaded
Open this post in threaded view
|

Build failed in Jenkins: Maven TLP » maven-assembly-plugin » MASSEMBLY-897 #2

Apache Jenkins Server-2
See https://builds.apache.org/job/maven-box/job/maven-assembly-plugin/job/MASSEMBLY-897/2/

Changes:

* Removed exclusion for problematic node cause the node is back online.
* reduce the history archiving
* reduce the history archiving
* increase a bit archiving
* increase a bit archiving
* Activate sonarqube on first project
* Disable sonar:sonar for now
* use publisherStrategy: 'EXPLICIT' to avoid non used publishers
* [INFRA-17514] Fix file separator + add other locations for workspaces
* fix indent

All tests passed

Build log:
[...truncated 4.03 MB...]
[windows-jdk7-m3.3.x_build] [INFO] Downloaded: https://repo.maven.apache.org/maven2/org/codehaus/plexus/plexus-resources/1.1.0/plexus-resources-1.1.0.jar (23 KB at 40.4 KB/sec)
[windows-jdk7-m3.3.x_build] [INFO] Downloading: https://repo.maven.apache.org/maven2/com/google/guava/guava/19.0/guava-19.0.jar
[windows-jdk7-m3.2.x_build] [INFO] Downloaded: https://repo.maven.apache.org/maven2/com/google/guava/guava/19.0/guava-19.0.jar (2255 KB at 3253.1 KB/sec)
[windows-jdk7-m3.3.x_build] [INFO] Downloaded: https://repo.maven.apache.org/maven2/org/apache/maven/shared/maven-shared-resources/2/maven-shared-resources-2.jar (13 KB at 21.5 KB/sec)
[windows-jdk7-m3.3.x_build] [INFO] Downloading: https://repo.maven.apache.org/maven2/commons-lang/commons-lang/2.1/commons-lang-2.1.jar
[windows-jdk7-m3.3.x_build] [INFO] Downloaded: https://repo.maven.apache.org/maven2/org/apache/maven/doxia/doxia-integration-tools/1.6/doxia-integration-tools-1.6.jar (44 KB at 72.3 KB/sec)
[windows-jdk7-m3.3.x_build] [INFO] Downloaded: https://repo.maven.apache.org/maven2/commons-cli/commons-cli/1.3.1/commons-cli-1.3.1.jar (52 KB at 83.7 KB/sec)
[windows-jdk7-m3.3.x_build] [INFO] Downloaded: https://repo.maven.apache.org/maven2/commons-lang/commons-lang/2.1/commons-lang-2.1.jar (203 KB at 307.4 KB/sec)
[windows-jdk7-m3.3.x_build] [INFO] Downloaded: https://repo.maven.apache.org/maven2/com/google/guava/guava/19.0/guava-19.0.jar (2255 KB at 3385.0 KB/sec)
[windows-jdk7-m3.3.x_build] [INFO] Downloaded: https://repo.maven.apache.org/maven2/com/puppycrawl/tools/checkstyle/6.18/checkstyle-6.18.jar (1132 KB at 1670.8 KB/sec)
[windows-jdk7-m3.2.x_build] [INFO] Downloaded: https://repo.maven.apache.org/maven2/commons-cli/commons-cli/1.3.1/commons-cli-1.3.1.jar (52 KB at 28.8 KB/sec)
[windows-jdk7-m3.2.x_build] [INFO] Downloaded: https://repo.maven.apache.org/maven2/org/antlr/antlr4-runtime/4.5.3/antlr4-runtime-4.5.3.jar (296 KB at 164.3 KB/sec)
[windows-jdk7-m3.3.x_build] [INFO] There are 2 errors reported by Checkstyle 6.18 with config/maven_checks.xml ruleset.
[windows-jdk7-m3.3.x_build] [INFO] Ignored 2 errors, 0 violation remaining.
[windows-jdk7-m3.3.x_build] [INFO]
[windows-jdk7-m3.3.x_build] [INFO] --- maven-invoker-plugin:3.1.0:verify (integration-test) @ maven-assembly-plugin ---
[windows-jdk7-m3.3.x_build] [INFO] -------------------------------------------------
[windows-jdk7-m3.3.x_build] [INFO] Build Summary:
[windows-jdk7-m3.3.x_build] [INFO]   Passed: 134, Failed: 1, Errors: 0, Skipped: 3
[windows-jdk7-m3.3.x_build] [INFO] -------------------------------------------------
[windows-jdk7-m3.3.x_build] [WARNING] The following builds failed:
[windows-jdk7-m3.3.x_build] [WARNING] *  projects\files\zipentrysize\pom.xml
[windows-jdk7-m3.3.x_build] [INFO] -------------------------------------------------
[windows-jdk7-m3.3.x_build] [WARNING] Ignoring that 1 build failed.
[windows-jdk7-m3.3.x_build] [INFO] ------------------------------------------------------------------------
[windows-jdk7-m3.3.x_build] [INFO] BUILD SUCCESS
[windows-jdk7-m3.3.x_build] [INFO] ------------------------------------------------------------------------
[windows-jdk7-m3.3.x_build] [INFO] Total time: 25:20 min
[windows-jdk7-m3.3.x_build] [INFO] Finished at: 2018-12-29T18:10:50-08:00
[windows-jdk7-m3.3.x_build] [INFO] Final Memory: 56M/904M
[windows-jdk7-m3.3.x_build] [INFO] ------------------------------------------------------------------------
[windows-jdk7-m3.3.x_build] [INFO] [jenkins-event-spy] Generated C:\Users\jenkins\AppData\Local\Temp\2\jenkins-maven-box-maven-assembly-plugin-MASSEMBLY-897-2@2@tmp\withMaven5eb50eb8\maven-spy-20181229-174529-2771112068614864876706.log
[windows-jdk7-m3.3.x_build] Picked up JAVA_TOOL_OPTIONS: -Dmaven.ext.class.path="C:\Users\jenkins\AppData\Local\Temp\2\jenkins-maven-box-maven-assembly-plugin-MASSEMBLY-897-2@2@tmp\withMaven5eb50eb8\pipeline-maven-spy.jar" -Dorg.jenkinsci.plugins.pipeline.maven.reportsFolder="C:\Users\jenkins\AppData\Local\Temp\2\jenkins-maven-box-maven-assembly-plugin-MASSEMBLY-897-2@2@tmp\withMaven5eb50eb8"
[windows-jdk7-m3.2.x_build] [INFO] There are 2 errors reported by Checkstyle 6.18 with config/maven_checks.xml ruleset.
[windows-jdk7-m3.2.x_build] [INFO] Ignored 2 errors, 0 violation remaining.
[windows-jdk7-m3.2.x_build] [INFO]
[windows-jdk7-m3.2.x_build] [INFO] --- maven-invoker-plugin:3.1.0:verify (integration-test) @ maven-assembly-plugin ---
[windows-jdk7-m3.2.x_build] [INFO] -------------------------------------------------
[windows-jdk7-m3.2.x_build] [INFO] Build Summary:
[windows-jdk7-m3.2.x_build] [INFO]   Passed: 134, Failed: 1, Errors: 0, Skipped: 3
[windows-jdk7-m3.2.x_build] [INFO] -------------------------------------------------
[windows-jdk7-m3.2.x_build] [WARNING] The following builds failed:
[windows-jdk7-m3.2.x_build] [WARNING] *  projects\files\zipentrysize\pom.xml
[windows-jdk7-m3.2.x_build] [INFO] -------------------------------------------------
[windows-jdk7-m3.2.x_build] [WARNING] Ignoring that 1 build failed.
[windows-jdk7-m3.2.x_build] [INFO] ------------------------------------------------------------------------
[windows-jdk7-m3.2.x_build] [INFO] BUILD SUCCESS
[windows-jdk7-m3.2.x_build] [INFO] ------------------------------------------------------------------------
[windows-jdk7-m3.2.x_build] [INFO] Total time: 25:22 min
[windows-jdk7-m3.2.x_build] [INFO] Finished at: 2018-12-29T18:10:51-08:00
[windows-jdk7-m3.2.x_build] [INFO] Final Memory: 50M/628M
[windows-jdk7-m3.2.x_build] [INFO] ------------------------------------------------------------------------
[windows-jdk7-m3.2.x_build] [INFO] [jenkins-event-spy] Generated C:\Users\jenkins\AppData\Local\Temp\2\jenkins-maven-box-maven-assembly-plugin-MASSEMBLY-897-2@tmp\withMavenbbd3bdc5\maven-spy-20181229-174529-27356681056940321556.log
[windows-jdk7-m3.2.x_build] Picked up JAVA_TOOL_OPTIONS: -Dmaven.ext.class.path="C:\Users\jenkins\AppData\Local\Temp\2\jenkins-maven-box-maven-assembly-plugin-MASSEMBLY-897-2@tmp\withMavenbbd3bdc5\pipeline-maven-spy.jar" -Dorg.jenkinsci.plugins.pipeline.maven.reportsFolder="C:\Users\jenkins\AppData\Local\Temp\2\jenkins-maven-box-maven-assembly-plugin-MASSEMBLY-897-2@tmp\withMavenbbd3bdc5"
[Pipeline] [linux-jdk8-m3.5.x_build] }
[Pipeline] [linux-jdk7-m3.5.x_build] }
[linux-jdk7-m3.5.x_build] [withMaven] artifactsPublisher - Archive artifact linux-jdk7-m3.5.x_build/pom.xml under org/apache/maven/plugins/maven-assembly-plugin/3.1.1-SNAPSHOT/maven-assembly-plugin-3.1.1-SNAPSHOT.pom
[linux-jdk7-m3.5.x_build] [withMaven] artifactsPublisher - Archive artifact linux-jdk7-m3.5.x_build/target/maven-assembly-plugin-3.1.1-SNAPSHOT.jar under org/apache/maven/plugins/maven-assembly-plugin/3.1.1-SNAPSHOT/maven-assembly-plugin-3.1.1-SNAPSHOT.jar
[linux-jdk7-m3.5.x_build] [withMaven] junitPublisher - Archive test results for Maven artifact org.apache.maven.plugins:maven-assembly-plugin:3.1.1-SNAPSHOT generated by maven-surefire-plugin:test (default-test): linux-jdk7-m3.5.x_build/target/surefire-reports/*.xml
[linux-jdk7-m3.5.x_build] Recording test results
[linux-jdk7-m3.5.x_build] [withMaven] openTasksPublisher - Scan Tasks for Maven artifact org.apache.maven.plugins:maven-assembly-plugin:3.1.1-SNAPSHOT in source directory linux-jdk7-m3.5.x_build/src/main/java
[linux-jdk7-m3.5.x_build] [TASKS] Scanning folder '/home/jenkins/jenkins-slave/workspace/sembly-plugin_MASSEMBLY-897-XOKD6HREDHTEVCPZMRLS47UFHARF6J6VICS7SIEQ7C2QRGVCV2HA@3' for files matching the pattern 'linux-jdk7-m3.5.x_build/src/main/java/**/*' - excludes: null
[linux-jdk7-m3.5.x_build] [TASKS] Found 71 files to scan for tasks
[linux-jdk7-m3.5.x_build] [TASKS] Found 14 open tasks.
[linux-jdk7-m3.5.x_build] Skipping warnings blame since pipelines do not have an SCM link.%n
[linux-jdk7-m3.5.x_build] [TASKS] Computing warning deltas based on reference build #1
[linux-jdk7-m3.5.x_build] [withMaven] invokerPublisher - Archive invoker results for Maven artifact MavenArtifact{org.apache.maven.plugins:maven-assembly-plugin::3.1.1-SNAPSHOT(version: 3.1.1-SNAPSHOT, snapshot:false) } generated by PluginInvocation{org.apache.maven.plugins:maven-invoker-plugin:3.1.0@integration-test  integration-test}: linux-jdk7-m3.5.x_build/target/invoker-reports/*.xml
[Pipeline] [linux-jdk11-m3.5.x_build] }
[linux-jdk11-m3.5.x_build] [withMaven] artifactsPublisher - Archive artifact linux-jdk11-m3.5.x_build/pom.xml under org/apache/maven/plugins/maven-assembly-plugin/3.1.1-SNAPSHOT/maven-assembly-plugin-3.1.1-SNAPSHOT.pom
[linux-jdk11-m3.5.x_build] [withMaven] artifactsPublisher - Archive artifact linux-jdk11-m3.5.x_build/target/maven-assembly-plugin-3.1.1-SNAPSHOT.jar under org/apache/maven/plugins/maven-assembly-plugin/3.1.1-SNAPSHOT/maven-assembly-plugin-3.1.1-SNAPSHOT.jar
[linux-jdk11-m3.5.x_build] [withMaven] junitPublisher - Archive test results for Maven artifact org.apache.maven.plugins:maven-assembly-plugin:3.1.1-SNAPSHOT generated by maven-surefire-plugin:test (default-test): linux-jdk11-m3.5.x_build/target/surefire-reports/*.xml
[linux-jdk11-m3.5.x_build] Recording test results
[linux-jdk11-m3.5.x_build] [withMaven] openTasksPublisher - Scan Tasks for Maven artifact org.apache.maven.plugins:maven-assembly-plugin:3.1.1-SNAPSHOT in source directory linux-jdk11-m3.5.x_build/src/main/java
[linux-jdk11-m3.5.x_build] [TASKS] Scanning folder '/home/jenkins/jenkins-slave/workspace/sembly-plugin_MASSEMBLY-897-XOKD6HREDHTEVCPZMRLS47UFHARF6J6VICS7SIEQ7C2QRGVCV2HA@2' for files matching the pattern 'linux-jdk11-m3.5.x_build/src/main/java/**/*' - excludes: null
[linux-jdk11-m3.5.x_build] [TASKS] Found 71 files to scan for tasks
[linux-jdk11-m3.5.x_build] [TASKS] Found 14 open tasks.
[linux-jdk11-m3.5.x_build] Skipping warnings blame since pipelines do not have an SCM link.%n
[linux-jdk11-m3.5.x_build] [TASKS] Computing warning deltas based on reference build #1
[linux-jdk11-m3.5.x_build] [withMaven] invokerPublisher - Archive invoker results for Maven artifact MavenArtifact{org.apache.maven.plugins:maven-assembly-plugin::3.1.1-SNAPSHOT(version: 3.1.1-SNAPSHOT, snapshot:false) } generated by PluginInvocation{org.apache.maven.plugins:maven-invoker-plugin:3.1.0@integration-test  integration-test}: linux-jdk11-m3.5.x_build/target/invoker-reports/*.xml
[Pipeline] [linux-jdk8-m3.5.x_build] // ws
[Pipeline] [linux-jdk7-m3.5.x_build] // withMaven
[Pipeline] [linux-jdk11-m3.5.x_build] // withMaven
[Pipeline] [linux-jdk8-m3.5.x_build] }
[Pipeline] [linux-jdk7-m3.3.x_build] }
[Pipeline] [linux-jdk7-m3.2.x_build] }
[Pipeline] [linux-jdk7-m3.5.x_build] cleanWs
[Pipeline] [linux-jdk11-m3.5.x_build] cleanWs
[Pipeline] [windows-jdk7-m3.2.x_build] }
[Pipeline] [windows-jdk7-m3.3.x_build] }
[Pipeline] [windows-jdk7-m3.5.x_build] }
[Pipeline] [windows-jdk8-m3.5.x_build] }
[Pipeline] [windows-jdk11-m3.5.x_build] }
[Pipeline] [linux-jdk8-m3.5.x_build] // node
[Pipeline] [linux-jdk7-m3.3.x_build] // stage
[Pipeline] [linux-jdk7-m3.2.x_build] // stage
[Pipeline] [windows-jdk7-m3.2.x_build] // dir
[Pipeline] [windows-jdk7-m3.3.x_build] // dir
[Pipeline] [windows-jdk7-m3.5.x_build] // dir
[Pipeline] [windows-jdk8-m3.5.x_build] // dir
[Pipeline] [windows-jdk11-m3.5.x_build] // dir
[linux-jdk7-m3.5.x_build] [WS-CLEANUP] Deleting project workspace...[WS-CLEANUP] done
[linux-jdk11-m3.5.x_build] [WS-CLEANUP] Deleting project workspace...[WS-CLEANUP] done
[Pipeline] [linux-jdk8-m3.5.x_build] }
[Pipeline] [linux-jdk7-m3.2.x_build] }
[Pipeline] [linux-jdk7-m3.3.x_build] }
[Pipeline] [windows-jdk7-m3.2.x_build] }
[windows-jdk7-m3.2.x_build] [withMaven] artifactsPublisher - Archive artifact windows-jdk7-m3.2.x_build\pom.xml under org\apache\maven\plugins\maven-assembly-plugin\3.1.1-SNAPSHOT\maven-assembly-plugin-3.1.1-SNAPSHOT.pom
[windows-jdk7-m3.2.x_build] [withMaven] artifactsPublisher - Archive artifact windows-jdk7-m3.2.x_build\target\maven-assembly-plugin-3.1.1-SNAPSHOT.jar under org\apache\maven\plugins\maven-assembly-plugin\3.1.1-SNAPSHOT\maven-assembly-plugin-3.1.1-SNAPSHOT.jar
[windows-jdk7-m3.2.x_build] [withMaven] junitPublisher - Archive test results for Maven artifact org.apache.maven.plugins:maven-assembly-plugin:3.1.1-SNAPSHOT generated by maven-surefire-plugin:test (default-test): windows-jdk7-m3.2.x_build\target\surefire-reports\*.xml
[windows-jdk7-m3.2.x_build] Recording test results
[windows-jdk7-m3.2.x_build] [withMaven] openTasksPublisher - Scan Tasks for Maven artifact org.apache.maven.plugins:maven-assembly-plugin:3.1.1-SNAPSHOT in source directory windows-jdk7-m3.2.x_build\src\main\java
[windows-jdk7-m3.2.x_build] [TASKS] Scanning folder 'C:\Users\jenkins\AppData\Local\Temp\2\jenkins-maven-box-maven-assembly-plugin-MASSEMBLY-897-2' for files matching the pattern 'windows-jdk7-m3.2.x_build\src\main\java\**\*' - excludes: null
[windows-jdk7-m3.2.x_build] [TASKS] Found 71 files to scan for tasks
[windows-jdk7-m3.2.x_build] [TASKS] Found 14 open tasks.
[windows-jdk7-m3.2.x_build] Skipping warnings blame since pipelines do not have an SCM link.%n
[windows-jdk7-m3.2.x_build] [TASKS] Computing warning deltas based on reference build #1
[windows-jdk7-m3.2.x_build] [withMaven] invokerPublisher - Archive invoker results for Maven artifact MavenArtifact{org.apache.maven.plugins:maven-assembly-plugin::3.1.1-SNAPSHOT(version: 3.1.1-SNAPSHOT, snapshot:false) } generated by PluginInvocation{org.apache.maven.plugins:maven-invoker-plugin:3.1.0@integration-test  integration-test}: windows-jdk7-m3.2.x_build\target\invoker-reports\*.xml
[Pipeline] [windows-jdk7-m3.3.x_build] }
[windows-jdk7-m3.3.x_build] [withMaven] artifactsPublisher - Archive artifact windows-jdk7-m3.3.x_build\pom.xml under org\apache\maven\plugins\maven-assembly-plugin\3.1.1-SNAPSHOT\maven-assembly-plugin-3.1.1-SNAPSHOT.pom
[windows-jdk7-m3.3.x_build] [withMaven] artifactsPublisher - Archive artifact windows-jdk7-m3.3.x_build\target\maven-assembly-plugin-3.1.1-SNAPSHOT.jar under org\apache\maven\plugins\maven-assembly-plugin\3.1.1-SNAPSHOT\maven-assembly-plugin-3.1.1-SNAPSHOT.jar
[windows-jdk7-m3.3.x_build] [withMaven] junitPublisher - Archive test results for Maven artifact org.apache.maven.plugins:maven-assembly-plugin:3.1.1-SNAPSHOT generated by maven-surefire-plugin:test (default-test): windows-jdk7-m3.3.x_build\target\surefire-reports\*.xml
[windows-jdk7-m3.3.x_build] Recording test results
[windows-jdk7-m3.3.x_build] [withMaven] openTasksPublisher - Scan Tasks for Maven artifact org.apache.maven.plugins:maven-assembly-plugin:3.1.1-SNAPSHOT in source directory windows-jdk7-m3.3.x_build\src\main\java
[windows-jdk7-m3.3.x_build] [TASKS] Scanning folder 'C:\Users\jenkins\AppData\Local\Temp\2\jenkins-maven-box-maven-assembly-plugin-MASSEMBLY-897-2@2' for files matching the pattern 'windows-jdk7-m3.3.x_build\src\main\java\**\*' - excludes: null
[windows-jdk7-m3.3.x_build] [TASKS] Found 71 files to scan for tasks
[windows-jdk7-m3.3.x_build] [TASKS] Found 14 open tasks.
[windows-jdk7-m3.3.x_build] Skipping warnings blame since pipelines do not have an SCM link.%n
[windows-jdk7-m3.3.x_build] [TASKS] Computing warning deltas based on reference build #1
[windows-jdk7-m3.3.x_build] [withMaven] invokerPublisher - Archive invoker results for Maven artifact MavenArtifact{org.apache.maven.plugins:maven-assembly-plugin::3.1.1-SNAPSHOT(version: 3.1.1-SNAPSHOT, snapshot:false) } generated by PluginInvocation{org.apache.maven.plugins:maven-invoker-plugin:3.1.0@integration-test  integration-test}: windows-jdk7-m3.3.x_build\target\invoker-reports\*.xml
[Pipeline] [windows-jdk7-m3.5.x_build] }
[windows-jdk7-m3.5.x_build] [withMaven] artifactsPublisher - Archive artifact windows-jdk7-m3.5.x_build\pom.xml under org\apache\maven\plugins\maven-assembly-plugin\3.1.1-SNAPSHOT\maven-assembly-plugin-3.1.1-SNAPSHOT.pom
[windows-jdk7-m3.5.x_build] [withMaven] artifactsPublisher - Archive artifact windows-jdk7-m3.5.x_build\target\maven-assembly-plugin-3.1.1-SNAPSHOT.jar under org\apache\maven\plugins\maven-assembly-plugin\3.1.1-SNAPSHOT\maven-assembly-plugin-3.1.1-SNAPSHOT.jar
[windows-jdk7-m3.5.x_build] [withMaven] junitPublisher - Archive test results for Maven artifact org.apache.maven.plugins:maven-assembly-plugin:3.1.1-SNAPSHOT generated by maven-surefire-plugin:test (default-test): windows-jdk7-m3.5.x_build\target\surefire-reports\*.xml
[windows-jdk7-m3.5.x_build] Recording test results
[windows-jdk7-m3.5.x_build] [withMaven] openTasksPublisher - Scan Tasks for Maven artifact org.apache.maven.plugins:maven-assembly-plugin:3.1.1-SNAPSHOT in source directory windows-jdk7-m3.5.x_build\src\main\java
[windows-jdk7-m3.5.x_build] [TASKS] Scanning folder 'C:\Users\jenkins\AppData\Local\Temp\2\jenkins-maven-box-maven-assembly-plugin-MASSEMBLY-897-2' for files matching the pattern 'windows-jdk7-m3.5.x_build\src\main\java\**\*' - excludes: null
[windows-jdk7-m3.5.x_build] [TASKS] Found 71 files to scan for tasks
[windows-jdk7-m3.5.x_build] [TASKS] Found 14 open tasks.
[windows-jdk7-m3.5.x_build] Skipping warnings blame since pipelines do not have an SCM link.%n
[windows-jdk7-m3.5.x_build] [TASKS] Computing warning deltas based on reference build #1
[windows-jdk7-m3.5.x_build] [withMaven] invokerPublisher - Archive invoker results for Maven artifact MavenArtifact{org.apache.maven.plugins:maven-assembly-plugin::3.1.1-SNAPSHOT(version: 3.1.1-SNAPSHOT, snapshot:false) } generated by PluginInvocation{org.apache.maven.plugins:maven-invoker-plugin:3.1.0@integration-test  integration-test}: windows-jdk7-m3.5.x_build\target\invoker-reports\*.xml
[Pipeline] [windows-jdk8-m3.5.x_build] }
[windows-jdk8-m3.5.x_build] [withMaven] artifactsPublisher - Archive artifact windows-jdk8-m3.5.x_build\pom.xml under org\apache\maven\plugins\maven-assembly-plugin\3.1.1-SNAPSHOT\maven-assembly-plugin-3.1.1-SNAPSHOT.pom
[windows-jdk8-m3.5.x_build] [withMaven] artifactsPublisher - Archive artifact windows-jdk8-m3.5.x_build\target\maven-assembly-plugin-3.1.1-SNAPSHOT.jar under org\apache\maven\plugins\maven-assembly-plugin\3.1.1-SNAPSHOT\maven-assembly-plugin-3.1.1-SNAPSHOT.jar
[windows-jdk8-m3.5.x_build] [withMaven] junitPublisher - Archive test results for Maven artifact org.apache.maven.plugins:maven-assembly-plugin:3.1.1-SNAPSHOT generated by maven-surefire-plugin:test (default-test): windows-jdk8-m3.5.x_build\target\surefire-reports\*.xml
[windows-jdk8-m3.5.x_build] Recording test results
[windows-jdk8-m3.5.x_build] [withMaven] openTasksPublisher - Scan Tasks for Maven artifact org.apache.maven.plugins:maven-assembly-plugin:3.1.1-SNAPSHOT in source directory windows-jdk8-m3.5.x_build\src\main\java
[windows-jdk8-m3.5.x_build] [TASKS] Scanning folder 'C:\Users\jenkins\AppData\Local\Temp\2\jenkins-maven-box-maven-assembly-plugin-MASSEMBLY-897-2' for files matching the pattern 'windows-jdk8-m3.5.x_build\src\main\java\**\*' - excludes: null
[windows-jdk8-m3.5.x_build] [TASKS] Found 71 files to scan for tasks
[windows-jdk8-m3.5.x_build] [TASKS] Found 14 open tasks.
[windows-jdk8-m3.5.x_build] Skipping warnings blame since pipelines do not have an SCM link.%n
[windows-jdk8-m3.5.x_build] [TASKS] Computing warning deltas based on reference build #1
[windows-jdk8-m3.5.x_build] [withMaven] invokerPublisher - Archive invoker results for Maven artifact MavenArtifact{org.apache.maven.plugins:maven-assembly-plugin::3.1.1-SNAPSHOT(version: 3.1.1-SNAPSHOT, snapshot:false) } generated by PluginInvocation{org.apache.maven.plugins:maven-invoker-plugin:3.1.0@integration-test  integration-test}: windows-jdk8-m3.5.x_build\target\invoker-reports\*.xml
[Pipeline] [windows-jdk11-m3.5.x_build] }
[windows-jdk11-m3.5.x_build] [withMaven] artifactsPublisher - Archive artifact windows-jdk11-m3.5.x_build\pom.xml under org\apache\maven\plugins\maven-assembly-plugin\3.1.1-SNAPSHOT\maven-assembly-plugin-3.1.1-SNAPSHOT.pom
[windows-jdk11-m3.5.x_build] [withMaven] artifactsPublisher - Archive artifact windows-jdk11-m3.5.x_build\target\maven-assembly-plugin-3.1.1-SNAPSHOT.jar under org\apache\maven\plugins\maven-assembly-plugin\3.1.1-SNAPSHOT\maven-assembly-plugin-3.1.1-SNAPSHOT.jar
[windows-jdk11-m3.5.x_build] [withMaven] junitPublisher - Archive test results for Maven artifact org.apache.maven.plugins:maven-assembly-plugin:3.1.1-SNAPSHOT generated by maven-surefire-plugin:test (default-test): windows-jdk11-m3.5.x_build\target\surefire-reports\*.xml
[windows-jdk11-m3.5.x_build] Recording test results
[windows-jdk11-m3.5.x_build] [withMaven] openTasksPublisher - Scan Tasks for Maven artifact org.apache.maven.plugins:maven-assembly-plugin:3.1.1-SNAPSHOT in source directory windows-jdk11-m3.5.x_build\src\main\java
[windows-jdk11-m3.5.x_build] [TASKS] Scanning folder 'C:\Users\jenkins\AppData\Local\Temp\2\jenkins-maven-box-maven-assembly-plugin-MASSEMBLY-897-2@2' for files matching the pattern 'windows-jdk11-m3.5.x_build\src\main\java\**\*' - excludes: null
[windows-jdk11-m3.5.x_build] [TASKS] Found 71 files to scan for tasks
[windows-jdk11-m3.5.x_build] [TASKS] Found 14 open tasks.
[windows-jdk11-m3.5.x_build] Skipping warnings blame since pipelines do not have an SCM link.%n
[windows-jdk11-m3.5.x_build] [TASKS] Computing warning deltas based on reference build #1
[windows-jdk11-m3.5.x_build] [withMaven] invokerPublisher - Archive invoker results for Maven artifact MavenArtifact{org.apache.maven.plugins:maven-assembly-plugin::3.1.1-SNAPSHOT(version: 3.1.1-SNAPSHOT, snapshot:false) } generated by PluginInvocation{org.apache.maven.plugins:maven-invoker-plugin:3.1.0@integration-test  integration-test}: windows-jdk11-m3.5.x_build\target\invoker-reports\*.xml
[Pipeline] [linux-jdk7-m3.2.x_build] // ws
[Pipeline] [linux-jdk7-m3.3.x_build] // ws
[Pipeline] [windows-jdk7-m3.2.x_build] // withMaven
[Pipeline] [windows-jdk7-m3.3.x_build] // withMaven
[Pipeline] [windows-jdk7-m3.5.x_build] // withMaven
[Pipeline] [windows-jdk8-m3.5.x_build] // withMaven
[Pipeline] [windows-jdk11-m3.5.x_build] // withMaven
[Pipeline] [linux-jdk7-m3.2.x_build] }
[Pipeline] [linux-jdk7-m3.3.x_build] }
[Pipeline] [linux-jdk7-m3.5.x_build] }
[Pipeline] [linux-jdk11-m3.5.x_build] }
[Pipeline] [windows-jdk7-m3.2.x_build] cleanWs
[Pipeline] [windows-jdk7-m3.3.x_build] cleanWs
[Pipeline] [windows-jdk7-m3.5.x_build] cleanWs
[Pipeline] [windows-jdk8-m3.5.x_build] cleanWs
[Pipeline] [windows-jdk11-m3.5.x_build] cleanWs
[Pipeline] [linux-jdk7-m3.2.x_build] // node
[Pipeline] [linux-jdk7-m3.3.x_build] // node
[windows-jdk7-m3.2.x_build] [WS-CLEANUP] Deleting project workspace...Cannot delete workspace :remote file operation failed: C:\Users\jenkins\AppData\Local\Temp\2\jenkins-maven-box-maven-assembly-plugin-MASSEMBLY-897-2 at hudson.remoting.Channel@6cb8ec07:JNLP4-connect connection from 37.48.69.226/37.48.69.226:60168: java.nio.file.AccessDeniedException: C:\Users\jenkins\AppData\Local\Temp\2\jenkins-maven-box-maven-assembly-plugin-MASSEMBLY-897-2 -> C:\Users\jenkins\AppData\Local\Temp\2\jenkins-maven-box-maven-assembly-plugin-MASSEMBLY-897-2_ws-cleanup_1546136620216
[windows-jdk7-m3.3.x_build] [WS-CLEANUP] Deleting project workspace...Cannot delete workspace :remote file operation failed: C:\Users\jenkins\AppData\Local\Temp\2\jenkins-maven-box-maven-assembly-plugin-MASSEMBLY-897-2@2 at hudson.remoting.Channel@6cb8ec07:JNLP4-connect connection from 37.48.69.226/37.48.69.226:60168: java.nio.file.AccessDeniedException: C:\Users\jenkins\AppData\Local\Temp\2\jenkins-maven-box-maven-assembly-plugin-MASSEMBLY-897-2@2 -> C:\Users\jenkins\AppData\Local\Temp\2\jenkins-maven-box-maven-assembly-plugin-MASSEMBLY-897-2@2_ws-cleanup_1546136620220
[windows-jdk7-m3.5.x_build] [WS-CLEANUP] Deleting project workspace...Cannot delete workspace :remote file operation failed: C:\Users\jenkins\AppData\Local\Temp\2\jenkins-maven-box-maven-assembly-plugin-MASSEMBLY-897-2 at hudson.remoting.Channel@41afa848:JNLP4-connect connection from 37.48.69.226/37.48.69.226:49574: java.nio.file.AccessDeniedException: C:\Users\jenkins\AppData\Local\Temp\2\jenkins-maven-box-maven-assembly-plugin-MASSEMBLY-897-2 -> C:\Users\jenkins\AppData\Local\Temp\2\jenkins-maven-box-maven-assembly-plugin-MASSEMBLY-897-2_ws-cleanup_1546136620227
[windows-jdk8-m3.5.x_build] [WS-CLEANUP] Deleting project workspace...Cannot delete workspace :remote file operation failed: C:\Users\jenkins\AppData\Local\Temp\2\jenkins-maven-box-maven-assembly-plugin-MASSEMBLY-897-2 at hudson.remoting.Channel@7f96cc69:JNLP4-connect connection from 37.48.69.226/37.48.69.226:63010: java.nio.file.AccessDeniedException: C:\Users\jenkins\AppData\Local\Temp\2\jenkins-maven-box-maven-assembly-plugin-MASSEMBLY-897-2 -> C:\Users\jenkins\AppData\Local\Temp\2\jenkins-maven-box-maven-assembly-plugin-MASSEMBLY-897-2_ws-cleanup_1546136620233
[windows-jdk11-m3.5.x_build] [WS-CLEANUP] Deleting project workspace...Cannot delete workspace :remote file operation failed: C:\Users\jenkins\AppData\Local\Temp\2\jenkins-maven-box-maven-assembly-plugin-MASSEMBLY-897-2@2 at hudson.remoting.Channel@7f96cc69:JNLP4-connect connection from 37.48.69.226/37.48.69.226:63010: java.nio.file.AccessDeniedException: C:\Users\jenkins\AppData\Local\Temp\2\jenkins-maven-box-maven-assembly-plugin-MASSEMBLY-897-2@2 -> C:\Users\jenkins\AppData\Local\Temp\2\jenkins-maven-box-maven-assembly-plugin-MASSEMBLY-897-2@2_ws-cleanup_1546136620236
[Pipeline] [linux-jdk7-m3.5.x_build] // stage
[Pipeline] [linux-jdk11-m3.5.x_build] // stage
[Pipeline] [linux-jdk7-m3.2.x_build] }
[Pipeline] [linux-jdk7-m3.3.x_build] }
[Pipeline] [linux-jdk7-m3.5.x_build] }
[Pipeline] [linux-jdk11-m3.5.x_build] }
[Pipeline] [windows-jdk7-m3.2.x_build] }
[Pipeline] [windows-jdk7-m3.3.x_build] }
[Pipeline] [windows-jdk7-m3.5.x_build] }
[Pipeline] [windows-jdk8-m3.5.x_build] }
[Pipeline] [windows-jdk11-m3.5.x_build] }
[Pipeline] [linux-jdk7-m3.5.x_build] // ws
[Pipeline] [linux-jdk11-m3.5.x_build] // ws
[Pipeline] [linux-jdk7-m3.5.x_build] }
[Pipeline] [linux-jdk11-m3.5.x_build] }
[Pipeline] [windows-jdk7-m3.2.x_build] // stage
[Pipeline] [windows-jdk7-m3.3.x_build] // stage
[Pipeline] [windows-jdk7-m3.5.x_build] // stage
[Pipeline] [windows-jdk8-m3.5.x_build] // stage
[Pipeline] [windows-jdk11-m3.5.x_build] // stage
[Pipeline] [windows-jdk7-m3.2.x_build] }
[Pipeline] [windows-jdk7-m3.3.x_build] }
[Pipeline] [windows-jdk7-m3.5.x_build] }
[Pipeline] [windows-jdk8-m3.5.x_build] }
[Pipeline] [windows-jdk11-m3.5.x_build] }
[Pipeline] [linux-jdk7-m3.5.x_build] // node
[Pipeline] [linux-jdk11-m3.5.x_build] // node
[Pipeline] [linux-jdk7-m3.5.x_build] }
[Pipeline] [linux-jdk11-m3.5.x_build] }
[Pipeline] [windows-jdk7-m3.2.x_build] // ws
[Pipeline] [windows-jdk7-m3.3.x_build] // ws
[Pipeline] [windows-jdk7-m3.5.x_build] // ws
[Pipeline] [windows-jdk8-m3.5.x_build] // ws
[Pipeline] [windows-jdk11-m3.5.x_build] // ws
[Pipeline] [windows-jdk7-m3.2.x_build] }
[Pipeline] [windows-jdk7-m3.3.x_build] }
[Pipeline] [windows-jdk7-m3.5.x_build] }
[Pipeline] [windows-jdk8-m3.5.x_build] }
[Pipeline] [windows-jdk11-m3.5.x_build] }
[Pipeline] [windows-jdk7-m3.2.x_build] // node
[Pipeline] [windows-jdk7-m3.3.x_build] // node
[Pipeline] [windows-jdk7-m3.5.x_build] // node
[Pipeline] [windows-jdk8-m3.5.x_build] // node
[Pipeline] [windows-jdk11-m3.5.x_build] // node
[Pipeline] [windows-jdk7-m3.2.x_build] }
[windows-jdk7-m3.2.x_build] Failed in branch windows-jdk7-m3.2.x_build
[Pipeline] [windows-jdk7-m3.3.x_build] }
[windows-jdk7-m3.3.x_build] Failed in branch windows-jdk7-m3.3.x_build
[Pipeline] [windows-jdk7-m3.5.x_build] }
[windows-jdk7-m3.5.x_build] Failed in branch windows-jdk7-m3.5.x_build
[Pipeline] [windows-jdk8-m3.5.x_build] }
[windows-jdk8-m3.5.x_build] Failed in branch windows-jdk8-m3.5.x_build
[Pipeline] [windows-jdk11-m3.5.x_build] }
[windows-jdk11-m3.5.x_build] Failed in branch windows-jdk11-m3.5.x_build
[Pipeline] // parallel
[Pipeline] stage
[Pipeline] { (Notifications)
[Pipeline] echo
Build result: FAILURE
[Pipeline] jiraIssueSelector
[Pipeline] emailext
Reply | Threaded
Open this post in threaded view
|

Build failed in Jenkins: Maven TLP » maven-assembly-plugin » MASSEMBLY-897 #3

Apache Jenkins Server-2
See https://builds.apache.org/job/maven-box/job/maven-assembly-plugin/job/MASSEMBLY-897/3/

Changes:

* use a special local repo to have a bit of caching
* add mavenLinkerPublisher

All tests passed

Build log:
[...truncated 9821 lines...]
[INFO] Building: projects\descriptor-refs\jar-with-dependencies\deps-unpacked-to-root-dir\pom.xml
[INFO] run post-build script verify.groovy
[INFO]           projects\descriptor-refs\jar-with-dependencies\deps-unpacked-to-root-dir\pom.xml SUCCESS (7.7 s)
[INFO] Building: projects\descriptor-refs\jar-with-dependencies\no-target-dir\pom.xml
[INFO] run post-build script verify.bsh
[INFO]           projects\descriptor-refs\jar-with-dependencies\no-target-dir\pom.xml SUCCESS (4.9 s)
[INFO] Building: projects\descriptor-refs\project\multimodule-sources-copied\pom.xml
[INFO] run post-build script verify.bsh
[INFO]           projects\descriptor-refs\project\multimodule-sources-copied\pom.xml SUCCESS (7.5 s)
[INFO] Building: projects\descriptor-refs\project\no-target-dir\pom.xml
[INFO] run post-build script verify.bsh
[INFO]           projects\descriptor-refs\project\no-target-dir\pom.xml SUCCESS (6.2 s)
[INFO] Building: projects\descriptor-refs\project\no-target-dir-multimodule\pom.xml
[INFO] run post-build script verify.bsh
[INFO]           projects\descriptor-refs\project\no-target-dir-multimodule\pom.xml SUCCESS (8.4 s)
[INFO] Building: projects\descriptor-refs\project\sources-copied\pom.xml
[INFO] run post-build script verify.bsh
[INFO]           projects\descriptor-refs\project\sources-copied\pom.xml SUCCESS (7.7 s)
[INFO] Building: projects\descriptor-refs\src\no-target-dir\pom.xml
[INFO] run post-build script verify.bsh
[INFO]           projects\descriptor-refs\src\no-target-dir\pom.xml SUCCESS (32.1 s)
[INFO] Building: projects\descriptor-refs\src\src-dir-copied\pom.xml
[INFO] run post-build script verify.bsh
[INFO]           projects\descriptor-refs\src\src-dir-copied\pom.xml SUCCESS (44.5 s)
[INFO] Building: projects\file-modes\file-set-fileMode\pom.xml
[INFO]           projects\file-modes\file-set-fileMode\pom.xml .... SKIPPED due to OS
[INFO] Building: projects\file-modes\fileItem-fileMode\pom.xml
[INFO] run post-build script verify.bsh
[INFO]           projects\file-modes\fileItem-fileMode\pom.xml .... SUCCESS (20.9 s)
[INFO] Building: projects\file-sets\default-directory-unspecified\pom.xml
[INFO] run post-build script verify.bsh
[INFO]           projects\file-sets\default-directory-unspecified\pom.xml SUCCESS (17.7 s)
[INFO] Building: projects\file-sets\default-excludes-unspecified\pom.xml
[INFO] run post-build script verify.bsh
[INFO]           projects\file-sets\default-excludes-unspecified\pom.xml SUCCESS (19.7 s)
[INFO] Building: projects\file-sets\dont-use-default-excludes\pom.xml
[INFO] run pre-build script setup.bsh
[INFO] run post-build script verify.groovy
[INFO]           projects\file-sets\dont-use-default-excludes\pom.xml SUCCESS (23.2 s)
[INFO] Building: projects\file-sets\excludes-using-regex\pom.xml
[INFO] run post-build script verify.bsh
[INFO]           projects\file-sets\excludes-using-regex\pom.xml .. SUCCESS (34.8 s)
[INFO] Building: projects\file-sets\excluding-svn-dirs\pom.xml
[INFO] run pre-build script setup.bsh
[INFO] run post-build script verify.groovy
[INFO]           projects\file-sets\excluding-svn-dirs\pom.xml .... SUCCESS (22.2 s)
[INFO] Building: projects\file-sets\filtered-module-sources\pom.xml
[INFO] run post-build script verify.bsh
[INFO]           projects\file-sets\filtered-module-sources\pom.xml SUCCESS (39.1 s)
[INFO] Building: projects\file-sets\filtered-multimodule\pom.xml
[INFO] run post-build script verify.bsh
[INFO]           projects\file-sets\filtered-multimodule\pom.xml .. SUCCESS (6.2 s)
[INFO] Building: projects\file-sets\include-base-directory\pom.xml
[INFO] run post-build script verify.bsh
[INFO]           projects\file-sets\include-base-directory\pom.xml  SUCCESS (3.8 s)
[INFO] Building: projects\file-sets\include-parent-dir\pom.xml
[INFO] run post-build script verify.bsh
[INFO]           projects\file-sets\include-parent-dir\pom.xml .... SUCCESS (8.0 s)
[INFO] Building: projects\file-sets\massembly-665\pom.xml
[INFO]           projects\file-sets\massembly-665\pom.xml ......... SUCCESS (3.3 s)
[INFO] Building: projects\file-sets\multimodule-unix-lineEndings\pom.xml
[INFO] run post-build script verify.bsh
[INFO]           projects\file-sets\multimodule-unix-lineEndings\pom.xml SUCCESS (4.6 s)
[INFO] Building: projects\file-sets\multimodule-win-lineEndings\pom.xml
[INFO] run post-build script verify.bsh
[INFO]           projects\file-sets\multimodule-win-lineEndings\pom.xml SUCCESS (5.5 s)
[INFO] Building: projects\file-sets\platformspecific-filesets\pom.xml
[INFO] run post-build script verify.groovy
[INFO]           projects\file-sets\platformspecific-filesets\pom.xml SUCCESS (3.2 s)
[INFO] Building: projects\file-sets\precedence-check\pom.xml
[INFO] run post-build script verify.groovy
[INFO]           projects\file-sets\precedence-check\pom.xml ...... SUCCESS (3.4 s)
[INFO] Building: projects\file-sets\use-default-excludes\pom.xml
[INFO] run post-build script verify.bsh
[INFO]           projects\file-sets\use-default-excludes\pom.xml .. SUCCESS (5.8 s)
[INFO] Building: projects\files\filtered-sysprop\pom.xml
[INFO] run post-build script verify.bsh
[INFO]           projects\files\filtered-sysprop\pom.xml .......... SUCCESS (32.4 s)
[INFO] Building: projects\files\multimodule-relativePath\pom.xml
[INFO] run post-build script verify.bsh
[INFO]           projects\files\multimodule-relativePath\pom.xml .. SUCCESS (32.8 s)
[INFO] Building: projects\files\zipentrysize\pom.xml
[INFO] run post-build script verify.bsh
[INFO]           projects\files\zipentrysize\pom.xml .............. FAILED (49.0 s)
[INFO]   The post-build script returned false.
[INFO] Building: projects\filtering-feature\fileset-to-tar-massembly-722\pom.xml
[INFO]           projects\filtering-feature\fileset-to-tar-massembly-722\pom.xml SUCCESS (36.9 s)
[INFO] Building: projects\filtering-feature\filter-comp-descriptor-path\pom.xml
[INFO] run post-build script verify.bsh
[INFO]           projects\filtering-feature\filter-comp-descriptor-path\pom.xml SUCCESS (20.3 s)
[INFO] Building: projects\filtering-feature\filters-defined-in-build\pom.xml
[INFO] run post-build script verify.bsh
[INFO]           projects\filtering-feature\filters-defined-in-build\pom.xml SUCCESS (26.8 s)
[INFO] Building: projects\filtering-feature\filtersDefinedInAssemblyPluginConfig\pom.xml
[INFO] run post-build script verify.bsh
[INFO]           projects\filtering-feature\filtersDefinedInAssemblyPluginConfig\pom.xml SUCCESS (26.1 s)
[INFO] Building: projects\filtering-feature\massembly-736\pom.xml
[INFO] run post-build script verify.bsh
[INFO]           projects\filtering-feature\massembly-736\pom.xml . SUCCESS (27.8 s)
[INFO] Building: projects\forking-tests\assembly-assembly-with-module-binaries\pom.xml
[INFO] run post-build script verify.bsh
[INFO]           projects\forking-tests\assembly-assembly-with-module-binaries\pom.xml SUCCESS (9.0 s)
[INFO] Building: projects\forking-tests\assembly-attached-with-module-binaries\pom.xml
[INFO] run post-build script verify.bsh
[INFO]           projects\forking-tests\assembly-attached-with-module-binaries\pom.xml SUCCESS (7.9 s)
[INFO] Building: projects\mojo-configuration\archiver-ignorePermissions\pom.xml
[INFO] run post-build script verify.bsh
[INFO]           projects\mojo-configuration\archiver-ignorePermissions\pom.xml SUCCESS (7.1 s)
[INFO] Building: projects\mojo-configuration\ignoreDirFormatExtensions\pom.xml
[INFO] run post-build script verify.bsh
[INFO]           projects\mojo-configuration\ignoreDirFormatExtensions\pom.xml SUCCESS (5.0 s)
[INFO] Building: projects\mojo-configuration\manifest-with-customEntry\pom.xml
[INFO] run post-build script verify.bsh
[INFO]           projects\mojo-configuration\manifest-with-customEntry\pom.xml SUCCESS (7.4 s)
[INFO] Building: projects\mojo-configuration\manifest-with-mainClass\pom.xml
[INFO] run post-build script verify.bsh
[INFO]           projects\mojo-configuration\manifest-with-mainClass\pom.xml SUCCESS (7.8 s)
[INFO] Building: projects\mojo-configuration\massembly-291\pom.xml
[INFO] run post-build script verify.bsh
[INFO]           projects\mojo-configuration\massembly-291\pom.xml  SUCCESS (6.2 s)
[INFO] Building: projects\mojo-configuration\massembly-301\pom.xml
[INFO] run post-build script verify.bsh
[INFO]           projects\mojo-configuration\massembly-301\pom.xml  SUCCESS (31.1 s)
[INFO] Building: projects\mojo-configuration\no-appendAssemblyId-no-classifier\pom.xml
[INFO] run post-build script verify.bsh
[INFO]           projects\mojo-configuration\no-appendAssemblyId-no-classifier\pom.xml SUCCESS (130.7 s)
[INFO] Building: projects\mojo-configuration\skipAssemblyCLIPropertySet\pom.xml
[INFO] run post-build script verify.bsh
[INFO]           projects\mojo-configuration\skipAssemblyCLIPropertySet\pom.xml SUCCESS (21.5 s)
[INFO] Building: projects\mojo-tests\single-in-one-project-hierarchy\pom.xml
[INFO] run post-build script verify.bsh
[INFO]           projects\mojo-tests\single-in-one-project-hierarchy\pom.xml SUCCESS (41.6 s)
[INFO] Building: projects\mojo-tests\single-twice-in-multimodule-hierarchy\pom.xml
[INFO] run post-build script verify.bsh
[INFO]           projects\mojo-tests\single-twice-in-multimodule-hierarchy\pom.xml SUCCESS (30.6 s)
[INFO] Building: projects\mojo-tests\single-twice-in-one-project-hierarchy\pom.xml
[INFO] run post-build script verify.bsh
[INFO]           projects\mojo-tests\single-twice-in-one-project-hierarchy\pom.xml SUCCESS (7.7 s)
[INFO] Building: projects\multimodule\massembly-298\pom.xml
[INFO] run post-build script verify.bsh
[INFO]           projects\multimodule\massembly-298\pom.xml ....... SUCCESS (8.9 s)
[INFO] Building: projects\multimodule\massembly-317\pom.xml
[INFO]           projects\multimodule\massembly-317\pom.xml ....... SUCCESS (5.6 s)
[INFO] Building: projects\multimodule\massembly-474\pom.xml
[INFO]           projects\multimodule\massembly-474\pom.xml ....... SUCCESS (6.5 s)
[INFO] Building: projects\multimodule\massembly-619\pom.xml
[INFO] run post-build script verify.bsh
[INFO]           projects\multimodule\massembly-619\pom.xml ....... SUCCESS (5.2 s)
[INFO] Building: projects\multimodule\multimodule-binariesNotSource\pom.xml
[INFO] run post-build script verify.bsh
[INFO]           projects\multimodule\multimodule-binariesNotSource\pom.xml SUCCESS (11.2 s)
[INFO] Building: projects\multimodule\multimodule-filteredFileSet\pom.xml
[INFO] run post-build script verify.bsh
[INFO]           projects\multimodule\multimodule-filteredFileSet\pom.xml SUCCESS (8.0 s)
[INFO] Building: projects\multimodule\multimodule-modulePomPropInterp\pom.xml
[INFO] run post-build script verify.bsh
[INFO]           projects\multimodule\multimodule-modulePomPropInterp\pom.xml SUCCESS (36.8 s)
[INFO] Building: projects\multimodule\multimodule-siblingParent\parent\pom.xml
[INFO] run post-build script verify.bsh
[INFO]           projects\multimodule\multimodule-siblingParent\parent\pom.xml SUCCESS (52.2 s)
[INFO] Building: projects\multimodule\multimodule-sourceNotBinaries\pom.xml
[INFO] run post-build script verify.bsh
[INFO]           projects\multimodule\multimodule-sourceNotBinaries\pom.xml SUCCESS (60.7 s)
[INFO] Building: projects\multimodule\multimodule-wholeReactorFromChild\pom.xml
[INFO] run post-build script verify.bsh
[INFO]           projects\multimodule\multimodule-wholeReactorFromChild\pom.xml SUCCESS (62.5 s)
[INFO] Building: projects\multimodule\two-level-multimodule\pom.xml
[INFO] run post-build script verify.groovy
[INFO]           projects\multimodule\two-level-multimodule\pom.xml SUCCESS (33.6 s)
[INFO] Building: projects\multimodule\two-levels-includeBaseDir-withBin\pom.xml
[INFO] run post-build script verify.groovy
[INFO]           projects\multimodule\two-levels-includeBaseDir-withBin\pom.xml SUCCESS (8.8 s)
[INFO] Building: projects\multimodule\two-levels-includeBaseDir-withSrc\pom.xml
[INFO] run post-build script verify.groovy
[INFO]           projects\multimodule\two-levels-includeBaseDir-withSrc\pom.xml SUCCESS (8.7 s)
[INFO] Building: projects\repositories\basic-repository\pom.xml
[INFO] run post-build script verify.bsh
[INFO]           projects\repositories\basic-repository\pom.xml ... SUCCESS (7.5 s)
[INFO] Building: projects\repositories\massembly-196\pom.xml
[INFO] run post-build script verify.bsh
[INFO]           projects\repositories\massembly-196\pom.xml ...... SUCCESS (9.9 s)
[INFO] Building: projects\repositories\massembly-855\pom.xml
[INFO] run post-build script verify.bsh
[INFO]           projects\repositories\massembly-855\pom.xml ...... SUCCESS (3.2 s)
[INFO]
[INFO] --- maven-checkstyle-plugin:3.0.0:check (checkstyle-check) @ maven-assembly-plugin ---
[INFO] Downloading from central: https://repo.maven.apache.org/maven2/javax/xml/bind/jaxb-api/2.3.0/jaxb-api-2.3.0.pom
[INFO] Downloaded from central: https://repo.maven.apache.org/maven2/javax/xml/bind/jaxb-api/2.3.0/jaxb-api-2.3.0.pom (23 kB at 377 kB/s)
[INFO] Downloading from central: https://repo.maven.apache.org/maven2/javax/xml/bind/jaxb-api-parent/2.3.0/jaxb-api-parent-2.3.0.pom
[INFO] Downloaded from central: https://repo.maven.apache.org/maven2/javax/xml/bind/jaxb-api-parent/2.3.0/jaxb-api-parent-2.3.0.pom (5.6 kB at 282 kB/s)
[INFO] Downloading from central: https://repo.maven.apache.org/maven2/net/java/jvnet-parent/5/jvnet-parent-5.pom
[INFO] Downloaded from central: https://repo.maven.apache.org/maven2/net/java/jvnet-parent/5/jvnet-parent-5.pom (8.9 kB at 443 kB/s)
[INFO] Downloading from central: https://repo.maven.apache.org/maven2/javax/xml/bind/jaxb-api/2.3.0/jaxb-api-2.3.0.jar
[INFO] Downloaded from central: https://repo.maven.apache.org/maven2/javax/xml/bind/jaxb-api/2.3.0/jaxb-api-2.3.0.jar (126 kB at 576 kB/s)
[INFO] There are 2 errors reported by Checkstyle 6.18 with config/maven_checks.xml ruleset.
[INFO] Ignored 2 errors, 0 violation remaining.
[INFO]
[INFO] --- maven-invoker-plugin:3.1.0:verify (integration-test) @ maven-assembly-plugin ---
[INFO] -------------------------------------------------
[INFO] Build Summary:
[INFO]   Passed: 135, Failed: 1, Errors: 0, Skipped: 2
[INFO] -------------------------------------------------
[WARNING] The following builds failed:
[WARNING] *  projects\files\zipentrysize\pom.xml
[INFO] -------------------------------------------------
[WARNING] Ignoring that 1 build failed.
[INFO] ------------------------------------------------------------------------
[INFO] BUILD SUCCESS
[INFO] ------------------------------------------------------------------------
[INFO] Total time: 50:14 min
[INFO] Finished at: 2019-01-02T20:25:52Z
[INFO] Final Memory: 48M/170M
[INFO] ------------------------------------------------------------------------
[INFO] [jenkins-event-spy] Generated C:\Users\jenkins\AppData\Local\Temp\2\jenkins-maven-box-maven-assembly-plugin-MASSEMBLY-897-3@tmp\withMavenf9bacf8b\maven-spy-20190102-193537-9391787674159202209872.log
[Pipeline] }
[Pipeline] // dir
[Pipeline] }
[withMaven] artifactsPublisher - Archive artifact windows-jdk11-m3.5.x_build\pom.xml under org\apache\maven\plugins\maven-assembly-plugin\3.1.1-SNAPSHOT\maven-assembly-plugin-3.1.1-SNAPSHOT.pom
[withMaven] artifactsPublisher - Archive artifact windows-jdk11-m3.5.x_build\target\maven-assembly-plugin-3.1.1-SNAPSHOT.jar under org\apache\maven\plugins\maven-assembly-plugin\3.1.1-SNAPSHOT\maven-assembly-plugin-3.1.1-SNAPSHOT.jar
[withMaven] junitPublisher - Archive test results for Maven artifact org.apache.maven.plugins:maven-assembly-plugin:maven-plugin:3.1.1-SNAPSHOT generated by maven-surefire-plugin:test (default-test): windows-jdk11-m3.5.x_build\target\surefire-reports\*.xml
Recording test results
[withMaven] openTasksPublisher - Scan Tasks for Maven artifact org.apache.maven.plugins:maven-assembly-plugin:maven-plugin:3.1.1-SNAPSHOT in source directory windows-jdk11-m3.5.x_build\src\main\java
[TASKS] Scanning folder 'C:\Users\jenkins\AppData\Local\Temp\2\jenkins-maven-box-maven-assembly-plugin-MASSEMBLY-897-3' for files matching the pattern 'windows-jdk11-m3.5.x_build\src\main\java\**\*' - excludes: null
[TASKS] Found 71 files to scan for tasks
[TASKS] Found 14 open tasks.
Skipping warnings blame since pipelines do not have an SCM link.%n
[TASKS] Computing warning deltas based on reference build #1
[withMaven] invokerPublisher - Archive invoker results for Maven artifact MavenArtifact{org.apache.maven.plugins:maven-assembly-plugin:maven-plugin:3.1.1-SNAPSHOT(version: 3.1.1-SNAPSHOT, snapshot:false) } generated by PluginInvocation{org.apache.maven.plugins:maven-invoker-plugin:3.1.0@integration-test  integration-test}: windows-jdk11-m3.5.x_build\target\invoker-reports\*.xml
[withMaven] Publishers: Generated Artifacts Publisher: 838 ms, Junit Publisher: 12305 ms, Open Task Scanner Publisher: 1410 ms, Invoker Publisher: 1198394 ms, Pipeline Graph Publisher: 1 ms
[Pipeline] // withMaven
[Pipeline] cleanWs
[WS-CLEANUP] Deleting project workspace...
[WS-CLEANUP] Deferred wipeout is used...
ERROR: Cannot delete workspace :C:\Users\jenkins\AppData\Local\Temp\2\jenkins-maven-box-maven-assembly-plugin-MASSEMBLY-897-3\windows-jdk11-m3.5.x_build\target\invoker-reports\BUILD-it-project-parent.xml
[Pipeline] }
[Pipeline] // stage
[Pipeline] }
[Pipeline] // ws
[Pipeline] }
[Pipeline] // node
[Pipeline] }
Failed in branch windows-jdk11-m3.5.x_build
[Pipeline] // parallel
[Pipeline] stage
[Pipeline] { (Notifications)
[Pipeline] echo
Build result: FAILURE
[Pipeline] jiraIssueSelector
[Pipeline] emailext
Reply | Threaded
Open this post in threaded view
|

Build unstable in Jenkins: Maven TLP » maven-assembly-plugin » MASSEMBLY-897 #4

Apache Jenkins Server-2
See https://builds.apache.org/job/maven-box/job/maven-assembly-plugin/job/MASSEMBLY-897/4/

Changes:

* Disable cleanWs() due to issues with file handles on Windows
* added a link to asf-gitpubsub-jenkins-plugin
* fixed markup (asciidoc, not markdown...)

All tests passed

Build log:
[...truncated 7724 lines...]
[INFO] run post-build script verify.bsh
[INFO]           projects\multimodule\massembly-619\pom.xml ....... SUCCESS (7.0 s)
[INFO] Building: projects\multimodule\multimodule-binariesNotSource\pom.xml
[INFO] run post-build script verify.bsh
[INFO]           projects\files\multimodule-relativePath\pom.xml .. SUCCESS (6.8 s)
[INFO] Building: projects\files\zipentrysize\pom.xml
[INFO] run post-build script verify.bsh
[INFO]           projects\files\zipentrysize\pom.xml .............. FAILED (8.9 s)
[INFO]   The post-build script returned false.
[INFO] Building: projects\filtering-feature\fileset-to-tar-massembly-722\pom.xml
[INFO] run post-build script verify.bsh
[INFO]           projects\multimodule\multimodule-binariesNotSource\pom.xml SUCCESS (11.1 s)
[INFO] Building: projects\multimodule\multimodule-filteredFileSet\pom.xml
[INFO]           projects\filtering-feature\fileset-to-tar-massembly-722\pom.xml SUCCESS (6.5 s)
[INFO] Building: projects\filtering-feature\filter-comp-descriptor-path\pom.xml
[INFO] run post-build script verify.bsh
[INFO]           projects\multimodule\multimodule-filteredFileSet\pom.xml SUCCESS (6.5 s)
[INFO] Building: projects\multimodule\multimodule-modulePomPropInterp\pom.xml
[INFO] run post-build script verify.bsh
[INFO]           projects\filtering-feature\filter-comp-descriptor-path\pom.xml SUCCESS (4.5 s)
[INFO] Building: projects\filtering-feature\filters-defined-in-build\pom.xml
[INFO] run post-build script verify.bsh
[INFO]           projects\multimodule\multimodule-modulePomPropInterp\pom.xml SUCCESS (6.5 s)
[INFO] Building: projects\multimodule\multimodule-siblingParent\parent\pom.xml
[INFO] run post-build script verify.bsh
[INFO]           projects\filtering-feature\filters-defined-in-build\pom.xml SUCCESS (5.0 s)
[INFO] Building: projects\filtering-feature\filtersDefinedInAssemblyPluginConfig\pom.xml
[INFO] run post-build script verify.bsh
[INFO]           projects\filtering-feature\filtersDefinedInAssemblyPluginConfig\pom.xml SUCCESS (5.3 s)
[INFO] Building: projects\filtering-feature\massembly-736\pom.xml
[INFO] run post-build script verify.bsh
[INFO]           projects\multimodule\multimodule-siblingParent\parent\pom.xml SUCCESS (10.2 s)
[INFO] Building: projects\multimodule\multimodule-sourceNotBinaries\pom.xml
[INFO] run post-build script verify.bsh
[INFO]           projects\filtering-feature\massembly-736\pom.xml . SUCCESS (4.8 s)
[INFO] Building: projects\forking-tests\assembly-assembly-with-module-binaries\pom.xml
[INFO] run post-build script verify.bsh
[INFO]           projects\multimodule\multimodule-sourceNotBinaries\pom.xml SUCCESS (11.1 s)
[INFO] Building: projects\multimodule\multimodule-wholeReactorFromChild\pom.xml
[INFO] run post-build script verify.bsh
[INFO]           projects\forking-tests\assembly-assembly-with-module-binaries\pom.xml SUCCESS (12.6 s)
[INFO] Building: projects\forking-tests\assembly-attached-with-module-binaries\pom.xml
[INFO] run post-build script verify.bsh
[INFO]           projects\multimodule\multimodule-wholeReactorFromChild\pom.xml SUCCESS (11.3 s)
[INFO] Building: projects\multimodule\two-level-multimodule\pom.xml
[INFO] run post-build script verify.bsh
[INFO]           projects\forking-tests\assembly-attached-with-module-binaries\pom.xml SUCCESS (12.4 s)
[INFO] Building: projects\mojo-configuration\archiver-ignorePermissions\pom.xml
[INFO] run post-build script verify.groovy
[INFO]           projects\multimodule\two-level-multimodule\pom.xml SUCCESS (10.6 s)
[INFO] Building: projects\multimodule\two-levels-includeBaseDir-withBin\pom.xml
[INFO] run post-build script verify.bsh
[INFO]           projects\mojo-configuration\archiver-ignorePermissions\pom.xml SUCCESS (10.1 s)
[INFO] Building: projects\mojo-configuration\ignoreDirFormatExtensions\pom.xml
[INFO] run post-build script verify.groovy
[INFO]           projects\multimodule\two-levels-includeBaseDir-withBin\pom.xml SUCCESS (10.3 s)
[INFO] Building: projects\multimodule\two-levels-includeBaseDir-withSrc\pom.xml
[INFO] run post-build script verify.bsh
[INFO]           projects\mojo-configuration\ignoreDirFormatExtensions\pom.xml SUCCESS (7.7 s)
[INFO] Building: projects\mojo-configuration\manifest-with-customEntry\pom.xml
[INFO] run post-build script verify.groovy
[INFO]           projects\multimodule\two-levels-includeBaseDir-withSrc\pom.xml SUCCESS (10.5 s)
[INFO] Building: projects\repositories\basic-repository\pom.xml
[INFO] run post-build script verify.bsh
[INFO]           projects\mojo-configuration\manifest-with-customEntry\pom.xml SUCCESS (10.1 s)
[INFO] Building: projects\mojo-configuration\manifest-with-mainClass\pom.xml
[INFO] run post-build script verify.bsh
[INFO]           projects\repositories\basic-repository\pom.xml ... SUCCESS (9.0 s)
[INFO] Building: projects\repositories\massembly-196\pom.xml
[INFO] run post-build script verify.bsh
[INFO]           projects\mojo-configuration\manifest-with-mainClass\pom.xml SUCCESS (11.2 s)
[INFO] Building: projects\mojo-configuration\massembly-291\pom.xml
[INFO] run post-build script verify.bsh
[INFO]           projects\mojo-configuration\massembly-291\pom.xml  SUCCESS (6.6 s)
[INFO] Building: projects\mojo-configuration\massembly-301\pom.xml
[INFO] run post-build script verify.bsh
[INFO]           projects\repositories\massembly-196\pom.xml ...... SUCCESS (11.6 s)
[INFO] Building: projects\repositories\massembly-855\pom.xml
[INFO] run post-build script verify.bsh
[INFO]           projects\repositories\massembly-855\pom.xml ...... SUCCESS (5.2 s)
[INFO]
[INFO] --- maven-checkstyle-plugin:3.0.0:check (checkstyle-check) @ maven-assembly-plugin ---
[INFO] run post-build script verify.bsh
[INFO]           projects\mojo-configuration\massembly-301\pom.xml  SUCCESS (8.4 s)
[INFO] Building: projects\mojo-configuration\no-appendAssemblyId-no-classifier\pom.xml
[INFO] There are 2 errors reported by Checkstyle 6.18 with config/maven_checks.xml ruleset.
[INFO] Ignored 2 errors, 0 violation remaining.
[INFO]
[INFO] --- maven-invoker-plugin:3.1.0:verify (integration-test) @ maven-assembly-plugin ---
[INFO] -------------------------------------------------
[INFO] Build Summary:
[INFO]   Passed: 135, Failed: 1, Errors: 0, Skipped: 2
[INFO] -------------------------------------------------
[WARNING] The following builds failed:
[WARNING] *  projects\files\zipentrysize\pom.xml
[INFO] -------------------------------------------------
[WARNING] Ignoring that 1 build failed.
[INFO] ------------------------------------------------------------------------
[INFO] BUILD SUCCESS
[INFO] ------------------------------------------------------------------------
[INFO] Total time: 22:38 min
[INFO] Finished at: 2019-01-11T02:31:03Z
[INFO] Final Memory: 55M/881M
[INFO] ------------------------------------------------------------------------
[INFO] [jenkins-event-spy] Generated C:\Users\jenkins\AppData\Local\Temp\2\jenkins-maven-box-maven-assembly-plugin-MASSEMBLY-897-4@tmp\withMavencfd278b9\maven-spy-20190111-020824-525537496721769237102.log
Picked up JAVA_TOOL_OPTIONS: -Dmaven.ext.class.path="C:\Users\jenkins\AppData\Local\Temp\2\jenkins-maven-box-maven-assembly-plugin-MASSEMBLY-897-4@tmp\withMavencfd278b9\pipeline-maven-spy.jar" -Dorg.jenkinsci.plugins.pipeline.maven.reportsFolder="C:\Users\jenkins\AppData\Local\Temp\2\jenkins-maven-box-maven-assembly-plugin-MASSEMBLY-897-4@tmp\withMavencfd278b9"
[Pipeline] }
[Pipeline] // dir
[Pipeline] }
[withMaven] artifactsPublisher - Archive artifact windows-jdk8-m3.5.x_build\pom.xml under org\apache\maven\plugins\maven-assembly-plugin\3.1.1-SNAPSHOT\maven-assembly-plugin-3.1.1-SNAPSHOT.pom
[withMaven] artifactsPublisher - Archive artifact windows-jdk8-m3.5.x_build\target\maven-assembly-plugin-3.1.1-SNAPSHOT.jar under org\apache\maven\plugins\maven-assembly-plugin\3.1.1-SNAPSHOT\maven-assembly-plugin-3.1.1-SNAPSHOT.jar
[withMaven] junitPublisher - Archive test results for Maven artifact org.apache.maven.plugins:maven-assembly-plugin:maven-plugin:3.1.1-SNAPSHOT generated by maven-surefire-plugin:test (default-test): windows-jdk8-m3.5.x_build\target\surefire-reports\*.xml
Recording test results
[withMaven] openTasksPublisher - Scan Tasks for Maven artifact org.apache.maven.plugins:maven-assembly-plugin:maven-plugin:3.1.1-SNAPSHOT in source directory windows-jdk8-m3.5.x_build\src\main\java
[TASKS] Scanning folder 'C:\Users\jenkins\AppData\Local\Temp\2\jenkins-maven-box-maven-assembly-plugin-MASSEMBLY-897-4' for files matching the pattern 'windows-jdk8-m3.5.x_build\src\main\java\**\*' - excludes: null
[TASKS] Found 71 files to scan for tasks
[TASKS] Found 14 open tasks.
Skipping warnings blame since pipelines do not have an SCM link.%n
[TASKS] Computing warning deltas based on reference build #1
[withMaven] invokerPublisher - Archive invoker results for Maven artifact MavenArtifact{org.apache.maven.plugins:maven-assembly-plugin:maven-plugin:3.1.1-SNAPSHOT(version: 3.1.1-SNAPSHOT, snapshot:false) } generated by PluginInvocation{org.apache.maven.plugins:maven-invoker-plugin:3.1.0@integration-test  integration-test}: windows-jdk8-m3.5.x_build\target\invoker-reports\*.xml
[INFO] run post-build script verify.bsh
[INFO]           projects\mojo-configuration\no-appendAssemblyId-no-classifier\pom.xml SUCCESS (28.4 s)
[INFO] Building: projects\mojo-configuration\skipAssemblyCLIPropertySet\pom.xml
[INFO] run post-build script verify.bsh
[INFO]           projects\mojo-configuration\skipAssemblyCLIPropertySet\pom.xml SUCCESS (4.6 s)
[INFO] Building: projects\mojo-tests\single-in-one-project-hierarchy\pom.xml
[INFO] run post-build script verify.bsh
[INFO]           projects\mojo-tests\single-in-one-project-hierarchy\pom.xml SUCCESS (10.1 s)
[INFO] Building: projects\mojo-tests\single-twice-in-multimodule-hierarchy\pom.xml
[INFO] run post-build script verify.bsh
[INFO]           projects\mojo-tests\single-twice-in-multimodule-hierarchy\pom.xml SUCCESS (11.6 s)
[INFO] Building: projects\mojo-tests\single-twice-in-one-project-hierarchy\pom.xml
[INFO] run post-build script verify.bsh
[INFO]           projects\mojo-tests\single-twice-in-one-project-hierarchy\pom.xml SUCCESS (9.9 s)
[INFO] Building: projects\multimodule\massembly-298\pom.xml
[INFO] run post-build script verify.bsh
[INFO]           projects\multimodule\massembly-298\pom.xml ....... SUCCESS (12.9 s)
[INFO] Building: projects\multimodule\massembly-317\pom.xml
[INFO]           projects\multimodule\massembly-317\pom.xml ....... SUCCESS (7.2 s)
[INFO] Building: projects\multimodule\massembly-474\pom.xml
[INFO]           projects\multimodule\massembly-474\pom.xml ....... SUCCESS (9.3 s)
[INFO] Building: projects\multimodule\massembly-619\pom.xml
[INFO] run post-build script verify.bsh
[INFO]           projects\multimodule\massembly-619\pom.xml ....... SUCCESS (7.1 s)
[INFO] Building: projects\multimodule\multimodule-binariesNotSource\pom.xml
[INFO] run post-build script verify.bsh
[INFO]           projects\multimodule\multimodule-binariesNotSource\pom.xml SUCCESS (14.1 s)
[INFO] Building: projects\multimodule\multimodule-filteredFileSet\pom.xml
[withMaven] Publishers: Generated Artifacts Publisher: 161 ms, Junit Publisher: 1628 ms, Open Task Scanner Publisher: 304 ms, Invoker Publisher: 111703 ms, Pipeline Graph Publisher: 1 ms
[Pipeline] // withMaven
[Pipeline] }
[Pipeline] // stage
[Pipeline] }
[Pipeline] // ws
[Pipeline] }
[Pipeline] // node
[Pipeline] }
[INFO] run post-build script verify.bsh
[INFO]           projects\multimodule\multimodule-filteredFileSet\pom.xml SUCCESS (6.9 s)
[INFO] Building: projects\multimodule\multimodule-modulePomPropInterp\pom.xml
[INFO] run post-build script verify.bsh
[INFO]           projects\multimodule\multimodule-modulePomPropInterp\pom.xml SUCCESS (7.5 s)
[INFO] Building: projects\multimodule\multimodule-siblingParent\parent\pom.xml
[INFO] run post-build script verify.bsh
[INFO]           projects\multimodule\multimodule-siblingParent\parent\pom.xml SUCCESS (12.6 s)
[INFO] Building: projects\multimodule\multimodule-sourceNotBinaries\pom.xml
[INFO] run post-build script verify.bsh
[INFO]           projects\multimodule\multimodule-sourceNotBinaries\pom.xml SUCCESS (14.4 s)
[INFO] Building: projects\multimodule\multimodule-wholeReactorFromChild\pom.xml
[INFO] run post-build script verify.bsh
[INFO]           projects\multimodule\multimodule-wholeReactorFromChild\pom.xml SUCCESS (13.6 s)
[INFO] Building: projects\multimodule\two-level-multimodule\pom.xml
[INFO] run post-build script verify.groovy
[INFO]           projects\multimodule\two-level-multimodule\pom.xml SUCCESS (12.4 s)
[INFO] Building: projects\multimodule\two-levels-includeBaseDir-withBin\pom.xml
[INFO] run post-build script verify.groovy
[INFO]           projects\multimodule\two-levels-includeBaseDir-withBin\pom.xml SUCCESS (11.7 s)
[INFO] Building: projects\multimodule\two-levels-includeBaseDir-withSrc\pom.xml
[INFO] run post-build script verify.groovy
[INFO]           projects\multimodule\two-levels-includeBaseDir-withSrc\pom.xml SUCCESS (12.7 s)
[INFO] Building: projects\repositories\basic-repository\pom.xml
[INFO] run post-build script verify.bsh
[INFO]           projects\repositories\basic-repository\pom.xml ... SUCCESS (10.3 s)
[INFO] Building: projects\repositories\massembly-196\pom.xml
[INFO] run post-build script verify.bsh
[INFO]           projects\repositories\massembly-196\pom.xml ...... SUCCESS (15.6 s)
[INFO] Building: projects\repositories\massembly-855\pom.xml
[INFO] run post-build script verify.bsh
[INFO]           projects\repositories\massembly-855\pom.xml ...... SUCCESS (5.2 s)
[INFO]
[INFO] --- maven-checkstyle-plugin:3.0.0:check (checkstyle-check) @ maven-assembly-plugin ---
[INFO] Downloading from central: https://repo.maven.apache.org/maven2/javax/xml/bind/jaxb-api/2.3.0/jaxb-api-2.3.0.pom
[INFO] Downloaded from central: https://repo.maven.apache.org/maven2/javax/xml/bind/jaxb-api/2.3.0/jaxb-api-2.3.0.pom (23 kB at 242 kB/s)
[INFO] Downloading from central: https://repo.maven.apache.org/maven2/javax/xml/bind/jaxb-api-parent/2.3.0/jaxb-api-parent-2.3.0.pom
[INFO] Downloaded from central: https://repo.maven.apache.org/maven2/javax/xml/bind/jaxb-api-parent/2.3.0/jaxb-api-parent-2.3.0.pom (5.6 kB at 88 kB/s)
[INFO] Downloading from central: https://repo.maven.apache.org/maven2/net/java/jvnet-parent/5/jvnet-parent-5.pom
[INFO] Downloaded from central: https://repo.maven.apache.org/maven2/net/java/jvnet-parent/5/jvnet-parent-5.pom (8.9 kB at 189 kB/s)
[INFO] Downloading from central: https://repo.maven.apache.org/maven2/javax/xml/bind/jaxb-api/2.3.0/jaxb-api-2.3.0.jar
[INFO] Downloaded from central: https://repo.maven.apache.org/maven2/javax/xml/bind/jaxb-api/2.3.0/jaxb-api-2.3.0.jar (126 kB at 460 kB/s)
[INFO] There are 2 errors reported by Checkstyle 6.18 with config/maven_checks.xml ruleset.
[INFO] Ignored 2 errors, 0 violation remaining.
[INFO]
[INFO] --- maven-invoker-plugin:3.1.0:verify (integration-test) @ maven-assembly-plugin ---
[INFO] -------------------------------------------------
[INFO] Build Summary:
[INFO]   Passed: 135, Failed: 1, Errors: 0, Skipped: 2
[INFO] -------------------------------------------------
[WARNING] The following builds failed:
[WARNING] *  projects\files\zipentrysize\pom.xml
[INFO] -------------------------------------------------
[WARNING] Ignoring that 1 build failed.
[INFO] ------------------------------------------------------------------------
[INFO] BUILD SUCCESS
[INFO] ------------------------------------------------------------------------
[INFO] Total time: 22:11 min
[INFO] Finished at: 2019-01-10T18:35:01-08:00
[INFO] Final Memory: 49M/170M
[INFO] ------------------------------------------------------------------------
[INFO] [jenkins-event-spy] Generated C:\Users\jenkins\AppData\Local\Temp\2\jenkins-maven-box-maven-assembly-plugin-MASSEMBLY-897-4@tmp\withMaven377cbb24\maven-spy-20190110-181249-43511327777404000962415.log
[Pipeline] }
[Pipeline] // dir
[Pipeline] }
[withMaven] artifactsPublisher - Archive artifact windows-jdk11-m3.5.x_build\pom.xml under org\apache\maven\plugins\maven-assembly-plugin\3.1.1-SNAPSHOT\maven-assembly-plugin-3.1.1-SNAPSHOT.pom
[withMaven] artifactsPublisher - Archive artifact windows-jdk11-m3.5.x_build\target\maven-assembly-plugin-3.1.1-SNAPSHOT.jar under org\apache\maven\plugins\maven-assembly-plugin\3.1.1-SNAPSHOT\maven-assembly-plugin-3.1.1-SNAPSHOT.jar
[withMaven] junitPublisher - Archive test results for Maven artifact org.apache.maven.plugins:maven-assembly-plugin:maven-plugin:3.1.1-SNAPSHOT generated by maven-surefire-plugin:test (default-test): windows-jdk11-m3.5.x_build\target\surefire-reports\*.xml
Recording test results
[withMaven] openTasksPublisher - Scan Tasks for Maven artifact org.apache.maven.plugins:maven-assembly-plugin:maven-plugin:3.1.1-SNAPSHOT in source directory windows-jdk11-m3.5.x_build\src\main\java
[TASKS] Scanning folder 'C:\Users\jenkins\AppData\Local\Temp\2\jenkins-maven-box-maven-assembly-plugin-MASSEMBLY-897-4' for files matching the pattern 'windows-jdk11-m3.5.x_build\src\main\java\**\*' - excludes: null
[TASKS] Found 71 files to scan for tasks
[TASKS] Found 14 open tasks.
Skipping warnings blame since pipelines do not have an SCM link.%n
[TASKS] Computing warning deltas based on reference build #1
[withMaven] invokerPublisher - Archive invoker results for Maven artifact MavenArtifact{org.apache.maven.plugins:maven-assembly-plugin:maven-plugin:3.1.1-SNAPSHOT(version: 3.1.1-SNAPSHOT, snapshot:false) } generated by PluginInvocation{org.apache.maven.plugins:maven-invoker-plugin:3.1.0@integration-test  integration-test}: windows-jdk11-m3.5.x_build\target\invoker-reports\*.xml
[withMaven] Publishers: Generated Artifacts Publisher: 202 ms, Junit Publisher: 1645 ms, Open Task Scanner Publisher: 294 ms, Invoker Publisher: 275342 ms, Pipeline Graph Publisher: 16 ms
[Pipeline] // withMaven
[Pipeline] }
[Pipeline] // stage
[Pipeline] }
[Pipeline] // ws
[Pipeline] }
[Pipeline] // node
[Pipeline] }
[Pipeline] // parallel
[Pipeline] stage
[Pipeline] { (Notifications)
[Pipeline] echo
Build result: UNSTABLE
[Pipeline] jiraIssueSelector
[Pipeline] emailext