Build unstable in Jenkins: Maven TLP » maven » MNG-6656 #24

classic Classic list List threaded Threaded
2 messages Options
Reply | Threaded
Open this post in threaded view
|

Build unstable in Jenkins: Maven TLP » maven » MNG-6656 #24

Apache Jenkins Server-2
See https://builds.apache.org/job/maven-box/job/maven/job/MNG-6656/24/

No changes.

38 tests failed.
FAILED:  org.apache.maven.it.IntegrationTestSuite.linux-jdk7 / Run ITs Linux Java 7 / initializationError

Error Message:
org.apache.maven.it.LauncherException: Illegal Maven output: String 'Maven' not found in the following output:
Picked up JAVA_TOOL_OPTIONS: -Dmaven.ext.class.path="/home/jenkins/jenkins-slave/workspace/maven-box_maven_MNG-6656/test@tmp/withMavenc4aff07b/pipeline-maven-spy.jar" -Dorg.jenkinsci.plugins.pipeline.maven.reportsFolder="/home/jenkins/jenkins-slave/workspace/maven-box_maven_MNG-6656/test@tmp/withMavenc4aff07b"
Exception in thread "main" java.lang.UnsupportedClassVersionError: org/apache/maven/cli/MavenCli : Unsupported major.minor version 52.0
at java.lang.ClassLoader.defineClass1(Native Method)
at java.lang.ClassLoader.defineClass(ClassLoader.java:800)
at java.security.SecureClassLoader.defineClass(SecureClassLoader.java:142)
at java.net.URLClassLoader.defineClass(URLClassLoader.java:449)
at java.net.URLClassLoader.access$100(URLClassLoader.java:71)
at java.net.URLClassLoader$1.run(URLClassLoader.java:361)
at java.net.URLClassLoader$1.run(URLClassLoader.java:355)
at java.security.AccessController.doPrivileged(Native Method)
at java.net.URLClassLoader.findClass(URLClassLoader.java:354)
at org.codehaus.plexus.classworlds.realm.ClassRealm.loadClassFromSelf(ClassRealm.java:425)
at org.codehaus.plexus.classworlds.strategy.SelfFirstStrategy.loadClass(SelfFirstStrategy.java:42)
at org.codehaus.plexus.classworlds.realm.ClassRealm.unsynchronizedLoadClass(ClassRealm.java:271)
at org.codehaus.plexus.classworlds.realm.ClassRealm.loadClass(ClassRealm.java:247)
at org.codehaus.plexus.classworlds.realm.ClassRealm.loadClass(ClassRealm.java:239)
at org.codehaus.plexus.classworlds.launcher.Launcher.getMainClass(Launcher.java:140)
at org.codehaus.plexus.classworlds.launcher.Launcher.launchEnhanced(Launcher.java:259)
at org.codehaus.plexus.classworlds.launcher.Launcher.launch(Launcher.java:225)
at org.codehaus.plexus.classworlds.launcher.Launcher.mainWithExitCode(Launcher.java:406)
at org.codehaus.plexus.classworlds.launcher.Launcher.main(Launcher.java:347)

Stack Trace:
org.apache.maven.it.VerificationException:
org.apache.maven.it.LauncherException: Illegal Maven output: String 'Maven' not found in the following output:
Picked up JAVA_TOOL_OPTIONS: -Dmaven.ext.class.path="/home/jenkins/jenkins-slave/workspace/maven-box_maven_MNG-6656/test@tmp/withMavenc4aff07b/pipeline-maven-spy.jar" -Dorg.jenkinsci.plugins.pipeline.maven.reportsFolder="/home/jenkins/jenkins-slave/workspace/maven-box_maven_MNG-6656/test@tmp/withMavenc4aff07b"
Exception in thread "main" java.lang.UnsupportedClassVersionError: org/apache/maven/cli/MavenCli : Unsupported major.minor version 52.0
at java.lang.ClassLoader.defineClass1(Native Method)
at java.lang.ClassLoader.defineClass(ClassLoader.java:800)
at java.security.SecureClassLoader.defineClass(SecureClassLoader.java:142)
at java.net.URLClassLoader.defineClass(URLClassLoader.java:449)
at java.net.URLClassLoader.access$100(URLClassLoader.java:71)
at java.net.URLClassLoader$1.run(URLClassLoader.java:361)
at java.net.URLClassLoader$1.run(URLClassLoader.java:355)
at java.security.AccessController.doPrivileged(Native Method)
at java.net.URLClassLoader.findClass(URLClassLoader.java:354)
at org.codehaus.plexus.classworlds.realm.ClassRealm.loadClassFromSelf(ClassRealm.java:425)
at org.codehaus.plexus.classworlds.strategy.SelfFirstStrategy.loadClass(SelfFirstStrategy.java:42)
at org.codehaus.plexus.classworlds.realm.ClassRealm.unsynchronizedLoadClass(ClassRealm.java:271)
at org.codehaus.plexus.classworlds.realm.ClassRealm.loadClass(ClassRealm.java:247)
at org.codehaus.plexus.classworlds.realm.ClassRealm.loadClass(ClassRealm.java:239)
at org.codehaus.plexus.classworlds.launcher.Launcher.getMainClass(Launcher.java:140)
at org.codehaus.plexus.classworlds.launcher.Launcher.launchEnhanced(Launcher.java:259)
at org.codehaus.plexus.classworlds.launcher.Launcher.launch(Launcher.java:225)
at org.codehaus.plexus.classworlds.launcher.Launcher.mainWithExitCode(Launcher.java:406)
at org.codehaus.plexus.classworlds.launcher.Launcher.main(Launcher.java:347)
        at org.apache.maven.it.IntegrationTestSuite.suite(IntegrationTestSuite.java:54)
Caused by: org.apache.maven.it.LauncherException:
Illegal Maven output: String 'Maven' not found in the following output:
Picked up JAVA_TOOL_OPTIONS: -Dmaven.ext.class.path="/home/jenkins/jenkins-slave/workspace/maven-box_maven_MNG-6656/test@tmp/withMavenc4aff07b/pipeline-maven-spy.jar" -Dorg.jenkinsci.plugins.pipeline.maven.reportsFolder="/home/jenkins/jenkins-slave/workspace/maven-box_maven_MNG-6656/test@tmp/withMavenc4aff07b"
Exception in thread "main" java.lang.UnsupportedClassVersionError: org/apache/maven/cli/MavenCli : Unsupported major.minor version 52.0
at java.lang.ClassLoader.defineClass1(Native Method)
at java.lang.ClassLoader.defineClass(ClassLoader.java:800)
at java.security.SecureClassLoader.defineClass(SecureClassLoader.java:142)
at java.net.URLClassLoader.defineClass(URLClassLoader.java:449)
at java.net.URLClassLoader.access$100(URLClassLoader.java:71)
at java.net.URLClassLoader$1.run(URLClassLoader.java:361)
at java.net.URLClassLoader$1.run(URLClassLoader.java:355)
at java.security.AccessController.doPrivileged(Native Method)
at java.net.URLClassLoader.findClass(URLClassLoader.java:354)
at org.codehaus.plexus.classworlds.realm.ClassRealm.loadClassFromSelf(ClassRealm.java:425)
at org.codehaus.plexus.classworlds.strategy.SelfFirstStrategy.loadClass(SelfFirstStrategy.java:42)
at org.codehaus.plexus.classworlds.realm.ClassRealm.unsynchronizedLoadClass(ClassRealm.java:271)
at org.codehaus.plexus.classworlds.realm.ClassRealm.loadClass(ClassRealm.java:247)
at org.codehaus.plexus.classworlds.realm.ClassRealm.loadClass(ClassRealm.java:239)
at org.codehaus.plexus.classworlds.launcher.Launcher.getMainClass(Launcher.java:140)
at org.codehaus.plexus.classworlds.launcher.Launcher.launchEnhanced(Launcher.java:259)
at org.codehaus.plexus.classworlds.launcher.Launcher.launch(Launcher.java:225)
at org.codehaus.plexus.classworlds.launcher.Launcher.mainWithExitCode(Launcher.java:406)
at org.codehaus.plexus.classworlds.launcher.Launcher.main(Launcher.java:347)
        at org.apache.maven.it.IntegrationTestSuite.suite(IntegrationTestSuite.java:54)


FAILED:  org.apache.maven.it.IntegrationTestSuite.windows-jdk7 / Run ITs Windows Java 7 / initializationError

Error Message:
org.apache.maven.it.LauncherException: Illegal Maven output: String 'Maven' not found in the following output:
Exception in thread "main" java.lang.UnsupportedClassVersionError: org/apache/maven/cli/MavenCli : Unsupported major.minor version 52.0
at java.lang.ClassLoader.defineClass1(Native Method)
at java.lang.ClassLoader.defineClass(ClassLoader.java:800)
at java.security.SecureClassLoader.defineClass(SecureClassLoader.java:142)
at java.net.URLClassLoader.defineClass(URLClassLoader.java:449)
at java.net.URLClassLoader.access$100(URLClassLoader.java:71)
at java.net.URLClassLoader$1.run(URLClassLoader.java:361)
at java.net.URLClassLoader$1.run(URLClassLoader.java:355)
at java.security.AccessController.doPrivileged(Native Method)
at java.net.URLClassLoader.findClass(URLClassLoader.java:354)
at org.codehaus.plexus.classworlds.realm.ClassRealm.loadClassFromSelf(ClassRealm.java:425)
at org.codehaus.plexus.classworlds.strategy.SelfFirstStrategy.loadClass(SelfFirstStrategy.java:42)
at org.codehaus.plexus.classworlds.realm.ClassRealm.unsynchronizedLoadClass(ClassRealm.java:271)
at org.codehaus.plexus.classworlds.realm.ClassRealm.loadClass(ClassRealm.java:247)
at org.codehaus.plexus.classworlds.realm.ClassRealm.loadClass(ClassRealm.java:239)
at org.codehaus.plexus.classworlds.launcher.Launcher.getMainClass(Launcher.java:140)
at org.codehaus.plexus.classworlds.launcher.Launcher.launchEnhanced(Launcher.java:259)
at org.codehaus.plexus.classworlds.launcher.Launcher.launch(Launcher.java:225)
at org.codehaus.plexus.classworlds.launcher.Launcher.mainWithExitCode(Launcher.java:406)
at org.codehaus.plexus.classworlds.launcher.Launcher.main(Launcher.java:347)
Picked up JAVA_TOOL_OPTIONS: -Dmaven.ext.class.path="c:\mvn-it-1.tmp@tmp\withMaven09e48948\pipeline-maven-spy.jar" -Dorg.jenkinsci.plugins.pipeline.maven.reportsFolder="c:\mvn-it-1.tmp@tmp\withMaven09e48948"

Stack Trace:
org.apache.maven.it.VerificationException:
org.apache.maven.it.LauncherException: Illegal Maven output: String 'Maven' not found in the following output:
Exception in thread "main" java.lang.UnsupportedClassVersionError: org/apache/maven/cli/MavenCli : Unsupported major.minor version 52.0
at java.lang.ClassLoader.defineClass1(Native Method)
at java.lang.ClassLoader.defineClass(ClassLoader.java:800)
at java.security.SecureClassLoader.defineClass(SecureClassLoader.java:142)
at java.net.URLClassLoader.defineClass(URLClassLoader.java:449)
at java.net.URLClassLoader.access$100(URLClassLoader.java:71)
at java.net.URLClassLoader$1.run(URLClassLoader.java:361)
at java.net.URLClassLoader$1.run(URLClassLoader.java:355)
at java.security.AccessController.doPrivileged(Native Method)
at java.net.URLClassLoader.findClass(URLClassLoader.java:354)
at org.codehaus.plexus.classworlds.realm.ClassRealm.loadClassFromSelf(ClassRealm.java:425)
at org.codehaus.plexus.classworlds.strategy.SelfFirstStrategy.loadClass(SelfFirstStrategy.java:42)
at org.codehaus.plexus.classworlds.realm.ClassRealm.unsynchronizedLoadClass(ClassRealm.java:271)
at org.codehaus.plexus.classworlds.realm.ClassRealm.loadClass(ClassRealm.java:247)
at org.codehaus.plexus.classworlds.realm.ClassRealm.loadClass(ClassRealm.java:239)
at org.codehaus.plexus.classworlds.launcher.Launcher.getMainClass(Launcher.java:140)
at org.codehaus.plexus.classworlds.launcher.Launcher.launchEnhanced(Launcher.java:259)
at org.codehaus.plexus.classworlds.launcher.Launcher.launch(Launcher.java:225)
at org.codehaus.plexus.classworlds.launcher.Launcher.mainWithExitCode(Launcher.java:406)
at org.codehaus.plexus.classworlds.launcher.Launcher.main(Launcher.java:347)
Picked up JAVA_TOOL_OPTIONS: -Dmaven.ext.class.path="c:\mvn-it-1.tmp@tmp\withMaven09e48948\pipeline-maven-spy.jar" -Dorg.jenkinsci.plugins.pipeline.maven.reportsFolder="c:\mvn-it-1.tmp@tmp\withMaven09e48948"
        at org.apache.maven.it.IntegrationTestSuite.suite(IntegrationTestSuite.java:54)
Caused by: org.apache.maven.it.LauncherException:
Illegal Maven output: String 'Maven' not found in the following output:
Exception in thread "main" java.lang.UnsupportedClassVersionError: org/apache/maven/cli/MavenCli : Unsupported major.minor version 52.0
at java.lang.ClassLoader.defineClass1(Native Method)
at java.lang.ClassLoader.defineClass(ClassLoader.java:800)
at java.security.SecureClassLoader.defineClass(SecureClassLoader.java:142)
at java.net.URLClassLoader.defineClass(URLClassLoader.java:449)
at java.net.URLClassLoader.access$100(URLClassLoader.java:71)
at java.net.URLClassLoader$1.run(URLClassLoader.java:361)
at java.net.URLClassLoader$1.run(URLClassLoader.java:355)
at java.security.AccessController.doPrivileged(Native Method)
at java.net.URLClassLoader.findClass(URLClassLoader.java:354)
at org.codehaus.plexus.classworlds.realm.ClassRealm.loadClassFromSelf(ClassRealm.java:425)
at org.codehaus.plexus.classworlds.strategy.SelfFirstStrategy.loadClass(SelfFirstStrategy.java:42)
at org.codehaus.plexus.classworlds.realm.ClassRealm.unsynchronizedLoadClass(ClassRealm.java:271)
at org.codehaus.plexus.classworlds.realm.ClassRealm.loadClass(ClassRealm.java:247)
at org.codehaus.plexus.classworlds.realm.ClassRealm.loadClass(ClassRealm.java:239)
at org.codehaus.plexus.classworlds.launcher.Launcher.getMainClass(Launcher.java:140)
at org.codehaus.plexus.classworlds.launcher.Launcher.launchEnhanced(Launcher.java:259)
at org.codehaus.plexus.classworlds.launcher.Launcher.launch(Launcher.java:225)
at org.codehaus.plexus.classworlds.launcher.Launcher.mainWithExitCode(Launcher.java:406)
at org.codehaus.plexus.classworlds.launcher.Launcher.main(Launcher.java:347)
Picked up JAVA_TOOL_OPTIONS: -Dmaven.ext.class.path="c:\mvn-it-1.tmp@tmp\withMaven09e48948\pipeline-maven-spy.jar" -Dorg.jenkinsci.plugins.pipeline.maven.reportsFolder="c:\mvn-it-1.tmp@tmp\withMaven09e48948"
        at org.apache.maven.it.IntegrationTestSuite.suite(IntegrationTestSuite.java:54)


FAILED:  org.apache.maven.it.MavenITmng1803PomValidationErrorIncludesLineNumberTest.linux-jdk8 / Run ITs Linux Java 8 / testit

Error Message:
Line number not found in: [ERROR] 'dependencies.dependency.artifactId' for org.apache.maven.its.mng1803::::bad/id::::jar with value ':::bad/id:::' does not match a valid id pattern. @

Stack Trace:
junit.framework.AssertionFailedError: Line number not found in: [ERROR] 'dependencies.dependency.artifactId' for org.apache.maven.its.mng1803::::bad/id::::jar with value ':::bad/id:::' does not match a valid id pattern. @
        at org.apache.maven.it.MavenITmng1803PomValidationErrorIncludesLineNumberTest.testit(MavenITmng1803PomValidationErrorIncludesLineNumberTest.java:71)


FAILED:  org.apache.maven.it.MavenITmng1803PomValidationErrorIncludesLineNumberTest.linux-jdk12 / Run ITs Linux Java 12 / testit

Error Message:
Line number not found in: [ERROR] 'dependencies.dependency.artifactId' for org.apache.maven.its.mng1803::::bad/id::::jar with value ':::bad/id:::' does not match a valid id pattern. @

Stack Trace:
junit.framework.AssertionFailedError: Line number not found in: [ERROR] 'dependencies.dependency.artifactId' for org.apache.maven.its.mng1803::::bad/id::::jar with value ':::bad/id:::' does not match a valid id pattern. @
        at org.apache.maven.it.MavenITmng1803PomValidationErrorIncludesLineNumberTest.testit(MavenITmng1803PomValidationErrorIncludesLineNumberTest.java:71)


FAILED:  org.apache.maven.it.MavenITmng1803PomValidationErrorIncludesLineNumberTest.linux-jdk11 / Run ITs Linux Java 11 / testit

Error Message:
Line number not found in: [ERROR] 'dependencies.dependency.artifactId' for org.apache.maven.its.mng1803::::bad/id::::jar with value ':::bad/id:::' does not match a valid id pattern. @

Stack Trace:
junit.framework.AssertionFailedError: Line number not found in: [ERROR] 'dependencies.dependency.artifactId' for org.apache.maven.its.mng1803::::bad/id::::jar with value ':::bad/id:::' does not match a valid id pattern. @
        at org.apache.maven.it.MavenITmng1803PomValidationErrorIncludesLineNumberTest.testit(MavenITmng1803PomValidationErrorIncludesLineNumberTest.java:71)


FAILED:  org.apache.maven.it.MavenITmng1803PomValidationErrorIncludesLineNumberTest.windows-jdk8 / Run ITs Windows Java 8 / testit

Error Message:
Line number not found in: [ERROR] 'dependencies.dependency.artifactId' for org.apache.maven.its.mng1803::::bad/id::::jar with value ':::bad/id:::' does not match a valid id pattern. @

Stack Trace:
junit.framework.AssertionFailedError: Line number not found in: [ERROR] 'dependencies.dependency.artifactId' for org.apache.maven.its.mng1803::::bad/id::::jar with value ':::bad/id:::' does not match a valid id pattern. @
        at org.apache.maven.it.MavenITmng1803PomValidationErrorIncludesLineNumberTest.testit(MavenITmng1803PomValidationErrorIncludesLineNumberTest.java:71)


FAILED:  org.apache.maven.it.MavenITmng1803PomValidationErrorIncludesLineNumberTest.windows-jdk12 / Run ITs Windows Java 12 / testit

Error Message:
Line number not found in: [ERROR] 'dependencies.dependency.artifactId' for org.apache.maven.its.mng1803::::bad/id::::jar with value ':::bad/id:::' does not match a valid id pattern. @

Stack Trace:
junit.framework.AssertionFailedError: Line number not found in: [ERROR] 'dependencies.dependency.artifactId' for org.apache.maven.its.mng1803::::bad/id::::jar with value ':::bad/id:::' does not match a valid id pattern. @
        at org.apache.maven.it.MavenITmng1803PomValidationErrorIncludesLineNumberTest.testit(MavenITmng1803PomValidationErrorIncludesLineNumberTest.java:71)


FAILED:  org.apache.maven.it.MavenITmng1803PomValidationErrorIncludesLineNumberTest.windows-jdk11 / Run ITs Windows Java 11 / testit

Error Message:
Line number not found in: [ERROR] 'dependencies.dependency.artifactId' for org.apache.maven.its.mng1803::::bad/id::::jar with value ':::bad/id:::' does not match a valid id pattern. @

Stack Trace:
junit.framework.AssertionFailedError: Line number not found in: [ERROR] 'dependencies.dependency.artifactId' for org.apache.maven.its.mng1803::::bad/id::::jar with value ':::bad/id:::' does not match a valid id pattern. @
        at org.apache.maven.it.MavenITmng1803PomValidationErrorIncludesLineNumberTest.testit(MavenITmng1803PomValidationErrorIncludesLineNumberTest.java:71)


FAILED:  org.apache.maven.it.MavenITmng2362DeployedPomEncodingTest.linux-jdk8 / Run ITs Linux Java 8 / testit

Error Message:
Corrupt data TEST-CHARS: Ã&#159 in /home/jenkins/jenkins-slave/workspace/maven-box_maven_MNG-6656/test/it-local-repo/org/apache/maven/its/mng2362/utf-8/0.1/utf-8-0.1.pom

Stack Trace:
junit.framework.AssertionFailedError: Corrupt data TEST-CHARS: Ã&#159 in /home/jenkins/jenkins-slave/workspace/maven-box_maven_MNG-6656/test/it-local-repo/org/apache/maven/its/mng2362/utf-8/0.1/utf-8-0.1.pom
        at org.apache.maven.it.MavenITmng2362DeployedPomEncodingTest.assertPom(MavenITmng2362DeployedPomEncodingTest.java:95)
        at org.apache.maven.it.MavenITmng2362DeployedPomEncodingTest.assertPomUtf8(MavenITmng2362DeployedPomEncodingTest.java:79)
        at org.apache.maven.it.MavenITmng2362DeployedPomEncodingTest.testit(MavenITmng2362DeployedPomEncodingTest.java:62)


FAILED:  org.apache.maven.it.MavenITmng2362DeployedPomEncodingTest.linux-jdk12 / Run ITs Linux Java 12 / testit

Error Message:
Corrupt data TEST-CHARS: Ã&#159 in /home/jenkins/jenkins-slave/workspace/maven-box_maven_MNG-6656/test/it-local-repo/org/apache/maven/its/mng2362/utf-8/0.1/utf-8-0.1.pom

Stack Trace:
junit.framework.AssertionFailedError: Corrupt data TEST-CHARS: Ã&#159 in /home/jenkins/jenkins-slave/workspace/maven-box_maven_MNG-6656/test/it-local-repo/org/apache/maven/its/mng2362/utf-8/0.1/utf-8-0.1.pom
        at org.apache.maven.it.MavenITmng2362DeployedPomEncodingTest.assertPom(MavenITmng2362DeployedPomEncodingTest.java:95)
        at org.apache.maven.it.MavenITmng2362DeployedPomEncodingTest.assertPomUtf8(MavenITmng2362DeployedPomEncodingTest.java:79)
        at org.apache.maven.it.MavenITmng2362DeployedPomEncodingTest.testit(MavenITmng2362DeployedPomEncodingTest.java:62)


FAILED:  org.apache.maven.it.MavenITmng2362DeployedPomEncodingTest.linux-jdk11 / Run ITs Linux Java 11 / testit

Error Message:
Corrupt data TEST-CHARS: Ã&#159 in /home/jenkins/jenkins-slave/workspace/maven-box_maven_MNG-6656@2/test/it-local-repo/org/apache/maven/its/mng2362/utf-8/0.1/utf-8-0.1.pom

Stack Trace:
junit.framework.AssertionFailedError: Corrupt data TEST-CHARS: Ã&#159 in /home/jenkins/jenkins-slave/workspace/maven-box_maven_MNG-6656@2/test/it-local-repo/org/apache/maven/its/mng2362/utf-8/0.1/utf-8-0.1.pom
        at org.apache.maven.it.MavenITmng2362DeployedPomEncodingTest.assertPom(MavenITmng2362DeployedPomEncodingTest.java:95)
        at org.apache.maven.it.MavenITmng2362DeployedPomEncodingTest.assertPomUtf8(MavenITmng2362DeployedPomEncodingTest.java:79)
        at org.apache.maven.it.MavenITmng2362DeployedPomEncodingTest.testit(MavenITmng2362DeployedPomEncodingTest.java:62)


FAILED:  org.apache.maven.it.MavenITmng2362DeployedPomEncodingTest.windows-jdk8 / Run ITs Windows Java 8 / testit

Error Message:
Corrupt data TEST-CHARS: ßıΣ in c:\mvn-it-1.tmp\it-local-repo\org\apache\maven\its\mng2362\utf-8\0.1\utf-8-0.1.pom

Stack Trace:
junit.framework.AssertionFailedError: Corrupt data TEST-CHARS: ßıΣ in c:\mvn-it-1.tmp\it-local-repo\org\apache\maven\its\mng2362\utf-8\0.1\utf-8-0.1.pom
        at org.apache.maven.it.MavenITmng2362DeployedPomEncodingTest.assertPom(MavenITmng2362DeployedPomEncodingTest.java:95)
        at org.apache.maven.it.MavenITmng2362DeployedPomEncodingTest.assertPomUtf8(MavenITmng2362DeployedPomEncodingTest.java:79)
        at org.apache.maven.it.MavenITmng2362DeployedPomEncodingTest.testit(MavenITmng2362DeployedPomEncodingTest.java:62)


FAILED:  org.apache.maven.it.MavenITmng2362DeployedPomEncodingTest.windows-jdk12 / Run ITs Windows Java 12 / testit

Error Message:
Corrupt data TEST-CHARS: ßıΣ in c:\mvn-it-0.tmp\it-local-repo\org\apache\maven\its\mng2362\utf-8\0.1\utf-8-0.1.pom

Stack Trace:
junit.framework.AssertionFailedError: Corrupt data TEST-CHARS: ßıΣ in c:\mvn-it-0.tmp\it-local-repo\org\apache\maven\its\mng2362\utf-8\0.1\utf-8-0.1.pom
        at org.apache.maven.it.MavenITmng2362DeployedPomEncodingTest.assertPom(MavenITmng2362DeployedPomEncodingTest.java:95)
        at org.apache.maven.it.MavenITmng2362DeployedPomEncodingTest.assertPomUtf8(MavenITmng2362DeployedPomEncodingTest.java:79)
        at org.apache.maven.it.MavenITmng2362DeployedPomEncodingTest.testit(MavenITmng2362DeployedPomEncodingTest.java:62)


FAILED:  org.apache.maven.it.MavenITmng2362DeployedPomEncodingTest.windows-jdk11 / Run ITs Windows Java 11 / testit

Error Message:
Corrupt data TEST-CHARS: ßıΣ in c:\mvn-it-1.tmp\it-local-repo\org\apache\maven\its\mng2362\utf-8\0.1\utf-8-0.1.pom

Stack Trace:
junit.framework.AssertionFailedError: Corrupt data TEST-CHARS: ßıΣ in c:\mvn-it-1.tmp\it-local-repo\org\apache\maven\its\mng2362\utf-8\0.1\utf-8-0.1.pom
        at org.apache.maven.it.MavenITmng2362DeployedPomEncodingTest.assertPom(MavenITmng2362DeployedPomEncodingTest.java:95)
        at org.apache.maven.it.MavenITmng2362DeployedPomEncodingTest.assertPomUtf8(MavenITmng2362DeployedPomEncodingTest.java:79)
        at org.apache.maven.it.MavenITmng2362DeployedPomEncodingTest.testit(MavenITmng2362DeployedPomEncodingTest.java:62)


FAILED:  org.apache.maven.it.MavenITmng2199ParentVersionRangeTest.linux-jdk8 / Run ITs Linux Java 8 / testValidParentVersionRangeInvalidVersionExpression

Error Message:
Expected error message not found.

Stack Trace:
junit.framework.AssertionFailedError: Expected error message not found.
        at org.apache.maven.it.MavenITmng2199ParentVersionRangeTest.testValidParentVersionRangeInvalidVersionExpression(MavenITmng2199ParentVersionRangeTest.java:152)


FAILED:  org.apache.maven.it.MavenITmng2199ParentVersionRangeTest.linux-jdk8 / Run ITs Linux Java 8 / testValidParentVersionRangeInvalidVersionInheritance

Error Message:
Expected error message not found.

Stack Trace:
junit.framework.AssertionFailedError: Expected error message not found.
        at org.apache.maven.it.MavenITmng2199ParentVersionRangeTest.testValidParentVersionRangeInvalidVersionInheritance(MavenITmng2199ParentVersionRangeTest.java:183)


FAILED:  org.apache.maven.it.MavenITmng2199ParentVersionRangeTest.linux-jdk8 / Run ITs Linux Java 8 / testValidLocalParentVersionRangeInvalidVersionExpression

Error Message:
Expected error message not found.

Stack Trace:
junit.framework.AssertionFailedError: Expected error message not found.
        at org.apache.maven.it.MavenITmng2199ParentVersionRangeTest.testValidLocalParentVersionRangeInvalidVersionExpression(MavenITmng2199ParentVersionRangeTest.java:311)


FAILED:  org.apache.maven.it.MavenITmng2199ParentVersionRangeTest.linux-jdk8 / Run ITs Linux Java 8 / testValidLocalParentVersionRangeInvalidVersionInheritance

Error Message:
Expected error message not found.

Stack Trace:
junit.framework.AssertionFailedError: Expected error message not found.
        at org.apache.maven.it.MavenITmng2199ParentVersionRangeTest.testValidLocalParentVersionRangeInvalidVersionInheritance(MavenITmng2199ParentVersionRangeTest.java:341)


FAILED:  org.apache.maven.it.MavenITmng2199ParentVersionRangeTest.linux-jdk12 / Run ITs Linux Java 12 / testValidParentVersionRangeInvalidVersionExpression

Error Message:
Expected error message not found.

Stack Trace:
junit.framework.AssertionFailedError: Expected error message not found.
        at org.apache.maven.it.MavenITmng2199ParentVersionRangeTest.testValidParentVersionRangeInvalidVersionExpression(MavenITmng2199ParentVersionRangeTest.java:152)


FAILED:  org.apache.maven.it.MavenITmng2199ParentVersionRangeTest.linux-jdk12 / Run ITs Linux Java 12 / testValidParentVersionRangeInvalidVersionInheritance

Error Message:
Expected error message not found.

Stack Trace:
junit.framework.AssertionFailedError: Expected error message not found.
        at org.apache.maven.it.MavenITmng2199ParentVersionRangeTest.testValidParentVersionRangeInvalidVersionInheritance(MavenITmng2199ParentVersionRangeTest.java:183)


FAILED:  org.apache.maven.it.MavenITmng2199ParentVersionRangeTest.linux-jdk12 / Run ITs Linux Java 12 / testValidLocalParentVersionRangeInvalidVersionExpression

Error Message:
Expected error message not found.

Stack Trace:
junit.framework.AssertionFailedError: Expected error message not found.
        at org.apache.maven.it.MavenITmng2199ParentVersionRangeTest.testValidLocalParentVersionRangeInvalidVersionExpression(MavenITmng2199ParentVersionRangeTest.java:311)


FAILED:  org.apache.maven.it.MavenITmng2199ParentVersionRangeTest.linux-jdk12 / Run ITs Linux Java 12 / testValidLocalParentVersionRangeInvalidVersionInheritance

Error Message:
Expected error message not found.

Stack Trace:
junit.framework.AssertionFailedError: Expected error message not found.
        at org.apache.maven.it.MavenITmng2199ParentVersionRangeTest.testValidLocalParentVersionRangeInvalidVersionInheritance(MavenITmng2199ParentVersionRangeTest.java:341)


FAILED:  org.apache.maven.it.MavenITmng2199ParentVersionRangeTest.linux-jdk11 / Run ITs Linux Java 11 / testValidParentVersionRangeInvalidVersionExpression

Error Message:
Expected error message not found.

Stack Trace:
junit.framework.AssertionFailedError: Expected error message not found.
        at org.apache.maven.it.MavenITmng2199ParentVersionRangeTest.testValidParentVersionRangeInvalidVersionExpression(MavenITmng2199ParentVersionRangeTest.java:152)


FAILED:  org.apache.maven.it.MavenITmng2199ParentVersionRangeTest.linux-jdk11 / Run ITs Linux Java 11 / testValidParentVersionRangeInvalidVersionInheritance

Error Message:
Expected error message not found.

Stack Trace:
junit.framework.AssertionFailedError: Expected error message not found.
        at org.apache.maven.it.MavenITmng2199ParentVersionRangeTest.testValidParentVersionRangeInvalidVersionInheritance(MavenITmng2199ParentVersionRangeTest.java:183)


FAILED:  org.apache.maven.it.MavenITmng2199ParentVersionRangeTest.linux-jdk11 / Run ITs Linux Java 11 / testValidLocalParentVersionRangeInvalidVersionExpression

Error Message:
Expected error message not found.

Stack Trace:
junit.framework.AssertionFailedError: Expected error message not found.
        at org.apache.maven.it.MavenITmng2199ParentVersionRangeTest.testValidLocalParentVersionRangeInvalidVersionExpression(MavenITmng2199ParentVersionRangeTest.java:311)


FAILED:  org.apache.maven.it.MavenITmng2199ParentVersionRangeTest.linux-jdk11 / Run ITs Linux Java 11 / testValidLocalParentVersionRangeInvalidVersionInheritance

Error Message:
Expected error message not found.

Stack Trace:
junit.framework.AssertionFailedError: Expected error message not found.
        at org.apache.maven.it.MavenITmng2199ParentVersionRangeTest.testValidLocalParentVersionRangeInvalidVersionInheritance(MavenITmng2199ParentVersionRangeTest.java:341)


FAILED:  org.apache.maven.it.MavenITmng2199ParentVersionRangeTest.windows-jdk8 / Run ITs Windows Java 8 / testValidParentVersionRangeInvalidVersionExpression

Error Message:
Expected error message not found.

Stack Trace:
junit.framework.AssertionFailedError: Expected error message not found.
        at org.apache.maven.it.MavenITmng2199ParentVersionRangeTest.testValidParentVersionRangeInvalidVersionExpression(MavenITmng2199ParentVersionRangeTest.java:152)


FAILED:  org.apache.maven.it.MavenITmng2199ParentVersionRangeTest.windows-jdk8 / Run ITs Windows Java 8 / testValidParentVersionRangeInvalidVersionInheritance

Error Message:
Expected error message not found.

Stack Trace:
junit.framework.AssertionFailedError: Expected error message not found.
        at org.apache.maven.it.MavenITmng2199ParentVersionRangeTest.testValidParentVersionRangeInvalidVersionInheritance(MavenITmng2199ParentVersionRangeTest.java:183)


FAILED:  org.apache.maven.it.MavenITmng2199ParentVersionRangeTest.windows-jdk8 / Run ITs Windows Java 8 / testValidLocalParentVersionRangeInvalidVersionExpression

Error Message:
Expected error message not found.

Stack Trace:
junit.framework.AssertionFailedError: Expected error message not found.
        at org.apache.maven.it.MavenITmng2199ParentVersionRangeTest.testValidLocalParentVersionRangeInvalidVersionExpression(MavenITmng2199ParentVersionRangeTest.java:311)


FAILED:  org.apache.maven.it.MavenITmng2199ParentVersionRangeTest.windows-jdk8 / Run ITs Windows Java 8 / testValidLocalParentVersionRangeInvalidVersionInheritance

Error Message:
Expected error message not found.

Stack Trace:
junit.framework.AssertionFailedError: Expected error message not found.
        at org.apache.maven.it.MavenITmng2199ParentVersionRangeTest.testValidLocalParentVersionRangeInvalidVersionInheritance(MavenITmng2199ParentVersionRangeTest.java:341)


FAILED:  org.apache.maven.it.MavenITmng2199ParentVersionRangeTest.windows-jdk12 / Run ITs Windows Java 12 / testValidParentVersionRangeInvalidVersionExpression

Error Message:
Expected error message not found.

Stack Trace:
junit.framework.AssertionFailedError: Expected error message not found.
        at org.apache.maven.it.MavenITmng2199ParentVersionRangeTest.testValidParentVersionRangeInvalidVersionExpression(MavenITmng2199ParentVersionRangeTest.java:152)


FAILED:  org.apache.maven.it.MavenITmng2199ParentVersionRangeTest.windows-jdk12 / Run ITs Windows Java 12 / testValidParentVersionRangeInvalidVersionInheritance

Error Message:
Expected error message not found.

Stack Trace:
junit.framework.AssertionFailedError: Expected error message not found.
        at org.apache.maven.it.MavenITmng2199ParentVersionRangeTest.testValidParentVersionRangeInvalidVersionInheritance(MavenITmng2199ParentVersionRangeTest.java:183)


FAILED:  org.apache.maven.it.MavenITmng2199ParentVersionRangeTest.windows-jdk12 / Run ITs Windows Java 12 / testValidLocalParentVersionRangeInvalidVersionExpression

Error Message:
Expected error message not found.

Stack Trace:
junit.framework.AssertionFailedError: Expected error message not found.
        at org.apache.maven.it.MavenITmng2199ParentVersionRangeTest.testValidLocalParentVersionRangeInvalidVersionExpression(MavenITmng2199ParentVersionRangeTest.java:311)


FAILED:  org.apache.maven.it.MavenITmng2199ParentVersionRangeTest.windows-jdk12 / Run ITs Windows Java 12 / testValidLocalParentVersionRangeInvalidVersionInheritance

Error Message:
Expected error message not found.

Stack Trace:
junit.framework.AssertionFailedError: Expected error message not found.
        at org.apache.maven.it.MavenITmng2199ParentVersionRangeTest.testValidLocalParentVersionRangeInvalidVersionInheritance(MavenITmng2199ParentVersionRangeTest.java:341)


FAILED:  org.apache.maven.it.MavenITmng2199ParentVersionRangeTest.windows-jdk11 / Run ITs Windows Java 11 / testValidParentVersionRangeInvalidVersionExpression

Error Message:
Expected error message not found.

Stack Trace:
junit.framework.AssertionFailedError: Expected error message not found.
        at org.apache.maven.it.MavenITmng2199ParentVersionRangeTest.testValidParentVersionRangeInvalidVersionExpression(MavenITmng2199ParentVersionRangeTest.java:152)


FAILED:  org.apache.maven.it.MavenITmng2199ParentVersionRangeTest.windows-jdk11 / Run ITs Windows Java 11 / testValidParentVersionRangeInvalidVersionInheritance

Error Message:
Expected error message not found.

Stack Trace:
junit.framework.AssertionFailedError: Expected error message not found.
        at org.apache.maven.it.MavenITmng2199ParentVersionRangeTest.testValidParentVersionRangeInvalidVersionInheritance(MavenITmng2199ParentVersionRangeTest.java:183)


FAILED:  org.apache.maven.it.MavenITmng2199ParentVersionRangeTest.windows-jdk11 / Run ITs Windows Java 11 / testValidLocalParentVersionRangeInvalidVersionExpression

Error Message:
Expected error message not found.

Stack Trace:
junit.framework.AssertionFailedError: Expected error message not found.
        at org.apache.maven.it.MavenITmng2199ParentVersionRangeTest.testValidLocalParentVersionRangeInvalidVersionExpression(MavenITmng2199ParentVersionRangeTest.java:311)


FAILED:  org.apache.maven.it.MavenITmng2199ParentVersionRangeTest.windows-jdk11 / Run ITs Windows Java 11 / testValidLocalParentVersionRangeInvalidVersionInheritance

Error Message:
Expected error message not found.

Stack Trace:
junit.framework.AssertionFailedError: Expected error message not found.
        at org.apache.maven.it.MavenITmng2199ParentVersionRangeTest.testValidLocalParentVersionRangeInvalidVersionInheritance(MavenITmng2199ParentVersionRangeTest.java:341)




Build log:
[...truncated 76254 lines...]
[withMaven] artifactsPublisher - Archive artifact core-it-support\core-it-plugins\maven-it-plugin-online\pom.xml under org\apache\maven\its\plugins\maven-it-plugin-online\2.1-SNAPSHOT\maven-it-plugin-online-2.1-SNAPSHOT.pom
[withMaven] artifactsPublisher - Archive artifact core-it-support\core-it-plugins\maven-it-plugin-online\target\maven-it-plugin-online-2.1-SNAPSHOT.jar under org\apache\maven\its\plugins\maven-it-plugin-online\2.1-SNAPSHOT\maven-it-plugin-online-2.1-SNAPSHOT.jar
[withMaven] artifactsPublisher - Archive artifact core-it-support\core-it-plugins\maven-it-plugin-optional-mojos\pom.xml under org\apache\maven\its\plugins\maven-it-plugin-optional-mojos\2.1-SNAPSHOT\maven-it-plugin-optional-mojos-2.1-SNAPSHOT.pom
[withMaven] artifactsPublisher - Archive artifact core-it-support\core-it-plugins\maven-it-plugin-optional-mojos\target\maven-it-plugin-optional-mojos-2.1-SNAPSHOT.jar under org\apache\maven\its\plugins\maven-it-plugin-optional-mojos\2.1-SNAPSHOT\maven-it-plugin-optional-mojos-2.1-SNAPSHOT.jar
[withMaven] artifactsPublisher - Archive artifact core-it-support\core-it-plugins\maven-it-plugin-packaging\pom.xml under org\apache\maven\its\plugins\maven-it-plugin-packaging\2.1-SNAPSHOT\maven-it-plugin-packaging-2.1-SNAPSHOT.pom
[withMaven] artifactsPublisher - Archive artifact core-it-support\core-it-plugins\maven-it-plugin-packaging\target\maven-it-plugin-packaging-2.1-SNAPSHOT.jar under org\apache\maven\its\plugins\maven-it-plugin-packaging\2.1-SNAPSHOT\maven-it-plugin-packaging-2.1-SNAPSHOT.jar
[withMaven] artifactsPublisher - Archive artifact core-it-support\core-it-plugins\maven-it-plugin-parameter-implementation\pom.xml under org\apache\maven\its\plugins\maven-it-plugin-parameter-implementation\2.1-SNAPSHOT\maven-it-plugin-parameter-implementation-2.1-SNAPSHOT.pom
[withMaven] artifactsPublisher - Archive artifact core-it-support\core-it-plugins\maven-it-plugin-parameter-implementation\target\maven-it-plugin-parameter-implementation-2.1-SNAPSHOT.jar under org\apache\maven\its\plugins\maven-it-plugin-parameter-implementation\2.1-SNAPSHOT\maven-it-plugin-parameter-implementation-2.1-SNAPSHOT.jar
[withMaven] artifactsPublisher - Archive artifact core-it-support\core-it-plugins\maven-it-plugin-plugin-dependency\pom.xml under org\apache\maven\its\plugins\maven-it-plugin-plugin-dependency\2.1-SNAPSHOT\maven-it-plugin-plugin-dependency-2.1-SNAPSHOT.pom
[withMaven] artifactsPublisher - Archive artifact core-it-support\core-it-plugins\maven-it-plugin-plugin-dependency\target\maven-it-plugin-plugin-dependency-2.1-SNAPSHOT.jar under org\apache\maven\its\plugins\maven-it-plugin-plugin-dependency\2.1-SNAPSHOT\maven-it-plugin-plugin-dependency-2.1-SNAPSHOT.jar
[withMaven] artifactsPublisher - Archive artifact core-it-support\core-it-plugins\maven-it-plugin-project\pom.xml under org\apache\maven\its\plugins\maven-it-plugin-project\2.1-SNAPSHOT\maven-it-plugin-project-2.1-SNAPSHOT.pom
[withMaven] artifactsPublisher - Archive artifact core-it-support\core-it-plugins\maven-it-plugin-project\target\maven-it-plugin-project-2.1-SNAPSHOT.jar under org\apache\maven\its\plugins\maven-it-plugin-project\2.1-SNAPSHOT\maven-it-plugin-project-2.1-SNAPSHOT.jar
[withMaven] artifactsPublisher - Archive artifact core-it-support\core-it-plugins\maven-it-plugin-project-interpolation\pom.xml under org\apache\maven\its\plugins\maven-it-plugin-project-interpolation\2.1-SNAPSHOT\maven-it-plugin-project-interpolation-2.1-SNAPSHOT.pom
[withMaven] artifactsPublisher - Archive artifact core-it-support\core-it-plugins\maven-it-plugin-project-interpolation\target\maven-it-plugin-project-interpolation-2.1-SNAPSHOT.jar under org\apache\maven\its\plugins\maven-it-plugin-project-interpolation\2.1-SNAPSHOT\maven-it-plugin-project-interpolation-2.1-SNAPSHOT.jar
[withMaven] artifactsPublisher - Archive artifact core-it-support\core-it-plugins\maven-it-plugin-setter\pom.xml under org\apache\maven\its\plugins\maven-it-plugin-setter\2.1-SNAPSHOT\maven-it-plugin-setter-2.1-SNAPSHOT.pom
[withMaven] artifactsPublisher - Archive artifact core-it-support\core-it-plugins\maven-it-plugin-setter\target\maven-it-plugin-setter-2.1-SNAPSHOT.jar under org\apache\maven\its\plugins\maven-it-plugin-setter\2.1-SNAPSHOT\maven-it-plugin-setter-2.1-SNAPSHOT.jar
[withMaven] artifactsPublisher - Archive artifact core-it-support\core-it-plugins\maven-it-plugin-singleton-component\pom.xml under org\apache\maven\its\plugins\maven-it-plugin-singleton-component\2.1-SNAPSHOT\maven-it-plugin-singleton-component-2.1-SNAPSHOT.pom
[withMaven] artifactsPublisher - Archive artifact core-it-support\core-it-plugins\maven-it-plugin-singleton-component\target\maven-it-plugin-singleton-component-2.1-SNAPSHOT.jar under org\apache\maven\its\plugins\maven-it-plugin-singleton-component\2.1-SNAPSHOT\maven-it-plugin-singleton-component-2.1-SNAPSHOT.jar
[withMaven] artifactsPublisher - Archive artifact core-it-support\core-it-plugins\maven-it-plugin-site\pom.xml under org\apache\maven\its\plugins\maven-it-plugin-site\2.1-SNAPSHOT\maven-it-plugin-site-2.1-SNAPSHOT.pom
[withMaven] artifactsPublisher - Archive artifact core-it-support\core-it-plugins\maven-it-plugin-site\target\maven-it-plugin-site-2.1-SNAPSHOT.jar under org\apache\maven\its\plugins\maven-it-plugin-site\2.1-SNAPSHOT\maven-it-plugin-site-2.1-SNAPSHOT.jar
[withMaven] artifactsPublisher - Archive artifact core-it-support\core-it-plugins\maven-it-plugin-toolchain\pom.xml under org\apache\maven\its\plugins\maven-it-plugin-toolchain\2.1-SNAPSHOT\maven-it-plugin-toolchain-2.1-SNAPSHOT.pom
[withMaven] artifactsPublisher - Archive artifact core-it-support\core-it-plugins\maven-it-plugin-toolchain\target\maven-it-plugin-toolchain-2.1-SNAPSHOT.jar under org\apache\maven\its\plugins\maven-it-plugin-toolchain\2.1-SNAPSHOT\maven-it-plugin-toolchain-2.1-SNAPSHOT.jar
[withMaven] artifactsPublisher - Archive artifact core-it-support\core-it-plugins\maven-it-plugin-touch\pom.xml under org\apache\maven\its\plugins\maven-it-plugin-touch\2.1-SNAPSHOT\maven-it-plugin-touch-2.1-SNAPSHOT.pom
[withMaven] artifactsPublisher - Archive artifact core-it-support\core-it-plugins\maven-it-plugin-touch\target\maven-it-plugin-touch-2.1-SNAPSHOT.jar under org\apache\maven\its\plugins\maven-it-plugin-touch\2.1-SNAPSHOT\maven-it-plugin-touch-2.1-SNAPSHOT.jar
[withMaven] artifactsPublisher - Archive artifact core-it-support\core-it-plugins\maven-it-plugin-uses-properties\pom.xml under org\apache\maven\its\plugins\maven-it-plugin-uses-properties\2.1-SNAPSHOT\maven-it-plugin-uses-properties-2.1-SNAPSHOT.pom
[withMaven] artifactsPublisher - Archive artifact core-it-support\core-it-plugins\maven-it-plugin-uses-properties\target\maven-it-plugin-uses-properties-2.1-SNAPSHOT.jar under org\apache\maven\its\plugins\maven-it-plugin-uses-properties\2.1-SNAPSHOT\maven-it-plugin-uses-properties-2.1-SNAPSHOT.jar
[withMaven] artifactsPublisher - Archive artifact core-it-support\core-it-plugins\maven-it-plugin-uses-wagon\pom.xml under org\apache\maven\its\plugins\maven-it-plugin-uses-wagon\2.1-SNAPSHOT\maven-it-plugin-uses-wagon-2.1-SNAPSHOT.pom
[withMaven] artifactsPublisher - Archive artifact core-it-support\core-it-plugins\maven-it-plugin-uses-wagon\target\maven-it-plugin-uses-wagon-2.1-SNAPSHOT.jar under org\apache\maven\its\plugins\maven-it-plugin-uses-wagon\2.1-SNAPSHOT\maven-it-plugin-uses-wagon-2.1-SNAPSHOT.jar
[withMaven] artifactsPublisher - Archive artifact core-it-support\core-it-plugins\maven-it-plugin-all\pom.xml under org\apache\maven\its\plugins\maven-it-plugin-all\2.1-SNAPSHOT\maven-it-plugin-all-2.1-SNAPSHOT.pom
[withMaven] artifactsPublisher - Archive artifact core-it-support\core-it-plugins\maven-it-plugin-all\target\maven-it-plugin-all-2.1-SNAPSHOT.jar under org\apache\maven\its\plugins\maven-it-plugin-all\2.1-SNAPSHOT\maven-it-plugin-all-2.1-SNAPSHOT.jar
[withMaven] artifactsPublisher - Archive artifact core-it-support\core-it-plugins\maven-it-plugin-plexus-utils-11\pom.xml under org\apache\maven\its\plugins\maven-it-plugin-plexus-utils-11\2.1-SNAPSHOT\maven-it-plugin-plexus-utils-11-2.1-SNAPSHOT.pom
[withMaven] artifactsPublisher - Archive artifact core-it-support\core-it-plugins\maven-it-plugin-plexus-utils-11\target\maven-it-plugin-plexus-utils-11-2.1-SNAPSHOT.jar under org\apache\maven\its\plugins\maven-it-plugin-plexus-utils-11\2.1-SNAPSHOT\maven-it-plugin-plexus-utils-11-2.1-SNAPSHOT.jar
[withMaven] artifactsPublisher - Archive artifact core-it-support\core-it-plugins\maven-it-plugin-plexus-utils-new\pom.xml under org\apache\maven\its\plugins\maven-it-plugin-plexus-utils-new\2.1-SNAPSHOT\maven-it-plugin-plexus-utils-new-2.1-SNAPSHOT.pom
[withMaven] artifactsPublisher - Archive artifact core-it-support\core-it-plugins\maven-it-plugin-plexus-utils-new\target\maven-it-plugin-plexus-utils-new-2.1-SNAPSHOT.jar under org\apache\maven\its\plugins\maven-it-plugin-plexus-utils-new\2.1-SNAPSHOT\maven-it-plugin-plexus-utils-new-2.1-SNAPSHOT.jar
[withMaven] artifactsPublisher - Archive artifact core-it-support\core-it-plugins\maven-it-plugin-plexus-component-api\pom.xml under org\apache\maven\its\plugins\maven-it-plugin-plexus-component-api\2.1-SNAPSHOT\maven-it-plugin-plexus-component-api-2.1-SNAPSHOT.pom
[withMaven] artifactsPublisher - Archive artifact core-it-support\core-it-plugins\maven-it-plugin-plexus-component-api\target\maven-it-plugin-plexus-component-api-2.1-SNAPSHOT.jar under org\apache\maven\its\plugins\maven-it-plugin-plexus-component-api\2.1-SNAPSHOT\maven-it-plugin-plexus-component-api-2.1-SNAPSHOT.jar
[withMaven] artifactsPublisher - Archive artifact core-it-support\core-it-plugins\maven-it-plugin-log4j\pom.xml under org\apache\maven\its\plugins\maven-it-plugin-log4j\2.1-SNAPSHOT\maven-it-plugin-log4j-2.1-SNAPSHOT.pom
[withMaven] artifactsPublisher - Archive artifact core-it-support\core-it-plugins\maven-it-plugin-log4j\target\maven-it-plugin-log4j-2.1-SNAPSHOT.jar under org\apache\maven\its\plugins\maven-it-plugin-log4j\2.1-SNAPSHOT\maven-it-plugin-log4j-2.1-SNAPSHOT.jar
[withMaven] artifactsPublisher - Archive artifact core-it-support\core-it-plugins\maven-it-plugin-extension1\pom.xml under org\apache\maven\its\plugins\maven-it-plugin-extension1\2.1-SNAPSHOT\maven-it-plugin-extension1-2.1-SNAPSHOT.pom
[withMaven] artifactsPublisher - Archive artifact core-it-support\core-it-plugins\maven-it-plugin-extension1\target\maven-it-plugin-extension1-2.1-SNAPSHOT.jar under org\apache\maven\its\plugins\maven-it-plugin-extension1\2.1-SNAPSHOT\maven-it-plugin-extension1-2.1-SNAPSHOT.jar
[withMaven] artifactsPublisher - Archive artifact core-it-support\core-it-plugins\maven-it-plugin-extension2\pom.xml under org\apache\maven\its\plugins\maven-it-plugin-extension2\2.1-SNAPSHOT\maven-it-plugin-extension2-2.1-SNAPSHOT.pom
[withMaven] artifactsPublisher - Archive artifact core-it-support\core-it-plugins\maven-it-plugin-extension2\target\maven-it-plugin-extension2-2.1-SNAPSHOT.jar under org\apache\maven\its\plugins\maven-it-plugin-extension2\2.1-SNAPSHOT\maven-it-plugin-extension2-2.1-SNAPSHOT.jar
[withMaven] artifactsPublisher - Archive artifact core-it-support\core-it-plugins\maven-it-plugin-plexus-lifecycle\pom.xml under org\apache\maven\its\plugins\maven-it-plugin-plexus-lifecycle\2.1-SNAPSHOT\maven-it-plugin-plexus-lifecycle-2.1-SNAPSHOT.pom
[withMaven] artifactsPublisher - Archive artifact core-it-support\core-it-plugins\maven-it-plugin-plexus-lifecycle\target\maven-it-plugin-plexus-lifecycle-2.1-SNAPSHOT.jar under org\apache\maven\its\plugins\maven-it-plugin-plexus-lifecycle\2.1-SNAPSHOT\maven-it-plugin-plexus-lifecycle-2.1-SNAPSHOT.jar
[withMaven] artifactsPublisher - Archive artifact core-it-support\core-it-plugins\maven-it-plugin-settings\pom.xml under org\apache\maven\its\plugins\maven-it-plugin-settings\2.1-SNAPSHOT\maven-it-plugin-settings-2.1-SNAPSHOT.pom
[withMaven] artifactsPublisher - Archive artifact core-it-support\core-it-plugins\maven-it-plugin-settings\target\maven-it-plugin-settings-2.1-SNAPSHOT.jar under org\apache\maven\its\plugins\maven-it-plugin-settings\2.1-SNAPSHOT\maven-it-plugin-settings-2.1-SNAPSHOT.jar
[withMaven] artifactsPublisher - Archive artifact core-it-support\core-it-plugins\mng5805-extension\pom.xml under org\apache\maven\its\plugins\mng-5805-pkg-type-mojo-configuration-extension\2.1-SNAPSHOT\mng-5805-pkg-type-mojo-configuration-extension-2.1-SNAPSHOT.pom
[withMaven] artifactsPublisher - Archive artifact core-it-support\core-it-plugins\mng5805-extension\target\mng-5805-pkg-type-mojo-configuration-extension-2.1-SNAPSHOT.jar under org\apache\maven\its\plugins\mng-5805-pkg-type-mojo-configuration-extension\2.1-SNAPSHOT\mng-5805-pkg-type-mojo-configuration-extension-2.1-SNAPSHOT.jar
[withMaven] artifactsPublisher - Archive artifact core-it-support\core-it-plugins\mng5805-extension2\pom.xml under org\apache\maven\its\plugins\mng-5805-pkg-type-mojo-configuration-extension2\2.1-SNAPSHOT\mng-5805-pkg-type-mojo-configuration-extension2-2.1-SNAPSHOT.pom
[withMaven] artifactsPublisher - Archive artifact core-it-support\core-it-plugins\mng5805-extension2\target\mng-5805-pkg-type-mojo-configuration-extension2-2.1-SNAPSHOT.jar under org\apache\maven\its\plugins\mng-5805-pkg-type-mojo-configuration-extension2\2.1-SNAPSHOT\mng-5805-pkg-type-mojo-configuration-extension2-2.1-SNAPSHOT.jar
[withMaven] artifactsPublisher - Archive artifact core-it-support\core-it-plugins\mng5805-plugin\pom.xml under org\apache\maven\its\plugins\mng-5805-pkg-type-mojo-configuration-plugin\2.1-SNAPSHOT\mng-5805-pkg-type-mojo-configuration-plugin-2.1-SNAPSHOT.pom
[withMaven] artifactsPublisher - Archive artifact core-it-support\core-it-plugins\mng5805-plugin\target\mng-5805-pkg-type-mojo-configuration-plugin-2.1-SNAPSHOT.jar under org\apache\maven\its\plugins\mng-5805-pkg-type-mojo-configuration-plugin\2.1-SNAPSHOT\mng-5805-pkg-type-mojo-configuration-plugin-2.1-SNAPSHOT.jar
[withMaven] artifactsPublisher - Archive artifact core-it-support\core-it-plugins\mng5805-plugin-dep\pom.xml under org\apache\maven\its\plugins\mng-5805-pkg-type-mojo-configuration-plugin-dep\2.1-SNAPSHOT\mng-5805-pkg-type-mojo-configuration-plugin-dep-2.1-SNAPSHOT.pom
[withMaven] artifactsPublisher - Archive artifact core-it-support\core-it-plugins\mng5805-plugin-dep\target\mng-5805-pkg-type-mojo-configuration-plugin-dep-2.1-SNAPSHOT.jar under org\apache\maven\its\plugins\mng-5805-pkg-type-mojo-configuration-plugin-dep\2.1-SNAPSHOT\mng-5805-pkg-type-mojo-configuration-plugin-dep-2.1-SNAPSHOT.jar
[withMaven] artifactsPublisher - Archive artifact core-it-support\core-it-plugins\mng5958-extension\pom.xml under org\apache\maven\its\plugins\mng-5958-pkg-type-extension\2.1-SNAPSHOT\mng-5958-pkg-type-extension-2.1-SNAPSHOT.pom
[withMaven] artifactsPublisher - Archive artifact core-it-support\core-it-plugins\mng5958-extension\target\mng-5958-pkg-type-extension-2.1-SNAPSHOT.jar under org\apache\maven\its\plugins\mng-5958-pkg-type-extension\2.1-SNAPSHOT\mng-5958-pkg-type-extension-2.1-SNAPSHOT.jar
[withMaven] artifactsPublisher - Archive artifact core-it-support\core-it-plugins\mng6759-plugin-resolves-project-dependencies\pom.xml under org\apache\maven\its\plugins\mng-6759-resolves-project-dependencies-plugin\2.1-SNAPSHOT\mng-6759-resolves-project-dependencies-plugin-2.1-SNAPSHOT.pom
[withMaven] artifactsPublisher - Archive artifact core-it-support\core-it-plugins\mng6759-plugin-resolves-project-dependencies\target\mng-6759-resolves-project-dependencies-plugin-2.1-SNAPSHOT.jar under org\apache\maven\its\plugins\mng-6759-resolves-project-dependencies-plugin\2.1-SNAPSHOT\mng-6759-resolves-project-dependencies-plugin-2.1-SNAPSHOT.jar
[withMaven] artifactsPublisher - Archive artifact core-it-support\core-it-toolchain\pom.xml under org\apache\maven\its\core-it-toolchain\2.1-SNAPSHOT\core-it-toolchain-2.1-SNAPSHOT.pom
[withMaven] artifactsPublisher - Archive artifact core-it-support\core-it-toolchain\target\core-it-toolchain-2.1-SNAPSHOT.jar under org\apache\maven\its\core-it-toolchain\2.1-SNAPSHOT\core-it-toolchain-2.1-SNAPSHOT.jar
[withMaven] artifactsPublisher - Archive artifact core-it-support\core-it-wagon\pom.xml under org\apache\maven\its\core-it-wagon\2.1-SNAPSHOT\core-it-wagon-2.1-SNAPSHOT.pom
[withMaven] artifactsPublisher - Archive artifact core-it-support\core-it-wagon\target\core-it-wagon-2.1-SNAPSHOT.jar under org\apache\maven\its\core-it-wagon\2.1-SNAPSHOT\core-it-wagon-2.1-SNAPSHOT.jar
[withMaven] artifactsPublisher - Archive artifact core-it-support\core-it-support-artifacts\pom.xml under org\apache\maven\its\core-it-support-artifacts\2.1-SNAPSHOT\core-it-support-artifacts-2.1-SNAPSHOT.pom
[withMaven] artifactsPublisher - Archive artifact core-it-support\core-it-support-artifacts\target\core-it-support-artifacts-2.1-SNAPSHOT-repo.zip under org\apache\maven\its\core-it-support-artifacts\2.1-SNAPSHOT\core-it-support-artifacts-2.1-SNAPSHOT-repo.zip
[withMaven] artifactsPublisher - Archive artifact core-it-support\core-it-extension\pom.xml under org\apache\maven\its\core-it-extension\2.1-SNAPSHOT\core-it-extension-2.1-SNAPSHOT.pom
[withMaven] artifactsPublisher - Archive artifact core-it-support\core-it-extension\target\core-it-extension-2.1-SNAPSHOT.jar under org\apache\maven\its\core-it-extension\2.1-SNAPSHOT\core-it-extension-2.1-SNAPSHOT.jar
[withMaven] artifactsPublisher - Archive artifact core-it-suite\pom.xml under org\apache\maven\its\core-it-suite\2.1-SNAPSHOT\core-it-suite-2.1-SNAPSHOT.pom
[withMaven] artifactsPublisher - Archive artifact core-it-suite\target\core-it-suite-2.1-SNAPSHOT.jar under org\apache\maven\its\core-it-suite\2.1-SNAPSHOT\core-it-suite-2.1-SNAPSHOT.jar
[withMaven] artifactsPublisher - Archive artifact core-it-suite\target\core-it-suite-2.1-SNAPSHOT-tests.jar under org\apache\maven\its\core-it-suite\2.1-SNAPSHOT\core-it-suite-2.1-SNAPSHOT-tests.jar
[withMaven] junitPublisher - Archive test results for Maven artifact org.apache.maven.its.plugins:maven-it-plugin-active-collection:maven-plugin:2.1-SNAPSHOT generated by maven-surefire-plugin:test (default-test): core-it-support\core-it-plugins\maven-it-plugin-active-collection\target\surefire-reports\*.xml
[withMaven] junitPublisher - Archive test results for Maven artifact org.apache.maven.its.plugins:maven-it-plugin-ant-based:maven-plugin:2.1-SNAPSHOT generated by maven-surefire-plugin:test (default-test): core-it-support\core-it-plugins\maven-it-plugin-ant-based\target\surefire-reports\*.xml
[withMaven] junitPublisher - Archive test results for Maven artifact org.apache.maven.its.plugins:maven-it-plugin-artifact:maven-plugin:2.1-SNAPSHOT generated by maven-surefire-plugin:test (default-test): core-it-support\core-it-plugins\maven-it-plugin-artifact\target\surefire-reports\*.xml
[withMaven] junitPublisher - Archive test results for Maven artifact org.apache.maven.its.plugins.class-loader:dep-a:jar:2.1-SNAPSHOT generated by maven-surefire-plugin:test (default-test): core-it-support\core-it-plugins\maven-it-plugin-class-loader\dep-a\target\surefire-reports\*.xml
[withMaven] junitPublisher - Archive test results for Maven artifact org.apache.maven.its.plugins.class-loader:dep-b:jar:2.1-SNAPSHOT generated by maven-surefire-plugin:test (default-test): core-it-support\core-it-plugins\maven-it-plugin-class-loader\dep-b\target\surefire-reports\*.xml
[withMaven] junitPublisher - Archive test results for Maven artifact org.apache.maven.its.plugins.class-loader:dep-c:jar:2.1-SNAPSHOT generated by maven-surefire-plugin:test (default-test): core-it-support\core-it-plugins\maven-it-plugin-class-loader\dep-c\target\surefire-reports\*.xml
[withMaven] junitPublisher - Archive test results for Maven artifact org.apache.maven.its.plugins:maven-it-plugin-class-loader:maven-plugin:2.1-SNAPSHOT generated by maven-surefire-plugin:test (default-test): core-it-support\core-it-plugins\maven-it-plugin-class-loader\maven-it-plugin-class-loader\target\surefire-reports\*.xml
[withMaven] junitPublisher - Archive test results for Maven artifact org.apache.maven.its.plugins:maven-it-plugin-configuration:maven-plugin:2.1-SNAPSHOT generated by maven-surefire-plugin:test (default-test): core-it-support\core-it-plugins\maven-it-plugin-configuration\target\surefire-reports\*.xml
[withMaven] junitPublisher - Archive test results for Maven artifact org.apache.maven.its.plugins:maven-it-plugin-context-passing:maven-plugin:2.1-SNAPSHOT generated by maven-surefire-plugin:test (default-test): core-it-support\core-it-plugins\maven-it-plugin-context-passing\target\surefire-reports\*.xml
[withMaven] junitPublisher - Archive test results for Maven artifact org.apache.maven.plugins:maven-clean-plugin:maven-plugin:0.1-stub-SNAPSHOT generated by maven-surefire-plugin:test (default-test): core-it-support\core-it-plugins\maven-it-plugin-core-stubs\maven-clean-plugin\target\surefire-reports\*.xml
[withMaven] junitPublisher - Archive test results for Maven artifact org.apache.maven.plugins:maven-compiler-plugin:maven-plugin:0.1-stub-SNAPSHOT generated by maven-surefire-plugin:test (default-test): core-it-support\core-it-plugins\maven-it-plugin-core-stubs\maven-compiler-plugin\target\surefire-reports\*.xml
[withMaven] junitPublisher - Archive test results for Maven artifact org.apache.maven.plugins:maven-deploy-plugin:maven-plugin:0.1-stub-SNAPSHOT generated by maven-surefire-plugin:test (default-test): core-it-support\core-it-plugins\maven-it-plugin-core-stubs\maven-deploy-plugin\target\surefire-reports\*.xml
[withMaven] junitPublisher - Archive test results for Maven artifact org.apache.maven.plugins:maven-ear-plugin:maven-plugin:0.1-stub-SNAPSHOT generated by maven-surefire-plugin:test (default-test): core-it-support\core-it-plugins\maven-it-plugin-core-stubs\maven-ear-plugin\target\surefire-reports\*.xml
[withMaven] junitPublisher - Archive test results for Maven artifact org.apache.maven.plugins:maven-ejb-plugin:maven-plugin:0.1-stub-SNAPSHOT generated by maven-surefire-plugin:test (default-test): core-it-support\core-it-plugins\maven-it-plugin-core-stubs\maven-ejb-plugin\target\surefire-reports\*.xml
[withMaven] junitPublisher - Archive test results for Maven artifact org.apache.maven.plugins:maven-install-plugin:maven-plugin:0.1-stub-SNAPSHOT generated by maven-surefire-plugin:test (default-test): core-it-support\core-it-plugins\maven-it-plugin-core-stubs\maven-install-plugin\target\surefire-reports\*.xml
[withMaven] junitPublisher - Archive test results for Maven artifact org.apache.maven.plugins:maven-jar-plugin:maven-plugin:0.1-stub-SNAPSHOT generated by maven-surefire-plugin:test (default-test): core-it-support\core-it-plugins\maven-it-plugin-core-stubs\maven-jar-plugin\target\surefire-reports\*.xml
[withMaven] junitPublisher - Archive test results for Maven artifact org.apache.maven.plugins:maven-javadoc-plugin:maven-plugin:0.1-stub-SNAPSHOT generated by maven-surefire-plugin:test (default-test): core-it-support\core-it-plugins\maven-it-plugin-core-stubs\maven-javadoc-plugin\target\surefire-reports\*.xml
[withMaven] junitPublisher - Archive test results for Maven artifact org.apache.maven.plugins:maven-plugin-plugin:maven-plugin:0.1-stub-SNAPSHOT generated by maven-surefire-plugin:test (default-test): core-it-support\core-it-plugins\maven-it-plugin-core-stubs\maven-plugin-plugin\target\surefire-reports\*.xml
[withMaven] junitPublisher - Archive test results for Maven artifact org.apache.maven.plugins:maven-rar-plugin:maven-plugin:0.1-stub-SNAPSHOT generated by maven-surefire-plugin:test (default-test): core-it-support\core-it-plugins\maven-it-plugin-core-stubs\maven-rar-plugin\target\surefire-reports\*.xml
[withMaven] junitPublisher - Archive test results for Maven artifact org.apache.maven.plugins:maven-resources-plugin:maven-plugin:0.1-stub-SNAPSHOT generated by maven-surefire-plugin:test (default-test): core-it-support\core-it-plugins\maven-it-plugin-core-stubs\maven-resources-plugin\target\surefire-reports\*.xml
[withMaven] junitPublisher - Archive test results for Maven artifact org.apache.maven.plugins:maven-site-plugin:maven-plugin:0.1-stub-SNAPSHOT generated by maven-surefire-plugin:test (default-test): core-it-support\core-it-plugins\maven-it-plugin-core-stubs\maven-site-plugin\target\surefire-reports\*.xml
[withMaven] junitPublisher - Archive test results for Maven artifact org.apache.maven.plugins:maven-source-plugin:maven-plugin:0.1-stub-SNAPSHOT generated by maven-surefire-plugin:test (default-test): core-it-support\core-it-plugins\maven-it-plugin-core-stubs\maven-source-plugin\target\surefire-reports\*.xml
[withMaven] junitPublisher - Archive test results for Maven artifact org.apache.maven.plugins:maven-surefire-plugin:maven-plugin:0.1-stub-SNAPSHOT generated by maven-surefire-plugin:test (default-test): core-it-support\core-it-plugins\maven-it-plugin-core-stubs\maven-surefire-plugin\target\surefire-reports\*.xml
[withMaven] junitPublisher - Archive test results for Maven artifact org.apache.maven.plugins:maven-war-plugin:maven-plugin:0.1-stub-SNAPSHOT generated by maven-surefire-plugin:test (default-test): core-it-support\core-it-plugins\maven-it-plugin-core-stubs\maven-war-plugin\target\surefire-reports\*.xml
[withMaven] junitPublisher - Archive test results for Maven artifact org.apache.maven.its.plugins:maven-it-plugin-dependency-collection:maven-plugin:2.1-SNAPSHOT generated by maven-surefire-plugin:test (default-test): core-it-support\core-it-plugins\maven-it-plugin-dependency-collection\target\surefire-reports\*.xml
[withMaven] junitPublisher - Archive test results for Maven artifact org.apache.maven.its.plugins:maven-it-plugin-dependency-resolution:maven-plugin:2.1-SNAPSHOT generated by maven-surefire-plugin:test (default-test): core-it-support\core-it-plugins\maven-it-plugin-dependency-resolution\target\surefire-reports\*.xml
[withMaven] junitPublisher - Archive test results for Maven artifact org.apache.maven.its.plugins:maven-it-plugin-expression:maven-plugin:2.1-SNAPSHOT generated by maven-surefire-plugin:test (default-test): core-it-support\core-it-plugins\maven-it-plugin-expression\target\surefire-reports\*.xml
[withMaven] junitPublisher - Archive test results for Maven artifact org.apache.maven.its.plugins:maven-it-plugin-error:maven-plugin:2.1-SNAPSHOT generated by maven-surefire-plugin:test (default-test): core-it-support\core-it-plugins\maven-it-plugin-error\target\surefire-reports\*.xml
[withMaven] junitPublisher - Archive test results for Maven artifact org.apache.maven.its:core-it-component:jar:2.1-SNAPSHOT generated by maven-surefire-plugin:test (default-test): core-it-support\core-it-component\target\surefire-reports\*.xml
[withMaven] junitPublisher - Archive test results for Maven artifact org.apache.maven.its.plugins:maven-it-plugin-extension-consumer:maven-plugin:2.1-SNAPSHOT generated by maven-surefire-plugin:test (default-test): core-it-support\core-it-plugins\maven-it-plugin-extension-consumer\target\surefire-reports\*.xml
[withMaven] junitPublisher - Archive test results for Maven artifact org.apache.maven.its.plugins:maven-it-plugin-extension-provider:maven-plugin:2.1-SNAPSHOT generated by maven-surefire-plugin:test (default-test): core-it-support\core-it-plugins\maven-it-plugin-extension-provider\target\surefire-reports\*.xml
[withMaven] junitPublisher - Archive test results for Maven artifact org.apache.maven.its.plugins:maven-it-plugin-fork:maven-plugin:2.1-SNAPSHOT generated by maven-surefire-plugin:test (default-test): core-it-support\core-it-plugins\maven-it-plugin-fork\target\surefire-reports\*.xml
[withMaven] junitPublisher - Archive test results for Maven artifact org.apache.maven.its.plugins:maven-it-plugin-invalid-descriptor:maven-plugin:2.1-SNAPSHOT generated by maven-surefire-plugin:test (default-test): core-it-support\core-it-plugins\maven-it-plugin-invalid-descriptor\target\surefire-reports\*.xml
[withMaven] junitPublisher - Archive test results for Maven artifact org.apache.maven.its.plugins:maven-it-plugin-log-file:maven-plugin:2.1-SNAPSHOT generated by maven-surefire-plugin:test (default-test): core-it-support\core-it-plugins\maven-it-plugin-log-file\target\surefire-reports\*.xml
[withMaven] junitPublisher - Archive test results for Maven artifact org.apache.maven.its:maven-it-helper:jar:2.1-SNAPSHOT generated by maven-surefire-plugin:test (default-test): core-it-support\maven-it-helper\target\surefire-reports\*.xml
[withMaven] junitPublisher - Archive test results for Maven artifact org.apache.maven.its.plugins:maven-it-plugin-model-interpolation:maven-plugin:2.1-SNAPSHOT generated by maven-surefire-plugin:test (default-test): core-it-support\core-it-plugins\maven-it-plugin-model-interpolation\target\surefire-reports\*.xml
[withMaven] junitPublisher - Archive test results for Maven artifact org.apache.maven.its.plugins:maven-it-plugin-no-default-comp:maven-plugin:2.1-SNAPSHOT generated by maven-surefire-plugin:test (default-test): core-it-support\core-it-plugins\maven-it-plugin-no-default-comp\target\surefire-reports\*.xml
[withMaven] junitPublisher - Archive test results for Maven artifact org.apache.maven.its.plugins:maven-it-plugin-no-project:maven-plugin:2.1-SNAPSHOT generated by maven-surefire-plugin:test (default-test): core-it-support\core-it-plugins\maven-it-plugin-no-project\target\surefire-reports\*.xml
[withMaven] junitPublisher - Archive test results for Maven artifact org.apache.maven.its.plugins:maven-it-plugin-online:maven-plugin:2.1-SNAPSHOT generated by maven-surefire-plugin:test (default-test): core-it-support\core-it-plugins\maven-it-plugin-online\target\surefire-reports\*.xml
[withMaven] junitPublisher - Archive test results for Maven artifact org.apache.maven.its.plugins:maven-it-plugin-optional-mojos:maven-plugin:2.1-SNAPSHOT generated by maven-surefire-plugin:test (default-test): core-it-support\core-it-plugins\maven-it-plugin-optional-mojos\target\surefire-reports\*.xml
[withMaven] junitPublisher - Archive test results for Maven artifact org.apache.maven.its.plugins:maven-it-plugin-packaging:maven-plugin:2.1-SNAPSHOT generated by maven-surefire-plugin:test (default-test): core-it-support\core-it-plugins\maven-it-plugin-packaging\target\surefire-reports\*.xml
[withMaven] junitPublisher - Archive test results for Maven artifact org.apache.maven.its.plugins:maven-it-plugin-parameter-implementation:maven-plugin:2.1-SNAPSHOT generated by maven-surefire-plugin:test (default-test): core-it-support\core-it-plugins\maven-it-plugin-parameter-implementation\target\surefire-reports\*.xml
[withMaven] junitPublisher - Archive test results for Maven artifact org.apache.maven.its.plugins:maven-it-plugin-plugin-dependency:maven-plugin:2.1-SNAPSHOT generated by maven-surefire-plugin:test (default-test): core-it-support\core-it-plugins\maven-it-plugin-plugin-dependency\target\surefire-reports\*.xml
[withMaven] junitPublisher - Archive test results for Maven artifact org.apache.maven.its.plugins:maven-it-plugin-project:maven-plugin:2.1-SNAPSHOT generated by maven-surefire-plugin:test (default-test): core-it-support\core-it-plugins\maven-it-plugin-project\target\surefire-reports\*.xml
[withMaven] junitPublisher - Archive test results for Maven artifact org.apache.maven.its.plugins:maven-it-plugin-project-interpolation:maven-plugin:2.1-SNAPSHOT generated by maven-surefire-plugin:test (default-test): core-it-support\core-it-plugins\maven-it-plugin-project-interpolation\target\surefire-reports\*.xml
[withMaven] junitPublisher - Archive test results for Maven artifact org.apache.maven.its.plugins:maven-it-plugin-setter:maven-plugin:2.1-SNAPSHOT generated by maven-surefire-plugin:test (default-test): core-it-support\core-it-plugins\maven-it-plugin-setter\target\surefire-reports\*.xml
[withMaven] junitPublisher - Archive test results for Maven artifact org.apache.maven.its.plugins:maven-it-plugin-singleton-component:maven-plugin:2.1-SNAPSHOT generated by maven-surefire-plugin:test (default-test): core-it-support\core-it-plugins\maven-it-plugin-singleton-component\target\surefire-reports\*.xml
[withMaven] junitPublisher - Archive test results for Maven artifact org.apache.maven.its.plugins:maven-it-plugin-site:maven-plugin:2.1-SNAPSHOT generated by maven-surefire-plugin:test (default-test): core-it-support\core-it-plugins\maven-it-plugin-site\target\surefire-reports\*.xml
[withMaven] junitPublisher - Archive test results for Maven artifact org.apache.maven.its.plugins:maven-it-plugin-toolchain:maven-plugin:2.1-SNAPSHOT generated by maven-surefire-plugin:test (default-test): core-it-support\core-it-plugins\maven-it-plugin-toolchain\target\surefire-reports\*.xml
[withMaven] junitPublisher - Archive test results for Maven artifact org.apache.maven.its.plugins:maven-it-plugin-touch:maven-plugin:2.1-SNAPSHOT generated by maven-surefire-plugin:test (default-test): core-it-support\core-it-plugins\maven-it-plugin-touch\target\surefire-reports\*.xml
[withMaven] junitPublisher - Archive test results for Maven artifact org.apache.maven.its.plugins:maven-it-plugin-uses-properties:maven-plugin:2.1-SNAPSHOT generated by maven-surefire-plugin:test (default-test): core-it-support\core-it-plugins\maven-it-plugin-uses-properties\target\surefire-reports\*.xml
[withMaven] junitPublisher - Archive test results for Maven artifact org.apache.maven.its.plugins:maven-it-plugin-uses-wagon:maven-plugin:2.1-SNAPSHOT generated by maven-surefire-plugin:test (default-test): core-it-support\core-it-plugins\maven-it-plugin-uses-wagon\target\surefire-reports\*.xml
[withMaven] junitPublisher - Archive test results for Maven artifact org.apache.maven.its.plugins:maven-it-plugin-all:maven-plugin:2.1-SNAPSHOT generated by maven-surefire-plugin:test (default-test): core-it-support\core-it-plugins\maven-it-plugin-all\target\surefire-reports\*.xml
[withMaven] junitPublisher - Archive test results for Maven artifact org.apache.maven.its.plugins:maven-it-plugin-plexus-utils-11:maven-plugin:2.1-SNAPSHOT generated by maven-surefire-plugin:test (default-test): core-it-support\core-it-plugins\maven-it-plugin-plexus-utils-11\target\surefire-reports\*.xml
[withMaven] junitPublisher - Archive test results for Maven artifact org.apache.maven.its.plugins:maven-it-plugin-plexus-utils-new:maven-plugin:2.1-SNAPSHOT generated by maven-surefire-plugin:test (default-test): core-it-support\core-it-plugins\maven-it-plugin-plexus-utils-new\target\surefire-reports\*.xml
[withMaven] junitPublisher - Archive test results for Maven artifact org.apache.maven.its.plugins:maven-it-plugin-plexus-component-api:maven-plugin:2.1-SNAPSHOT generated by maven-surefire-plugin:test (default-test): core-it-support\core-it-plugins\maven-it-plugin-plexus-component-api\target\surefire-reports\*.xml
[withMaven] junitPublisher - Archive test results for Maven artifact org.apache.maven.its.plugins:maven-it-plugin-log4j:maven-plugin:2.1-SNAPSHOT generated by maven-surefire-plugin:test (default-test): core-it-support\core-it-plugins\maven-it-plugin-log4j\target\surefire-reports\*.xml
[withMaven] junitPublisher - Archive test results for Maven artifact org.apache.maven.its.plugins:maven-it-plugin-extension1:maven-plugin:2.1-SNAPSHOT generated by maven-surefire-plugin:test (default-test): core-it-support\core-it-plugins\maven-it-plugin-extension1\target\surefire-reports\*.xml
[withMaven] junitPublisher - Archive test results for Maven artifact org.apache.maven.its.plugins:maven-it-plugin-extension2:maven-plugin:2.1-SNAPSHOT generated by maven-surefire-plugin:test (default-test): core-it-support\core-it-plugins\maven-it-plugin-extension2\target\surefire-reports\*.xml
[withMaven] junitPublisher - Archive test results for Maven artifact org.apache.maven.its.plugins:maven-it-plugin-plexus-lifecycle:maven-plugin:2.1-SNAPSHOT generated by maven-surefire-plugin:test (default-test): core-it-support\core-it-plugins\maven-it-plugin-plexus-lifecycle\target\surefire-reports\*.xml
[withMaven] junitPublisher - Archive test results for Maven artifact org.apache.maven.its.plugins:maven-it-plugin-settings:maven-plugin:2.1-SNAPSHOT generated by maven-surefire-plugin:test (default-test): core-it-support\core-it-plugins\maven-it-plugin-settings\target\surefire-reports\*.xml
[withMaven] junitPublisher - Archive test results for Maven artifact org.apache.maven.its.plugins:mng-5805-pkg-type-mojo-configuration-extension:jar:2.1-SNAPSHOT generated by maven-surefire-plugin:test (default-test): core-it-support\core-it-plugins\mng5805-extension\target\surefire-reports\*.xml
[withMaven] junitPublisher - Archive test results for Maven artifact org.apache.maven.its.plugins:mng-5805-pkg-type-mojo-configuration-extension2:jar:2.1-SNAPSHOT generated by maven-surefire-plugin:test (default-test): core-it-support\core-it-plugins\mng5805-extension2\target\surefire-reports\*.xml
[withMaven] junitPublisher - Archive test results for Maven artifact org.apache.maven.its.plugins:mng-5805-pkg-type-mojo-configuration-plugin:maven-plugin:2.1-SNAPSHOT generated by maven-surefire-plugin:test (default-test): core-it-support\core-it-plugins\mng5805-plugin\target\surefire-reports\*.xml
[withMaven] junitPublisher - Archive test results for Maven artifact org.apache.maven.its.plugins:mng-5805-pkg-type-mojo-configuration-plugin-dep:jar:2.1-SNAPSHOT generated by maven-surefire-plugin:test (default-test): core-it-support\core-it-plugins\mng5805-plugin-dep\target\surefire-reports\*.xml
[withMaven] junitPublisher - Archive test results for Maven artifact org.apache.maven.its.plugins:mng-5958-pkg-type-extension:jar:2.1-SNAPSHOT generated by maven-surefire-plugin:test (default-test): core-it-support\core-it-plugins\mng5958-extension\target\surefire-reports\*.xml
[withMaven] junitPublisher - Archive test results for Maven artifact org.apache.maven.its.plugins:mng-6759-resolves-project-dependencies-plugin:maven-plugin:2.1-SNAPSHOT generated by maven-surefire-plugin:test (default-test): core-it-support\core-it-plugins\mng6759-plugin-resolves-project-dependencies\target\surefire-reports\*.xml
[withMaven] junitPublisher - Archive test results for Maven artifact org.apache.maven.its:core-it-toolchain:jar:2.1-SNAPSHOT generated by maven-surefire-plugin:test (default-test): core-it-support\core-it-toolchain\target\surefire-reports\*.xml
[withMaven] junitPublisher - Archive test results for Maven artifact org.apache.maven.its:core-it-wagon:jar:2.1-SNAPSHOT generated by maven-surefire-plugin:test (default-test): core-it-support\core-it-wagon\target\surefire-reports\*.xml
[withMaven] junitPublisher - Archive test results for Maven artifact org.apache.maven.its:core-it-extension:jar:2.1-SNAPSHOT generated by maven-surefire-plugin:test (default-test): core-it-support\core-it-extension\target\surefire-reports\*.xml
[withMaven] junitPublisher - Archive test results for Maven artifact org.apache.maven.its:core-it-suite:jar:2.1-SNAPSHOT generated by maven-surefire-plugin:test (default-test): core-it-suite\target\surefire-reports\*.xml
Recording test results
[Pipeline] }
[Pipeline] // dir
[Pipeline] }
[Pipeline] // stage
[Pipeline] }
[Pipeline] // node
[Pipeline] }
[withMaven] openTasksPublisher - Scan Tasks for Maven artifact org.apache.maven.its.plugins:maven-it-plugin-active-collection:maven-plugin:2.1-SNAPSHOT in source directory core-it-support\core-it-plugins\maven-it-plugin-active-collection\src\main\java
[withMaven] openTasksPublisher - Scan Tasks for Maven artifact org.apache.maven.its.plugins:maven-it-plugin-artifact:maven-plugin:2.1-SNAPSHOT in source directory core-it-support\core-it-plugins\maven-it-plugin-artifact\src\main\java
[withMaven] openTasksPublisher - Scan Tasks for Maven artifact org.apache.maven.its.plugins.class-loader:dep-a:jar:2.1-SNAPSHOT in source directory core-it-support\core-it-plugins\maven-it-plugin-class-loader\dep-a\src\main\java
[withMaven] openTasksPublisher - Scan Tasks for Maven artifact org.apache.maven.its.plugins.class-loader:dep-b:jar:2.1-SNAPSHOT in source directory core-it-support\core-it-plugins\maven-it-plugin-class-loader\dep-b\src\main\java
[withMaven] openTasksPublisher - Scan Tasks for Maven artifact org.apache.maven.its.plugins:maven-it-plugin-class-loader:maven-plugin:2.1-SNAPSHOT in source directory core-it-support\core-it-plugins\maven-it-plugin-class-loader\maven-it-plugin-class-loader\src\main\java
[withMaven] openTasksPublisher - Scan Tasks for Maven artifact org.apache.maven.its.plugins:maven-it-plugin-configuration:maven-plugin:2.1-SNAPSHOT in source directory core-it-support\core-it-plugins\maven-it-plugin-configuration\src\main\java
[withMaven] openTasksPublisher - Scan Tasks for Maven artifact org.apache.maven.its.plugins:maven-it-plugin-context-passing:maven-plugin:2.1-SNAPSHOT in source directory core-it-support\core-it-plugins\maven-it-plugin-context-passing\src\main\java
[withMaven] openTasksPublisher - Scan Tasks for Maven artifact org.apache.maven.plugins:maven-clean-plugin:maven-plugin:0.1-stub-SNAPSHOT in source directory core-it-support\core-it-plugins\maven-it-plugin-core-stubs\maven-clean-plugin\src\main\java
[withMaven] openTasksPublisher - Scan Tasks for Maven artifact org.apache.maven.plugins:maven-compiler-plugin:maven-plugin:0.1-stub-SNAPSHOT in source directory core-it-support\core-it-plugins\maven-it-plugin-core-stubs\maven-compiler-plugin\src\main\java
[withMaven] openTasksPublisher - Scan Tasks for Maven artifact org.apache.maven.plugins:maven-deploy-plugin:maven-plugin:0.1-stub-SNAPSHOT in source directory core-it-support\core-it-plugins\maven-it-plugin-core-stubs\maven-deploy-plugin\src\main\java
[withMaven] openTasksPublisher - Scan Tasks for Maven artifact org.apache.maven.plugins:maven-ear-plugin:maven-plugin:0.1-stub-SNAPSHOT in source directory core-it-support\core-it-plugins\maven-it-plugin-core-stubs\maven-ear-plugin\src\main\java
[withMaven] openTasksPublisher - Scan Tasks for Maven artifact org.apache.maven.plugins:maven-ejb-plugin:maven-plugin:0.1-stub-SNAPSHOT in source directory core-it-support\core-it-plugins\maven-it-plugin-core-stubs\maven-ejb-plugin\src\main\java
[withMaven] openTasksPublisher - Scan Tasks for Maven artifact org.apache.maven.plugins:maven-install-plugin:maven-plugin:0.1-stub-SNAPSHOT in source directory core-it-support\core-it-plugins\maven-it-plugin-core-stubs\maven-install-plugin\src\main\java
[withMaven] openTasksPublisher - Scan Tasks for Maven artifact org.apache.maven.plugins:maven-jar-plugin:maven-plugin:0.1-stub-SNAPSHOT in source directory core-it-support\core-it-plugins\maven-it-plugin-core-stubs\maven-jar-plugin\src\main\java
[withMaven] openTasksPublisher - Scan Tasks for Maven artifact org.apache.maven.plugins:maven-javadoc-plugin:maven-plugin:0.1-stub-SNAPSHOT in source directory core-it-support\core-it-plugins\maven-it-plugin-core-stubs\maven-javadoc-plugin\src\main\java
[withMaven] openTasksPublisher - Scan Tasks for Maven artifact org.apache.maven.plugins:maven-plugin-plugin:maven-plugin:0.1-stub-SNAPSHOT in source directory core-it-support\core-it-plugins\maven-it-plugin-core-stubs\maven-plugin-plugin\src\main\java
[withMaven] openTasksPublisher - Scan Tasks for Maven artifact org.apache.maven.plugins:maven-rar-plugin:maven-plugin:0.1-stub-SNAPSHOT in source directory core-it-support\core-it-plugins\maven-it-plugin-core-stubs\maven-rar-plugin\src\main\java
[withMaven] openTasksPublisher - Scan Tasks for Maven artifact org.apache.maven.plugins:maven-resources-plugin:maven-plugin:0.1-stub-SNAPSHOT in source directory core-it-support\core-it-plugins\maven-it-plugin-core-stubs\maven-resources-plugin\src\main\java
[withMaven] openTasksPublisher - Scan Tasks for Maven artifact org.apache.maven.plugins:maven-site-plugin:maven-plugin:0.1-stub-SNAPSHOT in source directory core-it-support\core-it-plugins\maven-it-plugin-core-stubs\maven-site-plugin\src\main\java
[withMaven] openTasksPublisher - Scan Tasks for Maven artifact org.apache.maven.plugins:maven-source-plugin:maven-plugin:0.1-stub-SNAPSHOT in source directory core-it-support\core-it-plugins\maven-it-plugin-core-stubs\maven-source-plugin\src\main\java
[withMaven] openTasksPublisher - Scan Tasks for Maven artifact org.apache.maven.plugins:maven-surefire-plugin:maven-plugin:0.1-stub-SNAPSHOT in source directory core-it-support\core-it-plugins\maven-it-plugin-core-stubs\maven-surefire-plugin\src\main\java
[withMaven] openTasksPublisher - Scan Tasks for Maven artifact org.apache.maven.plugins:maven-war-plugin:maven-plugin:0.1-stub-SNAPSHOT in source directory core-it-support\core-it-plugins\maven-it-plugin-core-stubs\maven-war-plugin\src\main\java
[withMaven] openTasksPublisher - Scan Tasks for Maven artifact org.apache.maven.its.plugins:maven-it-plugin-dependency-collection:maven-plugin:2.1-SNAPSHOT in source directory core-it-support\core-it-plugins\maven-it-plugin-dependency-collection\src\main\java
[withMaven] openTasksPublisher - Scan Tasks for Maven artifact org.apache.maven.its.plugins:maven-it-plugin-dependency-resolution:maven-plugin:2.1-SNAPSHOT in source directory core-it-support\core-it-plugins\maven-it-plugin-dependency-resolution\src\main\java
[withMaven] openTasksPublisher - Scan Tasks for Maven artifact org.apache.maven.its.plugins:maven-it-plugin-expression:maven-plugin:2.1-SNAPSHOT in source directory core-it-support\core-it-plugins\maven-it-plugin-expression\src\main\java
[withMaven] openTasksPublisher - Scan Tasks for Maven artifact org.apache.maven.its.plugins:maven-it-plugin-error:maven-plugin:2.1-SNAPSHOT in source directory core-it-support\core-it-plugins\maven-it-plugin-error\src\main\java
[withMaven] openTasksPublisher - Scan Tasks for Maven artifact org.apache.maven.its:core-it-component:jar:2.1-SNAPSHOT in source directory core-it-support\core-it-component\src\main\java
[withMaven] openTasksPublisher - Scan Tasks for Maven artifact org.apache.maven.its.plugins:maven-it-plugin-extension-consumer:maven-plugin:2.1-SNAPSHOT in source directory core-it-support\core-it-plugins\maven-it-plugin-extension-consumer\src\main\java
[withMaven] openTasksPublisher - Scan Tasks for Maven artifact org.apache.maven.its.plugins:maven-it-plugin-extension-provider:maven-plugin:2.1-SNAPSHOT in source directory core-it-support\core-it-plugins\maven-it-plugin-extension-provider\src\main\java
[withMaven] openTasksPublisher - Scan Tasks for Maven artifact org.apache.maven.its.plugins:maven-it-plugin-fork:maven-plugin:2.1-SNAPSHOT in source directory core-it-support\core-it-plugins\maven-it-plugin-fork\src\main\java
[withMaven] openTasksPublisher - Scan Tasks for Maven artifact org.apache.maven.its.plugins:maven-it-plugin-invalid-descriptor:maven-plugin:2.1-SNAPSHOT in source directory core-it-support\core-it-plugins\maven-it-plugin-invalid-descriptor\src\main\java
[withMaven] openTasksPublisher - Scan Tasks for Maven artifact org.apache.maven.its.plugins:maven-it-plugin-log-file:maven-plugin:2.1-SNAPSHOT in source directory core-it-support\core-it-plugins\maven-it-plugin-log-file\src\main\java
[withMaven] openTasksPublisher - Scan Tasks for Maven artifact org.apache.maven.its:maven-it-helper:jar:2.1-SNAPSHOT in source directory core-it-support\maven-it-helper\src\main\java
[withMaven] openTasksPublisher - Scan Tasks for Maven artifact org.apache.maven.its.plugins:maven-it-plugin-model-interpolation:maven-plugin:2.1-SNAPSHOT in source directory core-it-support\core-it-plugins\maven-it-plugin-model-interpolation\src\main\java
[withMaven] openTasksPublisher - Scan Tasks for Maven artifact org.apache.maven.its.plugins:maven-it-plugin-no-default-comp:maven-plugin:2.1-SNAPSHOT in source directory core-it-support\core-it-plugins\maven-it-plugin-no-default-comp\src\main\java
[withMaven] openTasksPublisher - Scan Tasks for Maven artifact org.apache.maven.its.plugins:maven-it-plugin-no-project:maven-plugin:2.1-SNAPSHOT in source directory core-it-support\core-it-plugins\maven-it-plugin-no-project\src\main\java
[withMaven] openTasksPublisher - Scan Tasks for Maven artifact org.apache.maven.its.plugins:maven-it-plugin-online:maven-plugin:2.1-SNAPSHOT in source directory core-it-support\core-it-plugins\maven-it-plugin-online\src\main\java
[withMaven] openTasksPublisher - Scan Tasks for Maven artifact org.apache.maven.its.plugins:maven-it-plugin-optional-mojos:maven-plugin:2.1-SNAPSHOT in source directory core-it-support\core-it-plugins\maven-it-plugin-optional-mojos\src\main\java
[withMaven] openTasksPublisher - Scan Tasks for Maven artifact org.apache.maven.its.plugins:maven-it-plugin-packaging:maven-plugin:2.1-SNAPSHOT in source directory core-it-support\core-it-plugins\maven-it-plugin-packaging\src\main\java
[withMaven] openTasksPublisher - Scan Tasks for Maven artifact org.apache.maven.its.plugins:maven-it-plugin-parameter-implementation:maven-plugin:2.1-SNAPSHOT in source directory core-it-support\core-it-plugins\maven-it-plugin-parameter-implementation\src\main\java
[withMaven] openTasksPublisher - Scan Tasks for Maven artifact org.apache.maven.its.plugins:maven-it-plugin-plugin-dependency:maven-plugin:2.1-SNAPSHOT in source directory core-it-support\core-it-plugins\maven-it-plugin-plugin-dependency\src\main\java
[withMaven] openTasksPublisher - Scan Tasks for Maven artifact org.apache.maven.its.plugins:maven-it-plugin-project:maven-plugin:2.1-SNAPSHOT in source directory core-it-support\core-it-plugins\maven-it-plugin-project\src\main\java
[withMaven] openTasksPublisher - Scan Tasks for Maven artifact org.apache.maven.its.plugins:maven-it-plugin-project-interpolation:maven-plugin:2.1-SNAPSHOT in source directory core-it-support\core-it-plugins\maven-it-plugin-project-interpolation\src\main\java
[withMaven] openTasksPublisher - Scan Tasks for Maven artifact org.apache.maven.its.plugins:maven-it-plugin-setter:maven-plugin:2.1-SNAPSHOT in source directory core-it-support\core-it-plugins\maven-it-plugin-setter\src\main\java
[withMaven] openTasksPublisher - Scan Tasks for Maven artifact org.apache.maven.its.plugins:maven-it-plugin-singleton-component:maven-plugin:2.1-SNAPSHOT in source directory core-it-support\core-it-plugins\maven-it-plugin-singleton-component\src\main\java
[withMaven] openTasksPublisher - Scan Tasks for Maven artifact org.apache.maven.its.plugins:maven-it-plugin-site:maven-plugin:2.1-SNAPSHOT in source directory core-it-support\core-it-plugins\maven-it-plugin-site\src\main\java
[withMaven] openTasksPublisher - Scan Tasks for Maven artifact org.apache.maven.its.plugins:maven-it-plugin-toolchain:maven-plugin:2.1-SNAPSHOT in source directory core-it-support\core-it-plugins\maven-it-plugin-toolchain\src\main\java
[withMaven] openTasksPublisher - Scan Tasks for Maven artifact org.apache.maven.its.plugins:maven-it-plugin-touch:maven-plugin:2.1-SNAPSHOT in source directory core-it-support\core-it-plugins\maven-it-plugin-touch\src\main\java
[withMaven] openTasksPublisher - Scan Tasks for Maven artifact org.apache.maven.its.plugins:maven-it-plugin-uses-properties:maven-plugin:2.1-SNAPSHOT in source directory core-it-support\core-it-plugins\maven-it-plugin-uses-properties\src\main\java
[withMaven] openTasksPublisher - Scan Tasks for Maven artifact org.apache.maven.its.plugins:maven-it-plugin-uses-wagon:maven-plugin:2.1-SNAPSHOT in source directory core-it-support\core-it-plugins\maven-it-plugin-uses-wagon\src\main\java
[withMaven] openTasksPublisher - Scan Tasks for Maven artifact org.apache.maven.its.plugins:maven-it-plugin-all:maven-plugin:2.1-SNAPSHOT in source directory core-it-support\core-it-plugins\maven-it-plugin-all\src\main\java
[withMaven] openTasksPublisher - Scan Tasks for Maven artifact org.apache.maven.its.plugins:maven-it-plugin-plexus-utils-11:maven-plugin:2.1-SNAPSHOT in source directory core-it-support\core-it-plugins\maven-it-plugin-plexus-utils-11\src\main\java
[withMaven] openTasksPublisher - Scan Tasks for Maven artifact org.apache.maven.its.plugins:maven-it-plugin-plexus-utils-new:maven-plugin:2.1-SNAPSHOT in source directory core-it-support\core-it-plugins\maven-it-plugin-plexus-utils-new\src\main\java
[withMaven] openTasksPublisher - Scan Tasks for Maven artifact org.apache.maven.its.plugins:maven-it-plugin-plexus-component-api:maven-plugin:2.1-SNAPSHOT in source directory core-it-support\core-it-plugins\maven-it-plugin-plexus-component-api\src\main\java
[withMaven] openTasksPublisher - Scan Tasks for Maven artifact org.apache.maven.its.plugins:maven-it-plugin-log4j:maven-plugin:2.1-SNAPSHOT in source directory core-it-support\core-it-plugins\maven-it-plugin-log4j\src\main\java
[withMaven] openTasksPublisher - Scan Tasks for Maven artifact org.apache.maven.its.plugins:maven-it-plugin-extension1:maven-plugin:2.1-SNAPSHOT in source directory core-it-support\core-it-plugins\maven-it-plugin-extension1\src\main\java
[withMaven] openTasksPublisher - Scan Tasks for Maven artifact org.apache.maven.its.plugins:maven-it-plugin-extension2:maven-plugin:2.1-SNAPSHOT in source directory core-it-support\core-it-plugins\maven-it-plugin-extension2\src\main\java
[withMaven] openTasksPublisher - Scan Tasks for Maven artifact org.apache.maven.its.plugins:maven-it-plugin-plexus-lifecycle:maven-plugin:2.1-SNAPSHOT in source directory core-it-support\core-it-plugins\maven-it-plugin-plexus-lifecycle\src\main\java
[withMaven] openTasksPublisher - Scan Tasks for Maven artifact org.apache.maven.its.plugins:maven-it-plugin-settings:maven-plugin:2.1-SNAPSHOT in source directory core-it-support\core-it-plugins\maven-it-plugin-settings\src\main\java
[withMaven] openTasksPublisher - Scan Tasks for Maven artifact org.apache.maven.its.plugins:mng-5805-pkg-type-mojo-configuration-plugin:maven-plugin:2.1-SNAPSHOT in source directory core-it-support\core-it-plugins\mng5805-plugin\src\main\java
[withMaven] openTasksPublisher - Scan Tasks for Maven artifact org.apache.maven.its.plugins:mng-5805-pkg-type-mojo-configuration-plugin-dep:jar:2.1-SNAPSHOT in source directory core-it-support\core-it-plugins\mng5805-plugin-dep\src\main\java
[withMaven] openTasksPublisher - Scan Tasks for Maven artifact org.apache.maven.its.plugins:mng-5958-pkg-type-extension:jar:2.1-SNAPSHOT in source directory core-it-support\core-it-plugins\mng5958-extension\src\main\java
[withMaven] openTasksPublisher - Scan Tasks for Maven artifact org.apache.maven.its.plugins:mng-6759-resolves-project-dependencies-plugin:maven-plugin:2.1-SNAPSHOT in source directory core-it-support\core-it-plugins\mng6759-plugin-resolves-project-dependencies\src\main\java
[withMaven] openTasksPublisher - Scan Tasks for Maven artifact org.apache.maven.its:core-it-toolchain:jar:2.1-SNAPSHOT in source directory core-it-support\core-it-toolchain\src\main\java
[withMaven] openTasksPublisher - Scan Tasks for Maven artifact org.apache.maven.its:core-it-wagon:jar:2.1-SNAPSHOT in source directory core-it-support\core-it-wagon\src\main\java
[TASKS] Scanning folder 'c:\mvn-it-1.tmp' for files matching the pattern 'core-it-support\core-it-plugins\maven-it-plugin-active-collection\src\main\java\**\*,core-it-support\core-it-plugins\maven-it-plugin-artifact\src\main\java\**\*,core-it-support\core-it-plugins\maven-it-plugin-class-loader\dep-a\src\main\java\**\*,core-it-support\core-it-plugins\maven-it-plugin-class-loader\dep-b\src\main\java\**\*,core-it-support\core-it-plugins\maven-it-plugin-class-loader\maven-it-plugin-class-loader\src\main\java\**\*,core-it-support\core-it-plugins\maven-it-plugin-configuration\src\main\java\**\*,core-it-support\core-it-plugins\maven-it-plugin-context-passing\src\main\java\**\*,core-it-support\core-it-plugins\maven-it-plugin-core-stubs\maven-clean-plugin\src\main\java\**\*,core-it-support\core-it-plugins\maven-it-plugin-core-stubs\maven-compiler-plugin\src\main\java\**\*,core-it-support\core-it-plugins\maven-it-plugin-core-stubs\maven-deploy-plugin\src\main\java\**\*,core-it-support\core-it-plugins\maven-it-plugin-core-stubs\maven-ear-plugin\src\main\java\**\*,core-it-support\core-it-plugins\maven-it-plugin-core-stubs\maven-ejb-plugin\src\main\java\**\*,core-it-support\core-it-plugins\maven-it-plugin-core-stubs\maven-install-plugin\src\main\java\**\*,core-it-support\core-it-plugins\maven-it-plugin-core-stubs\maven-jar-plugin\src\main\java\**\*,core-it-support\core-it-plugins\maven-it-plugin-core-stubs\maven-javadoc-plugin\src\main\java\**\*,core-it-support\core-it-plugins\maven-it-plugin-core-stubs\maven-plugin-plugin\src\main\java\**\*,core-it-support\core-it-plugins\maven-it-plugin-core-stubs\maven-rar-plugin\src\main\java\**\*,core-it-support\core-it-plugins\maven-it-plugin-core-stubs\maven-resources-plugin\src\main\java\**\*,core-it-support\core-it-plugins\maven-it-plugin-core-stubs\maven-site-plugin\src\main\java\**\*,core-it-support\core-it-plugins\maven-it-plugin-core-stubs\maven-source-plugin\src\main\java\**\*,core-it-support\core-it-plugins\maven-it-plugin-core-stubs\maven-surefire-plugin\src\main\java\**\*,core-it-support\core-it-plugins\maven-it-plugin-core-stubs\maven-war-plugin\src\main\java\**\*,core-it-support\core-it-plugins\maven-it-plugin-dependency-collection\src\main\java\**\*,core-it-support\core-it-plugins\maven-it-plugin-dependency-resolution\src\main\java\**\*,core-it-support\core-it-plugins\maven-it-plugin-expression\src\main\java\**\*,core-it-support\core-it-plugins\maven-it-plugin-error\src\main\java\**\*,core-it-support\core-it-component\src\main\java\**\*,core-it-support\core-it-plugins\maven-it-plugin-extension-consumer\src\main\java\**\*,core-it-support\core-it-plugins\maven-it-plugin-extension-provider\src\main\java\**\*,core-it-support\core-it-plugins\maven-it-plugin-fork\src\main\java\**\*,core-it-support\core-it-plugins\maven-it-plugin-invalid-descriptor\src\main\java\**\*,core-it-support\core-it-plugins\maven-it-plugin-log-file\src\main\java\**\*,core-it-support\maven-it-helper\src\main\java\**\*,core-it-support\core-it-plugins\maven-it-plugin-model-interpolation\src\main\java\**\*,core-it-support\core-it-plugins\maven-it-plugin-no-default-comp\src\main\java\**\*,core-it-support\core-it-plugins\maven-it-plugin-no-project\src\main\java\**\*,core-it-support\core-it-plugins\maven-it-plugin-online\src\main\java\**\*,core-it-support\core-it-plugins\maven-it-plugin-optional-mojos\src\main\java\**\*,core-it-support\core-it-plugins\maven-it-plugin-packaging\src\main\java\**\*,core-it-support\core-it-plugins\maven-it-plugin-parameter-implementation\src\main\java\**\*,core-it-support\core-it-plugins\maven-it-plugin-plugin-dependency\src\main\java\**\*,core-it-support\core-it-plugins\maven-it-plugin-project\src\main\java\**\*,core-it-support\core-it-plugins\maven-it-plugin-project-interpolation\src\main\java\**\*,core-it-support\core-it-plugins\maven-it-plugin-setter\src\main\java\**\*,core-it-support\core-it-plugins\maven-it-plugin-singleton-component\src\main\java\**\*,core-it-support\core-it-plugins\maven-it-plugin-site\src\main\java\**\*,core-it-support\core-it-plugins\maven-it-plugin-toolchain\src\main\java\**\*,core-it-support\core-it-plugins\maven-it-plugin-touch\src\main\java\**\*,core-it-support\core-it-plugins\maven-it-plugin-uses-properties\src\main\java\**\*,core-it-support\core-it-plugins\maven-it-plugin-uses-wagon\src\main\java\**\*,core-it-support\core-it-plugins\maven-it-plugin-all\src\main\java\**\*,core-it-support\core-it-plugins\maven-it-plugin-plexus-utils-11\src\main\java\**\*,core-it-support\core-it-plugins\maven-it-plugin-plexus-utils-new\src\main\java\**\*,core-it-support\core-it-plugins\maven-it-plugin-plexus-component-api\src\main\java\**\*,core-it-support\core-it-plugins\maven-it-plugin-log4j\src\main\java\**\*,core-it-support\core-it-plugins\maven-it-plugin-extension1\src\main\java\**\*,core-it-support\core-it-plugins\maven-it-plugin-extension2\src\main\java\**\*,core-it-support\core-it-plugins\maven-it-plugin-plexus-lifecycle\src\main\java\**\*,core-it-support\core-it-plugins\maven-it-plugin-settings\src\main\java\**\*,core-it-support\core-it-plugins\mng5805-plugin\src\main\java\**\*,core-it-support\core-it-plugins\mng5805-plugin-dep\src\main\java\**\*,core-it-support\core-it-plugins\mng5958-extension\src\main\java\**\*,core-it-support\core-it-plugins\mng6759-plugin-resolves-project-dependencies\src\main\java\**\*,core-it-support\core-it-toolchain\src\main\java\**\*,core-it-support\core-it-wagon\src\main\java\**\*' - excludes: null
[TASKS] Found 165 files to scan for tasks
[TASKS] Found 0 open tasks.
Skipping warnings blame since pipelines do not have an SCM link.%n
[TASKS] Computing warning deltas based on reference build #23
[withMaven] Publishers: Pipeline Graph Publisher: 21 ms, Generated Artifacts Publisher: 6124 ms, Invoker Publisher: 7 ms, Junit Publisher: 11624 ms, Concordion Publisher: 6 ms, Dependencies Fingerprint Publisher: 130 ms, Findbugs Publisher: 2 ms, JGiven Publisher: 2 ms, Jacoco Publisher: 2 ms, SpotBugs Publisher: 2 ms, Open Task Scanner Publisher: 719 ms
[Pipeline] // withMaven
[Pipeline] fileExists
[Pipeline] zip
Writing zip file of c:\mvn-it-1.tmp\core-it-suite\target\test-classes to c:\mvn-it-1.tmp\core-it-suite-logs-windows-jdk11.zip
Zipped 6501 entries.
Archiving c:\mvn-it-1.tmp\core-it-suite-logs-windows-jdk11.zip
[Pipeline] fileExists
[Pipeline] zip
Writing zip file of c:\mvn-it-1.tmp\core-it-suite\target\surefire-reports to c:\mvn-it-1.tmp\core-it-suite-reports-windows-jdk11.zip
Zipped 4 entries.
Archiving c:\mvn-it-1.tmp\core-it-suite-reports-windows-jdk11.zip
[Pipeline] deleteDir
[Pipeline] }
[Pipeline] // dir
[Pipeline] }
[Pipeline] // stage
[Pipeline] }
[Pipeline] // node
[Pipeline] }
[Pipeline] // parallel
[Pipeline] stage
[Pipeline] { (Notifications)
[Pipeline] echo
Build result: UNSTABLE
[Pipeline] jiraIssueSelector
[Pipeline] echo
The authors of changes [].
[Pipeline] echo
Sending email ...
[Pipeline] emailext
Reply | Threaded
Open this post in threaded view
|

Build unstable in Jenkins: Maven TLP » maven » MNG-6656 #25

Apache Jenkins Server-2
See https://builds.apache.org/job/maven-box/job/maven/job/MNG-6656/25/

Changes:

* [MNG-6399] - Lift JDK minimum to JDK 8
* Fixed JavaDoc issue.
* [MNG-6656] Don't post-process when model has errors

48 tests failed.
FAILED:  org.apache.maven.it.MavenITmng1803PomValidationErrorIncludesLineNumberTest.windows-jdk13 / Run ITs Windows Java 13 / testit

Error Message:
Line number not found in: [ERROR] 'dependencies.dependency.artifactId' for org.apache.maven.its.mng1803::::bad/id::::jar with value ':::bad/id:::' does not match a valid id pattern. @

Stack Trace:
junit.framework.AssertionFailedError: Line number not found in: [ERROR] 'dependencies.dependency.artifactId' for org.apache.maven.its.mng1803::::bad/id::::jar with value ':::bad/id:::' does not match a valid id pattern. @
        at org.apache.maven.it.MavenITmng1803PomValidationErrorIncludesLineNumberTest.testit(MavenITmng1803PomValidationErrorIncludesLineNumberTest.java:71)


FAILED:  org.apache.maven.it.MavenITmng1803PomValidationErrorIncludesLineNumberTest.windows-jdk12 / Run ITs Windows Java 12 / testit

Error Message:
Line number not found in: [ERROR] 'dependencies.dependency.artifactId' for org.apache.maven.its.mng1803::::bad/id::::jar with value ':::bad/id:::' does not match a valid id pattern. @

Stack Trace:
junit.framework.AssertionFailedError: Line number not found in: [ERROR] 'dependencies.dependency.artifactId' for org.apache.maven.its.mng1803::::bad/id::::jar with value ':::bad/id:::' does not match a valid id pattern. @
        at org.apache.maven.it.MavenITmng1803PomValidationErrorIncludesLineNumberTest.testit(MavenITmng1803PomValidationErrorIncludesLineNumberTest.java:71)


FAILED:  org.apache.maven.it.MavenITmng1803PomValidationErrorIncludesLineNumberTest.windows-jdk8 / Run ITs Windows Java 8 / testit

Error Message:
Line number not found in: [ERROR] 'dependencies.dependency.artifactId' for org.apache.maven.its.mng1803::::bad/id::::jar with value ':::bad/id:::' does not match a valid id pattern. @

Stack Trace:
junit.framework.AssertionFailedError: Line number not found in: [ERROR] 'dependencies.dependency.artifactId' for org.apache.maven.its.mng1803::::bad/id::::jar with value ':::bad/id:::' does not match a valid id pattern. @
        at org.apache.maven.it.MavenITmng1803PomValidationErrorIncludesLineNumberTest.testit(MavenITmng1803PomValidationErrorIncludesLineNumberTest.java:71)


FAILED:  org.apache.maven.it.MavenITmng1803PomValidationErrorIncludesLineNumberTest.windows-jdk11 / Run ITs Windows Java 11 / testit

Error Message:
Line number not found in: [ERROR] 'dependencies.dependency.artifactId' for org.apache.maven.its.mng1803::::bad/id::::jar with value ':::bad/id:::' does not match a valid id pattern. @

Stack Trace:
junit.framework.AssertionFailedError: Line number not found in: [ERROR] 'dependencies.dependency.artifactId' for org.apache.maven.its.mng1803::::bad/id::::jar with value ':::bad/id:::' does not match a valid id pattern. @
        at org.apache.maven.it.MavenITmng1803PomValidationErrorIncludesLineNumberTest.testit(MavenITmng1803PomValidationErrorIncludesLineNumberTest.java:71)


FAILED:  org.apache.maven.it.MavenITmng1803PomValidationErrorIncludesLineNumberTest.linux-jdk11 / Run ITs Linux Java 11 / testit

Error Message:
Line number not found in: [ERROR] 'dependencies.dependency.artifactId' for org.apache.maven.its.mng1803::::bad/id::::jar with value ':::bad/id:::' does not match a valid id pattern. @

Stack Trace:
junit.framework.AssertionFailedError: Line number not found in: [ERROR] 'dependencies.dependency.artifactId' for org.apache.maven.its.mng1803::::bad/id::::jar with value ':::bad/id:::' does not match a valid id pattern. @
        at org.apache.maven.it.MavenITmng1803PomValidationErrorIncludesLineNumberTest.testit(MavenITmng1803PomValidationErrorIncludesLineNumberTest.java:71)


FAILED:  org.apache.maven.it.MavenITmng1803PomValidationErrorIncludesLineNumberTest.linux-jdk13 / Run ITs Linux Java 13 / testit

Error Message:
Line number not found in: [ERROR] 'dependencies.dependency.artifactId' for org.apache.maven.its.mng1803::::bad/id::::jar with value ':::bad/id:::' does not match a valid id pattern. @

Stack Trace:
junit.framework.AssertionFailedError: Line number not found in: [ERROR] 'dependencies.dependency.artifactId' for org.apache.maven.its.mng1803::::bad/id::::jar with value ':::bad/id:::' does not match a valid id pattern. @
        at org.apache.maven.it.MavenITmng1803PomValidationErrorIncludesLineNumberTest.testit(MavenITmng1803PomValidationErrorIncludesLineNumberTest.java:71)


FAILED:  org.apache.maven.it.MavenITmng1803PomValidationErrorIncludesLineNumberTest.linux-jdk8 / Run ITs Linux Java 8 / testit

Error Message:
Line number not found in: [ERROR] 'dependencies.dependency.artifactId' for org.apache.maven.its.mng1803::::bad/id::::jar with value ':::bad/id:::' does not match a valid id pattern. @

Stack Trace:
junit.framework.AssertionFailedError: Line number not found in: [ERROR] 'dependencies.dependency.artifactId' for org.apache.maven.its.mng1803::::bad/id::::jar with value ':::bad/id:::' does not match a valid id pattern. @
        at org.apache.maven.it.MavenITmng1803PomValidationErrorIncludesLineNumberTest.testit(MavenITmng1803PomValidationErrorIncludesLineNumberTest.java:71)


FAILED:  org.apache.maven.it.MavenITmng1803PomValidationErrorIncludesLineNumberTest.linux-jdk12 / Run ITs Linux Java 12 / testit

Error Message:
Line number not found in: [ERROR] 'dependencies.dependency.artifactId' for org.apache.maven.its.mng1803::::bad/id::::jar with value ':::bad/id:::' does not match a valid id pattern. @

Stack Trace:
junit.framework.AssertionFailedError: Line number not found in: [ERROR] 'dependencies.dependency.artifactId' for org.apache.maven.its.mng1803::::bad/id::::jar with value ':::bad/id:::' does not match a valid id pattern. @
        at org.apache.maven.it.MavenITmng1803PomValidationErrorIncludesLineNumberTest.testit(MavenITmng1803PomValidationErrorIncludesLineNumberTest.java:71)


FAILED:  org.apache.maven.it.MavenITmng2362DeployedPomEncodingTest.windows-jdk13 / Run ITs Windows Java 13 / testit

Error Message:
Corrupt data TEST-CHARS: ßıΣ in c:\mvn-it-0.tmp\it-local-repo\org\apache\maven\its\mng2362\utf-8\0.1\utf-8-0.1.pom

Stack Trace:
junit.framework.AssertionFailedError: Corrupt data TEST-CHARS: ßıΣ in c:\mvn-it-0.tmp\it-local-repo\org\apache\maven\its\mng2362\utf-8\0.1\utf-8-0.1.pom
        at org.apache.maven.it.MavenITmng2362DeployedPomEncodingTest.assertPom(MavenITmng2362DeployedPomEncodingTest.java:95)
        at org.apache.maven.it.MavenITmng2362DeployedPomEncodingTest.assertPomUtf8(MavenITmng2362DeployedPomEncodingTest.java:79)
        at org.apache.maven.it.MavenITmng2362DeployedPomEncodingTest.testit(MavenITmng2362DeployedPomEncodingTest.java:62)


FAILED:  org.apache.maven.it.MavenITmng2362DeployedPomEncodingTest.windows-jdk12 / Run ITs Windows Java 12 / testit

Error Message:
Corrupt data TEST-CHARS: ßıΣ in c:\mvn-it-1.tmp\it-local-repo\org\apache\maven\its\mng2362\utf-8\0.1\utf-8-0.1.pom

Stack Trace:
junit.framework.AssertionFailedError: Corrupt data TEST-CHARS: ßıΣ in c:\mvn-it-1.tmp\it-local-repo\org\apache\maven\its\mng2362\utf-8\0.1\utf-8-0.1.pom
        at org.apache.maven.it.MavenITmng2362DeployedPomEncodingTest.assertPom(MavenITmng2362DeployedPomEncodingTest.java:95)
        at org.apache.maven.it.MavenITmng2362DeployedPomEncodingTest.assertPomUtf8(MavenITmng2362DeployedPomEncodingTest.java:79)
        at org.apache.maven.it.MavenITmng2362DeployedPomEncodingTest.testit(MavenITmng2362DeployedPomEncodingTest.java:62)


FAILED:  org.apache.maven.it.MavenITmng2362DeployedPomEncodingTest.windows-jdk8 / Run ITs Windows Java 8 / testit

Error Message:
Corrupt data TEST-CHARS: ßıΣ in c:\mvn-it-1.tmp\it-local-repo\org\apache\maven\its\mng2362\utf-8\0.1\utf-8-0.1.pom

Stack Trace:
junit.framework.AssertionFailedError: Corrupt data TEST-CHARS: ßıΣ in c:\mvn-it-1.tmp\it-local-repo\org\apache\maven\its\mng2362\utf-8\0.1\utf-8-0.1.pom
        at org.apache.maven.it.MavenITmng2362DeployedPomEncodingTest.assertPom(MavenITmng2362DeployedPomEncodingTest.java:95)
        at org.apache.maven.it.MavenITmng2362DeployedPomEncodingTest.assertPomUtf8(MavenITmng2362DeployedPomEncodingTest.java:79)
        at org.apache.maven.it.MavenITmng2362DeployedPomEncodingTest.testit(MavenITmng2362DeployedPomEncodingTest.java:62)


FAILED:  org.apache.maven.it.MavenITmng2362DeployedPomEncodingTest.windows-jdk11 / Run ITs Windows Java 11 / testit

Error Message:
Corrupt data TEST-CHARS: ßıΣ in c:\mvn-it-0.tmp\it-local-repo\org\apache\maven\its\mng2362\utf-8\0.1\utf-8-0.1.pom

Stack Trace:
junit.framework.AssertionFailedError: Corrupt data TEST-CHARS: ßıΣ in c:\mvn-it-0.tmp\it-local-repo\org\apache\maven\its\mng2362\utf-8\0.1\utf-8-0.1.pom
        at org.apache.maven.it.MavenITmng2362DeployedPomEncodingTest.assertPom(MavenITmng2362DeployedPomEncodingTest.java:95)
        at org.apache.maven.it.MavenITmng2362DeployedPomEncodingTest.assertPomUtf8(MavenITmng2362DeployedPomEncodingTest.java:79)
        at org.apache.maven.it.MavenITmng2362DeployedPomEncodingTest.testit(MavenITmng2362DeployedPomEncodingTest.java:62)


FAILED:  org.apache.maven.it.MavenITmng2362DeployedPomEncodingTest.linux-jdk11 / Run ITs Linux Java 11 / testit

Error Message:
Corrupt data TEST-CHARS: Ã&#159 in /home/jenkins/jenkins-slave/workspace/maven-box_maven_MNG-6656/test/it-local-repo/org/apache/maven/its/mng2362/utf-8/0.1/utf-8-0.1.pom

Stack Trace:
junit.framework.AssertionFailedError: Corrupt data TEST-CHARS: Ã&#159 in /home/jenkins/jenkins-slave/workspace/maven-box_maven_MNG-6656/test/it-local-repo/org/apache/maven/its/mng2362/utf-8/0.1/utf-8-0.1.pom
        at org.apache.maven.it.MavenITmng2362DeployedPomEncodingTest.assertPom(MavenITmng2362DeployedPomEncodingTest.java:95)
        at org.apache.maven.it.MavenITmng2362DeployedPomEncodingTest.assertPomUtf8(MavenITmng2362DeployedPomEncodingTest.java:79)
        at org.apache.maven.it.MavenITmng2362DeployedPomEncodingTest.testit(MavenITmng2362DeployedPomEncodingTest.java:62)


FAILED:  org.apache.maven.it.MavenITmng2362DeployedPomEncodingTest.linux-jdk13 / Run ITs Linux Java 13 / testit

Error Message:
Corrupt data TEST-CHARS: Ã&#159 in /home/jenkins/jenkins-slave/workspace/maven-box_maven_MNG-6656/test/it-local-repo/org/apache/maven/its/mng2362/utf-8/0.1/utf-8-0.1.pom

Stack Trace:
junit.framework.AssertionFailedError: Corrupt data TEST-CHARS: Ã&#159 in /home/jenkins/jenkins-slave/workspace/maven-box_maven_MNG-6656/test/it-local-repo/org/apache/maven/its/mng2362/utf-8/0.1/utf-8-0.1.pom
        at org.apache.maven.it.MavenITmng2362DeployedPomEncodingTest.assertPom(MavenITmng2362DeployedPomEncodingTest.java:95)
        at org.apache.maven.it.MavenITmng2362DeployedPomEncodingTest.assertPomUtf8(MavenITmng2362DeployedPomEncodingTest.java:79)
        at org.apache.maven.it.MavenITmng2362DeployedPomEncodingTest.testit(MavenITmng2362DeployedPomEncodingTest.java:62)


FAILED:  org.apache.maven.it.MavenITmng2362DeployedPomEncodingTest.linux-jdk8 / Run ITs Linux Java 8 / testit

Error Message:
Corrupt data TEST-CHARS: Ã&#159 in /home/jenkins/jenkins-slave/workspace/maven-box_maven_MNG-6656/test/it-local-repo/org/apache/maven/its/mng2362/utf-8/0.1/utf-8-0.1.pom

Stack Trace:
junit.framework.AssertionFailedError: Corrupt data TEST-CHARS: Ã&#159 in /home/jenkins/jenkins-slave/workspace/maven-box_maven_MNG-6656/test/it-local-repo/org/apache/maven/its/mng2362/utf-8/0.1/utf-8-0.1.pom
        at org.apache.maven.it.MavenITmng2362DeployedPomEncodingTest.assertPom(MavenITmng2362DeployedPomEncodingTest.java:95)
        at org.apache.maven.it.MavenITmng2362DeployedPomEncodingTest.assertPomUtf8(MavenITmng2362DeployedPomEncodingTest.java:79)
        at org.apache.maven.it.MavenITmng2362DeployedPomEncodingTest.testit(MavenITmng2362DeployedPomEncodingTest.java:62)


FAILED:  org.apache.maven.it.MavenITmng2362DeployedPomEncodingTest.linux-jdk12 / Run ITs Linux Java 12 / testit

Error Message:
Corrupt data TEST-CHARS: Ã&#159 in /home/jenkins/jenkins-slave/workspace/maven-box_maven_MNG-6656/test/it-local-repo/org/apache/maven/its/mng2362/utf-8/0.1/utf-8-0.1.pom

Stack Trace:
junit.framework.AssertionFailedError: Corrupt data TEST-CHARS: Ã&#159 in /home/jenkins/jenkins-slave/workspace/maven-box_maven_MNG-6656/test/it-local-repo/org/apache/maven/its/mng2362/utf-8/0.1/utf-8-0.1.pom
        at org.apache.maven.it.MavenITmng2362DeployedPomEncodingTest.assertPom(MavenITmng2362DeployedPomEncodingTest.java:95)
        at org.apache.maven.it.MavenITmng2362DeployedPomEncodingTest.assertPomUtf8(MavenITmng2362DeployedPomEncodingTest.java:79)
        at org.apache.maven.it.MavenITmng2362DeployedPomEncodingTest.testit(MavenITmng2362DeployedPomEncodingTest.java:62)


FAILED:  org.apache.maven.it.MavenITmng2199ParentVersionRangeTest.windows-jdk13 / Run ITs Windows Java 13 / testValidParentVersionRangeInvalidVersionExpression

Error Message:
Expected error message not found.

Stack Trace:
junit.framework.AssertionFailedError: Expected error message not found.
        at org.apache.maven.it.MavenITmng2199ParentVersionRangeTest.testValidParentVersionRangeInvalidVersionExpression(MavenITmng2199ParentVersionRangeTest.java:152)


FAILED:  org.apache.maven.it.MavenITmng2199ParentVersionRangeTest.windows-jdk13 / Run ITs Windows Java 13 / testValidParentVersionRangeInvalidVersionInheritance

Error Message:
Expected error message not found.

Stack Trace:
junit.framework.AssertionFailedError: Expected error message not found.
        at org.apache.maven.it.MavenITmng2199ParentVersionRangeTest.testValidParentVersionRangeInvalidVersionInheritance(MavenITmng2199ParentVersionRangeTest.java:183)


FAILED:  org.apache.maven.it.MavenITmng2199ParentVersionRangeTest.windows-jdk13 / Run ITs Windows Java 13 / testValidLocalParentVersionRangeInvalidVersionExpression

Error Message:
Expected error message not found.

Stack Trace:
junit.framework.AssertionFailedError: Expected error message not found.
        at org.apache.maven.it.MavenITmng2199ParentVersionRangeTest.testValidLocalParentVersionRangeInvalidVersionExpression(MavenITmng2199ParentVersionRangeTest.java:311)


FAILED:  org.apache.maven.it.MavenITmng2199ParentVersionRangeTest.windows-jdk13 / Run ITs Windows Java 13 / testValidLocalParentVersionRangeInvalidVersionInheritance

Error Message:
Expected error message not found.

Stack Trace:
junit.framework.AssertionFailedError: Expected error message not found.
        at org.apache.maven.it.MavenITmng2199ParentVersionRangeTest.testValidLocalParentVersionRangeInvalidVersionInheritance(MavenITmng2199ParentVersionRangeTest.java:341)


FAILED:  org.apache.maven.it.MavenITmng2199ParentVersionRangeTest.windows-jdk12 / Run ITs Windows Java 12 / testValidParentVersionRangeInvalidVersionExpression

Error Message:
Expected error message not found.

Stack Trace:
junit.framework.AssertionFailedError: Expected error message not found.
        at org.apache.maven.it.MavenITmng2199ParentVersionRangeTest.testValidParentVersionRangeInvalidVersionExpression(MavenITmng2199ParentVersionRangeTest.java:152)


FAILED:  org.apache.maven.it.MavenITmng2199ParentVersionRangeTest.windows-jdk12 / Run ITs Windows Java 12 / testValidParentVersionRangeInvalidVersionInheritance

Error Message:
Expected error message not found.

Stack Trace:
junit.framework.AssertionFailedError: Expected error message not found.
        at org.apache.maven.it.MavenITmng2199ParentVersionRangeTest.testValidParentVersionRangeInvalidVersionInheritance(MavenITmng2199ParentVersionRangeTest.java:183)


FAILED:  org.apache.maven.it.MavenITmng2199ParentVersionRangeTest.windows-jdk12 / Run ITs Windows Java 12 / testValidLocalParentVersionRangeInvalidVersionExpression

Error Message:
Expected error message not found.

Stack Trace:
junit.framework.AssertionFailedError: Expected error message not found.
        at org.apache.maven.it.MavenITmng2199ParentVersionRangeTest.testValidLocalParentVersionRangeInvalidVersionExpression(MavenITmng2199ParentVersionRangeTest.java:311)


FAILED:  org.apache.maven.it.MavenITmng2199ParentVersionRangeTest.windows-jdk12 / Run ITs Windows Java 12 / testValidLocalParentVersionRangeInvalidVersionInheritance

Error Message:
Expected error message not found.

Stack Trace:
junit.framework.AssertionFailedError: Expected error message not found.
        at org.apache.maven.it.MavenITmng2199ParentVersionRangeTest.testValidLocalParentVersionRangeInvalidVersionInheritance(MavenITmng2199ParentVersionRangeTest.java:341)


FAILED:  org.apache.maven.it.MavenITmng2199ParentVersionRangeTest.windows-jdk8 / Run ITs Windows Java 8 / testValidParentVersionRangeInvalidVersionExpression

Error Message:
Expected error message not found.

Stack Trace:
junit.framework.AssertionFailedError: Expected error message not found.
        at org.apache.maven.it.MavenITmng2199ParentVersionRangeTest.testValidParentVersionRangeInvalidVersionExpression(MavenITmng2199ParentVersionRangeTest.java:152)


FAILED:  org.apache.maven.it.MavenITmng2199ParentVersionRangeTest.windows-jdk8 / Run ITs Windows Java 8 / testValidParentVersionRangeInvalidVersionInheritance

Error Message:
Expected error message not found.

Stack Trace:
junit.framework.AssertionFailedError: Expected error message not found.
        at org.apache.maven.it.MavenITmng2199ParentVersionRangeTest.testValidParentVersionRangeInvalidVersionInheritance(MavenITmng2199ParentVersionRangeTest.java:183)


FAILED:  org.apache.maven.it.MavenITmng2199ParentVersionRangeTest.windows-jdk8 / Run ITs Windows Java 8 / testValidLocalParentVersionRangeInvalidVersionExpression

Error Message:
Expected error message not found.

Stack Trace:
junit.framework.AssertionFailedError: Expected error message not found.
        at org.apache.maven.it.MavenITmng2199ParentVersionRangeTest.testValidLocalParentVersionRangeInvalidVersionExpression(MavenITmng2199ParentVersionRangeTest.java:311)


FAILED:  org.apache.maven.it.MavenITmng2199ParentVersionRangeTest.windows-jdk8 / Run ITs Windows Java 8 / testValidLocalParentVersionRangeInvalidVersionInheritance

Error Message:
Expected error message not found.

Stack Trace:
junit.framework.AssertionFailedError: Expected error message not found.
        at org.apache.maven.it.MavenITmng2199ParentVersionRangeTest.testValidLocalParentVersionRangeInvalidVersionInheritance(MavenITmng2199ParentVersionRangeTest.java:341)


FAILED:  org.apache.maven.it.MavenITmng2199ParentVersionRangeTest.windows-jdk11 / Run ITs Windows Java 11 / testValidParentVersionRangeInvalidVersionExpression

Error Message:
Expected error message not found.

Stack Trace:
junit.framework.AssertionFailedError: Expected error message not found.
        at org.apache.maven.it.MavenITmng2199ParentVersionRangeTest.testValidParentVersionRangeInvalidVersionExpression(MavenITmng2199ParentVersionRangeTest.java:152)


FAILED:  org.apache.maven.it.MavenITmng2199ParentVersionRangeTest.windows-jdk11 / Run ITs Windows Java 11 / testValidParentVersionRangeInvalidVersionInheritance

Error Message:
Expected error message not found.

Stack Trace:
junit.framework.AssertionFailedError: Expected error message not found.
        at org.apache.maven.it.MavenITmng2199ParentVersionRangeTest.testValidParentVersionRangeInvalidVersionInheritance(MavenITmng2199ParentVersionRangeTest.java:183)


FAILED:  org.apache.maven.it.MavenITmng2199ParentVersionRangeTest.windows-jdk11 / Run ITs Windows Java 11 / testValidLocalParentVersionRangeInvalidVersionExpression

Error Message:
Expected error message not found.

Stack Trace:
junit.framework.AssertionFailedError: Expected error message not found.
        at org.apache.maven.it.MavenITmng2199ParentVersionRangeTest.testValidLocalParentVersionRangeInvalidVersionExpression(MavenITmng2199ParentVersionRangeTest.java:311)


FAILED:  org.apache.maven.it.MavenITmng2199ParentVersionRangeTest.windows-jdk11 / Run ITs Windows Java 11 / testValidLocalParentVersionRangeInvalidVersionInheritance

Error Message:
Expected error message not found.

Stack Trace:
junit.framework.AssertionFailedError: Expected error message not found.
        at org.apache.maven.it.MavenITmng2199ParentVersionRangeTest.testValidLocalParentVersionRangeInvalidVersionInheritance(MavenITmng2199ParentVersionRangeTest.java:341)


FAILED:  org.apache.maven.it.MavenITmng2199ParentVersionRangeTest.linux-jdk11 / Run ITs Linux Java 11 / testValidParentVersionRangeInvalidVersionExpression

Error Message:
Expected error message not found.

Stack Trace:
junit.framework.AssertionFailedError: Expected error message not found.
        at org.apache.maven.it.MavenITmng2199ParentVersionRangeTest.testValidParentVersionRangeInvalidVersionExpression(MavenITmng2199ParentVersionRangeTest.java:152)


FAILED:  org.apache.maven.it.MavenITmng2199ParentVersionRangeTest.linux-jdk11 / Run ITs Linux Java 11 / testValidParentVersionRangeInvalidVersionInheritance

Error Message:
Expected error message not found.

Stack Trace:
junit.framework.AssertionFailedError: Expected error message not found.
        at org.apache.maven.it.MavenITmng2199ParentVersionRangeTest.testValidParentVersionRangeInvalidVersionInheritance(MavenITmng2199ParentVersionRangeTest.java:183)


FAILED:  org.apache.maven.it.MavenITmng2199ParentVersionRangeTest.linux-jdk11 / Run ITs Linux Java 11 / testValidLocalParentVersionRangeInvalidVersionExpression

Error Message:
Expected error message not found.

Stack Trace:
junit.framework.AssertionFailedError: Expected error message not found.
        at org.apache.maven.it.MavenITmng2199ParentVersionRangeTest.testValidLocalParentVersionRangeInvalidVersionExpression(MavenITmng2199ParentVersionRangeTest.java:311)


FAILED:  org.apache.maven.it.MavenITmng2199ParentVersionRangeTest.linux-jdk11 / Run ITs Linux Java 11 / testValidLocalParentVersionRangeInvalidVersionInheritance

Error Message:
Expected error message not found.

Stack Trace:
junit.framework.AssertionFailedError: Expected error message not found.
        at org.apache.maven.it.MavenITmng2199ParentVersionRangeTest.testValidLocalParentVersionRangeInvalidVersionInheritance(MavenITmng2199ParentVersionRangeTest.java:341)


FAILED:  org.apache.maven.it.MavenITmng2199ParentVersionRangeTest.linux-jdk13 / Run ITs Linux Java 13 / testValidParentVersionRangeInvalidVersionExpression

Error Message:
Expected error message not found.

Stack Trace:
junit.framework.AssertionFailedError: Expected error message not found.
        at org.apache.maven.it.MavenITmng2199ParentVersionRangeTest.testValidParentVersionRangeInvalidVersionExpression(MavenITmng2199ParentVersionRangeTest.java:152)


FAILED:  org.apache.maven.it.MavenITmng2199ParentVersionRangeTest.linux-jdk13 / Run ITs Linux Java 13 / testValidParentVersionRangeInvalidVersionInheritance

Error Message:
Expected error message not found.

Stack Trace:
junit.framework.AssertionFailedError: Expected error message not found.
        at org.apache.maven.it.MavenITmng2199ParentVersionRangeTest.testValidParentVersionRangeInvalidVersionInheritance(MavenITmng2199ParentVersionRangeTest.java:183)


FAILED:  org.apache.maven.it.MavenITmng2199ParentVersionRangeTest.linux-jdk13 / Run ITs Linux Java 13 / testValidLocalParentVersionRangeInvalidVersionExpression

Error Message:
Expected error message not found.

Stack Trace:
junit.framework.AssertionFailedError: Expected error message not found.
        at org.apache.maven.it.MavenITmng2199ParentVersionRangeTest.testValidLocalParentVersionRangeInvalidVersionExpression(MavenITmng2199ParentVersionRangeTest.java:311)


FAILED:  org.apache.maven.it.MavenITmng2199ParentVersionRangeTest.linux-jdk13 / Run ITs Linux Java 13 / testValidLocalParentVersionRangeInvalidVersionInheritance

Error Message:
Expected error message not found.

Stack Trace:
junit.framework.AssertionFailedError: Expected error message not found.
        at org.apache.maven.it.MavenITmng2199ParentVersionRangeTest.testValidLocalParentVersionRangeInvalidVersionInheritance(MavenITmng2199ParentVersionRangeTest.java:341)


FAILED:  org.apache.maven.it.MavenITmng2199ParentVersionRangeTest.linux-jdk8 / Run ITs Linux Java 8 / testValidParentVersionRangeInvalidVersionExpression

Error Message:
Expected error message not found.

Stack Trace:
junit.framework.AssertionFailedError: Expected error message not found.
        at org.apache.maven.it.MavenITmng2199ParentVersionRangeTest.testValidParentVersionRangeInvalidVersionExpression(MavenITmng2199ParentVersionRangeTest.java:152)


FAILED:  org.apache.maven.it.MavenITmng2199ParentVersionRangeTest.linux-jdk8 / Run ITs Linux Java 8 / testValidParentVersionRangeInvalidVersionInheritance

Error Message:
Expected error message not found.

Stack Trace:
junit.framework.AssertionFailedError: Expected error message not found.
        at org.apache.maven.it.MavenITmng2199ParentVersionRangeTest.testValidParentVersionRangeInvalidVersionInheritance(MavenITmng2199ParentVersionRangeTest.java:183)


FAILED:  org.apache.maven.it.MavenITmng2199ParentVersionRangeTest.linux-jdk8 / Run ITs Linux Java 8 / testValidLocalParentVersionRangeInvalidVersionExpression

Error Message:
Expected error message not found.

Stack Trace:
junit.framework.AssertionFailedError: Expected error message not found.
        at org.apache.maven.it.MavenITmng2199ParentVersionRangeTest.testValidLocalParentVersionRangeInvalidVersionExpression(MavenITmng2199ParentVersionRangeTest.java:311)


FAILED:  org.apache.maven.it.MavenITmng2199ParentVersionRangeTest.linux-jdk8 / Run ITs Linux Java 8 / testValidLocalParentVersionRangeInvalidVersionInheritance

Error Message:
Expected error message not found.

Stack Trace:
junit.framework.AssertionFailedError: Expected error message not found.
        at org.apache.maven.it.MavenITmng2199ParentVersionRangeTest.testValidLocalParentVersionRangeInvalidVersionInheritance(MavenITmng2199ParentVersionRangeTest.java:341)


FAILED:  org.apache.maven.it.MavenITmng2199ParentVersionRangeTest.linux-jdk12 / Run ITs Linux Java 12 / testValidParentVersionRangeInvalidVersionExpression

Error Message:
Expected error message not found.

Stack Trace:
junit.framework.AssertionFailedError: Expected error message not found.
        at org.apache.maven.it.MavenITmng2199ParentVersionRangeTest.testValidParentVersionRangeInvalidVersionExpression(MavenITmng2199ParentVersionRangeTest.java:152)


FAILED:  org.apache.maven.it.MavenITmng2199ParentVersionRangeTest.linux-jdk12 / Run ITs Linux Java 12 / testValidParentVersionRangeInvalidVersionInheritance

Error Message:
Expected error message not found.

Stack Trace:
junit.framework.AssertionFailedError: Expected error message not found.
        at org.apache.maven.it.MavenITmng2199ParentVersionRangeTest.testValidParentVersionRangeInvalidVersionInheritance(MavenITmng2199ParentVersionRangeTest.java:183)


FAILED:  org.apache.maven.it.MavenITmng2199ParentVersionRangeTest.linux-jdk12 / Run ITs Linux Java 12 / testValidLocalParentVersionRangeInvalidVersionExpression

Error Message:
Expected error message not found.

Stack Trace:
junit.framework.AssertionFailedError: Expected error message not found.
        at org.apache.maven.it.MavenITmng2199ParentVersionRangeTest.testValidLocalParentVersionRangeInvalidVersionExpression(MavenITmng2199ParentVersionRangeTest.java:311)


FAILED:  org.apache.maven.it.MavenITmng2199ParentVersionRangeTest.linux-jdk12 / Run ITs Linux Java 12 / testValidLocalParentVersionRangeInvalidVersionInheritance

Error Message:
Expected error message not found.

Stack Trace:
junit.framework.AssertionFailedError: Expected error message not found.
        at org.apache.maven.it.MavenITmng2199ParentVersionRangeTest.testValidLocalParentVersionRangeInvalidVersionInheritance(MavenITmng2199ParentVersionRangeTest.java:341)




Build log:
[...truncated 77883 lines...]
[withMaven] artifactsPublisher - Archive artifact core-it-support/core-it-plugins/maven-it-plugin-model-interpolation/target/maven-it-plugin-model-interpolation-2.1-SNAPSHOT.jar under org/apache/maven/its/plugins/maven-it-plugin-model-interpolation/2.1-SNAPSHOT/maven-it-plugin-model-interpolation-2.1-SNAPSHOT.jar
[withMaven] artifactsPublisher - Archive artifact core-it-support/core-it-plugins/maven-it-plugin-no-default-comp/pom.xml under org/apache/maven/its/plugins/maven-it-plugin-no-default-comp/2.1-SNAPSHOT/maven-it-plugin-no-default-comp-2.1-SNAPSHOT.pom
[withMaven] artifactsPublisher - Archive artifact core-it-support/core-it-plugins/maven-it-plugin-no-default-comp/target/maven-it-plugin-no-default-comp-2.1-SNAPSHOT.jar under org/apache/maven/its/plugins/maven-it-plugin-no-default-comp/2.1-SNAPSHOT/maven-it-plugin-no-default-comp-2.1-SNAPSHOT.jar
[withMaven] artifactsPublisher - Archive artifact core-it-support/core-it-plugins/maven-it-plugin-no-project/pom.xml under org/apache/maven/its/plugins/maven-it-plugin-no-project/2.1-SNAPSHOT/maven-it-plugin-no-project-2.1-SNAPSHOT.pom
[withMaven] artifactsPublisher - Archive artifact core-it-support/core-it-plugins/maven-it-plugin-no-project/target/maven-it-plugin-no-project-2.1-SNAPSHOT.jar under org/apache/maven/its/plugins/maven-it-plugin-no-project/2.1-SNAPSHOT/maven-it-plugin-no-project-2.1-SNAPSHOT.jar
[withMaven] artifactsPublisher - Archive artifact core-it-support/core-it-plugins/maven-it-plugin-online/pom.xml under org/apache/maven/its/plugins/maven-it-plugin-online/2.1-SNAPSHOT/maven-it-plugin-online-2.1-SNAPSHOT.pom
[withMaven] artifactsPublisher - Archive artifact core-it-support/core-it-plugins/maven-it-plugin-online/target/maven-it-plugin-online-2.1-SNAPSHOT.jar under org/apache/maven/its/plugins/maven-it-plugin-online/2.1-SNAPSHOT/maven-it-plugin-online-2.1-SNAPSHOT.jar
[withMaven] artifactsPublisher - Archive artifact core-it-support/core-it-plugins/maven-it-plugin-optional-mojos/pom.xml under org/apache/maven/its/plugins/maven-it-plugin-optional-mojos/2.1-SNAPSHOT/maven-it-plugin-optional-mojos-2.1-SNAPSHOT.pom
[withMaven] artifactsPublisher - Archive artifact core-it-support/core-it-plugins/maven-it-plugin-optional-mojos/target/maven-it-plugin-optional-mojos-2.1-SNAPSHOT.jar under org/apache/maven/its/plugins/maven-it-plugin-optional-mojos/2.1-SNAPSHOT/maven-it-plugin-optional-mojos-2.1-SNAPSHOT.jar
[withMaven] artifactsPublisher - Archive artifact core-it-support/core-it-plugins/maven-it-plugin-packaging/pom.xml under org/apache/maven/its/plugins/maven-it-plugin-packaging/2.1-SNAPSHOT/maven-it-plugin-packaging-2.1-SNAPSHOT.pom
[withMaven] artifactsPublisher - Archive artifact core-it-support/core-it-plugins/maven-it-plugin-packaging/target/maven-it-plugin-packaging-2.1-SNAPSHOT.jar under org/apache/maven/its/plugins/maven-it-plugin-packaging/2.1-SNAPSHOT/maven-it-plugin-packaging-2.1-SNAPSHOT.jar
[withMaven] artifactsPublisher - Archive artifact core-it-support/core-it-plugins/maven-it-plugin-parameter-implementation/pom.xml under org/apache/maven/its/plugins/maven-it-plugin-parameter-implementation/2.1-SNAPSHOT/maven-it-plugin-parameter-implementation-2.1-SNAPSHOT.pom
[withMaven] artifactsPublisher - Archive artifact core-it-support/core-it-plugins/maven-it-plugin-parameter-implementation/target/maven-it-plugin-parameter-implementation-2.1-SNAPSHOT.jar under org/apache/maven/its/plugins/maven-it-plugin-parameter-implementation/2.1-SNAPSHOT/maven-it-plugin-parameter-implementation-2.1-SNAPSHOT.jar
[withMaven] artifactsPublisher - Archive artifact core-it-support/core-it-plugins/maven-it-plugin-plugin-dependency/pom.xml under org/apache/maven/its/plugins/maven-it-plugin-plugin-dependency/2.1-SNAPSHOT/maven-it-plugin-plugin-dependency-2.1-SNAPSHOT.pom
[withMaven] artifactsPublisher - Archive artifact core-it-support/core-it-plugins/maven-it-plugin-plugin-dependency/target/maven-it-plugin-plugin-dependency-2.1-SNAPSHOT.jar under org/apache/maven/its/plugins/maven-it-plugin-plugin-dependency/2.1-SNAPSHOT/maven-it-plugin-plugin-dependency-2.1-SNAPSHOT.jar
[withMaven] artifactsPublisher - Archive artifact core-it-support/core-it-plugins/maven-it-plugin-project/pom.xml under org/apache/maven/its/plugins/maven-it-plugin-project/2.1-SNAPSHOT/maven-it-plugin-project-2.1-SNAPSHOT.pom
[withMaven] artifactsPublisher - Archive artifact core-it-support/core-it-plugins/maven-it-plugin-project/target/maven-it-plugin-project-2.1-SNAPSHOT.jar under org/apache/maven/its/plugins/maven-it-plugin-project/2.1-SNAPSHOT/maven-it-plugin-project-2.1-SNAPSHOT.jar
[withMaven] artifactsPublisher - Archive artifact core-it-support/core-it-plugins/maven-it-plugin-project-interpolation/pom.xml under org/apache/maven/its/plugins/maven-it-plugin-project-interpolation/2.1-SNAPSHOT/maven-it-plugin-project-interpolation-2.1-SNAPSHOT.pom
[withMaven] artifactsPublisher - Archive artifact core-it-support/core-it-plugins/maven-it-plugin-project-interpolation/target/maven-it-plugin-project-interpolation-2.1-SNAPSHOT.jar under org/apache/maven/its/plugins/maven-it-plugin-project-interpolation/2.1-SNAPSHOT/maven-it-plugin-project-interpolation-2.1-SNAPSHOT.jar
[withMaven] artifactsPublisher - Archive artifact core-it-support/core-it-plugins/maven-it-plugin-setter/pom.xml under org/apache/maven/its/plugins/maven-it-plugin-setter/2.1-SNAPSHOT/maven-it-plugin-setter-2.1-SNAPSHOT.pom
[withMaven] artifactsPublisher - Archive artifact core-it-support/core-it-plugins/maven-it-plugin-setter/target/maven-it-plugin-setter-2.1-SNAPSHOT.jar under org/apache/maven/its/plugins/maven-it-plugin-setter/2.1-SNAPSHOT/maven-it-plugin-setter-2.1-SNAPSHOT.jar
[withMaven] artifactsPublisher - Archive artifact core-it-support/core-it-plugins/maven-it-plugin-singleton-component/pom.xml under org/apache/maven/its/plugins/maven-it-plugin-singleton-component/2.1-SNAPSHOT/maven-it-plugin-singleton-component-2.1-SNAPSHOT.pom
[withMaven] artifactsPublisher - Archive artifact core-it-support/core-it-plugins/maven-it-plugin-singleton-component/target/maven-it-plugin-singleton-component-2.1-SNAPSHOT.jar under org/apache/maven/its/plugins/maven-it-plugin-singleton-component/2.1-SNAPSHOT/maven-it-plugin-singleton-component-2.1-SNAPSHOT.jar
[withMaven] artifactsPublisher - Archive artifact core-it-support/core-it-plugins/maven-it-plugin-site/pom.xml under org/apache/maven/its/plugins/maven-it-plugin-site/2.1-SNAPSHOT/maven-it-plugin-site-2.1-SNAPSHOT.pom
[withMaven] artifactsPublisher - Archive artifact core-it-support/core-it-plugins/maven-it-plugin-site/target/maven-it-plugin-site-2.1-SNAPSHOT.jar under org/apache/maven/its/plugins/maven-it-plugin-site/2.1-SNAPSHOT/maven-it-plugin-site-2.1-SNAPSHOT.jar
[withMaven] artifactsPublisher - Archive artifact core-it-support/core-it-plugins/maven-it-plugin-toolchain/pom.xml under org/apache/maven/its/plugins/maven-it-plugin-toolchain/2.1-SNAPSHOT/maven-it-plugin-toolchain-2.1-SNAPSHOT.pom
[withMaven] artifactsPublisher - Archive artifact core-it-support/core-it-plugins/maven-it-plugin-toolchain/target/maven-it-plugin-toolchain-2.1-SNAPSHOT.jar under org/apache/maven/its/plugins/maven-it-plugin-toolchain/2.1-SNAPSHOT/maven-it-plugin-toolchain-2.1-SNAPSHOT.jar
[withMaven] artifactsPublisher - Archive artifact core-it-support/core-it-plugins/maven-it-plugin-touch/pom.xml under org/apache/maven/its/plugins/maven-it-plugin-touch/2.1-SNAPSHOT/maven-it-plugin-touch-2.1-SNAPSHOT.pom
[withMaven] artifactsPublisher - Archive artifact core-it-support/core-it-plugins/maven-it-plugin-touch/target/maven-it-plugin-touch-2.1-SNAPSHOT.jar under org/apache/maven/its/plugins/maven-it-plugin-touch/2.1-SNAPSHOT/maven-it-plugin-touch-2.1-SNAPSHOT.jar
[withMaven] artifactsPublisher - Archive artifact core-it-support/core-it-plugins/maven-it-plugin-uses-properties/pom.xml under org/apache/maven/its/plugins/maven-it-plugin-uses-properties/2.1-SNAPSHOT/maven-it-plugin-uses-properties-2.1-SNAPSHOT.pom
[withMaven] artifactsPublisher - Archive artifact core-it-support/core-it-plugins/maven-it-plugin-uses-properties/target/maven-it-plugin-uses-properties-2.1-SNAPSHOT.jar under org/apache/maven/its/plugins/maven-it-plugin-uses-properties/2.1-SNAPSHOT/maven-it-plugin-uses-properties-2.1-SNAPSHOT.jar
[withMaven] artifactsPublisher - Archive artifact core-it-support/core-it-plugins/maven-it-plugin-uses-wagon/pom.xml under org/apache/maven/its/plugins/maven-it-plugin-uses-wagon/2.1-SNAPSHOT/maven-it-plugin-uses-wagon-2.1-SNAPSHOT.pom
[withMaven] artifactsPublisher - Archive artifact core-it-support/core-it-plugins/maven-it-plugin-uses-wagon/target/maven-it-plugin-uses-wagon-2.1-SNAPSHOT.jar under org/apache/maven/its/plugins/maven-it-plugin-uses-wagon/2.1-SNAPSHOT/maven-it-plugin-uses-wagon-2.1-SNAPSHOT.jar
[withMaven] artifactsPublisher - Archive artifact core-it-support/core-it-plugins/maven-it-plugin-all/pom.xml under org/apache/maven/its/plugins/maven-it-plugin-all/2.1-SNAPSHOT/maven-it-plugin-all-2.1-SNAPSHOT.pom
[withMaven] artifactsPublisher - Archive artifact core-it-support/core-it-plugins/maven-it-plugin-all/target/maven-it-plugin-all-2.1-SNAPSHOT.jar under org/apache/maven/its/plugins/maven-it-plugin-all/2.1-SNAPSHOT/maven-it-plugin-all-2.1-SNAPSHOT.jar
[withMaven] artifactsPublisher - Archive artifact core-it-support/core-it-plugins/maven-it-plugin-plexus-utils-11/pom.xml under org/apache/maven/its/plugins/maven-it-plugin-plexus-utils-11/2.1-SNAPSHOT/maven-it-plugin-plexus-utils-11-2.1-SNAPSHOT.pom
[withMaven] artifactsPublisher - Archive artifact core-it-support/core-it-plugins/maven-it-plugin-plexus-utils-11/target/maven-it-plugin-plexus-utils-11-2.1-SNAPSHOT.jar under org/apache/maven/its/plugins/maven-it-plugin-plexus-utils-11/2.1-SNAPSHOT/maven-it-plugin-plexus-utils-11-2.1-SNAPSHOT.jar
[withMaven] artifactsPublisher - Archive artifact core-it-support/core-it-plugins/maven-it-plugin-plexus-utils-new/pom.xml under org/apache/maven/its/plugins/maven-it-plugin-plexus-utils-new/2.1-SNAPSHOT/maven-it-plugin-plexus-utils-new-2.1-SNAPSHOT.pom
[withMaven] artifactsPublisher - Archive artifact core-it-support/core-it-plugins/maven-it-plugin-plexus-utils-new/target/maven-it-plugin-plexus-utils-new-2.1-SNAPSHOT.jar under org/apache/maven/its/plugins/maven-it-plugin-plexus-utils-new/2.1-SNAPSHOT/maven-it-plugin-plexus-utils-new-2.1-SNAPSHOT.jar
[withMaven] artifactsPublisher - Archive artifact core-it-support/core-it-plugins/maven-it-plugin-plexus-component-api/pom.xml under org/apache/maven/its/plugins/maven-it-plugin-plexus-component-api/2.1-SNAPSHOT/maven-it-plugin-plexus-component-api-2.1-SNAPSHOT.pom
[withMaven] artifactsPublisher - Archive artifact core-it-support/core-it-plugins/maven-it-plugin-plexus-component-api/target/maven-it-plugin-plexus-component-api-2.1-SNAPSHOT.jar under org/apache/maven/its/plugins/maven-it-plugin-plexus-component-api/2.1-SNAPSHOT/maven-it-plugin-plexus-component-api-2.1-SNAPSHOT.jar
[withMaven] artifactsPublisher - Archive artifact core-it-support/core-it-plugins/maven-it-plugin-log4j/pom.xml under org/apache/maven/its/plugins/maven-it-plugin-log4j/2.1-SNAPSHOT/maven-it-plugin-log4j-2.1-SNAPSHOT.pom
[withMaven] artifactsPublisher - Archive artifact core-it-support/core-it-plugins/maven-it-plugin-log4j/target/maven-it-plugin-log4j-2.1-SNAPSHOT.jar under org/apache/maven/its/plugins/maven-it-plugin-log4j/2.1-SNAPSHOT/maven-it-plugin-log4j-2.1-SNAPSHOT.jar
[withMaven] artifactsPublisher - Archive artifact core-it-support/core-it-plugins/maven-it-plugin-extension1/pom.xml under org/apache/maven/its/plugins/maven-it-plugin-extension1/2.1-SNAPSHOT/maven-it-plugin-extension1-2.1-SNAPSHOT.pom
[withMaven] artifactsPublisher - Archive artifact core-it-support/core-it-plugins/maven-it-plugin-extension1/target/maven-it-plugin-extension1-2.1-SNAPSHOT.jar under org/apache/maven/its/plugins/maven-it-plugin-extension1/2.1-SNAPSHOT/maven-it-plugin-extension1-2.1-SNAPSHOT.jar
[withMaven] artifactsPublisher - Archive artifact core-it-support/core-it-plugins/maven-it-plugin-extension2/pom.xml under org/apache/maven/its/plugins/maven-it-plugin-extension2/2.1-SNAPSHOT/maven-it-plugin-extension2-2.1-SNAPSHOT.pom
[withMaven] artifactsPublisher - Archive artifact core-it-support/core-it-plugins/maven-it-plugin-extension2/target/maven-it-plugin-extension2-2.1-SNAPSHOT.jar under org/apache/maven/its/plugins/maven-it-plugin-extension2/2.1-SNAPSHOT/maven-it-plugin-extension2-2.1-SNAPSHOT.jar
[withMaven] artifactsPublisher - Archive artifact core-it-support/core-it-plugins/maven-it-plugin-plexus-lifecycle/pom.xml under org/apache/maven/its/plugins/maven-it-plugin-plexus-lifecycle/2.1-SNAPSHOT/maven-it-plugin-plexus-lifecycle-2.1-SNAPSHOT.pom
[withMaven] artifactsPublisher - Archive artifact core-it-support/core-it-plugins/maven-it-plugin-plexus-lifecycle/target/maven-it-plugin-plexus-lifecycle-2.1-SNAPSHOT.jar under org/apache/maven/its/plugins/maven-it-plugin-plexus-lifecycle/2.1-SNAPSHOT/maven-it-plugin-plexus-lifecycle-2.1-SNAPSHOT.jar
[withMaven] artifactsPublisher - Archive artifact core-it-support/core-it-plugins/maven-it-plugin-settings/pom.xml under org/apache/maven/its/plugins/maven-it-plugin-settings/2.1-SNAPSHOT/maven-it-plugin-settings-2.1-SNAPSHOT.pom
[withMaven] artifactsPublisher - Archive artifact core-it-support/core-it-plugins/maven-it-plugin-settings/target/maven-it-plugin-settings-2.1-SNAPSHOT.jar under org/apache/maven/its/plugins/maven-it-plugin-settings/2.1-SNAPSHOT/maven-it-plugin-settings-2.1-SNAPSHOT.jar
[withMaven] artifactsPublisher - Archive artifact core-it-support/core-it-plugins/mng5805-extension/pom.xml under org/apache/maven/its/plugins/mng-5805-pkg-type-mojo-configuration-extension/2.1-SNAPSHOT/mng-5805-pkg-type-mojo-configuration-extension-2.1-SNAPSHOT.pom
[withMaven] artifactsPublisher - Archive artifact core-it-support/core-it-plugins/mng5805-extension/target/mng-5805-pkg-type-mojo-configuration-extension-2.1-SNAPSHOT.jar under org/apache/maven/its/plugins/mng-5805-pkg-type-mojo-configuration-extension/2.1-SNAPSHOT/mng-5805-pkg-type-mojo-configuration-extension-2.1-SNAPSHOT.jar
[withMaven] artifactsPublisher - Archive artifact core-it-support/core-it-plugins/mng5805-extension2/pom.xml under org/apache/maven/its/plugins/mng-5805-pkg-type-mojo-configuration-extension2/2.1-SNAPSHOT/mng-5805-pkg-type-mojo-configuration-extension2-2.1-SNAPSHOT.pom
[withMaven] artifactsPublisher - Archive artifact core-it-support/core-it-plugins/mng5805-extension2/target/mng-5805-pkg-type-mojo-configuration-extension2-2.1-SNAPSHOT.jar under org/apache/maven/its/plugins/mng-5805-pkg-type-mojo-configuration-extension2/2.1-SNAPSHOT/mng-5805-pkg-type-mojo-configuration-extension2-2.1-SNAPSHOT.jar
[withMaven] artifactsPublisher - Archive artifact core-it-support/core-it-plugins/mng5805-plugin/pom.xml under org/apache/maven/its/plugins/mng-5805-pkg-type-mojo-configuration-plugin/2.1-SNAPSHOT/mng-5805-pkg-type-mojo-configuration-plugin-2.1-SNAPSHOT.pom
[withMaven] artifactsPublisher - Archive artifact core-it-support/core-it-plugins/mng5805-plugin/target/mng-5805-pkg-type-mojo-configuration-plugin-2.1-SNAPSHOT.jar under org/apache/maven/its/plugins/mng-5805-pkg-type-mojo-configuration-plugin/2.1-SNAPSHOT/mng-5805-pkg-type-mojo-configuration-plugin-2.1-SNAPSHOT.jar
[withMaven] artifactsPublisher - Archive artifact core-it-support/core-it-plugins/mng5805-plugin-dep/pom.xml under org/apache/maven/its/plugins/mng-5805-pkg-type-mojo-configuration-plugin-dep/2.1-SNAPSHOT/mng-5805-pkg-type-mojo-configuration-plugin-dep-2.1-SNAPSHOT.pom
[withMaven] artifactsPublisher - Archive artifact core-it-support/core-it-plugins/mng5805-plugin-dep/target/mng-5805-pkg-type-mojo-configuration-plugin-dep-2.1-SNAPSHOT.jar under org/apache/maven/its/plugins/mng-5805-pkg-type-mojo-configuration-plugin-dep/2.1-SNAPSHOT/mng-5805-pkg-type-mojo-configuration-plugin-dep-2.1-SNAPSHOT.jar
[withMaven] artifactsPublisher - Archive artifact core-it-support/core-it-plugins/mng5958-extension/pom.xml under org/apache/maven/its/plugins/mng-5958-pkg-type-extension/2.1-SNAPSHOT/mng-5958-pkg-type-extension-2.1-SNAPSHOT.pom
[withMaven] artifactsPublisher - Archive artifact core-it-support/core-it-plugins/mng5958-extension/target/mng-5958-pkg-type-extension-2.1-SNAPSHOT.jar under org/apache/maven/its/plugins/mng-5958-pkg-type-extension/2.1-SNAPSHOT/mng-5958-pkg-type-extension-2.1-SNAPSHOT.jar
[withMaven] artifactsPublisher - Archive artifact core-it-support/core-it-plugins/mng6759-plugin-resolves-project-dependencies/pom.xml under org/apache/maven/its/plugins/mng-6759-resolves-project-dependencies-plugin/2.1-SNAPSHOT/mng-6759-resolves-project-dependencies-plugin-2.1-SNAPSHOT.pom
[withMaven] artifactsPublisher - Archive artifact core-it-support/core-it-plugins/mng6759-plugin-resolves-project-dependencies/target/mng-6759-resolves-project-dependencies-plugin-2.1-SNAPSHOT.jar under org/apache/maven/its/plugins/mng-6759-resolves-project-dependencies-plugin/2.1-SNAPSHOT/mng-6759-resolves-project-dependencies-plugin-2.1-SNAPSHOT.jar
[withMaven] artifactsPublisher - Archive artifact core-it-support/core-it-toolchain/pom.xml under org/apache/maven/its/core-it-toolchain/2.1-SNAPSHOT/core-it-toolchain-2.1-SNAPSHOT.pom
[withMaven] artifactsPublisher - Archive artifact core-it-support/core-it-toolchain/target/core-it-toolchain-2.1-SNAPSHOT.jar under org/apache/maven/its/core-it-toolchain/2.1-SNAPSHOT/core-it-toolchain-2.1-SNAPSHOT.jar
[withMaven] artifactsPublisher - Archive artifact core-it-support/core-it-wagon/pom.xml under org/apache/maven/its/core-it-wagon/2.1-SNAPSHOT/core-it-wagon-2.1-SNAPSHOT.pom
[withMaven] artifactsPublisher - Archive artifact core-it-support/core-it-wagon/target/core-it-wagon-2.1-SNAPSHOT.jar under org/apache/maven/its/core-it-wagon/2.1-SNAPSHOT/core-it-wagon-2.1-SNAPSHOT.jar
[withMaven] artifactsPublisher - Archive artifact core-it-support/core-it-support-artifacts/pom.xml under org/apache/maven/its/core-it-support-artifacts/2.1-SNAPSHOT/core-it-support-artifacts-2.1-SNAPSHOT.pom
[withMaven] artifactsPublisher - Archive artifact core-it-support/core-it-support-artifacts/target/core-it-support-artifacts-2.1-SNAPSHOT-repo.zip under org/apache/maven/its/core-it-support-artifacts/2.1-SNAPSHOT/core-it-support-artifacts-2.1-SNAPSHOT-repo.zip
[withMaven] artifactsPublisher - Archive artifact core-it-support/core-it-extension/pom.xml under org/apache/maven/its/core-it-extension/2.1-SNAPSHOT/core-it-extension-2.1-SNAPSHOT.pom
[withMaven] artifactsPublisher - Archive artifact core-it-support/core-it-extension/target/core-it-extension-2.1-SNAPSHOT.jar under org/apache/maven/its/core-it-extension/2.1-SNAPSHOT/core-it-extension-2.1-SNAPSHOT.jar
[withMaven] artifactsPublisher - Archive artifact core-it-suite/pom.xml under org/apache/maven/its/core-it-suite/2.1-SNAPSHOT/core-it-suite-2.1-SNAPSHOT.pom
[withMaven] artifactsPublisher - Archive artifact core-it-suite/target/core-it-suite-2.1-SNAPSHOT.jar under org/apache/maven/its/core-it-suite/2.1-SNAPSHOT/core-it-suite-2.1-SNAPSHOT.jar
[withMaven] artifactsPublisher - Archive artifact core-it-suite/target/core-it-suite-2.1-SNAPSHOT-tests.jar under org/apache/maven/its/core-it-suite/2.1-SNAPSHOT/core-it-suite-2.1-SNAPSHOT-tests.jar
[withMaven] junitPublisher - Archive test results for Maven artifact org.apache.maven.its.plugins:maven-it-plugin-active-collection:maven-plugin:2.1-SNAPSHOT generated by maven-surefire-plugin:test (default-test): core-it-support/core-it-plugins/maven-it-plugin-active-collection/target/surefire-reports/*.xml
[withMaven] junitPublisher - Archive test results for Maven artifact org.apache.maven.its.plugins:maven-it-plugin-ant-based:maven-plugin:2.1-SNAPSHOT generated by maven-surefire-plugin:test (default-test): core-it-support/core-it-plugins/maven-it-plugin-ant-based/target/surefire-reports/*.xml
[withMaven] junitPublisher - Archive test results for Maven artifact org.apache.maven.its.plugins:maven-it-plugin-artifact:maven-plugin:2.1-SNAPSHOT generated by maven-surefire-plugin:test (default-test): core-it-support/core-it-plugins/maven-it-plugin-artifact/target/surefire-reports/*.xml
[withMaven] junitPublisher - Archive test results for Maven artifact org.apache.maven.its.plugins.class-loader:dep-a:jar:2.1-SNAPSHOT generated by maven-surefire-plugin:test (default-test): core-it-support/core-it-plugins/maven-it-plugin-class-loader/dep-a/target/surefire-reports/*.xml
[withMaven] junitPublisher - Archive test results for Maven artifact org.apache.maven.its.plugins.class-loader:dep-b:jar:2.1-SNAPSHOT generated by maven-surefire-plugin:test (default-test): core-it-support/core-it-plugins/maven-it-plugin-class-loader/dep-b/target/surefire-reports/*.xml
[withMaven] junitPublisher - Archive test results for Maven artifact org.apache.maven.its.plugins.class-loader:dep-c:jar:2.1-SNAPSHOT generated by maven-surefire-plugin:test (default-test): core-it-support/core-it-plugins/maven-it-plugin-class-loader/dep-c/target/surefire-reports/*.xml
[withMaven] junitPublisher - Archive test results for Maven artifact org.apache.maven.its.plugins:maven-it-plugin-class-loader:maven-plugin:2.1-SNAPSHOT generated by maven-surefire-plugin:test (default-test): core-it-support/core-it-plugins/maven-it-plugin-class-loader/maven-it-plugin-class-loader/target/surefire-reports/*.xml
[withMaven] junitPublisher - Archive test results for Maven artifact org.apache.maven.its.plugins:maven-it-plugin-configuration:maven-plugin:2.1-SNAPSHOT generated by maven-surefire-plugin:test (default-test): core-it-support/core-it-plugins/maven-it-plugin-configuration/target/surefire-reports/*.xml
[withMaven] junitPublisher - Archive test results for Maven artifact org.apache.maven.its.plugins:maven-it-plugin-context-passing:maven-plugin:2.1-SNAPSHOT generated by maven-surefire-plugin:test (default-test): core-it-support/core-it-plugins/maven-it-plugin-context-passing/target/surefire-reports/*.xml
[withMaven] junitPublisher - Archive test results for Maven artifact org.apache.maven.plugins:maven-clean-plugin:maven-plugin:0.1-stub-SNAPSHOT generated by maven-surefire-plugin:test (default-test): core-it-support/core-it-plugins/maven-it-plugin-core-stubs/maven-clean-plugin/target/surefire-reports/*.xml
[withMaven] junitPublisher - Archive test results for Maven artifact org.apache.maven.plugins:maven-compiler-plugin:maven-plugin:0.1-stub-SNAPSHOT generated by maven-surefire-plugin:test (default-test): core-it-support/core-it-plugins/maven-it-plugin-core-stubs/maven-compiler-plugin/target/surefire-reports/*.xml
[withMaven] junitPublisher - Archive test results for Maven artifact org.apache.maven.plugins:maven-deploy-plugin:maven-plugin:0.1-stub-SNAPSHOT generated by maven-surefire-plugin:test (default-test): core-it-support/core-it-plugins/maven-it-plugin-core-stubs/maven-deploy-plugin/target/surefire-reports/*.xml
[withMaven] junitPublisher - Archive test results for Maven artifact org.apache.maven.plugins:maven-ear-plugin:maven-plugin:0.1-stub-SNAPSHOT generated by maven-surefire-plugin:test (default-test): core-it-support/core-it-plugins/maven-it-plugin-core-stubs/maven-ear-plugin/target/surefire-reports/*.xml
[withMaven] junitPublisher - Archive test results for Maven artifact org.apache.maven.plugins:maven-ejb-plugin:maven-plugin:0.1-stub-SNAPSHOT generated by maven-surefire-plugin:test (default-test): core-it-support/core-it-plugins/maven-it-plugin-core-stubs/maven-ejb-plugin/target/surefire-reports/*.xml
[withMaven] junitPublisher - Archive test results for Maven artifact org.apache.maven.plugins:maven-install-plugin:maven-plugin:0.1-stub-SNAPSHOT generated by maven-surefire-plugin:test (default-test): core-it-support/core-it-plugins/maven-it-plugin-core-stubs/maven-install-plugin/target/surefire-reports/*.xml
[withMaven] junitPublisher - Archive test results for Maven artifact org.apache.maven.plugins:maven-jar-plugin:maven-plugin:0.1-stub-SNAPSHOT generated by maven-surefire-plugin:test (default-test): core-it-support/core-it-plugins/maven-it-plugin-core-stubs/maven-jar-plugin/target/surefire-reports/*.xml
[withMaven] junitPublisher - Archive test results for Maven artifact org.apache.maven.plugins:maven-javadoc-plugin:maven-plugin:0.1-stub-SNAPSHOT generated by maven-surefire-plugin:test (default-test): core-it-support/core-it-plugins/maven-it-plugin-core-stubs/maven-javadoc-plugin/target/surefire-reports/*.xml
[withMaven] junitPublisher - Archive test results for Maven artifact org.apache.maven.plugins:maven-plugin-plugin:maven-plugin:0.1-stub-SNAPSHOT generated by maven-surefire-plugin:test (default-test): core-it-support/core-it-plugins/maven-it-plugin-core-stubs/maven-plugin-plugin/target/surefire-reports/*.xml
[withMaven] junitPublisher - Archive test results for Maven artifact org.apache.maven.plugins:maven-rar-plugin:maven-plugin:0.1-stub-SNAPSHOT generated by maven-surefire-plugin:test (default-test): core-it-support/core-it-plugins/maven-it-plugin-core-stubs/maven-rar-plugin/target/surefire-reports/*.xml
[withMaven] junitPublisher - Archive test results for Maven artifact org.apache.maven.plugins:maven-resources-plugin:maven-plugin:0.1-stub-SNAPSHOT generated by maven-surefire-plugin:test (default-test): core-it-support/core-it-plugins/maven-it-plugin-core-stubs/maven-resources-plugin/target/surefire-reports/*.xml
[withMaven] junitPublisher - Archive test results for Maven artifact org.apache.maven.plugins:maven-site-plugin:maven-plugin:0.1-stub-SNAPSHOT generated by maven-surefire-plugin:test (default-test): core-it-support/core-it-plugins/maven-it-plugin-core-stubs/maven-site-plugin/target/surefire-reports/*.xml
[withMaven] junitPublisher - Archive test results for Maven artifact org.apache.maven.plugins:maven-source-plugin:maven-plugin:0.1-stub-SNAPSHOT generated by maven-surefire-plugin:test (default-test): core-it-support/core-it-plugins/maven-it-plugin-core-stubs/maven-source-plugin/target/surefire-reports/*.xml
[withMaven] junitPublisher - Archive test results for Maven artifact org.apache.maven.plugins:maven-surefire-plugin:maven-plugin:0.1-stub-SNAPSHOT generated by maven-surefire-plugin:test (default-test): core-it-support/core-it-plugins/maven-it-plugin-core-stubs/maven-surefire-plugin/target/surefire-reports/*.xml
[withMaven] junitPublisher - Archive test results for Maven artifact org.apache.maven.plugins:maven-war-plugin:maven-plugin:0.1-stub-SNAPSHOT generated by maven-surefire-plugin:test (default-test): core-it-support/core-it-plugins/maven-it-plugin-core-stubs/maven-war-plugin/target/surefire-reports/*.xml
[withMaven] junitPublisher - Archive test results for Maven artifact org.apache.maven.its.plugins:maven-it-plugin-dependency-collection:maven-plugin:2.1-SNAPSHOT generated by maven-surefire-plugin:test (default-test): core-it-support/core-it-plugins/maven-it-plugin-dependency-collection/target/surefire-reports/*.xml
[withMaven] junitPublisher - Archive test results for Maven artifact org.apache.maven.its.plugins:maven-it-plugin-dependency-resolution:maven-plugin:2.1-SNAPSHOT generated by maven-surefire-plugin:test (default-test): core-it-support/core-it-plugins/maven-it-plugin-dependency-resolution/target/surefire-reports/*.xml
[withMaven] junitPublisher - Archive test results for Maven artifact org.apache.maven.its.plugins:maven-it-plugin-expression:maven-plugin:2.1-SNAPSHOT generated by maven-surefire-plugin:test (default-test): core-it-support/core-it-plugins/maven-it-plugin-expression/target/surefire-reports/*.xml
[withMaven] junitPublisher - Archive test results for Maven artifact org.apache.maven.its.plugins:maven-it-plugin-error:maven-plugin:2.1-SNAPSHOT generated by maven-surefire-plugin:test (default-test): core-it-support/core-it-plugins/maven-it-plugin-error/target/surefire-reports/*.xml
[withMaven] junitPublisher - Archive test results for Maven artifact org.apache.maven.its:core-it-component:jar:2.1-SNAPSHOT generated by maven-surefire-plugin:test (default-test): core-it-support/core-it-component/target/surefire-reports/*.xml
[withMaven] junitPublisher - Archive test results for Maven artifact org.apache.maven.its.plugins:maven-it-plugin-extension-consumer:maven-plugin:2.1-SNAPSHOT generated by maven-surefire-plugin:test (default-test): core-it-support/core-it-plugins/maven-it-plugin-extension-consumer/target/surefire-reports/*.xml
[withMaven] junitPublisher - Archive test results for Maven artifact org.apache.maven.its.plugins:maven-it-plugin-extension-provider:maven-plugin:2.1-SNAPSHOT generated by maven-surefire-plugin:test (default-test): core-it-support/core-it-plugins/maven-it-plugin-extension-provider/target/surefire-reports/*.xml
[withMaven] junitPublisher - Archive test results for Maven artifact org.apache.maven.its.plugins:maven-it-plugin-fork:maven-plugin:2.1-SNAPSHOT generated by maven-surefire-plugin:test (default-test): core-it-support/core-it-plugins/maven-it-plugin-fork/target/surefire-reports/*.xml
[withMaven] junitPublisher - Archive test results for Maven artifact org.apache.maven.its.plugins:maven-it-plugin-invalid-descriptor:maven-plugin:2.1-SNAPSHOT generated by maven-surefire-plugin:test (default-test): core-it-support/core-it-plugins/maven-it-plugin-invalid-descriptor/target/surefire-reports/*.xml
[withMaven] junitPublisher - Archive test results for Maven artifact org.apache.maven.its.plugins:maven-it-plugin-log-file:maven-plugin:2.1-SNAPSHOT generated by maven-surefire-plugin:test (default-test): core-it-support/core-it-plugins/maven-it-plugin-log-file/target/surefire-reports/*.xml
[withMaven] junitPublisher - Archive test results for Maven artifact org.apache.maven.its:maven-it-helper:jar:2.1-SNAPSHOT generated by maven-surefire-plugin:test (default-test): core-it-support/maven-it-helper/target/surefire-reports/*.xml
[withMaven] junitPublisher - Archive test results for Maven artifact org.apache.maven.its.plugins:maven-it-plugin-model-interpolation:maven-plugin:2.1-SNAPSHOT generated by maven-surefire-plugin:test (default-test): core-it-support/core-it-plugins/maven-it-plugin-model-interpolation/target/surefire-reports/*.xml
[withMaven] junitPublisher - Archive test results for Maven artifact org.apache.maven.its.plugins:maven-it-plugin-no-default-comp:maven-plugin:2.1-SNAPSHOT generated by maven-surefire-plugin:test (default-test): core-it-support/core-it-plugins/maven-it-plugin-no-default-comp/target/surefire-reports/*.xml
[withMaven] junitPublisher - Archive test results for Maven artifact org.apache.maven.its.plugins:maven-it-plugin-no-project:maven-plugin:2.1-SNAPSHOT generated by maven-surefire-plugin:test (default-test): core-it-support/core-it-plugins/maven-it-plugin-no-project/target/surefire-reports/*.xml
[withMaven] junitPublisher - Archive test results for Maven artifact org.apache.maven.its.plugins:maven-it-plugin-online:maven-plugin:2.1-SNAPSHOT generated by maven-surefire-plugin:test (default-test): core-it-support/core-it-plugins/maven-it-plugin-online/target/surefire-reports/*.xml
[withMaven] junitPublisher - Archive test results for Maven artifact org.apache.maven.its.plugins:maven-it-plugin-optional-mojos:maven-plugin:2.1-SNAPSHOT generated by maven-surefire-plugin:test (default-test): core-it-support/core-it-plugins/maven-it-plugin-optional-mojos/target/surefire-reports/*.xml
[withMaven] junitPublisher - Archive test results for Maven artifact org.apache.maven.its.plugins:maven-it-plugin-packaging:maven-plugin:2.1-SNAPSHOT generated by maven-surefire-plugin:test (default-test): core-it-support/core-it-plugins/maven-it-plugin-packaging/target/surefire-reports/*.xml
[withMaven] junitPublisher - Archive test results for Maven artifact org.apache.maven.its.plugins:maven-it-plugin-parameter-implementation:maven-plugin:2.1-SNAPSHOT generated by maven-surefire-plugin:test (default-test): core-it-support/core-it-plugins/maven-it-plugin-parameter-implementation/target/surefire-reports/*.xml
[withMaven] junitPublisher - Archive test results for Maven artifact org.apache.maven.its.plugins:maven-it-plugin-plugin-dependency:maven-plugin:2.1-SNAPSHOT generated by maven-surefire-plugin:test (default-test): core-it-support/core-it-plugins/maven-it-plugin-plugin-dependency/target/surefire-reports/*.xml
[withMaven] junitPublisher - Archive test results for Maven artifact org.apache.maven.its.plugins:maven-it-plugin-project:maven-plugin:2.1-SNAPSHOT generated by maven-surefire-plugin:test (default-test): core-it-support/core-it-plugins/maven-it-plugin-project/target/surefire-reports/*.xml
[withMaven] junitPublisher - Archive test results for Maven artifact org.apache.maven.its.plugins:maven-it-plugin-project-interpolation:maven-plugin:2.1-SNAPSHOT generated by maven-surefire-plugin:test (default-test): core-it-support/core-it-plugins/maven-it-plugin-project-interpolation/target/surefire-reports/*.xml
[withMaven] junitPublisher - Archive test results for Maven artifact org.apache.maven.its.plugins:maven-it-plugin-setter:maven-plugin:2.1-SNAPSHOT generated by maven-surefire-plugin:test (default-test): core-it-support/core-it-plugins/maven-it-plugin-setter/target/surefire-reports/*.xml
[withMaven] junitPublisher - Archive test results for Maven artifact org.apache.maven.its.plugins:maven-it-plugin-singleton-component:maven-plugin:2.1-SNAPSHOT generated by maven-surefire-plugin:test (default-test): core-it-support/core-it-plugins/maven-it-plugin-singleton-component/target/surefire-reports/*.xml
[withMaven] junitPublisher - Archive test results for Maven artifact org.apache.maven.its.plugins:maven-it-plugin-site:maven-plugin:2.1-SNAPSHOT generated by maven-surefire-plugin:test (default-test): core-it-support/core-it-plugins/maven-it-plugin-site/target/surefire-reports/*.xml
[withMaven] junitPublisher - Archive test results for Maven artifact org.apache.maven.its.plugins:maven-it-plugin-toolchain:maven-plugin:2.1-SNAPSHOT generated by maven-surefire-plugin:test (default-test): core-it-support/core-it-plugins/maven-it-plugin-toolchain/target/surefire-reports/*.xml
[withMaven] junitPublisher - Archive test results for Maven artifact org.apache.maven.its.plugins:maven-it-plugin-touch:maven-plugin:2.1-SNAPSHOT generated by maven-surefire-plugin:test (default-test): core-it-support/core-it-plugins/maven-it-plugin-touch/target/surefire-reports/*.xml
[withMaven] junitPublisher - Archive test results for Maven artifact org.apache.maven.its.plugins:maven-it-plugin-uses-properties:maven-plugin:2.1-SNAPSHOT generated by maven-surefire-plugin:test (default-test): core-it-support/core-it-plugins/maven-it-plugin-uses-properties/target/surefire-reports/*.xml
[withMaven] junitPublisher - Archive test results for Maven artifact org.apache.maven.its.plugins:maven-it-plugin-uses-wagon:maven-plugin:2.1-SNAPSHOT generated by maven-surefire-plugin:test (default-test): core-it-support/core-it-plugins/maven-it-plugin-uses-wagon/target/surefire-reports/*.xml
[withMaven] junitPublisher - Archive test results for Maven artifact org.apache.maven.its.plugins:maven-it-plugin-all:maven-plugin:2.1-SNAPSHOT generated by maven-surefire-plugin:test (default-test): core-it-support/core-it-plugins/maven-it-plugin-all/target/surefire-reports/*.xml
[withMaven] junitPublisher - Archive test results for Maven artifact org.apache.maven.its.plugins:maven-it-plugin-plexus-utils-11:maven-plugin:2.1-SNAPSHOT generated by maven-surefire-plugin:test (default-test): core-it-support/core-it-plugins/maven-it-plugin-plexus-utils-11/target/surefire-reports/*.xml
[withMaven] junitPublisher - Archive test results for Maven artifact org.apache.maven.its.plugins:maven-it-plugin-plexus-utils-new:maven-plugin:2.1-SNAPSHOT generated by maven-surefire-plugin:test (default-test): core-it-support/core-it-plugins/maven-it-plugin-plexus-utils-new/target/surefire-reports/*.xml
[withMaven] junitPublisher - Archive test results for Maven artifact org.apache.maven.its.plugins:maven-it-plugin-plexus-component-api:maven-plugin:2.1-SNAPSHOT generated by maven-surefire-plugin:test (default-test): core-it-support/core-it-plugins/maven-it-plugin-plexus-component-api/target/surefire-reports/*.xml
[withMaven] junitPublisher - Archive test results for Maven artifact org.apache.maven.its.plugins:maven-it-plugin-log4j:maven-plugin:2.1-SNAPSHOT generated by maven-surefire-plugin:test (default-test): core-it-support/core-it-plugins/maven-it-plugin-log4j/target/surefire-reports/*.xml
[withMaven] junitPublisher - Archive test results for Maven artifact org.apache.maven.its.plugins:maven-it-plugin-extension1:maven-plugin:2.1-SNAPSHOT generated by maven-surefire-plugin:test (default-test): core-it-support/core-it-plugins/maven-it-plugin-extension1/target/surefire-reports/*.xml
[withMaven] junitPublisher - Archive test results for Maven artifact org.apache.maven.its.plugins:maven-it-plugin-extension2:maven-plugin:2.1-SNAPSHOT generated by maven-surefire-plugin:test (default-test): core-it-support/core-it-plugins/maven-it-plugin-extension2/target/surefire-reports/*.xml
[withMaven] junitPublisher - Archive test results for Maven artifact org.apache.maven.its.plugins:maven-it-plugin-plexus-lifecycle:maven-plugin:2.1-SNAPSHOT generated by maven-surefire-plugin:test (default-test): core-it-support/core-it-plugins/maven-it-plugin-plexus-lifecycle/target/surefire-reports/*.xml
[withMaven] junitPublisher - Archive test results for Maven artifact org.apache.maven.its.plugins:maven-it-plugin-settings:maven-plugin:2.1-SNAPSHOT generated by maven-surefire-plugin:test (default-test): core-it-support/core-it-plugins/maven-it-plugin-settings/target/surefire-reports/*.xml
[withMaven] junitPublisher - Archive test results for Maven artifact org.apache.maven.its.plugins:mng-5805-pkg-type-mojo-configuration-extension:jar:2.1-SNAPSHOT generated by maven-surefire-plugin:test (default-test): core-it-support/core-it-plugins/mng5805-extension/target/surefire-reports/*.xml
[withMaven] junitPublisher - Archive test results for Maven artifact org.apache.maven.its.plugins:mng-5805-pkg-type-mojo-configuration-extension2:jar:2.1-SNAPSHOT generated by maven-surefire-plugin:test (default-test): core-it-support/core-it-plugins/mng5805-extension2/target/surefire-reports/*.xml
[withMaven] junitPublisher - Archive test results for Maven artifact org.apache.maven.its.plugins:mng-5805-pkg-type-mojo-configuration-plugin:maven-plugin:2.1-SNAPSHOT generated by maven-surefire-plugin:test (default-test): core-it-support/core-it-plugins/mng5805-plugin/target/surefire-reports/*.xml
[withMaven] junitPublisher - Archive test results for Maven artifact org.apache.maven.its.plugins:mng-5805-pkg-type-mojo-configuration-plugin-dep:jar:2.1-SNAPSHOT generated by maven-surefire-plugin:test (default-test): core-it-support/core-it-plugins/mng5805-plugin-dep/target/surefire-reports/*.xml
[withMaven] junitPublisher - Archive test results for Maven artifact org.apache.maven.its.plugins:mng-5958-pkg-type-extension:jar:2.1-SNAPSHOT generated by maven-surefire-plugin:test (default-test): core-it-support/core-it-plugins/mng5958-extension/target/surefire-reports/*.xml
[withMaven] junitPublisher - Archive test results for Maven artifact org.apache.maven.its.plugins:mng-6759-resolves-project-dependencies-plugin:maven-plugin:2.1-SNAPSHOT generated by maven-surefire-plugin:test (default-test): core-it-support/core-it-plugins/mng6759-plugin-resolves-project-dependencies/target/surefire-reports/*.xml
[withMaven] junitPublisher - Archive test results for Maven artifact org.apache.maven.its:core-it-toolchain:jar:2.1-SNAPSHOT generated by maven-surefire-plugin:test (default-test): core-it-support/core-it-toolchain/target/surefire-reports/*.xml
[withMaven] junitPublisher - Archive test results for Maven artifact org.apache.maven.its:core-it-wagon:jar:2.1-SNAPSHOT generated by maven-surefire-plugin:test (default-test): core-it-support/core-it-wagon/target/surefire-reports/*.xml
[withMaven] junitPublisher - Archive test results for Maven artifact org.apache.maven.its:core-it-extension:jar:2.1-SNAPSHOT generated by maven-surefire-plugin:test (default-test): core-it-support/core-it-extension/target/surefire-reports/*.xml
[withMaven] junitPublisher - Archive test results for Maven artifact org.apache.maven.its:core-it-suite:jar:2.1-SNAPSHOT generated by maven-surefire-plugin:test (default-test): core-it-suite/target/surefire-reports/*.xml
Recording test results
[withMaven] openTasksPublisher - Scan Tasks for Maven artifact org.apache.maven.its.plugins:maven-it-plugin-active-collection:maven-plugin:2.1-SNAPSHOT in source directory core-it-support/core-it-plugins/maven-it-plugin-active-collection/src/main/java
[withMaven] openTasksPublisher - Scan Tasks for Maven artifact org.apache.maven.its.plugins:maven-it-plugin-artifact:maven-plugin:2.1-SNAPSHOT in source directory core-it-support/core-it-plugins/maven-it-plugin-artifact/src/main/java
[withMaven] openTasksPublisher - Scan Tasks for Maven artifact org.apache.maven.its.plugins.class-loader:dep-a:jar:2.1-SNAPSHOT in source directory core-it-support/core-it-plugins/maven-it-plugin-class-loader/dep-a/src/main/java
[withMaven] openTasksPublisher - Scan Tasks for Maven artifact org.apache.maven.its.plugins.class-loader:dep-b:jar:2.1-SNAPSHOT in source directory core-it-support/core-it-plugins/maven-it-plugin-class-loader/dep-b/src/main/java
[withMaven] openTasksPublisher - Scan Tasks for Maven artifact org.apache.maven.its.plugins:maven-it-plugin-class-loader:maven-plugin:2.1-SNAPSHOT in source directory core-it-support/core-it-plugins/maven-it-plugin-class-loader/maven-it-plugin-class-loader/src/main/java
[withMaven] openTasksPublisher - Scan Tasks for Maven artifact org.apache.maven.its.plugins:maven-it-plugin-configuration:maven-plugin:2.1-SNAPSHOT in source directory core-it-support/core-it-plugins/maven-it-plugin-configuration/src/main/java
[withMaven] openTasksPublisher - Scan Tasks for Maven artifact org.apache.maven.its.plugins:maven-it-plugin-context-passing:maven-plugin:2.1-SNAPSHOT in source directory core-it-support/core-it-plugins/maven-it-plugin-context-passing/src/main/java
[withMaven] openTasksPublisher - Scan Tasks for Maven artifact org.apache.maven.plugins:maven-clean-plugin:maven-plugin:0.1-stub-SNAPSHOT in source directory core-it-support/core-it-plugins/maven-it-plugin-core-stubs/maven-clean-plugin/src/main/java
[withMaven] openTasksPublisher - Scan Tasks for Maven artifact org.apache.maven.plugins:maven-compiler-plugin:maven-plugin:0.1-stub-SNAPSHOT in source directory core-it-support/core-it-plugins/maven-it-plugin-core-stubs/maven-compiler-plugin/src/main/java
[withMaven] openTasksPublisher - Scan Tasks for Maven artifact org.apache.maven.plugins:maven-deploy-plugin:maven-plugin:0.1-stub-SNAPSHOT in source directory core-it-support/core-it-plugins/maven-it-plugin-core-stubs/maven-deploy-plugin/src/main/java
[withMaven] openTasksPublisher - Scan Tasks for Maven artifact org.apache.maven.plugins:maven-ear-plugin:maven-plugin:0.1-stub-SNAPSHOT in source directory core-it-support/core-it-plugins/maven-it-plugin-core-stubs/maven-ear-plugin/src/main/java
[withMaven] openTasksPublisher - Scan Tasks for Maven artifact org.apache.maven.plugins:maven-ejb-plugin:maven-plugin:0.1-stub-SNAPSHOT in source directory core-it-support/core-it-plugins/maven-it-plugin-core-stubs/maven-ejb-plugin/src/main/java
[withMaven] openTasksPublisher - Scan Tasks for Maven artifact org.apache.maven.plugins:maven-install-plugin:maven-plugin:0.1-stub-SNAPSHOT in source directory core-it-support/core-it-plugins/maven-it-plugin-core-stubs/maven-install-plugin/src/main/java
[withMaven] openTasksPublisher - Scan Tasks for Maven artifact org.apache.maven.plugins:maven-jar-plugin:maven-plugin:0.1-stub-SNAPSHOT in source directory core-it-support/core-it-plugins/maven-it-plugin-core-stubs/maven-jar-plugin/src/main/java
[withMaven] openTasksPublisher - Scan Tasks for Maven artifact org.apache.maven.plugins:maven-javadoc-plugin:maven-plugin:0.1-stub-SNAPSHOT in source directory core-it-support/core-it-plugins/maven-it-plugin-core-stubs/maven-javadoc-plugin/src/main/java
[withMaven] openTasksPublisher - Scan Tasks for Maven artifact org.apache.maven.plugins:maven-plugin-plugin:maven-plugin:0.1-stub-SNAPSHOT in source directory core-it-support/core-it-plugins/maven-it-plugin-core-stubs/maven-plugin-plugin/src/main/java
[withMaven] openTasksPublisher - Scan Tasks for Maven artifact org.apache.maven.plugins:maven-rar-plugin:maven-plugin:0.1-stub-SNAPSHOT in source directory core-it-support/core-it-plugins/maven-it-plugin-core-stubs/maven-rar-plugin/src/main/java
[withMaven] openTasksPublisher - Scan Tasks for Maven artifact org.apache.maven.plugins:maven-resources-plugin:maven-plugin:0.1-stub-SNAPSHOT in source directory core-it-support/core-it-plugins/maven-it-plugin-core-stubs/maven-resources-plugin/src/main/java
[withMaven] openTasksPublisher - Scan Tasks for Maven artifact org.apache.maven.plugins:maven-site-plugin:maven-plugin:0.1-stub-SNAPSHOT in source directory core-it-support/core-it-plugins/maven-it-plugin-core-stubs/maven-site-plugin/src/main/java
[withMaven] openTasksPublisher - Scan Tasks for Maven artifact org.apache.maven.plugins:maven-source-plugin:maven-plugin:0.1-stub-SNAPSHOT in source directory core-it-support/core-it-plugins/maven-it-plugin-core-stubs/maven-source-plugin/src/main/java
[withMaven] openTasksPublisher - Scan Tasks for Maven artifact org.apache.maven.plugins:maven-surefire-plugin:maven-plugin:0.1-stub-SNAPSHOT in source directory core-it-support/core-it-plugins/maven-it-plugin-core-stubs/maven-surefire-plugin/src/main/java
[withMaven] openTasksPublisher - Scan Tasks for Maven artifact org.apache.maven.plugins:maven-war-plugin:maven-plugin:0.1-stub-SNAPSHOT in source directory core-it-support/core-it-plugins/maven-it-plugin-core-stubs/maven-war-plugin/src/main/java
[withMaven] openTasksPublisher - Scan Tasks for Maven artifact org.apache.maven.its.plugins:maven-it-plugin-dependency-collection:maven-plugin:2.1-SNAPSHOT in source directory core-it-support/core-it-plugins/maven-it-plugin-dependency-collection/src/main/java
[withMaven] openTasksPublisher - Scan Tasks for Maven artifact org.apache.maven.its.plugins:maven-it-plugin-dependency-resolution:maven-plugin:2.1-SNAPSHOT in source directory core-it-support/core-it-plugins/maven-it-plugin-dependency-resolution/src/main/java
[withMaven] openTasksPublisher - Scan Tasks for Maven artifact org.apache.maven.its.plugins:maven-it-plugin-expression:maven-plugin:2.1-SNAPSHOT in source directory core-it-support/core-it-plugins/maven-it-plugin-expression/src/main/java
[withMaven] openTasksPublisher - Scan Tasks for Maven artifact org.apache.maven.its.plugins:maven-it-plugin-error:maven-plugin:2.1-SNAPSHOT in source directory core-it-support/core-it-plugins/maven-it-plugin-error/src/main/java
[withMaven] openTasksPublisher - Scan Tasks for Maven artifact org.apache.maven.its:core-it-component:jar:2.1-SNAPSHOT in source directory core-it-support/core-it-component/src/main/java
[withMaven] openTasksPublisher - Scan Tasks for Maven artifact org.apache.maven.its.plugins:maven-it-plugin-extension-consumer:maven-plugin:2.1-SNAPSHOT in source directory core-it-support/core-it-plugins/maven-it-plugin-extension-consumer/src/main/java
[withMaven] openTasksPublisher - Scan Tasks for Maven artifact org.apache.maven.its.plugins:maven-it-plugin-extension-provider:maven-plugin:2.1-SNAPSHOT in source directory core-it-support/core-it-plugins/maven-it-plugin-extension-provider/src/main/java
[withMaven] openTasksPublisher - Scan Tasks for Maven artifact org.apache.maven.its.plugins:maven-it-plugin-fork:maven-plugin:2.1-SNAPSHOT in source directory core-it-support/core-it-plugins/maven-it-plugin-fork/src/main/java
[withMaven] openTasksPublisher - Scan Tasks for Maven artifact org.apache.maven.its.plugins:maven-it-plugin-invalid-descriptor:maven-plugin:2.1-SNAPSHOT in source directory core-it-support/core-it-plugins/maven-it-plugin-invalid-descriptor/src/main/java
[withMaven] openTasksPublisher - Scan Tasks for Maven artifact org.apache.maven.its.plugins:maven-it-plugin-log-file:maven-plugin:2.1-SNAPSHOT in source directory core-it-support/core-it-plugins/maven-it-plugin-log-file/src/main/java
[withMaven] openTasksPublisher - Scan Tasks for Maven artifact org.apache.maven.its:maven-it-helper:jar:2.1-SNAPSHOT in source directory core-it-support/maven-it-helper/src/main/java
[withMaven] openTasksPublisher - Scan Tasks for Maven artifact org.apache.maven.its.plugins:maven-it-plugin-model-interpolation:maven-plugin:2.1-SNAPSHOT in source directory core-it-support/core-it-plugins/maven-it-plugin-model-interpolation/src/main/java
[withMaven] openTasksPublisher - Scan Tasks for Maven artifact org.apache.maven.its.plugins:maven-it-plugin-no-default-comp:maven-plugin:2.1-SNAPSHOT in source directory core-it-support/core-it-plugins/maven-it-plugin-no-default-comp/src/main/java
[withMaven] openTasksPublisher - Scan Tasks for Maven artifact org.apache.maven.its.plugins:maven-it-plugin-no-project:maven-plugin:2.1-SNAPSHOT in source directory core-it-support/core-it-plugins/maven-it-plugin-no-project/src/main/java
[withMaven] openTasksPublisher - Scan Tasks for Maven artifact org.apache.maven.its.plugins:maven-it-plugin-online:maven-plugin:2.1-SNAPSHOT in source directory core-it-support/core-it-plugins/maven-it-plugin-online/src/main/java
[withMaven] openTasksPublisher - Scan Tasks for Maven artifact org.apache.maven.its.plugins:maven-it-plugin-optional-mojos:maven-plugin:2.1-SNAPSHOT in source directory core-it-support/core-it-plugins/maven-it-plugin-optional-mojos/src/main/java
[withMaven] openTasksPublisher - Scan Tasks for Maven artifact org.apache.maven.its.plugins:maven-it-plugin-packaging:maven-plugin:2.1-SNAPSHOT in source directory core-it-support/core-it-plugins/maven-it-plugin-packaging/src/main/java
[withMaven] openTasksPublisher - Scan Tasks for Maven artifact org.apache.maven.its.plugins:maven-it-plugin-parameter-implementation:maven-plugin:2.1-SNAPSHOT in source directory core-it-support/core-it-plugins/maven-it-plugin-parameter-implementation/src/main/java
[withMaven] openTasksPublisher - Scan Tasks for Maven artifact org.apache.maven.its.plugins:maven-it-plugin-plugin-dependency:maven-plugin:2.1-SNAPSHOT in source directory core-it-support/core-it-plugins/maven-it-plugin-plugin-dependency/src/main/java
[withMaven] openTasksPublisher - Scan Tasks for Maven artifact org.apache.maven.its.plugins:maven-it-plugin-project:maven-plugin:2.1-SNAPSHOT in source directory core-it-support/core-it-plugins/maven-it-plugin-project/src/main/java
[withMaven] openTasksPublisher - Scan Tasks for Maven artifact org.apache.maven.its.plugins:maven-it-plugin-project-interpolation:maven-plugin:2.1-SNAPSHOT in source directory core-it-support/core-it-plugins/maven-it-plugin-project-interpolation/src/main/java
[withMaven] openTasksPublisher - Scan Tasks for Maven artifact org.apache.maven.its.plugins:maven-it-plugin-setter:maven-plugin:2.1-SNAPSHOT in source directory core-it-support/core-it-plugins/maven-it-plugin-setter/src/main/java
[withMaven] openTasksPublisher - Scan Tasks for Maven artifact org.apache.maven.its.plugins:maven-it-plugin-singleton-component:maven-plugin:2.1-SNAPSHOT in source directory core-it-support/core-it-plugins/maven-it-plugin-singleton-component/src/main/java
[withMaven] openTasksPublisher - Scan Tasks for Maven artifact org.apache.maven.its.plugins:maven-it-plugin-site:maven-plugin:2.1-SNAPSHOT in source directory core-it-support/core-it-plugins/maven-it-plugin-site/src/main/java
[withMaven] openTasksPublisher - Scan Tasks for Maven artifact org.apache.maven.its.plugins:maven-it-plugin-toolchain:maven-plugin:2.1-SNAPSHOT in source directory core-it-support/core-it-plugins/maven-it-plugin-toolchain/src/main/java
[withMaven] openTasksPublisher - Scan Tasks for Maven artifact org.apache.maven.its.plugins:maven-it-plugin-touch:maven-plugin:2.1-SNAPSHOT in source directory core-it-support/core-it-plugins/maven-it-plugin-touch/src/main/java
[withMaven] openTasksPublisher - Scan Tasks for Maven artifact org.apache.maven.its.plugins:maven-it-plugin-uses-properties:maven-plugin:2.1-SNAPSHOT in source directory core-it-support/core-it-plugins/maven-it-plugin-uses-properties/src/main/java
[withMaven] openTasksPublisher - Scan Tasks for Maven artifact org.apache.maven.its.plugins:maven-it-plugin-uses-wagon:maven-plugin:2.1-SNAPSHOT in source directory core-it-support/core-it-plugins/maven-it-plugin-uses-wagon/src/main/java
[withMaven] openTasksPublisher - Scan Tasks for Maven artifact org.apache.maven.its.plugins:maven-it-plugin-all:maven-plugin:2.1-SNAPSHOT in source directory core-it-support/core-it-plugins/maven-it-plugin-all/src/main/java
[withMaven] openTasksPublisher - Scan Tasks for Maven artifact org.apache.maven.its.plugins:maven-it-plugin-plexus-utils-11:maven-plugin:2.1-SNAPSHOT in source directory core-it-support/core-it-plugins/maven-it-plugin-plexus-utils-11/src/main/java
[withMaven] openTasksPublisher - Scan Tasks for Maven artifact org.apache.maven.its.plugins:maven-it-plugin-plexus-utils-new:maven-plugin:2.1-SNAPSHOT in source directory core-it-support/core-it-plugins/maven-it-plugin-plexus-utils-new/src/main/java
[withMaven] openTasksPublisher - Scan Tasks for Maven artifact org.apache.maven.its.plugins:maven-it-plugin-plexus-component-api:maven-plugin:2.1-SNAPSHOT in source directory core-it-support/core-it-plugins/maven-it-plugin-plexus-component-api/src/main/java
[withMaven] openTasksPublisher - Scan Tasks for Maven artifact org.apache.maven.its.plugins:maven-it-plugin-log4j:maven-plugin:2.1-SNAPSHOT in source directory core-it-support/core-it-plugins/maven-it-plugin-log4j/src/main/java
[withMaven] openTasksPublisher - Scan Tasks for Maven artifact org.apache.maven.its.plugins:maven-it-plugin-extension1:maven-plugin:2.1-SNAPSHOT in source directory core-it-support/core-it-plugins/maven-it-plugin-extension1/src/main/java
[withMaven] openTasksPublisher - Scan Tasks for Maven artifact org.apache.maven.its.plugins:maven-it-plugin-extension2:maven-plugin:2.1-SNAPSHOT in source directory core-it-support/core-it-plugins/maven-it-plugin-extension2/src/main/java
[withMaven] openTasksPublisher - Scan Tasks for Maven artifact org.apache.maven.its.plugins:maven-it-plugin-plexus-lifecycle:maven-plugin:2.1-SNAPSHOT in source directory core-it-support/core-it-plugins/maven-it-plugin-plexus-lifecycle/src/main/java
[withMaven] openTasksPublisher - Scan Tasks for Maven artifact org.apache.maven.its.plugins:maven-it-plugin-settings:maven-plugin:2.1-SNAPSHOT in source directory core-it-support/core-it-plugins/maven-it-plugin-settings/src/main/java
[withMaven] openTasksPublisher - Scan Tasks for Maven artifact org.apache.maven.its.plugins:mng-5805-pkg-type-mojo-configuration-plugin:maven-plugin:2.1-SNAPSHOT in source directory core-it-support/core-it-plugins/mng5805-plugin/src/main/java
[withMaven] openTasksPublisher - Scan Tasks for Maven artifact org.apache.maven.its.plugins:mng-5805-pkg-type-mojo-configuration-plugin-dep:jar:2.1-SNAPSHOT in source directory core-it-support/core-it-plugins/mng5805-plugin-dep/src/main/java
[withMaven] openTasksPublisher - Scan Tasks for Maven artifact org.apache.maven.its.plugins:mng-5958-pkg-type-extension:jar:2.1-SNAPSHOT in source directory core-it-support/core-it-plugins/mng5958-extension/src/main/java
[withMaven] openTasksPublisher - Scan Tasks for Maven artifact org.apache.maven.its.plugins:mng-6759-resolves-project-dependencies-plugin:maven-plugin:2.1-SNAPSHOT in source directory core-it-support/core-it-plugins/mng6759-plugin-resolves-project-dependencies/src/main/java
[withMaven] openTasksPublisher - Scan Tasks for Maven artifact org.apache.maven.its:core-it-toolchain:jar:2.1-SNAPSHOT in source directory core-it-support/core-it-toolchain/src/main/java
[withMaven] openTasksPublisher - Scan Tasks for Maven artifact org.apache.maven.its:core-it-wagon:jar:2.1-SNAPSHOT in source directory core-it-support/core-it-wagon/src/main/java
[TASKS] Scanning folder '/home/jenkins/jenkins-slave/workspace/maven-box_maven_MNG-6656/test' for files matching the pattern 'core-it-support/core-it-plugins/maven-it-plugin-active-collection/src/main/java/**/*,core-it-support/core-it-plugins/maven-it-plugin-artifact/src/main/java/**/*,core-it-support/core-it-plugins/maven-it-plugin-class-loader/dep-a/src/main/java/**/*,core-it-support/core-it-plugins/maven-it-plugin-class-loader/dep-b/src/main/java/**/*,core-it-support/core-it-plugins/maven-it-plugin-class-loader/maven-it-plugin-class-loader/src/main/java/**/*,core-it-support/core-it-plugins/maven-it-plugin-configuration/src/main/java/**/*,core-it-support/core-it-plugins/maven-it-plugin-context-passing/src/main/java/**/*,core-it-support/core-it-plugins/maven-it-plugin-core-stubs/maven-clean-plugin/src/main/java/**/*,core-it-support/core-it-plugins/maven-it-plugin-core-stubs/maven-compiler-plugin/src/main/java/**/*,core-it-support/core-it-plugins/maven-it-plugin-core-stubs/maven-deploy-plugin/src/main/java/**/*,core-it-support/core-it-plugins/maven-it-plugin-core-stubs/maven-ear-plugin/src/main/java/**/*,core-it-support/core-it-plugins/maven-it-plugin-core-stubs/maven-ejb-plugin/src/main/java/**/*,core-it-support/core-it-plugins/maven-it-plugin-core-stubs/maven-install-plugin/src/main/java/**/*,core-it-support/core-it-plugins/maven-it-plugin-core-stubs/maven-jar-plugin/src/main/java/**/*,core-it-support/core-it-plugins/maven-it-plugin-core-stubs/maven-javadoc-plugin/src/main/java/**/*,core-it-support/core-it-plugins/maven-it-plugin-core-stubs/maven-plugin-plugin/src/main/java/**/*,core-it-support/core-it-plugins/maven-it-plugin-core-stubs/maven-rar-plugin/src/main/java/**/*,core-it-support/core-it-plugins/maven-it-plugin-core-stubs/maven-resources-plugin/src/main/java/**/*,core-it-support/core-it-plugins/maven-it-plugin-core-stubs/maven-site-plugin/src/main/java/**/*,core-it-support/core-it-plugins/maven-it-plugin-core-stubs/maven-source-plugin/src/main/java/**/*,core-it-support/core-it-plugins/maven-it-plugin-core-stubs/maven-surefire-plugin/src/main/java/**/*,core-it-support/core-it-plugins/maven-it-plugin-core-stubs/maven-war-plugin/src/main/java/**/*,core-it-support/core-it-plugins/maven-it-plugin-dependency-collection/src/main/java/**/*,core-it-support/core-it-plugins/maven-it-plugin-dependency-resolution/src/main/java/**/*,core-it-support/core-it-plugins/maven-it-plugin-expression/src/main/java/**/*,core-it-support/core-it-plugins/maven-it-plugin-error/src/main/java/**/*,core-it-support/core-it-component/src/main/java/**/*,core-it-support/core-it-plugins/maven-it-plugin-extension-consumer/src/main/java/**/*,core-it-support/core-it-plugins/maven-it-plugin-extension-provider/src/main/java/**/*,core-it-support/core-it-plugins/maven-it-plugin-fork/src/main/java/**/*,core-it-support/core-it-plugins/maven-it-plugin-invalid-descriptor/src/main/java/**/*,core-it-support/core-it-plugins/maven-it-plugin-log-file/src/main/java/**/*,core-it-support/maven-it-helper/src/main/java/**/*,core-it-support/core-it-plugins/maven-it-plugin-model-interpolation/src/main/java/**/*,core-it-support/core-it-plugins/maven-it-plugin-no-default-comp/src/main/java/**/*,core-it-support/core-it-plugins/maven-it-plugin-no-project/src/main/java/**/*,core-it-support/core-it-plugins/maven-it-plugin-online/src/main/java/**/*,core-it-support/core-it-plugins/maven-it-plugin-optional-mojos/src/main/java/**/*,core-it-support/core-it-plugins/maven-it-plugin-packaging/src/main/java/**/*,core-it-support/core-it-plugins/maven-it-plugin-parameter-implementation/src/main/java/**/*,core-it-support/core-it-plugins/maven-it-plugin-plugin-dependency/src/main/java/**/*,core-it-support/core-it-plugins/maven-it-plugin-project/src/main/java/**/*,core-it-support/core-it-plugins/maven-it-plugin-project-interpolation/src/main/java/**/*,core-it-support/core-it-plugins/maven-it-plugin-setter/src/main/java/**/*,core-it-support/core-it-plugins/maven-it-plugin-singleton-component/src/main/java/**/*,core-it-support/core-it-plugins/maven-it-plugin-site/src/main/java/**/*,core-it-support/core-it-plugins/maven-it-plugin-toolchain/src/main/java/**/*,core-it-support/core-it-plugins/maven-it-plugin-touch/src/main/java/**/*,core-it-support/core-it-plugins/maven-it-plugin-uses-properties/src/main/java/**/*,core-it-support/core-it-plugins/maven-it-plugin-uses-wagon/src/main/java/**/*,core-it-support/core-it-plugins/maven-it-plugin-all/src/main/java/**/*,core-it-support/core-it-plugins/maven-it-plugin-plexus-utils-11/src/main/java/**/*,core-it-support/core-it-plugins/maven-it-plugin-plexus-utils-new/src/main/java/**/*,core-it-support/core-it-plugins/maven-it-plugin-plexus-component-api/src/main/java/**/*,core-it-support/core-it-plugins/maven-it-plugin-log4j/src/main/java/**/*,core-it-support/core-it-plugins/maven-it-plugin-extension1/src/main/java/**/*,core-it-support/core-it-plugins/maven-it-plugin-extension2/src/main/java/**/*,core-it-support/core-it-plugins/maven-it-plugin-plexus-lifecycle/src/main/java/**/*,core-it-support/core-it-plugins/maven-it-plugin-settings/src/main/java/**/*,core-it-support/core-it-plugins/mng5805-plugin/src/main/java/**/*,core-it-support/core-it-plugins/mng5805-plugin-dep/src/main/java/**/*,core-it-support/core-it-plugins/mng5958-extension/src/main/java/**/*,core-it-support/core-it-plugins/mng6759-plugin-resolves-project-dependencies/src/main/java/**/*,core-it-support/core-it-toolchain/src/main/java/**/*,core-it-support/core-it-wagon/src/main/java/**/*' - excludes: null
[TASKS] Found 165 files to scan for tasks
[TASKS] Found 0 open tasks.
Skipping warnings blame since pipelines do not have an SCM link.%n
[TASKS] Computing warning deltas based on reference build #24
[withMaven] Publishers: Pipeline Graph Publisher: 29 ms, Generated Artifacts Publisher: 645606 ms, Invoker Publisher: 5 ms, Junit Publisher: 291662 ms, Concordion Publisher: 10 ms, Dependencies Fingerprint Publisher: 2499 ms, Findbugs Publisher: 4 ms, JGiven Publisher: 4 ms, Jacoco Publisher: 4 ms, SpotBugs Publisher: 7 ms, Open Task Scanner Publisher: 12566 ms
[Pipeline] // withMaven
[Pipeline] fileExists
[Pipeline] zip
Writing zip file of /home/jenkins/jenkins-slave/workspace/maven-box_maven_MNG-6656/test/core-it-suite/target/test-classes to /home/jenkins/jenkins-slave/workspace/maven-box_maven_MNG-6656/test/core-it-suite-logs-linux-jdk12.zip
Zipped 6499 entries.
Archiving /home/jenkins/jenkins-slave/workspace/maven-box_maven_MNG-6656/test/core-it-suite-logs-linux-jdk12.zip
[Pipeline] fileExists
[Pipeline] zip
Writing zip file of /home/jenkins/jenkins-slave/workspace/maven-box_maven_MNG-6656/test/core-it-suite/target/surefire-reports to /home/jenkins/jenkins-slave/workspace/maven-box_maven_MNG-6656/test/core-it-suite-reports-linux-jdk12.zip
Zipped 4 entries.
Archiving /home/jenkins/jenkins-slave/workspace/maven-box_maven_MNG-6656/test/core-it-suite-reports-linux-jdk12.zip
[Pipeline] deleteDir
[Pipeline] }
[Pipeline] // dir
[Pipeline] }
[Pipeline] // stage
[Pipeline] }
[Pipeline] // node
[Pipeline] }
[Pipeline] // parallel
[Pipeline] stage
[Pipeline] { (Notifications)
[Pipeline] echo
Build result: UNSTABLE
[Pipeline] jiraIssueSelector
[Pipeline] jiraComment
[Pipeline] jiraComment
[Pipeline] echo
The authors of changes [khmarbaise, rfscholte].
[Pipeline] echo
Sending email ...
[Pipeline] emailext