Build unstable in Jenkins: Maven » Maven TLP » maven » system-line-separator #2

Previous Topic Next Topic
 
classic Classic list List threaded Threaded
2 messages Options
Reply | Threaded
Open this post in threaded view
|

Build unstable in Jenkins: Maven » Maven TLP » maven » system-line-separator #2

Apache Jenkins Server-2
See https://ci-builds.apache.org/job/Maven/job/maven-box/job/maven/job/system-line-separator/2/

Changes:

* Next Maven version change 3.7.x -> 4.x.x
* Added Java 17
* [MNG-5760] Add `-r/--resume` to automatically resume from the last failure point
* [MNG-6972] Allow access to org.apache.maven.graph
* Trim line endings as done by Maven Resolver
* Correct last remaining incorrect checksums
* Test for consistent logging
* [MNG-6972] Fix IT - explicitly set compiler target versions to 8
* Set minimal default target/source/release for maven-compiler to Java 7

4 tests failed.
FAILED:  org.apache.maven.it.MavenITmng5572ReactorPluginExtensionsTest.windows-jdk8 / Run ITs Windows Java 8 / testit

Error Message:
Text not found in log: [WARNING] 'project' uses 'org.apache.maven.its.mng5572:plugin' as extension which is not possible within the same reactor build. This plugin was pulled from the local repository!

Stack Trace:
org.apache.maven.it.VerificationException: Text not found in log: [WARNING] 'project' uses 'org.apache.maven.its.mng5572:plugin' as extension which is not possible within the same reactor build. This plugin was pulled from the local repository!
        at org.apache.maven.it.MavenITmng5572ReactorPluginExtensionsTest.testit(MavenITmng5572ReactorPluginExtensionsTest.java:64)


FAILED:  org.apache.maven.it.MavenITmng5572ReactorPluginExtensionsTest.windows-jdk11 / Run ITs Windows Java 11 / testit

Error Message:
Text not found in log: [WARNING] 'project' uses 'org.apache.maven.its.mng5572:plugin' as extension which is not possible within the same reactor build. This plugin was pulled from the local repository!

Stack Trace:
org.apache.maven.it.VerificationException: Text not found in log: [WARNING] 'project' uses 'org.apache.maven.its.mng5572:plugin' as extension which is not possible within the same reactor build. This plugin was pulled from the local repository!
        at org.apache.maven.it.MavenITmng5572ReactorPluginExtensionsTest.testit(MavenITmng5572ReactorPluginExtensionsTest.java:64)


FAILED:  org.apache.maven.it.MavenITmng5572ReactorPluginExtensionsTest.linux-jdk8 / Run ITs Linux Java 8 / testit

Error Message:
Text not found in log: [WARNING] 'project' uses 'org.apache.maven.its.mng5572:plugin' as extension which is not possible within the same reactor build. This plugin was pulled from the local repository!

Stack Trace:
org.apache.maven.it.VerificationException: Text not found in log: [WARNING] 'project' uses 'org.apache.maven.its.mng5572:plugin' as extension which is not possible within the same reactor build. This plugin was pulled from the local repository!
        at org.apache.maven.it.MavenITmng5572ReactorPluginExtensionsTest.testit(MavenITmng5572ReactorPluginExtensionsTest.java:64)


FAILED:  org.apache.maven.it.MavenITmng5572ReactorPluginExtensionsTest.linux-jdk11 / Run ITs Linux Java 11 / testit

Error Message:
Text not found in log: [WARNING] 'project' uses 'org.apache.maven.its.mng5572:plugin' as extension which is not possible within the same reactor build. This plugin was pulled from the local repository!

Stack Trace:
org.apache.maven.it.VerificationException: Text not found in log: [WARNING] 'project' uses 'org.apache.maven.its.mng5572:plugin' as extension which is not possible within the same reactor build. This plugin was pulled from the local repository!
        at org.apache.maven.it.MavenITmng5572ReactorPluginExtensionsTest.testit(MavenITmng5572ReactorPluginExtensionsTest.java:64)




Build log:
[...truncated 42675 lines...]
[withMaven] artifactsPublisher - Archive artifact core-it-support/core-it-plugins/maven-it-plugin-toolchain/target/maven-it-plugin-toolchain-2.1-SNAPSHOT.jar under org/apache/maven/its/plugins/maven-it-plugin-toolchain/2.1-SNAPSHOT/maven-it-plugin-toolchain-2.1-SNAPSHOT.jar
[withMaven] artifactsPublisher - Archive artifact core-it-support/core-it-plugins/maven-it-plugin-touch/pom.xml under org/apache/maven/its/plugins/maven-it-plugin-touch/2.1-SNAPSHOT/maven-it-plugin-touch-2.1-SNAPSHOT.pom
[withMaven] artifactsPublisher - Archive artifact core-it-support/core-it-plugins/maven-it-plugin-touch/target/maven-it-plugin-touch-2.1-SNAPSHOT.jar under org/apache/maven/its/plugins/maven-it-plugin-touch/2.1-SNAPSHOT/maven-it-plugin-touch-2.1-SNAPSHOT.jar
[withMaven] artifactsPublisher - Archive artifact core-it-support/core-it-plugins/maven-it-plugin-uses-properties/pom.xml under org/apache/maven/its/plugins/maven-it-plugin-uses-properties/2.1-SNAPSHOT/maven-it-plugin-uses-properties-2.1-SNAPSHOT.pom
[withMaven] artifactsPublisher - Archive artifact core-it-support/core-it-plugins/maven-it-plugin-uses-properties/target/maven-it-plugin-uses-properties-2.1-SNAPSHOT.jar under org/apache/maven/its/plugins/maven-it-plugin-uses-properties/2.1-SNAPSHOT/maven-it-plugin-uses-properties-2.1-SNAPSHOT.jar
[withMaven] artifactsPublisher - Archive artifact core-it-support/core-it-plugins/maven-it-plugin-uses-wagon/pom.xml under org/apache/maven/its/plugins/maven-it-plugin-uses-wagon/2.1-SNAPSHOT/maven-it-plugin-uses-wagon-2.1-SNAPSHOT.pom
[withMaven] artifactsPublisher - Archive artifact core-it-support/core-it-plugins/maven-it-plugin-uses-wagon/target/maven-it-plugin-uses-wagon-2.1-SNAPSHOT.jar under org/apache/maven/its/plugins/maven-it-plugin-uses-wagon/2.1-SNAPSHOT/maven-it-plugin-uses-wagon-2.1-SNAPSHOT.jar
[withMaven] artifactsPublisher - Archive artifact core-it-support/core-it-plugins/maven-it-plugin-all/pom.xml under org/apache/maven/its/plugins/maven-it-plugin-all/2.1-SNAPSHOT/maven-it-plugin-all-2.1-SNAPSHOT.pom
[withMaven] artifactsPublisher - Archive artifact core-it-support/core-it-plugins/maven-it-plugin-all/target/maven-it-plugin-all-2.1-SNAPSHOT.jar under org/apache/maven/its/plugins/maven-it-plugin-all/2.1-SNAPSHOT/maven-it-plugin-all-2.1-SNAPSHOT.jar
[withMaven] artifactsPublisher - Archive artifact core-it-support/core-it-plugins/maven-it-plugin-plexus-utils-11/pom.xml under org/apache/maven/its/plugins/maven-it-plugin-plexus-utils-11/2.1-SNAPSHOT/maven-it-plugin-plexus-utils-11-2.1-SNAPSHOT.pom
[withMaven] artifactsPublisher - Archive artifact core-it-support/core-it-plugins/maven-it-plugin-plexus-utils-11/target/maven-it-plugin-plexus-utils-11-2.1-SNAPSHOT.jar under org/apache/maven/its/plugins/maven-it-plugin-plexus-utils-11/2.1-SNAPSHOT/maven-it-plugin-plexus-utils-11-2.1-SNAPSHOT.jar
[withMaven] artifactsPublisher - Archive artifact core-it-support/core-it-plugins/maven-it-plugin-plexus-utils-new/pom.xml under org/apache/maven/its/plugins/maven-it-plugin-plexus-utils-new/2.1-SNAPSHOT/maven-it-plugin-plexus-utils-new-2.1-SNAPSHOT.pom
[withMaven] artifactsPublisher - Archive artifact core-it-support/core-it-plugins/maven-it-plugin-plexus-utils-new/target/maven-it-plugin-plexus-utils-new-2.1-SNAPSHOT.jar under org/apache/maven/its/plugins/maven-it-plugin-plexus-utils-new/2.1-SNAPSHOT/maven-it-plugin-plexus-utils-new-2.1-SNAPSHOT.jar
[withMaven] artifactsPublisher - Archive artifact core-it-support/core-it-plugins/maven-it-plugin-plexus-component-api/pom.xml under org/apache/maven/its/plugins/maven-it-plugin-plexus-component-api/2.1-SNAPSHOT/maven-it-plugin-plexus-component-api-2.1-SNAPSHOT.pom
[withMaven] artifactsPublisher - Archive artifact core-it-support/core-it-plugins/maven-it-plugin-plexus-component-api/target/maven-it-plugin-plexus-component-api-2.1-SNAPSHOT.jar under org/apache/maven/its/plugins/maven-it-plugin-plexus-component-api/2.1-SNAPSHOT/maven-it-plugin-plexus-component-api-2.1-SNAPSHOT.jar
[withMaven] artifactsPublisher - Archive artifact core-it-support/core-it-plugins/maven-it-plugin-log4j/pom.xml under org/apache/maven/its/plugins/maven-it-plugin-log4j/2.1-SNAPSHOT/maven-it-plugin-log4j-2.1-SNAPSHOT.pom
[withMaven] artifactsPublisher - Archive artifact core-it-support/core-it-plugins/maven-it-plugin-log4j/target/maven-it-plugin-log4j-2.1-SNAPSHOT.jar under org/apache/maven/its/plugins/maven-it-plugin-log4j/2.1-SNAPSHOT/maven-it-plugin-log4j-2.1-SNAPSHOT.jar
[withMaven] artifactsPublisher - Archive artifact core-it-support/core-it-plugins/maven-it-plugin-extension1/pom.xml under org/apache/maven/its/plugins/maven-it-plugin-extension1/2.1-SNAPSHOT/maven-it-plugin-extension1-2.1-SNAPSHOT.pom
[withMaven] artifactsPublisher - Archive artifact core-it-support/core-it-plugins/maven-it-plugin-extension1/target/maven-it-plugin-extension1-2.1-SNAPSHOT.jar under org/apache/maven/its/plugins/maven-it-plugin-extension1/2.1-SNAPSHOT/maven-it-plugin-extension1-2.1-SNAPSHOT.jar
[withMaven] artifactsPublisher - Archive artifact core-it-support/core-it-plugins/maven-it-plugin-extension2/pom.xml under org/apache/maven/its/plugins/maven-it-plugin-extension2/2.1-SNAPSHOT/maven-it-plugin-extension2-2.1-SNAPSHOT.pom
[withMaven] artifactsPublisher - Archive artifact core-it-support/core-it-plugins/maven-it-plugin-extension2/target/maven-it-plugin-extension2-2.1-SNAPSHOT.jar under org/apache/maven/its/plugins/maven-it-plugin-extension2/2.1-SNAPSHOT/maven-it-plugin-extension2-2.1-SNAPSHOT.jar
[withMaven] artifactsPublisher - Archive artifact core-it-support/core-it-plugins/maven-it-plugin-plexus-lifecycle/pom.xml under org/apache/maven/its/plugins/maven-it-plugin-plexus-lifecycle/2.1-SNAPSHOT/maven-it-plugin-plexus-lifecycle-2.1-SNAPSHOT.pom
[withMaven] artifactsPublisher - Archive artifact core-it-support/core-it-plugins/maven-it-plugin-plexus-lifecycle/target/maven-it-plugin-plexus-lifecycle-2.1-SNAPSHOT.jar under org/apache/maven/its/plugins/maven-it-plugin-plexus-lifecycle/2.1-SNAPSHOT/maven-it-plugin-plexus-lifecycle-2.1-SNAPSHOT.jar
[withMaven] artifactsPublisher - Archive artifact core-it-support/core-it-plugins/maven-it-plugin-settings/pom.xml under org/apache/maven/its/plugins/maven-it-plugin-settings/2.1-SNAPSHOT/maven-it-plugin-settings-2.1-SNAPSHOT.pom
[withMaven] artifactsPublisher - Archive artifact core-it-support/core-it-plugins/maven-it-plugin-settings/target/maven-it-plugin-settings-2.1-SNAPSHOT.jar under org/apache/maven/its/plugins/maven-it-plugin-settings/2.1-SNAPSHOT/maven-it-plugin-settings-2.1-SNAPSHOT.jar
[withMaven] artifactsPublisher - Archive artifact core-it-support/core-it-plugins/mng5805-extension/pom.xml under org/apache/maven/its/plugins/mng-5805-pkg-type-mojo-configuration-extension/2.1-SNAPSHOT/mng-5805-pkg-type-mojo-configuration-extension-2.1-SNAPSHOT.pom
[withMaven] artifactsPublisher - Archive artifact core-it-support/core-it-plugins/mng5805-extension/target/mng-5805-pkg-type-mojo-configuration-extension-2.1-SNAPSHOT.jar under org/apache/maven/its/plugins/mng-5805-pkg-type-mojo-configuration-extension/2.1-SNAPSHOT/mng-5805-pkg-type-mojo-configuration-extension-2.1-SNAPSHOT.jar
[withMaven] artifactsPublisher - Archive artifact core-it-support/core-it-plugins/mng5805-extension2/pom.xml under org/apache/maven/its/plugins/mng-5805-pkg-type-mojo-configuration-extension2/2.1-SNAPSHOT/mng-5805-pkg-type-mojo-configuration-extension2-2.1-SNAPSHOT.pom
[withMaven] artifactsPublisher - Archive artifact core-it-support/core-it-plugins/mng5805-extension2/target/mng-5805-pkg-type-mojo-configuration-extension2-2.1-SNAPSHOT.jar under org/apache/maven/its/plugins/mng-5805-pkg-type-mojo-configuration-extension2/2.1-SNAPSHOT/mng-5805-pkg-type-mojo-configuration-extension2-2.1-SNAPSHOT.jar
[withMaven] artifactsPublisher - Archive artifact core-it-support/core-it-plugins/mng5805-plugin/pom.xml under org/apache/maven/its/plugins/mng-5805-pkg-type-mojo-configuration-plugin/2.1-SNAPSHOT/mng-5805-pkg-type-mojo-configuration-plugin-2.1-SNAPSHOT.pom
[withMaven] artifactsPublisher - Archive artifact core-it-support/core-it-plugins/mng5805-plugin/target/mng-5805-pkg-type-mojo-configuration-plugin-2.1-SNAPSHOT.jar under org/apache/maven/its/plugins/mng-5805-pkg-type-mojo-configuration-plugin/2.1-SNAPSHOT/mng-5805-pkg-type-mojo-configuration-plugin-2.1-SNAPSHOT.jar
[withMaven] artifactsPublisher - Archive artifact core-it-support/core-it-plugins/mng5805-plugin-dep/pom.xml under org/apache/maven/its/plugins/mng-5805-pkg-type-mojo-configuration-plugin-dep/2.1-SNAPSHOT/mng-5805-pkg-type-mojo-configuration-plugin-dep-2.1-SNAPSHOT.pom
[withMaven] artifactsPublisher - Archive artifact core-it-support/core-it-plugins/mng5805-plugin-dep/target/mng-5805-pkg-type-mojo-configuration-plugin-dep-2.1-SNAPSHOT.jar under org/apache/maven/its/plugins/mng-5805-pkg-type-mojo-configuration-plugin-dep/2.1-SNAPSHOT/mng-5805-pkg-type-mojo-configuration-plugin-dep-2.1-SNAPSHOT.jar
[withMaven] artifactsPublisher - Archive artifact core-it-support/core-it-plugins/mng5958-extension/pom.xml under org/apache/maven/its/plugins/mng-5958-pkg-type-extension/2.1-SNAPSHOT/mng-5958-pkg-type-extension-2.1-SNAPSHOT.pom
[withMaven] artifactsPublisher - Archive artifact core-it-support/core-it-plugins/mng5958-extension/target/mng-5958-pkg-type-extension-2.1-SNAPSHOT.jar under org/apache/maven/its/plugins/mng-5958-pkg-type-extension/2.1-SNAPSHOT/mng-5958-pkg-type-extension-2.1-SNAPSHOT.jar
[withMaven] artifactsPublisher - Archive artifact core-it-support/core-it-plugins/mng6759-plugin-resolves-project-dependencies/pom.xml under org/apache/maven/its/plugins/mng-6759-resolves-project-dependencies-plugin/2.1-SNAPSHOT/mng-6759-resolves-project-dependencies-plugin-2.1-SNAPSHOT.pom
[withMaven] artifactsPublisher - Archive artifact core-it-support/core-it-plugins/mng6759-plugin-resolves-project-dependencies/target/mng-6759-resolves-project-dependencies-plugin-2.1-SNAPSHOT.jar under org/apache/maven/its/plugins/mng-6759-resolves-project-dependencies-plugin/2.1-SNAPSHOT/mng-6759-resolves-project-dependencies-plugin-2.1-SNAPSHOT.jar
[withMaven] artifactsPublisher - Archive artifact core-it-support/core-it-toolchain/pom.xml under org/apache/maven/its/core-it-toolchain/2.1-SNAPSHOT/core-it-toolchain-2.1-SNAPSHOT.pom
[withMaven] artifactsPublisher - Archive artifact core-it-support/core-it-toolchain/target/core-it-toolchain-2.1-SNAPSHOT.jar under org/apache/maven/its/core-it-toolchain/2.1-SNAPSHOT/core-it-toolchain-2.1-SNAPSHOT.jar
[withMaven] artifactsPublisher - Archive artifact core-it-support/core-it-wagon/pom.xml under org/apache/maven/its/core-it-wagon/2.1-SNAPSHOT/core-it-wagon-2.1-SNAPSHOT.pom
[withMaven] artifactsPublisher - Archive artifact core-it-support/core-it-wagon/target/core-it-wagon-2.1-SNAPSHOT.jar under org/apache/maven/its/core-it-wagon/2.1-SNAPSHOT/core-it-wagon-2.1-SNAPSHOT.jar
[withMaven] artifactsPublisher - Archive artifact core-it-support/core-it-support-artifacts/pom.xml under org/apache/maven/its/core-it-support-artifacts/2.1-SNAPSHOT/core-it-support-artifacts-2.1-SNAPSHOT.pom
[withMaven] artifactsPublisher - Archive artifact core-it-support/core-it-support-artifacts/target/core-it-support-artifacts-2.1-SNAPSHOT-repo.zip under org/apache/maven/its/core-it-support-artifacts/2.1-SNAPSHOT/core-it-support-artifacts-2.1-SNAPSHOT-repo.zip
[withMaven] artifactsPublisher - Archive artifact core-it-support/core-it-extension/pom.xml under org/apache/maven/its/core-it-extension/2.1-SNAPSHOT/core-it-extension-2.1-SNAPSHOT.pom
[withMaven] artifactsPublisher - Archive artifact core-it-support/core-it-extension/target/core-it-extension-2.1-SNAPSHOT.jar under org/apache/maven/its/core-it-extension/2.1-SNAPSHOT/core-it-extension-2.1-SNAPSHOT.jar
[withMaven] artifactsPublisher - Archive artifact core-it-support/core-it-javaagent/pom.xml under mng-coreit/javaagent/1.0-SNAPSHOT/javaagent-1.0-SNAPSHOT.pom
[withMaven] artifactsPublisher - Archive artifact core-it-support/core-it-javaagent/target/javaagent-1.0-SNAPSHOT.jar under mng-coreit/javaagent/1.0-SNAPSHOT/javaagent-1.0-SNAPSHOT.jar
[withMaven] artifactsPublisher - Archive artifact core-it-suite/pom.xml under org/apache/maven/its/core-it-suite/2.1-SNAPSHOT/core-it-suite-2.1-SNAPSHOT.pom
[withMaven] artifactsPublisher - Archive artifact core-it-suite/target/core-it-suite-2.1-SNAPSHOT.jar under org/apache/maven/its/core-it-suite/2.1-SNAPSHOT/core-it-suite-2.1-SNAPSHOT.jar
[withMaven] artifactsPublisher - Archive artifact core-it-suite/target/core-it-suite-2.1-SNAPSHOT-tests.jar under org/apache/maven/its/core-it-suite/2.1-SNAPSHOT/core-it-suite-2.1-SNAPSHOT-tests.jar
[withMaven] junitPublisher - Archive test results for Maven artifact org.apache.maven.its.plugins:maven-it-plugin-active-collection:maven-plugin:2.1-SNAPSHOT generated by maven-surefire-plugin:test (default-test): core-it-support/core-it-plugins/maven-it-plugin-active-collection/target/surefire-reports/*.xml
[withMaven] junitPublisher - Archive test results for Maven artifact org.apache.maven.its.plugins:maven-it-plugin-ant-based:maven-plugin:2.1-SNAPSHOT generated by maven-surefire-plugin:test (default-test): core-it-support/core-it-plugins/maven-it-plugin-ant-based/target/surefire-reports/*.xml
[withMaven] junitPublisher - Archive test results for Maven artifact org.apache.maven.its.plugins:maven-it-plugin-artifact:maven-plugin:2.1-SNAPSHOT generated by maven-surefire-plugin:test (default-test): core-it-support/core-it-plugins/maven-it-plugin-artifact/target/surefire-reports/*.xml
[withMaven] junitPublisher - Archive test results for Maven artifact org.apache.maven.its.plugins.class-loader:dep-a:jar:2.1-SNAPSHOT generated by maven-surefire-plugin:test (default-test): core-it-support/core-it-plugins/maven-it-plugin-class-loader/dep-a/target/surefire-reports/*.xml
[withMaven] junitPublisher - Archive test results for Maven artifact org.apache.maven.its.plugins.class-loader:dep-b:jar:2.1-SNAPSHOT generated by maven-surefire-plugin:test (default-test): core-it-support/core-it-plugins/maven-it-plugin-class-loader/dep-b/target/surefire-reports/*.xml
[withMaven] junitPublisher - Archive test results for Maven artifact org.apache.maven.its.plugins.class-loader:dep-c:jar:2.1-SNAPSHOT generated by maven-surefire-plugin:test (default-test): core-it-support/core-it-plugins/maven-it-plugin-class-loader/dep-c/target/surefire-reports/*.xml
[withMaven] junitPublisher - Archive test results for Maven artifact org.apache.maven.its.plugins:maven-it-plugin-class-loader:maven-plugin:2.1-SNAPSHOT generated by maven-surefire-plugin:test (default-test): core-it-support/core-it-plugins/maven-it-plugin-class-loader/maven-it-plugin-class-loader/target/surefire-reports/*.xml
[withMaven] junitPublisher - Archive test results for Maven artifact org.apache.maven.its.plugins:maven-it-plugin-configuration:maven-plugin:2.1-SNAPSHOT generated by maven-surefire-plugin:test (default-test): core-it-support/core-it-plugins/maven-it-plugin-configuration/target/surefire-reports/*.xml
[withMaven] junitPublisher - Archive test results for Maven artifact org.apache.maven.its.plugins:maven-it-plugin-context-passing:maven-plugin:2.1-SNAPSHOT generated by maven-surefire-plugin:test (default-test): core-it-support/core-it-plugins/maven-it-plugin-context-passing/target/surefire-reports/*.xml
[withMaven] junitPublisher - Archive test results for Maven artifact org.apache.maven.plugins:maven-clean-plugin:maven-plugin:0.1-stub-SNAPSHOT generated by maven-surefire-plugin:test (default-test): core-it-support/core-it-plugins/maven-it-plugin-core-stubs/maven-clean-plugin/target/surefire-reports/*.xml
[withMaven] junitPublisher - Archive test results for Maven artifact org.apache.maven.plugins:maven-compiler-plugin:maven-plugin:0.1-stub-SNAPSHOT generated by maven-surefire-plugin:test (default-test): core-it-support/core-it-plugins/maven-it-plugin-core-stubs/maven-compiler-plugin/target/surefire-reports/*.xml
[withMaven] junitPublisher - Archive test results for Maven artifact org.apache.maven.plugins:maven-deploy-plugin:maven-plugin:0.1-stub-SNAPSHOT generated by maven-surefire-plugin:test (default-test): core-it-support/core-it-plugins/maven-it-plugin-core-stubs/maven-deploy-plugin/target/surefire-reports/*.xml
[withMaven] junitPublisher - Archive test results for Maven artifact org.apache.maven.plugins:maven-ear-plugin:maven-plugin:0.1-stub-SNAPSHOT generated by maven-surefire-plugin:test (default-test): core-it-support/core-it-plugins/maven-it-plugin-core-stubs/maven-ear-plugin/target/surefire-reports/*.xml
[withMaven] junitPublisher - Archive test results for Maven artifact org.apache.maven.plugins:maven-ejb-plugin:maven-plugin:0.1-stub-SNAPSHOT generated by maven-surefire-plugin:test (default-test): core-it-support/core-it-plugins/maven-it-plugin-core-stubs/maven-ejb-plugin/target/surefire-reports/*.xml
[withMaven] junitPublisher - Archive test results for Maven artifact org.apache.maven.plugins:maven-install-plugin:maven-plugin:0.1-stub-SNAPSHOT generated by maven-surefire-plugin:test (default-test): core-it-support/core-it-plugins/maven-it-plugin-core-stubs/maven-install-plugin/target/surefire-reports/*.xml
[withMaven] junitPublisher - Archive test results for Maven artifact org.apache.maven.plugins:maven-jar-plugin:maven-plugin:0.1-stub-SNAPSHOT generated by maven-surefire-plugin:test (default-test): core-it-support/core-it-plugins/maven-it-plugin-core-stubs/maven-jar-plugin/target/surefire-reports/*.xml
[withMaven] junitPublisher - Archive test results for Maven artifact org.apache.maven.plugins:maven-javadoc-plugin:maven-plugin:0.1-stub-SNAPSHOT generated by maven-surefire-plugin:test (default-test): core-it-support/core-it-plugins/maven-it-plugin-core-stubs/maven-javadoc-plugin/target/surefire-reports/*.xml
[withMaven] junitPublisher - Archive test results for Maven artifact org.apache.maven.plugins:maven-plugin-plugin:maven-plugin:0.1-stub-SNAPSHOT generated by maven-surefire-plugin:test (default-test): core-it-support/core-it-plugins/maven-it-plugin-core-stubs/maven-plugin-plugin/target/surefire-reports/*.xml
[withMaven] junitPublisher - Archive test results for Maven artifact org.apache.maven.plugins:maven-rar-plugin:maven-plugin:0.1-stub-SNAPSHOT generated by maven-surefire-plugin:test (default-test): core-it-support/core-it-plugins/maven-it-plugin-core-stubs/maven-rar-plugin/target/surefire-reports/*.xml
[withMaven] junitPublisher - Archive test results for Maven artifact org.apache.maven.plugins:maven-resources-plugin:maven-plugin:0.1-stub-SNAPSHOT generated by maven-surefire-plugin:test (default-test): core-it-support/core-it-plugins/maven-it-plugin-core-stubs/maven-resources-plugin/target/surefire-reports/*.xml
[withMaven] junitPublisher - Archive test results for Maven artifact org.apache.maven.plugins:maven-site-plugin:maven-plugin:0.1-stub-SNAPSHOT generated by maven-surefire-plugin:test (default-test): core-it-support/core-it-plugins/maven-it-plugin-core-stubs/maven-site-plugin/target/surefire-reports/*.xml
[withMaven] junitPublisher - Archive test results for Maven artifact org.apache.maven.plugins:maven-source-plugin:maven-plugin:0.1-stub-SNAPSHOT generated by maven-surefire-plugin:test (default-test): core-it-support/core-it-plugins/maven-it-plugin-core-stubs/maven-source-plugin/target/surefire-reports/*.xml
[withMaven] junitPublisher - Archive test results for Maven artifact org.apache.maven.plugins:maven-surefire-plugin:maven-plugin:0.1-stub-SNAPSHOT generated by maven-surefire-plugin:test (default-test): core-it-support/core-it-plugins/maven-it-plugin-core-stubs/maven-surefire-plugin/target/surefire-reports/*.xml
[withMaven] junitPublisher - Archive test results for Maven artifact org.apache.maven.plugins:maven-war-plugin:maven-plugin:0.1-stub-SNAPSHOT generated by maven-surefire-plugin:test (default-test): core-it-support/core-it-plugins/maven-it-plugin-core-stubs/maven-war-plugin/target/surefire-reports/*.xml
[withMaven] junitPublisher - Archive test results for Maven artifact org.apache.maven.its.plugins:maven-it-plugin-dependency-collection:maven-plugin:2.1-SNAPSHOT generated by maven-surefire-plugin:test (default-test): core-it-support/core-it-plugins/maven-it-plugin-dependency-collection/target/surefire-reports/*.xml
[withMaven] junitPublisher - Archive test results for Maven artifact org.apache.maven.its.plugins:maven-it-plugin-dependency-resolution:maven-plugin:2.1-SNAPSHOT generated by maven-surefire-plugin:test (default-test): core-it-support/core-it-plugins/maven-it-plugin-dependency-resolution/target/surefire-reports/*.xml
[withMaven] junitPublisher - Archive test results for Maven artifact org.apache.maven.its.plugins:maven-it-plugin-expression:maven-plugin:2.1-SNAPSHOT generated by maven-surefire-plugin:test (default-test): core-it-support/core-it-plugins/maven-it-plugin-expression/target/surefire-reports/*.xml
[withMaven] junitPublisher - Archive test results for Maven artifact org.apache.maven.its.plugins:maven-it-plugin-error:maven-plugin:2.1-SNAPSHOT generated by maven-surefire-plugin:test (default-test): core-it-support/core-it-plugins/maven-it-plugin-error/target/surefire-reports/*.xml
[withMaven] junitPublisher - Archive test results for Maven artifact org.apache.maven.its:core-it-component:jar:2.1-SNAPSHOT generated by maven-surefire-plugin:test (default-test): core-it-support/core-it-component/target/surefire-reports/*.xml
[withMaven] junitPublisher - Archive test results for Maven artifact org.apache.maven.its.plugins:maven-it-plugin-extension-consumer:maven-plugin:2.1-SNAPSHOT generated by maven-surefire-plugin:test (default-test): core-it-support/core-it-plugins/maven-it-plugin-extension-consumer/target/surefire-reports/*.xml
[withMaven] junitPublisher - Archive test results for Maven artifact org.apache.maven.its.plugins:maven-it-plugin-extension-provider:maven-plugin:2.1-SNAPSHOT generated by maven-surefire-plugin:test (default-test): core-it-support/core-it-plugins/maven-it-plugin-extension-provider/target/surefire-reports/*.xml
[withMaven] junitPublisher - Archive test results for Maven artifact org.apache.maven.its.plugins:maven-it-plugin-fork:maven-plugin:2.1-SNAPSHOT generated by maven-surefire-plugin:test (default-test): core-it-support/core-it-plugins/maven-it-plugin-fork/target/surefire-reports/*.xml
[withMaven] junitPublisher - Archive test results for Maven artifact org.apache.maven.its.plugins:maven-it-plugin-invalid-descriptor:maven-plugin:2.1-SNAPSHOT generated by maven-surefire-plugin:test (default-test): core-it-support/core-it-plugins/maven-it-plugin-invalid-descriptor/target/surefire-reports/*.xml
[withMaven] junitPublisher - Archive test results for Maven artifact org.apache.maven.its.plugins:maven-it-plugin-log-file:maven-plugin:2.1-SNAPSHOT generated by maven-surefire-plugin:test (default-test): core-it-support/core-it-plugins/maven-it-plugin-log-file/target/surefire-reports/*.xml
[withMaven] junitPublisher - Archive test results for Maven artifact org.apache.maven.its:maven-it-helper:jar:2.1-SNAPSHOT generated by maven-surefire-plugin:test (default-test): core-it-support/maven-it-helper/target/surefire-reports/*.xml
[withMaven] junitPublisher - Archive test results for Maven artifact org.apache.maven.its.plugins:maven-it-plugin-model-interpolation:maven-plugin:2.1-SNAPSHOT generated by maven-surefire-plugin:test (default-test): core-it-support/core-it-plugins/maven-it-plugin-model-interpolation/target/surefire-reports/*.xml
[withMaven] junitPublisher - Archive test results for Maven artifact org.apache.maven.its.plugins:maven-it-plugin-no-default-comp:maven-plugin:2.1-SNAPSHOT generated by maven-surefire-plugin:test (default-test): core-it-support/core-it-plugins/maven-it-plugin-no-default-comp/target/surefire-reports/*.xml
[withMaven] junitPublisher - Archive test results for Maven artifact org.apache.maven.its.plugins:maven-it-plugin-no-project:maven-plugin:2.1-SNAPSHOT generated by maven-surefire-plugin:test (default-test): core-it-support/core-it-plugins/maven-it-plugin-no-project/target/surefire-reports/*.xml
[withMaven] junitPublisher - Archive test results for Maven artifact org.apache.maven.its.plugins:maven-it-plugin-online:maven-plugin:2.1-SNAPSHOT generated by maven-surefire-plugin:test (default-test): core-it-support/core-it-plugins/maven-it-plugin-online/target/surefire-reports/*.xml
[withMaven] junitPublisher - Archive test results for Maven artifact org.apache.maven.its.plugins:maven-it-plugin-optional-mojos:maven-plugin:2.1-SNAPSHOT generated by maven-surefire-plugin:test (default-test): core-it-support/core-it-plugins/maven-it-plugin-optional-mojos/target/surefire-reports/*.xml
[withMaven] junitPublisher - Archive test results for Maven artifact org.apache.maven.its.plugins:maven-it-plugin-packaging:maven-plugin:2.1-SNAPSHOT generated by maven-surefire-plugin:test (default-test): core-it-support/core-it-plugins/maven-it-plugin-packaging/target/surefire-reports/*.xml
[withMaven] junitPublisher - Archive test results for Maven artifact org.apache.maven.its.plugins:maven-it-plugin-parameter-implementation:maven-plugin:2.1-SNAPSHOT generated by maven-surefire-plugin:test (default-test): core-it-support/core-it-plugins/maven-it-plugin-parameter-implementation/target/surefire-reports/*.xml
[withMaven] junitPublisher - Archive test results for Maven artifact org.apache.maven.its.plugins:maven-it-plugin-plugin-dependency:maven-plugin:2.1-SNAPSHOT generated by maven-surefire-plugin:test (default-test): core-it-support/core-it-plugins/maven-it-plugin-plugin-dependency/target/surefire-reports/*.xml
[withMaven] junitPublisher - Archive test results for Maven artifact org.apache.maven.its.plugins:maven-it-plugin-project:maven-plugin:2.1-SNAPSHOT generated by maven-surefire-plugin:test (default-test): core-it-support/core-it-plugins/maven-it-plugin-project/target/surefire-reports/*.xml
[withMaven] junitPublisher - Archive test results for Maven artifact org.apache.maven.its.plugins:maven-it-plugin-project-interpolation:maven-plugin:2.1-SNAPSHOT generated by maven-surefire-plugin:test (default-test): core-it-support/core-it-plugins/maven-it-plugin-project-interpolation/target/surefire-reports/*.xml
[withMaven] junitPublisher - Archive test results for Maven artifact org.apache.maven.its.plugins:maven-it-plugin-setter:maven-plugin:2.1-SNAPSHOT generated by maven-surefire-plugin:test (default-test): core-it-support/core-it-plugins/maven-it-plugin-setter/target/surefire-reports/*.xml
[withMaven] junitPublisher - Archive test results for Maven artifact org.apache.maven.its.plugins:maven-it-plugin-singleton-component:maven-plugin:2.1-SNAPSHOT generated by maven-surefire-plugin:test (default-test): core-it-support/core-it-plugins/maven-it-plugin-singleton-component/target/surefire-reports/*.xml
[withMaven] junitPublisher - Archive test results for Maven artifact org.apache.maven.its.plugins:maven-it-plugin-site:maven-plugin:2.1-SNAPSHOT generated by maven-surefire-plugin:test (default-test): core-it-support/core-it-plugins/maven-it-plugin-site/target/surefire-reports/*.xml
[withMaven] junitPublisher - Archive test results for Maven artifact org.apache.maven.its.plugins:maven-it-plugin-toolchain:maven-plugin:2.1-SNAPSHOT generated by maven-surefire-plugin:test (default-test): core-it-support/core-it-plugins/maven-it-plugin-toolchain/target/surefire-reports/*.xml
[withMaven] junitPublisher - Archive test results for Maven artifact org.apache.maven.its.plugins:maven-it-plugin-touch:maven-plugin:2.1-SNAPSHOT generated by maven-surefire-plugin:test (default-test): core-it-support/core-it-plugins/maven-it-plugin-touch/target/surefire-reports/*.xml
[withMaven] junitPublisher - Archive test results for Maven artifact org.apache.maven.its.plugins:maven-it-plugin-uses-properties:maven-plugin:2.1-SNAPSHOT generated by maven-surefire-plugin:test (default-test): core-it-support/core-it-plugins/maven-it-plugin-uses-properties/target/surefire-reports/*.xml
[withMaven] junitPublisher - Archive test results for Maven artifact org.apache.maven.its.plugins:maven-it-plugin-uses-wagon:maven-plugin:2.1-SNAPSHOT generated by maven-surefire-plugin:test (default-test): core-it-support/core-it-plugins/maven-it-plugin-uses-wagon/target/surefire-reports/*.xml
[withMaven] junitPublisher - Archive test results for Maven artifact org.apache.maven.its.plugins:maven-it-plugin-all:maven-plugin:2.1-SNAPSHOT generated by maven-surefire-plugin:test (default-test): core-it-support/core-it-plugins/maven-it-plugin-all/target/surefire-reports/*.xml
[withMaven] junitPublisher - Archive test results for Maven artifact org.apache.maven.its.plugins:maven-it-plugin-plexus-utils-11:maven-plugin:2.1-SNAPSHOT generated by maven-surefire-plugin:test (default-test): core-it-support/core-it-plugins/maven-it-plugin-plexus-utils-11/target/surefire-reports/*.xml
[withMaven] junitPublisher - Archive test results for Maven artifact org.apache.maven.its.plugins:maven-it-plugin-plexus-utils-new:maven-plugin:2.1-SNAPSHOT generated by maven-surefire-plugin:test (default-test): core-it-support/core-it-plugins/maven-it-plugin-plexus-utils-new/target/surefire-reports/*.xml
[withMaven] junitPublisher - Archive test results for Maven artifact org.apache.maven.its.plugins:maven-it-plugin-plexus-component-api:maven-plugin:2.1-SNAPSHOT generated by maven-surefire-plugin:test (default-test): core-it-support/core-it-plugins/maven-it-plugin-plexus-component-api/target/surefire-reports/*.xml
[withMaven] junitPublisher - Archive test results for Maven artifact org.apache.maven.its.plugins:maven-it-plugin-log4j:maven-plugin:2.1-SNAPSHOT generated by maven-surefire-plugin:test (default-test): core-it-support/core-it-plugins/maven-it-plugin-log4j/target/surefire-reports/*.xml
[withMaven] junitPublisher - Archive test results for Maven artifact org.apache.maven.its.plugins:maven-it-plugin-extension1:maven-plugin:2.1-SNAPSHOT generated by maven-surefire-plugin:test (default-test): core-it-support/core-it-plugins/maven-it-plugin-extension1/target/surefire-reports/*.xml
[withMaven] junitPublisher - Archive test results for Maven artifact org.apache.maven.its.plugins:maven-it-plugin-extension2:maven-plugin:2.1-SNAPSHOT generated by maven-surefire-plugin:test (default-test): core-it-support/core-it-plugins/maven-it-plugin-extension2/target/surefire-reports/*.xml
[withMaven] junitPublisher - Archive test results for Maven artifact org.apache.maven.its.plugins:maven-it-plugin-plexus-lifecycle:maven-plugin:2.1-SNAPSHOT generated by maven-surefire-plugin:test (default-test): core-it-support/core-it-plugins/maven-it-plugin-plexus-lifecycle/target/surefire-reports/*.xml
[withMaven] junitPublisher - Archive test results for Maven artifact org.apache.maven.its.plugins:maven-it-plugin-settings:maven-plugin:2.1-SNAPSHOT generated by maven-surefire-plugin:test (default-test): core-it-support/core-it-plugins/maven-it-plugin-settings/target/surefire-reports/*.xml
[withMaven] junitPublisher - Archive test results for Maven artifact org.apache.maven.its.plugins:mng-5805-pkg-type-mojo-configuration-extension:jar:2.1-SNAPSHOT generated by maven-surefire-plugin:test (default-test): core-it-support/core-it-plugins/mng5805-extension/target/surefire-reports/*.xml
[withMaven] junitPublisher - Archive test results for Maven artifact org.apache.maven.its.plugins:mng-5805-pkg-type-mojo-configuration-extension2:jar:2.1-SNAPSHOT generated by maven-surefire-plugin:test (default-test): core-it-support/core-it-plugins/mng5805-extension2/target/surefire-reports/*.xml
[withMaven] junitPublisher - Archive test results for Maven artifact org.apache.maven.its.plugins:mng-5805-pkg-type-mojo-configuration-plugin:maven-plugin:2.1-SNAPSHOT generated by maven-surefire-plugin:test (default-test): core-it-support/core-it-plugins/mng5805-plugin/target/surefire-reports/*.xml
[withMaven] junitPublisher - Archive test results for Maven artifact org.apache.maven.its.plugins:mng-5805-pkg-type-mojo-configuration-plugin-dep:jar:2.1-SNAPSHOT generated by maven-surefire-plugin:test (default-test): core-it-support/core-it-plugins/mng5805-plugin-dep/target/surefire-reports/*.xml
[withMaven] junitPublisher - Archive test results for Maven artifact org.apache.maven.its.plugins:mng-5958-pkg-type-extension:jar:2.1-SNAPSHOT generated by maven-surefire-plugin:test (default-test): core-it-support/core-it-plugins/mng5958-extension/target/surefire-reports/*.xml
[withMaven] junitPublisher - Archive test results for Maven artifact org.apache.maven.its.plugins:mng-6759-resolves-project-dependencies-plugin:maven-plugin:2.1-SNAPSHOT generated by maven-surefire-plugin:test (default-test): core-it-support/core-it-plugins/mng6759-plugin-resolves-project-dependencies/target/surefire-reports/*.xml
[withMaven] junitPublisher - Archive test results for Maven artifact org.apache.maven.its:core-it-toolchain:jar:2.1-SNAPSHOT generated by maven-surefire-plugin:test (default-test): core-it-support/core-it-toolchain/target/surefire-reports/*.xml
[withMaven] junitPublisher - Archive test results for Maven artifact org.apache.maven.its:core-it-wagon:jar:2.1-SNAPSHOT generated by maven-surefire-plugin:test (default-test): core-it-support/core-it-wagon/target/surefire-reports/*.xml
[withMaven] junitPublisher - Archive test results for Maven artifact org.apache.maven.its:core-it-extension:jar:2.1-SNAPSHOT generated by maven-surefire-plugin:test (default-test): core-it-support/core-it-extension/target/surefire-reports/*.xml
[withMaven] junitPublisher - Archive test results for Maven artifact mng-coreit:javaagent:jar:1.0-SNAPSHOT generated by maven-surefire-plugin:test (default-test): core-it-support/core-it-javaagent/target/surefire-reports/*.xml
[withMaven] junitPublisher - Archive test results for Maven artifact org.apache.maven.its:core-it-suite:jar:2.1-SNAPSHOT generated by maven-surefire-plugin:test (default-test): core-it-suite/target/surefire-reports/*.xml
Recording test results
[DevOpticsMavenPublisher] dependencies consumed: 5, artifacts produced: 156
[withMaven] Publishers: Pipeline Graph Publisher: 14 ms, Generated Artifacts Publisher: 110418 ms, Invoker Publisher: 2 ms, Junit Publisher: 441695 ms, Concordion Publisher: 2 ms, Dependencies Fingerprint Publisher: 4679 ms, Findbugs Publisher: 1 ms, JGiven Publisher: 1 ms, Jacoco Publisher: 1 ms, SpotBugs Publisher: 1 ms, Open Task Scanner Publisher: 22567 ms, CloudBees DevOptics Gate Artifact Publisher: 480735 ms
[Pipeline] // withMaven
[Pipeline] fileExists
[Pipeline] zip
Writing zip file of /home/jenkins/jenkins-agent/workspace/_box_maven_system-line-separator/test/core-it-suite/target/test-classes to /home/jenkins/jenkins-agent/workspace/_box_maven_system-line-separator/test/core-it-suite-logs-linux-jdk8.zip
Zipped 8648 entries.
Archiving /home/jenkins/jenkins-agent/workspace/_box_maven_system-line-separator/test/core-it-suite-logs-linux-jdk8.zip
[Pipeline] fileExists
[Pipeline] zip
Writing zip file of /home/jenkins/jenkins-agent/workspace/_box_maven_system-line-separator/test/core-it-suite/target/surefire-reports to /home/jenkins/jenkins-agent/workspace/_box_maven_system-line-separator/test/core-it-suite-reports-linux-jdk8.zip
Zipped 4 entries.
Archiving /home/jenkins/jenkins-agent/workspace/_box_maven_system-line-separator/test/core-it-suite-reports-linux-jdk8.zip
[Pipeline] deleteDir
[withMaven] openTasksPublisher - Scan Tasks for Maven artifact org.apache.maven.its.plugins:maven-it-plugin-active-collection:maven-plugin:2.1-SNAPSHOT in source directory core-it-support/core-it-plugins/maven-it-plugin-active-collection/src/main/java
[withMaven] openTasksPublisher - Scan Tasks for Maven artifact org.apache.maven.its.plugins:maven-it-plugin-artifact:maven-plugin:2.1-SNAPSHOT in source directory core-it-support/core-it-plugins/maven-it-plugin-artifact/src/main/java
[withMaven] openTasksPublisher - Scan Tasks for Maven artifact org.apache.maven.its.plugins.class-loader:dep-a:jar:2.1-SNAPSHOT in source directory core-it-support/core-it-plugins/maven-it-plugin-class-loader/dep-a/src/main/java
[withMaven] openTasksPublisher - Scan Tasks for Maven artifact org.apache.maven.its.plugins.class-loader:dep-b:jar:2.1-SNAPSHOT in source directory core-it-support/core-it-plugins/maven-it-plugin-class-loader/dep-b/src/main/java
[withMaven] openTasksPublisher - Scan Tasks for Maven artifact org.apache.maven.its.plugins:maven-it-plugin-class-loader:maven-plugin:2.1-SNAPSHOT in source directory core-it-support/core-it-plugins/maven-it-plugin-class-loader/maven-it-plugin-class-loader/src/main/java
[withMaven] openTasksPublisher - Scan Tasks for Maven artifact org.apache.maven.its.plugins:maven-it-plugin-configuration:maven-plugin:2.1-SNAPSHOT in source directory core-it-support/core-it-plugins/maven-it-plugin-configuration/src/main/java
[Pipeline] }
[Pipeline] // dir
[Pipeline] }
[withMaven] openTasksPublisher - Scan Tasks for Maven artifact org.apache.maven.its.plugins:maven-it-plugin-context-passing:maven-plugin:2.1-SNAPSHOT in source directory core-it-support/core-it-plugins/maven-it-plugin-context-passing/src/main/java
[Pipeline] // stage
[Pipeline] }
[Pipeline] // node
[Pipeline] }
[withMaven] openTasksPublisher - Scan Tasks for Maven artifact org.apache.maven.plugins:maven-clean-plugin:maven-plugin:0.1-stub-SNAPSHOT in source directory core-it-support/core-it-plugins/maven-it-plugin-core-stubs/maven-clean-plugin/src/main/java
[withMaven] openTasksPublisher - Scan Tasks for Maven artifact org.apache.maven.plugins:maven-compiler-plugin:maven-plugin:0.1-stub-SNAPSHOT in source directory core-it-support/core-it-plugins/maven-it-plugin-core-stubs/maven-compiler-plugin/src/main/java
[withMaven] openTasksPublisher - Scan Tasks for Maven artifact org.apache.maven.plugins:maven-deploy-plugin:maven-plugin:0.1-stub-SNAPSHOT in source directory core-it-support/core-it-plugins/maven-it-plugin-core-stubs/maven-deploy-plugin/src/main/java
[withMaven] openTasksPublisher - Scan Tasks for Maven artifact org.apache.maven.plugins:maven-ear-plugin:maven-plugin:0.1-stub-SNAPSHOT in source directory core-it-support/core-it-plugins/maven-it-plugin-core-stubs/maven-ear-plugin/src/main/java
[withMaven] openTasksPublisher - Scan Tasks for Maven artifact org.apache.maven.plugins:maven-ejb-plugin:maven-plugin:0.1-stub-SNAPSHOT in source directory core-it-support/core-it-plugins/maven-it-plugin-core-stubs/maven-ejb-plugin/src/main/java
[withMaven] openTasksPublisher - Scan Tasks for Maven artifact org.apache.maven.plugins:maven-install-plugin:maven-plugin:0.1-stub-SNAPSHOT in source directory core-it-support/core-it-plugins/maven-it-plugin-core-stubs/maven-install-plugin/src/main/java
[withMaven] openTasksPublisher - Scan Tasks for Maven artifact org.apache.maven.plugins:maven-jar-plugin:maven-plugin:0.1-stub-SNAPSHOT in source directory core-it-support/core-it-plugins/maven-it-plugin-core-stubs/maven-jar-plugin/src/main/java
[withMaven] openTasksPublisher - Scan Tasks for Maven artifact org.apache.maven.plugins:maven-javadoc-plugin:maven-plugin:0.1-stub-SNAPSHOT in source directory core-it-support/core-it-plugins/maven-it-plugin-core-stubs/maven-javadoc-plugin/src/main/java
[withMaven] openTasksPublisher - Scan Tasks for Maven artifact org.apache.maven.plugins:maven-plugin-plugin:maven-plugin:0.1-stub-SNAPSHOT in source directory core-it-support/core-it-plugins/maven-it-plugin-core-stubs/maven-plugin-plugin/src/main/java
[withMaven] openTasksPublisher - Scan Tasks for Maven artifact org.apache.maven.plugins:maven-rar-plugin:maven-plugin:0.1-stub-SNAPSHOT in source directory core-it-support/core-it-plugins/maven-it-plugin-core-stubs/maven-rar-plugin/src/main/java
[withMaven] openTasksPublisher - Scan Tasks for Maven artifact org.apache.maven.plugins:maven-resources-plugin:maven-plugin:0.1-stub-SNAPSHOT in source directory core-it-support/core-it-plugins/maven-it-plugin-core-stubs/maven-resources-plugin/src/main/java
[withMaven] openTasksPublisher - Scan Tasks for Maven artifact org.apache.maven.plugins:maven-site-plugin:maven-plugin:0.1-stub-SNAPSHOT in source directory core-it-support/core-it-plugins/maven-it-plugin-core-stubs/maven-site-plugin/src/main/java
[withMaven] openTasksPublisher - Scan Tasks for Maven artifact org.apache.maven.plugins:maven-source-plugin:maven-plugin:0.1-stub-SNAPSHOT in source directory core-it-support/core-it-plugins/maven-it-plugin-core-stubs/maven-source-plugin/src/main/java
[withMaven] openTasksPublisher - Scan Tasks for Maven artifact org.apache.maven.plugins:maven-surefire-plugin:maven-plugin:0.1-stub-SNAPSHOT in source directory core-it-support/core-it-plugins/maven-it-plugin-core-stubs/maven-surefire-plugin/src/main/java
[withMaven] openTasksPublisher - Scan Tasks for Maven artifact org.apache.maven.plugins:maven-war-plugin:maven-plugin:0.1-stub-SNAPSHOT in source directory core-it-support/core-it-plugins/maven-it-plugin-core-stubs/maven-war-plugin/src/main/java
[withMaven] openTasksPublisher - Scan Tasks for Maven artifact org.apache.maven.its.plugins:maven-it-plugin-dependency-collection:maven-plugin:2.1-SNAPSHOT in source directory core-it-support/core-it-plugins/maven-it-plugin-dependency-collection/src/main/java
[withMaven] openTasksPublisher - Scan Tasks for Maven artifact org.apache.maven.its.plugins:maven-it-plugin-dependency-resolution:maven-plugin:2.1-SNAPSHOT in source directory core-it-support/core-it-plugins/maven-it-plugin-dependency-resolution/src/main/java
[withMaven] openTasksPublisher - Scan Tasks for Maven artifact org.apache.maven.its.plugins:maven-it-plugin-expression:maven-plugin:2.1-SNAPSHOT in source directory core-it-support/core-it-plugins/maven-it-plugin-expression/src/main/java
[withMaven] openTasksPublisher - Scan Tasks for Maven artifact org.apache.maven.its.plugins:maven-it-plugin-error:maven-plugin:2.1-SNAPSHOT in source directory core-it-support/core-it-plugins/maven-it-plugin-error/src/main/java
[withMaven] openTasksPublisher - Scan Tasks for Maven artifact org.apache.maven.its:core-it-component:jar:2.1-SNAPSHOT in source directory core-it-support/core-it-component/src/main/java
[withMaven] openTasksPublisher - Scan Tasks for Maven artifact org.apache.maven.its.plugins:maven-it-plugin-extension-consumer:maven-plugin:2.1-SNAPSHOT in source directory core-it-support/core-it-plugins/maven-it-plugin-extension-consumer/src/main/java
[withMaven] openTasksPublisher - Scan Tasks for Maven artifact org.apache.maven.its.plugins:maven-it-plugin-extension-provider:maven-plugin:2.1-SNAPSHOT in source directory core-it-support/core-it-plugins/maven-it-plugin-extension-provider/src/main/java
[withMaven] openTasksPublisher - Scan Tasks for Maven artifact org.apache.maven.its.plugins:maven-it-plugin-fork:maven-plugin:2.1-SNAPSHOT in source directory core-it-support/core-it-plugins/maven-it-plugin-fork/src/main/java
[withMaven] openTasksPublisher - Scan Tasks for Maven artifact org.apache.maven.its.plugins:maven-it-plugin-invalid-descriptor:maven-plugin:2.1-SNAPSHOT in source directory core-it-support/core-it-plugins/maven-it-plugin-invalid-descriptor/src/main/java
[withMaven] openTasksPublisher - Scan Tasks for Maven artifact org.apache.maven.its.plugins:maven-it-plugin-log-file:maven-plugin:2.1-SNAPSHOT in source directory core-it-support/core-it-plugins/maven-it-plugin-log-file/src/main/java
[withMaven] openTasksPublisher - Scan Tasks for Maven artifact org.apache.maven.its:maven-it-helper:jar:2.1-SNAPSHOT in source directory core-it-support/maven-it-helper/src/main/java
[withMaven] openTasksPublisher - Scan Tasks for Maven artifact org.apache.maven.its.plugins:maven-it-plugin-model-interpolation:maven-plugin:2.1-SNAPSHOT in source directory core-it-support/core-it-plugins/maven-it-plugin-model-interpolation/src/main/java
[withMaven] openTasksPublisher - Scan Tasks for Maven artifact org.apache.maven.its.plugins:maven-it-plugin-no-default-comp:maven-plugin:2.1-SNAPSHOT in source directory core-it-support/core-it-plugins/maven-it-plugin-no-default-comp/src/main/java
[withMaven] openTasksPublisher - Scan Tasks for Maven artifact org.apache.maven.its.plugins:maven-it-plugin-no-project:maven-plugin:2.1-SNAPSHOT in source directory core-it-support/core-it-plugins/maven-it-plugin-no-project/src/main/java
[withMaven] openTasksPublisher - Scan Tasks for Maven artifact org.apache.maven.its.plugins:maven-it-plugin-online:maven-plugin:2.1-SNAPSHOT in source directory core-it-support/core-it-plugins/maven-it-plugin-online/src/main/java
[withMaven] openTasksPublisher - Scan Tasks for Maven artifact org.apache.maven.its.plugins:maven-it-plugin-optional-mojos:maven-plugin:2.1-SNAPSHOT in source directory core-it-support/core-it-plugins/maven-it-plugin-optional-mojos/src/main/java
[withMaven] openTasksPublisher - Scan Tasks for Maven artifact org.apache.maven.its.plugins:maven-it-plugin-packaging:maven-plugin:2.1-SNAPSHOT in source directory core-it-support/core-it-plugins/maven-it-plugin-packaging/src/main/java
[withMaven] openTasksPublisher - Scan Tasks for Maven artifact org.apache.maven.its.plugins:maven-it-plugin-parameter-implementation:maven-plugin:2.1-SNAPSHOT in source directory core-it-support/core-it-plugins/maven-it-plugin-parameter-implementation/src/main/java
[withMaven] openTasksPublisher - Scan Tasks for Maven artifact org.apache.maven.its.plugins:maven-it-plugin-plugin-dependency:maven-plugin:2.1-SNAPSHOT in source directory core-it-support/core-it-plugins/maven-it-plugin-plugin-dependency/src/main/java
[withMaven] openTasksPublisher - Scan Tasks for Maven artifact org.apache.maven.its.plugins:maven-it-plugin-project:maven-plugin:2.1-SNAPSHOT in source directory core-it-support/core-it-plugins/maven-it-plugin-project/src/main/java
[withMaven] openTasksPublisher - Scan Tasks for Maven artifact org.apache.maven.its.plugins:maven-it-plugin-project-interpolation:maven-plugin:2.1-SNAPSHOT in source directory core-it-support/core-it-plugins/maven-it-plugin-project-interpolation/src/main/java
[withMaven] openTasksPublisher - Scan Tasks for Maven artifact org.apache.maven.its.plugins:maven-it-plugin-setter:maven-plugin:2.1-SNAPSHOT in source directory core-it-support/core-it-plugins/maven-it-plugin-setter/src/main/java
[withMaven] openTasksPublisher - Scan Tasks for Maven artifact org.apache.maven.its.plugins:maven-it-plugin-singleton-component:maven-plugin:2.1-SNAPSHOT in source directory core-it-support/core-it-plugins/maven-it-plugin-singleton-component/src/main/java
[withMaven] openTasksPublisher - Scan Tasks for Maven artifact org.apache.maven.its.plugins:maven-it-plugin-site:maven-plugin:2.1-SNAPSHOT in source directory core-it-support/core-it-plugins/maven-it-plugin-site/src/main/java
[withMaven] openTasksPublisher - Scan Tasks for Maven artifact org.apache.maven.its.plugins:maven-it-plugin-toolchain:maven-plugin:2.1-SNAPSHOT in source directory core-it-support/core-it-plugins/maven-it-plugin-toolchain/src/main/java
[withMaven] openTasksPublisher - Scan Tasks for Maven artifact org.apache.maven.its.plugins:maven-it-plugin-touch:maven-plugin:2.1-SNAPSHOT in source directory core-it-support/core-it-plugins/maven-it-plugin-touch/src/main/java
[withMaven] openTasksPublisher - Scan Tasks for Maven artifact org.apache.maven.its.plugins:maven-it-plugin-uses-properties:maven-plugin:2.1-SNAPSHOT in source directory core-it-support/core-it-plugins/maven-it-plugin-uses-properties/src/main/java
[withMaven] openTasksPublisher - Scan Tasks for Maven artifact org.apache.maven.its.plugins:maven-it-plugin-uses-wagon:maven-plugin:2.1-SNAPSHOT in source directory core-it-support/core-it-plugins/maven-it-plugin-uses-wagon/src/main/java
[withMaven] openTasksPublisher - Scan Tasks for Maven artifact org.apache.maven.its.plugins:maven-it-plugin-all:maven-plugin:2.1-SNAPSHOT in source directory core-it-support/core-it-plugins/maven-it-plugin-all/src/main/java
[withMaven] openTasksPublisher - Scan Tasks for Maven artifact org.apache.maven.its.plugins:maven-it-plugin-plexus-utils-11:maven-plugin:2.1-SNAPSHOT in source directory core-it-support/core-it-plugins/maven-it-plugin-plexus-utils-11/src/main/java
[withMaven] openTasksPublisher - Scan Tasks for Maven artifact org.apache.maven.its.plugins:maven-it-plugin-plexus-utils-new:maven-plugin:2.1-SNAPSHOT in source directory core-it-support/core-it-plugins/maven-it-plugin-plexus-utils-new/src/main/java
[withMaven] openTasksPublisher - Scan Tasks for Maven artifact org.apache.maven.its.plugins:maven-it-plugin-plexus-component-api:maven-plugin:2.1-SNAPSHOT in source directory core-it-support/core-it-plugins/maven-it-plugin-plexus-component-api/src/main/java
[withMaven] openTasksPublisher - Scan Tasks for Maven artifact org.apache.maven.its.plugins:maven-it-plugin-log4j:maven-plugin:2.1-SNAPSHOT in source directory core-it-support/core-it-plugins/maven-it-plugin-log4j/src/main/java
[withMaven] openTasksPublisher - Scan Tasks for Maven artifact org.apache.maven.its.plugins:maven-it-plugin-extension1:maven-plugin:2.1-SNAPSHOT in source directory core-it-support/core-it-plugins/maven-it-plugin-extension1/src/main/java
[withMaven] openTasksPublisher - Scan Tasks for Maven artifact org.apache.maven.its.plugins:maven-it-plugin-extension2:maven-plugin:2.1-SNAPSHOT in source directory core-it-support/core-it-plugins/maven-it-plugin-extension2/src/main/java
[withMaven] openTasksPublisher - Scan Tasks for Maven artifact org.apache.maven.its.plugins:maven-it-plugin-plexus-lifecycle:maven-plugin:2.1-SNAPSHOT in source directory core-it-support/core-it-plugins/maven-it-plugin-plexus-lifecycle/src/main/java
[withMaven] openTasksPublisher - Scan Tasks for Maven artifact org.apache.maven.its.plugins:maven-it-plugin-settings:maven-plugin:2.1-SNAPSHOT in source directory core-it-support/core-it-plugins/maven-it-plugin-settings/src/main/java
[withMaven] openTasksPublisher - Scan Tasks for Maven artifact org.apache.maven.its.plugins:mng-5805-pkg-type-mojo-configuration-plugin:maven-plugin:2.1-SNAPSHOT in source directory core-it-support/core-it-plugins/mng5805-plugin/src/main/java
[withMaven] openTasksPublisher - Scan Tasks for Maven artifact org.apache.maven.its.plugins:mng-5805-pkg-type-mojo-configuration-plugin-dep:jar:2.1-SNAPSHOT in source directory core-it-support/core-it-plugins/mng5805-plugin-dep/src/main/java
[withMaven] openTasksPublisher - Scan Tasks for Maven artifact org.apache.maven.its.plugins:mng-5958-pkg-type-extension:jar:2.1-SNAPSHOT in source directory core-it-support/core-it-plugins/mng5958-extension/src/main/java
[withMaven] openTasksPublisher - Scan Tasks for Maven artifact org.apache.maven.its.plugins:mng-6759-resolves-project-dependencies-plugin:maven-plugin:2.1-SNAPSHOT in source directory core-it-support/core-it-plugins/mng6759-plugin-resolves-project-dependencies/src/main/java
[withMaven] openTasksPublisher - Scan Tasks for Maven artifact org.apache.maven.its:core-it-toolchain:jar:2.1-SNAPSHOT in source directory core-it-support/core-it-toolchain/src/main/java
[withMaven] openTasksPublisher - Scan Tasks for Maven artifact org.apache.maven.its:core-it-wagon:jar:2.1-SNAPSHOT in source directory core-it-support/core-it-wagon/src/main/java
[withMaven] openTasksPublisher - Scan Tasks for Maven artifact mng-coreit:javaagent:jar:1.0-SNAPSHOT in source directory core-it-support/core-it-javaagent/src/main/java
[TASKS] Scanning folder '/home/jenkins/jenkins-agent/workspace/_box_maven_system-line-separator/test' for files matching the pattern 'core-it-support/core-it-plugins/maven-it-plugin-active-collection/src/main/java/**/*,core-it-support/core-it-plugins/maven-it-plugin-artifact/src/main/java/**/*,core-it-support/core-it-plugins/maven-it-plugin-class-loader/dep-a/src/main/java/**/*,core-it-support/core-it-plugins/maven-it-plugin-class-loader/dep-b/src/main/java/**/*,core-it-support/core-it-plugins/maven-it-plugin-class-loader/maven-it-plugin-class-loader/src/main/java/**/*,core-it-support/core-it-plugins/maven-it-plugin-configuration/src/main/java/**/*,core-it-support/core-it-plugins/maven-it-plugin-context-passing/src/main/java/**/*,core-it-support/core-it-plugins/maven-it-plugin-core-stubs/maven-clean-plugin/src/main/java/**/*,core-it-support/core-it-plugins/maven-it-plugin-core-stubs/maven-compiler-plugin/src/main/java/**/*,core-it-support/core-it-plugins/maven-it-plugin-core-stubs/maven-deploy-plugin/src/main/java/**/*,core-it-support/core-it-plugins/maven-it-plugin-core-stubs/maven-ear-plugin/src/main/java/**/*,core-it-support/core-it-plugins/maven-it-plugin-core-stubs/maven-ejb-plugin/src/main/java/**/*,core-it-support/core-it-plugins/maven-it-plugin-core-stubs/maven-install-plugin/src/main/java/**/*,core-it-support/core-it-plugins/maven-it-plugin-core-stubs/maven-jar-plugin/src/main/java/**/*,core-it-support/core-it-plugins/maven-it-plugin-core-stubs/maven-javadoc-plugin/src/main/java/**/*,core-it-support/core-it-plugins/maven-it-plugin-core-stubs/maven-plugin-plugin/src/main/java/**/*,core-it-support/core-it-plugins/maven-it-plugin-core-stubs/maven-rar-plugin/src/main/java/**/*,core-it-support/core-it-plugins/maven-it-plugin-core-stubs/maven-resources-plugin/src/main/java/**/*,core-it-support/core-it-plugins/maven-it-plugin-core-stubs/maven-site-plugin/src/main/java/**/*,core-it-support/core-it-plugins/maven-it-plugin-core-stubs/maven-source-plugin/src/main/java/**/*,core-it-support/core-it-plugins/maven-it-plugin-core-stubs/maven-surefire-plugin/src/main/java/**/*,core-it-support/core-it-plugins/maven-it-plugin-core-stubs/maven-war-plugin/src/main/java/**/*,core-it-support/core-it-plugins/maven-it-plugin-dependency-collection/src/main/java/**/*,core-it-support/core-it-plugins/maven-it-plugin-dependency-resolution/src/main/java/**/*,core-it-support/core-it-plugins/maven-it-plugin-expression/src/main/java/**/*,core-it-support/core-it-plugins/maven-it-plugin-error/src/main/java/**/*,core-it-support/core-it-component/src/main/java/**/*,core-it-support/core-it-plugins/maven-it-plugin-extension-consumer/src/main/java/**/*,core-it-support/core-it-plugins/maven-it-plugin-extension-provider/src/main/java/**/*,core-it-support/core-it-plugins/maven-it-plugin-fork/src/main/java/**/*,core-it-support/core-it-plugins/maven-it-plugin-invalid-descriptor/src/main/java/**/*,core-it-support/core-it-plugins/maven-it-plugin-log-file/src/main/java/**/*,core-it-support/maven-it-helper/src/main/java/**/*,core-it-support/core-it-plugins/maven-it-plugin-model-interpolation/src/main/java/**/*,core-it-support/core-it-plugins/maven-it-plugin-no-default-comp/src/main/java/**/*,core-it-support/core-it-plugins/maven-it-plugin-no-project/src/main/java/**/*,core-it-support/core-it-plugins/maven-it-plugin-online/src/main/java/**/*,core-it-support/core-it-plugins/maven-it-plugin-optional-mojos/src/main/java/**/*,core-it-support/core-it-plugins/maven-it-plugin-packaging/src/main/java/**/*,core-it-support/core-it-plugins/maven-it-plugin-parameter-implementation/src/main/java/**/*,core-it-support/core-it-plugins/maven-it-plugin-plugin-dependency/src/main/java/**/*,core-it-support/core-it-plugins/maven-it-plugin-project/src/main/java/**/*,core-it-support/core-it-plugins/maven-it-plugin-project-interpolation/src/main/java/**/*,core-it-support/core-it-plugins/maven-it-plugin-setter/src/main/java/**/*,core-it-support/core-it-plugins/maven-it-plugin-singleton-component/src/main/java/**/*,core-it-support/core-it-plugins/maven-it-plugin-site/src/main/java/**/*,core-it-support/core-it-plugins/maven-it-plugin-toolchain/src/main/java/**/*,core-it-support/core-it-plugins/maven-it-plugin-touch/src/main/java/**/*,core-it-support/core-it-plugins/maven-it-plugin-uses-properties/src/main/java/**/*,core-it-support/core-it-plugins/maven-it-plugin-uses-wagon/src/main/java/**/*,core-it-support/core-it-plugins/maven-it-plugin-all/src/main/java/**/*,core-it-support/core-it-plugins/maven-it-plugin-plexus-utils-11/src/main/java/**/*,core-it-support/core-it-plugins/maven-it-plugin-plexus-utils-new/src/main/java/**/*,core-it-support/core-it-plugins/maven-it-plugin-plexus-component-api/src/main/java/**/*,core-it-support/core-it-plugins/maven-it-plugin-log4j/src/main/java/**/*,core-it-support/core-it-plugins/maven-it-plugin-extension1/src/main/java/**/*,core-it-support/core-it-plugins/maven-it-plugin-extension2/src/main/java/**/*,core-it-support/core-it-plugins/maven-it-plugin-plexus-lifecycle/src/main/java/**/*,core-it-support/core-it-plugins/maven-it-plugin-settings/src/main/java/**/*,core-it-support/core-it-plugins/mng5805-plugin/src/main/java/**/*,core-it-support/core-it-plugins/mng5805-plugin-dep/src/main/java/**/*,core-it-support/core-it-plugins/mng5958-extension/src/main/java/**/*,core-it-support/core-it-plugins/mng6759-plugin-resolves-project-dependencies/src/main/java/**/*,core-it-support/core-it-toolchain/src/main/java/**/*,core-it-support/core-it-wagon/src/main/java/**/*,core-it-support/core-it-javaagent/src/main/java/**/*' - excludes: null
[TASKS] Found 167 files to scan for tasks
[TASKS] Found 0 open tasks.
Skipping warnings blame since pipelines do not have an SCM link.%n
[TASKS] Computing warning deltas based on reference build #1
[DevOpticsMavenPublisher] dependencies consumed: 5, artifacts produced: 156
[withMaven] Publishers: Pipeline Graph Publisher: 29 ms, Generated Artifacts Publisher: 406803 ms, Invoker Publisher: 2 ms, Junit Publisher: 553049 ms, Concordion Publisher: 2 ms, Dependencies Fingerprint Publisher: 5523 ms, Findbugs Publisher: 1 ms, JGiven Publisher: 1 ms, Jacoco Publisher: 1 ms, SpotBugs Publisher: 1 ms, Open Task Scanner Publisher: 27465 ms, CloudBees DevOptics Gate Artifact Publisher: 563740 ms
[Pipeline] // withMaven
[Pipeline] fileExists
[Pipeline] zip
Writing zip file of /home/jenkins/jenkins-agent/workspace/_box_maven_system-line-separator/test/core-it-suite/target/test-classes to /home/jenkins/jenkins-agent/workspace/_box_maven_system-line-separator/test/core-it-suite-logs-linux-jdk11.zip
Zipped 8648 entries.
Archiving /home/jenkins/jenkins-agent/workspace/_box_maven_system-line-separator/test/core-it-suite-logs-linux-jdk11.zip
[Pipeline] fileExists
[Pipeline] zip
Writing zip file of /home/jenkins/jenkins-agent/workspace/_box_maven_system-line-separator/test/core-it-suite/target/surefire-reports to /home/jenkins/jenkins-agent/workspace/_box_maven_system-line-separator/test/core-it-suite-reports-linux-jdk11.zip
Zipped 4 entries.
Archiving /home/jenkins/jenkins-agent/workspace/_box_maven_system-line-separator/test/core-it-suite-reports-linux-jdk11.zip
[Pipeline] deleteDir
[Pipeline] }
[Pipeline] // dir
[Pipeline] }
[Pipeline] // stage
[Pipeline] }
[Pipeline] // node
[Pipeline] }
[Pipeline] // parallel
[Pipeline] stage
[Pipeline] { (Notifications)
[Pipeline] echo
Build result: UNSTABLE
[Pipeline] jiraIssueSelector
[Pipeline] jiraComment
[Pipeline] jiraComment
[Pipeline] echo
The authors of changes [slachiewicz, michaelo].
[Pipeline] echo
Sending email ...
[Pipeline] emailext
Reply | Threaded
Open this post in threaded view
|

Build unstable in Jenkins: Maven » Maven TLP » maven » system-line-separator #3

Apache Jenkins Server-2
See https://ci-builds.apache.org/job/Maven/job/maven-box/job/maven/job/system-line-separator/3/

Changes:

* Clean to avoid stale files
* Correct terms: Java operates on files and directories
* [MNG-7051] Optionally skip non-existing profiles and break on missing required profiles.
* [MNG-7029] Remove super POM release profile
* [MNG-7095] Support for parallel builds when resuming

24 tests failed.
FAILED:  org.apache.maven.it.MavenITmng7051OptionalProfileActivationTest.windows-jdk8 / Run ITs Windows Java 8 / testDeactivatingNonExistingProfileWithQuestionMarkDoesNotBreak

Error Message:
Text not found in log: [WARNING] The requested optional profiles [non-existing-profile] could not be activated or deactivated because they do not exist.

Stack Trace:
org.apache.maven.it.VerificationException: Text not found in log: [WARNING] The requested optional profiles [non-existing-profile] could not be activated or deactivated because they do not exist.
        at org.apache.maven.it.MavenITmng7051OptionalProfileActivationTest.testDeactivatingNonExistingProfileWithQuestionMarkDoesNotBreak(MavenITmng7051OptionalProfileActivationTest.java:109)


FAILED:  org.apache.maven.it.MavenITmng7051OptionalProfileActivationTest.windows-jdk8 / Run ITs Windows Java 8 / testActivatingExistingAndNonExistingProfiles

Error Message:
Text not found in log: [WARNING] The requested optional profiles [non-existing-profile] could not be activated or deactivated because they do not exist.

Stack Trace:
org.apache.maven.it.VerificationException: Text not found in log: [WARNING] The requested optional profiles [non-existing-profile] could not be activated or deactivated because they do not exist.
        at org.apache.maven.it.MavenITmng7051OptionalProfileActivationTest.testActivatingExistingAndNonExistingProfiles(MavenITmng7051OptionalProfileActivationTest.java:92)


FAILED:  org.apache.maven.it.MavenITmng7051OptionalProfileActivationTest.windows-jdk8 / Run ITs Windows Java 8 / testDeactivatingExistingAndNonExistingProfiles

Error Message:
Text not found in log: [WARNING] The requested optional profiles [non-existing-profile] could not be activated or deactivated because they do not exist.

Stack Trace:
org.apache.maven.it.VerificationException: Text not found in log: [WARNING] The requested optional profiles [non-existing-profile] could not be activated or deactivated because they do not exist.
        at org.apache.maven.it.MavenITmng7051OptionalProfileActivationTest.testDeactivatingExistingAndNonExistingProfiles(MavenITmng7051OptionalProfileActivationTest.java:126)


FAILED:  org.apache.maven.it.MavenITmng7051OptionalProfileActivationTest.windows-jdk8 / Run ITs Windows Java 8 / testActivatingNonExistingProfileWithQuestionMarkDoesNotBreak

Error Message:
Text not found in log: [WARNING] The requested optional profiles [non-existing-profile] could not be activated or deactivated because they do not exist.

Stack Trace:
org.apache.maven.it.VerificationException: Text not found in log: [WARNING] The requested optional profiles [non-existing-profile] could not be activated or deactivated because they do not exist.
        at org.apache.maven.it.MavenITmng7051OptionalProfileActivationTest.testActivatingNonExistingProfileWithQuestionMarkDoesNotBreak(MavenITmng7051OptionalProfileActivationTest.java:75)


FAILED:  org.apache.maven.it.MavenITmng7051OptionalProfileActivationTest.windows-jdk8 / Run ITs Windows Java 8 / testActivatingNonExistingProfileBreaks

Error Message:
Activated a non-existing profile without ? prefix should break the build, but it didn't.

Stack Trace:
junit.framework.AssertionFailedError: Activated a non-existing profile without ? prefix should break the build, but it didn't.
        at org.apache.maven.it.MavenITmng7051OptionalProfileActivationTest.testActivatingNonExistingProfileBreaks(MavenITmng7051OptionalProfileActivationTest.java:52)


FAILED:  org.apache.maven.it.MavenITmng5572ReactorPluginExtensionsTest.windows-jdk8 / Run ITs Windows Java 8 / testit

Error Message:
Text not found in log: [WARNING] 'project' uses 'org.apache.maven.its.mng5572:plugin' as extension which is not possible within the same reactor build. This plugin was pulled from the local repository!

Stack Trace:
org.apache.maven.it.VerificationException: Text not found in log: [WARNING] 'project' uses 'org.apache.maven.its.mng5572:plugin' as extension which is not possible within the same reactor build. This plugin was pulled from the local repository!
        at org.apache.maven.it.MavenITmng5572ReactorPluginExtensionsTest.testit(MavenITmng5572ReactorPluginExtensionsTest.java:64)


FAILED:  org.apache.maven.it.MavenITmng7051OptionalProfileActivationTest.windows-jdk11 / Run ITs Windows Java 11 / testDeactivatingNonExistingProfileWithQuestionMarkDoesNotBreak

Error Message:
Text not found in log: [WARNING] The requested optional profiles [non-existing-profile] could not be activated or deactivated because they do not exist.

Stack Trace:
org.apache.maven.it.VerificationException: Text not found in log: [WARNING] The requested optional profiles [non-existing-profile] could not be activated or deactivated because they do not exist.
        at org.apache.maven.it.MavenITmng7051OptionalProfileActivationTest.testDeactivatingNonExistingProfileWithQuestionMarkDoesNotBreak(MavenITmng7051OptionalProfileActivationTest.java:109)


FAILED:  org.apache.maven.it.MavenITmng7051OptionalProfileActivationTest.windows-jdk11 / Run ITs Windows Java 11 / testActivatingExistingAndNonExistingProfiles

Error Message:
Text not found in log: [WARNING] The requested optional profiles [non-existing-profile] could not be activated or deactivated because they do not exist.

Stack Trace:
org.apache.maven.it.VerificationException: Text not found in log: [WARNING] The requested optional profiles [non-existing-profile] could not be activated or deactivated because they do not exist.
        at org.apache.maven.it.MavenITmng7051OptionalProfileActivationTest.testActivatingExistingAndNonExistingProfiles(MavenITmng7051OptionalProfileActivationTest.java:92)


FAILED:  org.apache.maven.it.MavenITmng7051OptionalProfileActivationTest.windows-jdk11 / Run ITs Windows Java 11 / testDeactivatingExistingAndNonExistingProfiles

Error Message:
Text not found in log: [WARNING] The requested optional profiles [non-existing-profile] could not be activated or deactivated because they do not exist.

Stack Trace:
org.apache.maven.it.VerificationException: Text not found in log: [WARNING] The requested optional profiles [non-existing-profile] could not be activated or deactivated because they do not exist.
        at org.apache.maven.it.MavenITmng7051OptionalProfileActivationTest.testDeactivatingExistingAndNonExistingProfiles(MavenITmng7051OptionalProfileActivationTest.java:126)


FAILED:  org.apache.maven.it.MavenITmng7051OptionalProfileActivationTest.windows-jdk11 / Run ITs Windows Java 11 / testActivatingNonExistingProfileWithQuestionMarkDoesNotBreak

Error Message:
Text not found in log: [WARNING] The requested optional profiles [non-existing-profile] could not be activated or deactivated because they do not exist.

Stack Trace:
org.apache.maven.it.VerificationException: Text not found in log: [WARNING] The requested optional profiles [non-existing-profile] could not be activated or deactivated because they do not exist.
        at org.apache.maven.it.MavenITmng7051OptionalProfileActivationTest.testActivatingNonExistingProfileWithQuestionMarkDoesNotBreak(MavenITmng7051OptionalProfileActivationTest.java:75)


FAILED:  org.apache.maven.it.MavenITmng7051OptionalProfileActivationTest.windows-jdk11 / Run ITs Windows Java 11 / testActivatingNonExistingProfileBreaks

Error Message:
Activated a non-existing profile without ? prefix should break the build, but it didn't.

Stack Trace:
junit.framework.AssertionFailedError: Activated a non-existing profile without ? prefix should break the build, but it didn't.
        at org.apache.maven.it.MavenITmng7051OptionalProfileActivationTest.testActivatingNonExistingProfileBreaks(MavenITmng7051OptionalProfileActivationTest.java:52)


FAILED:  org.apache.maven.it.MavenITmng5572ReactorPluginExtensionsTest.windows-jdk11 / Run ITs Windows Java 11 / testit

Error Message:
Text not found in log: [WARNING] 'project' uses 'org.apache.maven.its.mng5572:plugin' as extension which is not possible within the same reactor build. This plugin was pulled from the local repository!

Stack Trace:
org.apache.maven.it.VerificationException: Text not found in log: [WARNING] 'project' uses 'org.apache.maven.its.mng5572:plugin' as extension which is not possible within the same reactor build. This plugin was pulled from the local repository!
        at org.apache.maven.it.MavenITmng5572ReactorPluginExtensionsTest.testit(MavenITmng5572ReactorPluginExtensionsTest.java:64)


FAILED:  org.apache.maven.it.MavenITmng7051OptionalProfileActivationTest.linux-jdk11 / Run ITs Linux Java 11 / testDeactivatingNonExistingProfileWithQuestionMarkDoesNotBreak

Error Message:
Text not found in log: [WARNING] The requested optional profiles [non-existing-profile] could not be activated or deactivated because they do not exist.

Stack Trace:
org.apache.maven.it.VerificationException: Text not found in log: [WARNING] The requested optional profiles [non-existing-profile] could not be activated or deactivated because they do not exist.
        at org.apache.maven.it.MavenITmng7051OptionalProfileActivationTest.testDeactivatingNonExistingProfileWithQuestionMarkDoesNotBreak(MavenITmng7051OptionalProfileActivationTest.java:109)


FAILED:  org.apache.maven.it.MavenITmng7051OptionalProfileActivationTest.linux-jdk11 / Run ITs Linux Java 11 / testActivatingExistingAndNonExistingProfiles

Error Message:
Text not found in log: [WARNING] The requested optional profiles [non-existing-profile] could not be activated or deactivated because they do not exist.

Stack Trace:
org.apache.maven.it.VerificationException: Text not found in log: [WARNING] The requested optional profiles [non-existing-profile] could not be activated or deactivated because they do not exist.
        at org.apache.maven.it.MavenITmng7051OptionalProfileActivationTest.testActivatingExistingAndNonExistingProfiles(MavenITmng7051OptionalProfileActivationTest.java:92)


FAILED:  org.apache.maven.it.MavenITmng7051OptionalProfileActivationTest.linux-jdk11 / Run ITs Linux Java 11 / testDeactivatingExistingAndNonExistingProfiles

Error Message:
Text not found in log: [WARNING] The requested optional profiles [non-existing-profile] could not be activated or deactivated because they do not exist.

Stack Trace:
org.apache.maven.it.VerificationException: Text not found in log: [WARNING] The requested optional profiles [non-existing-profile] could not be activated or deactivated because they do not exist.
        at org.apache.maven.it.MavenITmng7051OptionalProfileActivationTest.testDeactivatingExistingAndNonExistingProfiles(MavenITmng7051OptionalProfileActivationTest.java:126)


FAILED:  org.apache.maven.it.MavenITmng7051OptionalProfileActivationTest.linux-jdk11 / Run ITs Linux Java 11 / testActivatingNonExistingProfileWithQuestionMarkDoesNotBreak

Error Message:
Text not found in log: [WARNING] The requested optional profiles [non-existing-profile] could not be activated or deactivated because they do not exist.

Stack Trace:
org.apache.maven.it.VerificationException: Text not found in log: [WARNING] The requested optional profiles [non-existing-profile] could not be activated or deactivated because they do not exist.
        at org.apache.maven.it.MavenITmng7051OptionalProfileActivationTest.testActivatingNonExistingProfileWithQuestionMarkDoesNotBreak(MavenITmng7051OptionalProfileActivationTest.java:75)


FAILED:  org.apache.maven.it.MavenITmng7051OptionalProfileActivationTest.linux-jdk11 / Run ITs Linux Java 11 / testActivatingNonExistingProfileBreaks

Error Message:
Activated a non-existing profile without ? prefix should break the build, but it didn't.

Stack Trace:
junit.framework.AssertionFailedError: Activated a non-existing profile without ? prefix should break the build, but it didn't.
        at org.apache.maven.it.MavenITmng7051OptionalProfileActivationTest.testActivatingNonExistingProfileBreaks(MavenITmng7051OptionalProfileActivationTest.java:52)


FAILED:  org.apache.maven.it.MavenITmng5572ReactorPluginExtensionsTest.linux-jdk11 / Run ITs Linux Java 11 / testit

Error Message:
Text not found in log: [WARNING] 'project' uses 'org.apache.maven.its.mng5572:plugin' as extension which is not possible within the same reactor build. This plugin was pulled from the local repository!

Stack Trace:
org.apache.maven.it.VerificationException: Text not found in log: [WARNING] 'project' uses 'org.apache.maven.its.mng5572:plugin' as extension which is not possible within the same reactor build. This plugin was pulled from the local repository!
        at org.apache.maven.it.MavenITmng5572ReactorPluginExtensionsTest.testit(MavenITmng5572ReactorPluginExtensionsTest.java:64)


FAILED:  org.apache.maven.it.MavenITmng7051OptionalProfileActivationTest.linux-jdk8 / Run ITs Linux Java 8 / testDeactivatingNonExistingProfileWithQuestionMarkDoesNotBreak

Error Message:
Text not found in log: [WARNING] The requested optional profiles [non-existing-profile] could not be activated or deactivated because they do not exist.

Stack Trace:
org.apache.maven.it.VerificationException: Text not found in log: [WARNING] The requested optional profiles [non-existing-profile] could not be activated or deactivated because they do not exist.
        at org.apache.maven.it.MavenITmng7051OptionalProfileActivationTest.testDeactivatingNonExistingProfileWithQuestionMarkDoesNotBreak(MavenITmng7051OptionalProfileActivationTest.java:109)


FAILED:  org.apache.maven.it.MavenITmng7051OptionalProfileActivationTest.linux-jdk8 / Run ITs Linux Java 8 / testActivatingExistingAndNonExistingProfiles

Error Message:
Text not found in log: [WARNING] The requested optional profiles [non-existing-profile] could not be activated or deactivated because they do not exist.

Stack Trace:
org.apache.maven.it.VerificationException: Text not found in log: [WARNING] The requested optional profiles [non-existing-profile] could not be activated or deactivated because they do not exist.
        at org.apache.maven.it.MavenITmng7051OptionalProfileActivationTest.testActivatingExistingAndNonExistingProfiles(MavenITmng7051OptionalProfileActivationTest.java:92)


FAILED:  org.apache.maven.it.MavenITmng7051OptionalProfileActivationTest.linux-jdk8 / Run ITs Linux Java 8 / testDeactivatingExistingAndNonExistingProfiles

Error Message:
Text not found in log: [WARNING] The requested optional profiles [non-existing-profile] could not be activated or deactivated because they do not exist.

Stack Trace:
org.apache.maven.it.VerificationException: Text not found in log: [WARNING] The requested optional profiles [non-existing-profile] could not be activated or deactivated because they do not exist.
        at org.apache.maven.it.MavenITmng7051OptionalProfileActivationTest.testDeactivatingExistingAndNonExistingProfiles(MavenITmng7051OptionalProfileActivationTest.java:126)


FAILED:  org.apache.maven.it.MavenITmng7051OptionalProfileActivationTest.linux-jdk8 / Run ITs Linux Java 8 / testActivatingNonExistingProfileWithQuestionMarkDoesNotBreak

Error Message:
Text not found in log: [WARNING] The requested optional profiles [non-existing-profile] could not be activated or deactivated because they do not exist.

Stack Trace:
org.apache.maven.it.VerificationException: Text not found in log: [WARNING] The requested optional profiles [non-existing-profile] could not be activated or deactivated because they do not exist.
        at org.apache.maven.it.MavenITmng7051OptionalProfileActivationTest.testActivatingNonExistingProfileWithQuestionMarkDoesNotBreak(MavenITmng7051OptionalProfileActivationTest.java:75)


FAILED:  org.apache.maven.it.MavenITmng7051OptionalProfileActivationTest.linux-jdk8 / Run ITs Linux Java 8 / testActivatingNonExistingProfileBreaks

Error Message:
Activated a non-existing profile without ? prefix should break the build, but it didn't.

Stack Trace:
junit.framework.AssertionFailedError: Activated a non-existing profile without ? prefix should break the build, but it didn't.
        at org.apache.maven.it.MavenITmng7051OptionalProfileActivationTest.testActivatingNonExistingProfileBreaks(MavenITmng7051OptionalProfileActivationTest.java:52)


FAILED:  org.apache.maven.it.MavenITmng5572ReactorPluginExtensionsTest.linux-jdk8 / Run ITs Linux Java 8 / testit

Error Message:
Text not found in log: [WARNING] 'project' uses 'org.apache.maven.its.mng5572:plugin' as extension which is not possible within the same reactor build. This plugin was pulled from the local repository!

Stack Trace:
org.apache.maven.it.VerificationException: Text not found in log: [WARNING] 'project' uses 'org.apache.maven.its.mng5572:plugin' as extension which is not possible within the same reactor build. This plugin was pulled from the local repository!
        at org.apache.maven.it.MavenITmng5572ReactorPluginExtensionsTest.testit(MavenITmng5572ReactorPluginExtensionsTest.java:64)




Build log:
[...truncated 42808 lines...]
[withMaven] junitPublisher - Archive test results for Maven artifact org.apache.maven.plugins:maven-surefire-plugin:maven-plugin:0.1-stub-SNAPSHOT generated by maven-surefire-plugin:test (default-test): core-it-support/core-it-plugins/maven-it-plugin-core-stubs/maven-surefire-plugin/target/surefire-reports/*.xml
[withMaven] junitPublisher - Archive test results for Maven artifact org.apache.maven.plugins:maven-war-plugin:maven-plugin:0.1-stub-SNAPSHOT generated by maven-surefire-plugin:test (default-test): core-it-support/core-it-plugins/maven-it-plugin-core-stubs/maven-war-plugin/target/surefire-reports/*.xml
[withMaven] junitPublisher - Archive test results for Maven artifact org.apache.maven.its.plugins:maven-it-plugin-dependency-collection:maven-plugin:2.1-SNAPSHOT generated by maven-surefire-plugin:test (default-test): core-it-support/core-it-plugins/maven-it-plugin-dependency-collection/target/surefire-reports/*.xml
[withMaven] junitPublisher - Archive test results for Maven artifact org.apache.maven.its.plugins:maven-it-plugin-dependency-resolution:maven-plugin:2.1-SNAPSHOT generated by maven-surefire-plugin:test (default-test): core-it-support/core-it-plugins/maven-it-plugin-dependency-resolution/target/surefire-reports/*.xml
[withMaven] junitPublisher - Archive test results for Maven artifact org.apache.maven.its.plugins:maven-it-plugin-expression:maven-plugin:2.1-SNAPSHOT generated by maven-surefire-plugin:test (default-test): core-it-support/core-it-plugins/maven-it-plugin-expression/target/surefire-reports/*.xml
[withMaven] junitPublisher - Archive test results for Maven artifact org.apache.maven.its.plugins:maven-it-plugin-error:maven-plugin:2.1-SNAPSHOT generated by maven-surefire-plugin:test (default-test): core-it-support/core-it-plugins/maven-it-plugin-error/target/surefire-reports/*.xml
[withMaven] junitPublisher - Archive test results for Maven artifact org.apache.maven.its:core-it-component:jar:2.1-SNAPSHOT generated by maven-surefire-plugin:test (default-test): core-it-support/core-it-component/target/surefire-reports/*.xml
[withMaven] junitPublisher - Archive test results for Maven artifact org.apache.maven.its.plugins:maven-it-plugin-extension-consumer:maven-plugin:2.1-SNAPSHOT generated by maven-surefire-plugin:test (default-test): core-it-support/core-it-plugins/maven-it-plugin-extension-consumer/target/surefire-reports/*.xml
[withMaven] junitPublisher - Archive test results for Maven artifact org.apache.maven.its.plugins:maven-it-plugin-extension-provider:maven-plugin:2.1-SNAPSHOT generated by maven-surefire-plugin:test (default-test): core-it-support/core-it-plugins/maven-it-plugin-extension-provider/target/surefire-reports/*.xml
[withMaven] junitPublisher - Archive test results for Maven artifact org.apache.maven.its.plugins:maven-it-plugin-fork:maven-plugin:2.1-SNAPSHOT generated by maven-surefire-plugin:test (default-test): core-it-support/core-it-plugins/maven-it-plugin-fork/target/surefire-reports/*.xml
[withMaven] junitPublisher - Archive test results for Maven artifact org.apache.maven.its.plugins:maven-it-plugin-invalid-descriptor:maven-plugin:2.1-SNAPSHOT generated by maven-surefire-plugin:test (default-test): core-it-support/core-it-plugins/maven-it-plugin-invalid-descriptor/target/surefire-reports/*.xml
[withMaven] junitPublisher - Archive test results for Maven artifact org.apache.maven.its.plugins:maven-it-plugin-log-file:maven-plugin:2.1-SNAPSHOT generated by maven-surefire-plugin:test (default-test): core-it-support/core-it-plugins/maven-it-plugin-log-file/target/surefire-reports/*.xml
[withMaven] junitPublisher - Archive test results for Maven artifact org.apache.maven.its:maven-it-helper:jar:2.1-SNAPSHOT generated by maven-surefire-plugin:test (default-test): core-it-support/maven-it-helper/target/surefire-reports/*.xml
[withMaven] junitPublisher - Archive test results for Maven artifact org.apache.maven.its.plugins:maven-it-plugin-model-interpolation:maven-plugin:2.1-SNAPSHOT generated by maven-surefire-plugin:test (default-test): core-it-support/core-it-plugins/maven-it-plugin-model-interpolation/target/surefire-reports/*.xml
[withMaven] junitPublisher - Archive test results for Maven artifact org.apache.maven.its.plugins:maven-it-plugin-no-default-comp:maven-plugin:2.1-SNAPSHOT generated by maven-surefire-plugin:test (default-test): core-it-support/core-it-plugins/maven-it-plugin-no-default-comp/target/surefire-reports/*.xml
[withMaven] junitPublisher - Archive test results for Maven artifact org.apache.maven.its.plugins:maven-it-plugin-no-project:maven-plugin:2.1-SNAPSHOT generated by maven-surefire-plugin:test (default-test): core-it-support/core-it-plugins/maven-it-plugin-no-project/target/surefire-reports/*.xml
[withMaven] junitPublisher - Archive test results for Maven artifact org.apache.maven.its.plugins:maven-it-plugin-online:maven-plugin:2.1-SNAPSHOT generated by maven-surefire-plugin:test (default-test): core-it-support/core-it-plugins/maven-it-plugin-online/target/surefire-reports/*.xml
[withMaven] junitPublisher - Archive test results for Maven artifact org.apache.maven.its.plugins:maven-it-plugin-optional-mojos:maven-plugin:2.1-SNAPSHOT generated by maven-surefire-plugin:test (default-test): core-it-support/core-it-plugins/maven-it-plugin-optional-mojos/target/surefire-reports/*.xml
[withMaven] junitPublisher - Archive test results for Maven artifact org.apache.maven.its.plugins:maven-it-plugin-packaging:maven-plugin:2.1-SNAPSHOT generated by maven-surefire-plugin:test (default-test): core-it-support/core-it-plugins/maven-it-plugin-packaging/target/surefire-reports/*.xml
[withMaven] junitPublisher - Archive test results for Maven artifact org.apache.maven.its.plugins:maven-it-plugin-parameter-implementation:maven-plugin:2.1-SNAPSHOT generated by maven-surefire-plugin:test (default-test): core-it-support/core-it-plugins/maven-it-plugin-parameter-implementation/target/surefire-reports/*.xml
[withMaven] junitPublisher - Archive test results for Maven artifact org.apache.maven.its.plugins:maven-it-plugin-plugin-dependency:maven-plugin:2.1-SNAPSHOT generated by maven-surefire-plugin:test (default-test): core-it-support/core-it-plugins/maven-it-plugin-plugin-dependency/target/surefire-reports/*.xml
[withMaven] junitPublisher - Archive test results for Maven artifact org.apache.maven.its.plugins:maven-it-plugin-project:maven-plugin:2.1-SNAPSHOT generated by maven-surefire-plugin:test (default-test): core-it-support/core-it-plugins/maven-it-plugin-project/target/surefire-reports/*.xml
[withMaven] junitPublisher - Archive test results for Maven artifact org.apache.maven.its.plugins:maven-it-plugin-project-interpolation:maven-plugin:2.1-SNAPSHOT generated by maven-surefire-plugin:test (default-test): core-it-support/core-it-plugins/maven-it-plugin-project-interpolation/target/surefire-reports/*.xml
[withMaven] junitPublisher - Archive test results for Maven artifact org.apache.maven.its.plugins:maven-it-plugin-setter:maven-plugin:2.1-SNAPSHOT generated by maven-surefire-plugin:test (default-test): core-it-support/core-it-plugins/maven-it-plugin-setter/target/surefire-reports/*.xml
[withMaven] junitPublisher - Archive test results for Maven artifact org.apache.maven.its.plugins:maven-it-plugin-singleton-component:maven-plugin:2.1-SNAPSHOT generated by maven-surefire-plugin:test (default-test): core-it-support/core-it-plugins/maven-it-plugin-singleton-component/target/surefire-reports/*.xml
[withMaven] junitPublisher - Archive test results for Maven artifact org.apache.maven.its.plugins:maven-it-plugin-site:maven-plugin:2.1-SNAPSHOT generated by maven-surefire-plugin:test (default-test): core-it-support/core-it-plugins/maven-it-plugin-site/target/surefire-reports/*.xml
[withMaven] junitPublisher - Archive test results for Maven artifact org.apache.maven.its.plugins:maven-it-plugin-toolchain:maven-plugin:2.1-SNAPSHOT generated by maven-surefire-plugin:test (default-test): core-it-support/core-it-plugins/maven-it-plugin-toolchain/target/surefire-reports/*.xml
[withMaven] junitPublisher - Archive test results for Maven artifact org.apache.maven.its.plugins:maven-it-plugin-touch:maven-plugin:2.1-SNAPSHOT generated by maven-surefire-plugin:test (default-test): core-it-support/core-it-plugins/maven-it-plugin-touch/target/surefire-reports/*.xml
[withMaven] junitPublisher - Archive test results for Maven artifact org.apache.maven.its.plugins:maven-it-plugin-uses-properties:maven-plugin:2.1-SNAPSHOT generated by maven-surefire-plugin:test (default-test): core-it-support/core-it-plugins/maven-it-plugin-uses-properties/target/surefire-reports/*.xml
[withMaven] junitPublisher - Archive test results for Maven artifact org.apache.maven.its.plugins:maven-it-plugin-uses-wagon:maven-plugin:2.1-SNAPSHOT generated by maven-surefire-plugin:test (default-test): core-it-support/core-it-plugins/maven-it-plugin-uses-wagon/target/surefire-reports/*.xml
[withMaven] junitPublisher - Archive test results for Maven artifact org.apache.maven.its.plugins:maven-it-plugin-all:maven-plugin:2.1-SNAPSHOT generated by maven-surefire-plugin:test (default-test): core-it-support/core-it-plugins/maven-it-plugin-all/target/surefire-reports/*.xml
[withMaven] junitPublisher - Archive test results for Maven artifact org.apache.maven.its.plugins:maven-it-plugin-plexus-utils-11:maven-plugin:2.1-SNAPSHOT generated by maven-surefire-plugin:test (default-test): core-it-support/core-it-plugins/maven-it-plugin-plexus-utils-11/target/surefire-reports/*.xml
[withMaven] junitPublisher - Archive test results for Maven artifact org.apache.maven.its.plugins:maven-it-plugin-plexus-utils-new:maven-plugin:2.1-SNAPSHOT generated by maven-surefire-plugin:test (default-test): core-it-support/core-it-plugins/maven-it-plugin-plexus-utils-new/target/surefire-reports/*.xml
[withMaven] junitPublisher - Archive test results for Maven artifact org.apache.maven.its.plugins:maven-it-plugin-plexus-component-api:maven-plugin:2.1-SNAPSHOT generated by maven-surefire-plugin:test (default-test): core-it-support/core-it-plugins/maven-it-plugin-plexus-component-api/target/surefire-reports/*.xml
[withMaven] junitPublisher - Archive test results for Maven artifact org.apache.maven.its.plugins:maven-it-plugin-log4j:maven-plugin:2.1-SNAPSHOT generated by maven-surefire-plugin:test (default-test): core-it-support/core-it-plugins/maven-it-plugin-log4j/target/surefire-reports/*.xml
[withMaven] junitPublisher - Archive test results for Maven artifact org.apache.maven.its.plugins:maven-it-plugin-extension1:maven-plugin:2.1-SNAPSHOT generated by maven-surefire-plugin:test (default-test): core-it-support/core-it-plugins/maven-it-plugin-extension1/target/surefire-reports/*.xml
[withMaven] junitPublisher - Archive test results for Maven artifact org.apache.maven.its.plugins:maven-it-plugin-extension2:maven-plugin:2.1-SNAPSHOT generated by maven-surefire-plugin:test (default-test): core-it-support/core-it-plugins/maven-it-plugin-extension2/target/surefire-reports/*.xml
[withMaven] junitPublisher - Archive test results for Maven artifact org.apache.maven.its.plugins:maven-it-plugin-plexus-lifecycle:maven-plugin:2.1-SNAPSHOT generated by maven-surefire-plugin:test (default-test): core-it-support/core-it-plugins/maven-it-plugin-plexus-lifecycle/target/surefire-reports/*.xml
[withMaven] junitPublisher - Archive test results for Maven artifact org.apache.maven.its.plugins:maven-it-plugin-settings:maven-plugin:2.1-SNAPSHOT generated by maven-surefire-plugin:test (default-test): core-it-support/core-it-plugins/maven-it-plugin-settings/target/surefire-reports/*.xml
[withMaven] junitPublisher - Archive test results for Maven artifact org.apache.maven.its.plugins:mng-5805-pkg-type-mojo-configuration-extension:jar:2.1-SNAPSHOT generated by maven-surefire-plugin:test (default-test): core-it-support/core-it-plugins/mng5805-extension/target/surefire-reports/*.xml
[withMaven] junitPublisher - Archive test results for Maven artifact org.apache.maven.its.plugins:mng-5805-pkg-type-mojo-configuration-extension2:jar:2.1-SNAPSHOT generated by maven-surefire-plugin:test (default-test): core-it-support/core-it-plugins/mng5805-extension2/target/surefire-reports/*.xml
[withMaven] junitPublisher - Archive test results for Maven artifact org.apache.maven.its.plugins:mng-5805-pkg-type-mojo-configuration-plugin:maven-plugin:2.1-SNAPSHOT generated by maven-surefire-plugin:test (default-test): core-it-support/core-it-plugins/mng5805-plugin/target/surefire-reports/*.xml
[withMaven] junitPublisher - Archive test results for Maven artifact org.apache.maven.its.plugins:mng-5805-pkg-type-mojo-configuration-plugin-dep:jar:2.1-SNAPSHOT generated by maven-surefire-plugin:test (default-test): core-it-support/core-it-plugins/mng5805-plugin-dep/target/surefire-reports/*.xml
[withMaven] junitPublisher - Archive test results for Maven artifact org.apache.maven.its.plugins:mng-5958-pkg-type-extension:jar:2.1-SNAPSHOT generated by maven-surefire-plugin:test (default-test): core-it-support/core-it-plugins/mng5958-extension/target/surefire-reports/*.xml
[withMaven] junitPublisher - Archive test results for Maven artifact org.apache.maven.its.plugins:mng-6759-resolves-project-dependencies-plugin:maven-plugin:2.1-SNAPSHOT generated by maven-surefire-plugin:test (default-test): core-it-support/core-it-plugins/mng6759-plugin-resolves-project-dependencies/target/surefire-reports/*.xml
[withMaven] junitPublisher - Archive test results for Maven artifact org.apache.maven.its:core-it-toolchain:jar:2.1-SNAPSHOT generated by maven-surefire-plugin:test (default-test): core-it-support/core-it-toolchain/target/surefire-reports/*.xml
[withMaven] junitPublisher - Archive test results for Maven artifact org.apache.maven.its:core-it-wagon:jar:2.1-SNAPSHOT generated by maven-surefire-plugin:test (default-test): core-it-support/core-it-wagon/target/surefire-reports/*.xml
[withMaven] junitPublisher - Archive test results for Maven artifact org.apache.maven.its:core-it-extension:jar:2.1-SNAPSHOT generated by maven-surefire-plugin:test (default-test): core-it-support/core-it-extension/target/surefire-reports/*.xml
[withMaven] junitPublisher - Archive test results for Maven artifact mng-coreit:javaagent:jar:1.0-SNAPSHOT generated by maven-surefire-plugin:test (default-test): core-it-support/core-it-javaagent/target/surefire-reports/*.xml
[withMaven] junitPublisher - Archive test results for Maven artifact org.apache.maven.its:core-it-suite:jar:2.1-SNAPSHOT generated by maven-surefire-plugin:test (default-test): core-it-suite/target/surefire-reports/*.xml
Recording test results
[withMaven] openTasksPublisher - Scan Tasks for Maven artifact org.apache.maven.its.plugins:maven-it-plugin-active-collection:maven-plugin:2.1-SNAPSHOT in source directory core-it-support/core-it-plugins/maven-it-plugin-active-collection/src/main/java
[withMaven] openTasksPublisher - Scan Tasks for Maven artifact org.apache.maven.its.plugins:maven-it-plugin-artifact:maven-plugin:2.1-SNAPSHOT in source directory core-it-support/core-it-plugins/maven-it-plugin-artifact/src/main/java
[withMaven] openTasksPublisher - Scan Tasks for Maven artifact org.apache.maven.its.plugins.class-loader:dep-a:jar:2.1-SNAPSHOT in source directory core-it-support/core-it-plugins/maven-it-plugin-class-loader/dep-a/src/main/java
[withMaven] openTasksPublisher - Scan Tasks for Maven artifact org.apache.maven.its.plugins.class-loader:dep-b:jar:2.1-SNAPSHOT in source directory core-it-support/core-it-plugins/maven-it-plugin-class-loader/dep-b/src/main/java
[withMaven] openTasksPublisher - Scan Tasks for Maven artifact org.apache.maven.its.plugins:maven-it-plugin-class-loader:maven-plugin:2.1-SNAPSHOT in source directory core-it-support/core-it-plugins/maven-it-plugin-class-loader/maven-it-plugin-class-loader/src/main/java
[withMaven] openTasksPublisher - Scan Tasks for Maven artifact org.apache.maven.its.plugins:maven-it-plugin-configuration:maven-plugin:2.1-SNAPSHOT in source directory core-it-support/core-it-plugins/maven-it-plugin-configuration/src/main/java
[withMaven] openTasksPublisher - Scan Tasks for Maven artifact org.apache.maven.its.plugins:maven-it-plugin-context-passing:maven-plugin:2.1-SNAPSHOT in source directory core-it-support/core-it-plugins/maven-it-plugin-context-passing/src/main/java
[withMaven] openTasksPublisher - Scan Tasks for Maven artifact org.apache.maven.plugins:maven-clean-plugin:maven-plugin:0.1-stub-SNAPSHOT in source directory core-it-support/core-it-plugins/maven-it-plugin-core-stubs/maven-clean-plugin/src/main/java
[withMaven] openTasksPublisher - Scan Tasks for Maven artifact org.apache.maven.plugins:maven-compiler-plugin:maven-plugin:0.1-stub-SNAPSHOT in source directory core-it-support/core-it-plugins/maven-it-plugin-core-stubs/maven-compiler-plugin/src/main/java
[withMaven] openTasksPublisher - Scan Tasks for Maven artifact org.apache.maven.plugins:maven-deploy-plugin:maven-plugin:0.1-stub-SNAPSHOT in source directory core-it-support/core-it-plugins/maven-it-plugin-core-stubs/maven-deploy-plugin/src/main/java
[withMaven] openTasksPublisher - Scan Tasks for Maven artifact org.apache.maven.plugins:maven-ear-plugin:maven-plugin:0.1-stub-SNAPSHOT in source directory core-it-support/core-it-plugins/maven-it-plugin-core-stubs/maven-ear-plugin/src/main/java
[withMaven] openTasksPublisher - Scan Tasks for Maven artifact org.apache.maven.plugins:maven-ejb-plugin:maven-plugin:0.1-stub-SNAPSHOT in source directory core-it-support/core-it-plugins/maven-it-plugin-core-stubs/maven-ejb-plugin/src/main/java
[withMaven] openTasksPublisher - Scan Tasks for Maven artifact org.apache.maven.plugins:maven-install-plugin:maven-plugin:0.1-stub-SNAPSHOT in source directory core-it-support/core-it-plugins/maven-it-plugin-core-stubs/maven-install-plugin/src/main/java
[withMaven] openTasksPublisher - Scan Tasks for Maven artifact org.apache.maven.plugins:maven-jar-plugin:maven-plugin:0.1-stub-SNAPSHOT in source directory core-it-support/core-it-plugins/maven-it-plugin-core-stubs/maven-jar-plugin/src/main/java
[withMaven] openTasksPublisher - Scan Tasks for Maven artifact org.apache.maven.plugins:maven-javadoc-plugin:maven-plugin:0.1-stub-SNAPSHOT in source directory core-it-support/core-it-plugins/maven-it-plugin-core-stubs/maven-javadoc-plugin/src/main/java
[withMaven] openTasksPublisher - Scan Tasks for Maven artifact org.apache.maven.plugins:maven-plugin-plugin:maven-plugin:0.1-stub-SNAPSHOT in source directory core-it-support/core-it-plugins/maven-it-plugin-core-stubs/maven-plugin-plugin/src/main/java
[withMaven] openTasksPublisher - Scan Tasks for Maven artifact org.apache.maven.plugins:maven-rar-plugin:maven-plugin:0.1-stub-SNAPSHOT in source directory core-it-support/core-it-plugins/maven-it-plugin-core-stubs/maven-rar-plugin/src/main/java
[withMaven] openTasksPublisher - Scan Tasks for Maven artifact org.apache.maven.plugins:maven-resources-plugin:maven-plugin:0.1-stub-SNAPSHOT in source directory core-it-support/core-it-plugins/maven-it-plugin-core-stubs/maven-resources-plugin/src/main/java
[withMaven] openTasksPublisher - Scan Tasks for Maven artifact org.apache.maven.plugins:maven-site-plugin:maven-plugin:0.1-stub-SNAPSHOT in source directory core-it-support/core-it-plugins/maven-it-plugin-core-stubs/maven-site-plugin/src/main/java
[withMaven] openTasksPublisher - Scan Tasks for Maven artifact org.apache.maven.plugins:maven-source-plugin:maven-plugin:0.1-stub-SNAPSHOT in source directory core-it-support/core-it-plugins/maven-it-plugin-core-stubs/maven-source-plugin/src/main/java
[withMaven] openTasksPublisher - Scan Tasks for Maven artifact org.apache.maven.plugins:maven-surefire-plugin:maven-plugin:0.1-stub-SNAPSHOT in source directory core-it-support/core-it-plugins/maven-it-plugin-core-stubs/maven-surefire-plugin/src/main/java
[withMaven] openTasksPublisher - Scan Tasks for Maven artifact org.apache.maven.plugins:maven-war-plugin:maven-plugin:0.1-stub-SNAPSHOT in source directory core-it-support/core-it-plugins/maven-it-plugin-core-stubs/maven-war-plugin/src/main/java
[withMaven] openTasksPublisher - Scan Tasks for Maven artifact org.apache.maven.its.plugins:maven-it-plugin-dependency-collection:maven-plugin:2.1-SNAPSHOT in source directory core-it-support/core-it-plugins/maven-it-plugin-dependency-collection/src/main/java
[withMaven] openTasksPublisher - Scan Tasks for Maven artifact org.apache.maven.its.plugins:maven-it-plugin-dependency-resolution:maven-plugin:2.1-SNAPSHOT in source directory core-it-support/core-it-plugins/maven-it-plugin-dependency-resolution/src/main/java
[withMaven] openTasksPublisher - Scan Tasks for Maven artifact org.apache.maven.its.plugins:maven-it-plugin-expression:maven-plugin:2.1-SNAPSHOT in source directory core-it-support/core-it-plugins/maven-it-plugin-expression/src/main/java
[withMaven] openTasksPublisher - Scan Tasks for Maven artifact org.apache.maven.its.plugins:maven-it-plugin-error:maven-plugin:2.1-SNAPSHOT in source directory core-it-support/core-it-plugins/maven-it-plugin-error/src/main/java
[withMaven] openTasksPublisher - Scan Tasks for Maven artifact org.apache.maven.its:core-it-component:jar:2.1-SNAPSHOT in source directory core-it-support/core-it-component/src/main/java
[withMaven] openTasksPublisher - Scan Tasks for Maven artifact org.apache.maven.its.plugins:maven-it-plugin-extension-consumer:maven-plugin:2.1-SNAPSHOT in source directory core-it-support/core-it-plugins/maven-it-plugin-extension-consumer/src/main/java
[withMaven] openTasksPublisher - Scan Tasks for Maven artifact org.apache.maven.its.plugins:maven-it-plugin-extension-provider:maven-plugin:2.1-SNAPSHOT in source directory core-it-support/core-it-plugins/maven-it-plugin-extension-provider/src/main/java
[withMaven] openTasksPublisher - Scan Tasks for Maven artifact org.apache.maven.its.plugins:maven-it-plugin-fork:maven-plugin:2.1-SNAPSHOT in source directory core-it-support/core-it-plugins/maven-it-plugin-fork/src/main/java
[withMaven] openTasksPublisher - Scan Tasks for Maven artifact org.apache.maven.its.plugins:maven-it-plugin-invalid-descriptor:maven-plugin:2.1-SNAPSHOT in source directory core-it-support/core-it-plugins/maven-it-plugin-invalid-descriptor/src/main/java
[withMaven] openTasksPublisher - Scan Tasks for Maven artifact org.apache.maven.its.plugins:maven-it-plugin-log-file:maven-plugin:2.1-SNAPSHOT in source directory core-it-support/core-it-plugins/maven-it-plugin-log-file/src/main/java
[withMaven] openTasksPublisher - Scan Tasks for Maven artifact org.apache.maven.its:maven-it-helper:jar:2.1-SNAPSHOT in source directory core-it-support/maven-it-helper/src/main/java
[withMaven] openTasksPublisher - Scan Tasks for Maven artifact org.apache.maven.its.plugins:maven-it-plugin-model-interpolation:maven-plugin:2.1-SNAPSHOT in source directory core-it-support/core-it-plugins/maven-it-plugin-model-interpolation/src/main/java
[withMaven] openTasksPublisher - Scan Tasks for Maven artifact org.apache.maven.its.plugins:maven-it-plugin-no-default-comp:maven-plugin:2.1-SNAPSHOT in source directory core-it-support/core-it-plugins/maven-it-plugin-no-default-comp/src/main/java
[withMaven] openTasksPublisher - Scan Tasks for Maven artifact org.apache.maven.its.plugins:maven-it-plugin-no-project:maven-plugin:2.1-SNAPSHOT in source directory core-it-support/core-it-plugins/maven-it-plugin-no-project/src/main/java
[withMaven] openTasksPublisher - Scan Tasks for Maven artifact org.apache.maven.its.plugins:maven-it-plugin-online:maven-plugin:2.1-SNAPSHOT in source directory core-it-support/core-it-plugins/maven-it-plugin-online/src/main/java
[withMaven] openTasksPublisher - Scan Tasks for Maven artifact org.apache.maven.its.plugins:maven-it-plugin-optional-mojos:maven-plugin:2.1-SNAPSHOT in source directory core-it-support/core-it-plugins/maven-it-plugin-optional-mojos/src/main/java
[withMaven] openTasksPublisher - Scan Tasks for Maven artifact org.apache.maven.its.plugins:maven-it-plugin-packaging:maven-plugin:2.1-SNAPSHOT in source directory core-it-support/core-it-plugins/maven-it-plugin-packaging/src/main/java
[withMaven] openTasksPublisher - Scan Tasks for Maven artifact org.apache.maven.its.plugins:maven-it-plugin-parameter-implementation:maven-plugin:2.1-SNAPSHOT in source directory core-it-support/core-it-plugins/maven-it-plugin-parameter-implementation/src/main/java
[withMaven] openTasksPublisher - Scan Tasks for Maven artifact org.apache.maven.its.plugins:maven-it-plugin-plugin-dependency:maven-plugin:2.1-SNAPSHOT in source directory core-it-support/core-it-plugins/maven-it-plugin-plugin-dependency/src/main/java
[withMaven] openTasksPublisher - Scan Tasks for Maven artifact org.apache.maven.its.plugins:maven-it-plugin-project:maven-plugin:2.1-SNAPSHOT in source directory core-it-support/core-it-plugins/maven-it-plugin-project/src/main/java
[withMaven] openTasksPublisher - Scan Tasks for Maven artifact org.apache.maven.its.plugins:maven-it-plugin-project-interpolation:maven-plugin:2.1-SNAPSHOT in source directory core-it-support/core-it-plugins/maven-it-plugin-project-interpolation/src/main/java
[withMaven] openTasksPublisher - Scan Tasks for Maven artifact org.apache.maven.its.plugins:maven-it-plugin-setter:maven-plugin:2.1-SNAPSHOT in source directory core-it-support/core-it-plugins/maven-it-plugin-setter/src/main/java
[withMaven] openTasksPublisher - Scan Tasks for Maven artifact org.apache.maven.its.plugins:maven-it-plugin-singleton-component:maven-plugin:2.1-SNAPSHOT in source directory core-it-support/core-it-plugins/maven-it-plugin-singleton-component/src/main/java
[withMaven] openTasksPublisher - Scan Tasks for Maven artifact org.apache.maven.its.plugins:maven-it-plugin-site:maven-plugin:2.1-SNAPSHOT in source directory core-it-support/core-it-plugins/maven-it-plugin-site/src/main/java
[withMaven] openTasksPublisher - Scan Tasks for Maven artifact org.apache.maven.its.plugins:maven-it-plugin-toolchain:maven-plugin:2.1-SNAPSHOT in source directory core-it-support/core-it-plugins/maven-it-plugin-toolchain/src/main/java
[withMaven] openTasksPublisher - Scan Tasks for Maven artifact org.apache.maven.its.plugins:maven-it-plugin-touch:maven-plugin:2.1-SNAPSHOT in source directory core-it-support/core-it-plugins/maven-it-plugin-touch/src/main/java
[withMaven] openTasksPublisher - Scan Tasks for Maven artifact org.apache.maven.its.plugins:maven-it-plugin-uses-properties:maven-plugin:2.1-SNAPSHOT in source directory core-it-support/core-it-plugins/maven-it-plugin-uses-properties/src/main/java
[withMaven] openTasksPublisher - Scan Tasks for Maven artifact org.apache.maven.its.plugins:maven-it-plugin-uses-wagon:maven-plugin:2.1-SNAPSHOT in source directory core-it-support/core-it-plugins/maven-it-plugin-uses-wagon/src/main/java
[withMaven] openTasksPublisher - Scan Tasks for Maven artifact org.apache.maven.its.plugins:maven-it-plugin-all:maven-plugin:2.1-SNAPSHOT in source directory core-it-support/core-it-plugins/maven-it-plugin-all/src/main/java
[withMaven] openTasksPublisher - Scan Tasks for Maven artifact org.apache.maven.its.plugins:maven-it-plugin-plexus-utils-11:maven-plugin:2.1-SNAPSHOT in source directory core-it-support/core-it-plugins/maven-it-plugin-plexus-utils-11/src/main/java
[withMaven] openTasksPublisher - Scan Tasks for Maven artifact org.apache.maven.its.plugins:maven-it-plugin-plexus-utils-new:maven-plugin:2.1-SNAPSHOT in source directory core-it-support/core-it-plugins/maven-it-plugin-plexus-utils-new/src/main/java
[withMaven] openTasksPublisher - Scan Tasks for Maven artifact org.apache.maven.its.plugins:maven-it-plugin-plexus-component-api:maven-plugin:2.1-SNAPSHOT in source directory core-it-support/core-it-plugins/maven-it-plugin-plexus-component-api/src/main/java
[withMaven] openTasksPublisher - Scan Tasks for Maven artifact org.apache.maven.its.plugins:maven-it-plugin-log4j:maven-plugin:2.1-SNAPSHOT in source directory core-it-support/core-it-plugins/maven-it-plugin-log4j/src/main/java
[withMaven] openTasksPublisher - Scan Tasks for Maven artifact org.apache.maven.its.plugins:maven-it-plugin-extension1:maven-plugin:2.1-SNAPSHOT in source directory core-it-support/core-it-plugins/maven-it-plugin-extension1/src/main/java
[withMaven] openTasksPublisher - Scan Tasks for Maven artifact org.apache.maven.its.plugins:maven-it-plugin-extension2:maven-plugin:2.1-SNAPSHOT in source directory core-it-support/core-it-plugins/maven-it-plugin-extension2/src/main/java
[withMaven] openTasksPublisher - Scan Tasks for Maven artifact org.apache.maven.its.plugins:maven-it-plugin-plexus-lifecycle:maven-plugin:2.1-SNAPSHOT in source directory core-it-support/core-it-plugins/maven-it-plugin-plexus-lifecycle/src/main/java
[withMaven] openTasksPublisher - Scan Tasks for Maven artifact org.apache.maven.its.plugins:maven-it-plugin-settings:maven-plugin:2.1-SNAPSHOT in source directory core-it-support/core-it-plugins/maven-it-plugin-settings/src/main/java
[withMaven] openTasksPublisher - Scan Tasks for Maven artifact org.apache.maven.its.plugins:mng-5805-pkg-type-mojo-configuration-plugin:maven-plugin:2.1-SNAPSHOT in source directory core-it-support/core-it-plugins/mng5805-plugin/src/main/java
[withMaven] openTasksPublisher - Scan Tasks for Maven artifact org.apache.maven.its.plugins:mng-5805-pkg-type-mojo-configuration-plugin-dep:jar:2.1-SNAPSHOT in source directory core-it-support/core-it-plugins/mng5805-plugin-dep/src/main/java
[withMaven] openTasksPublisher - Scan Tasks for Maven artifact org.apache.maven.its.plugins:mng-5958-pkg-type-extension:jar:2.1-SNAPSHOT in source directory core-it-support/core-it-plugins/mng5958-extension/src/main/java
[withMaven] openTasksPublisher - Scan Tasks for Maven artifact org.apache.maven.its.plugins:mng-6759-resolves-project-dependencies-plugin:maven-plugin:2.1-SNAPSHOT in source directory core-it-support/core-it-plugins/mng6759-plugin-resolves-project-dependencies/src/main/java
[withMaven] openTasksPublisher - Scan Tasks for Maven artifact org.apache.maven.its:core-it-toolchain:jar:2.1-SNAPSHOT in source directory core-it-support/core-it-toolchain/src/main/java
[withMaven] openTasksPublisher - Scan Tasks for Maven artifact org.apache.maven.its:core-it-wagon:jar:2.1-SNAPSHOT in source directory core-it-support/core-it-wagon/src/main/java
[withMaven] openTasksPublisher - Scan Tasks for Maven artifact mng-coreit:javaagent:jar:1.0-SNAPSHOT in source directory core-it-support/core-it-javaagent/src/main/java
[TASKS] Scanning folder '/home/jenkins/workspace/_box_maven_system-line-separator/test' for files matching the pattern 'core-it-support/core-it-plugins/maven-it-plugin-active-collection/src/main/java/**/*,core-it-support/core-it-plugins/maven-it-plugin-artifact/src/main/java/**/*,core-it-support/core-it-plugins/maven-it-plugin-class-loader/dep-a/src/main/java/**/*,core-it-support/core-it-plugins/maven-it-plugin-class-loader/dep-b/src/main/java/**/*,core-it-support/core-it-plugins/maven-it-plugin-class-loader/maven-it-plugin-class-loader/src/main/java/**/*,core-it-support/core-it-plugins/maven-it-plugin-configuration/src/main/java/**/*,core-it-support/core-it-plugins/maven-it-plugin-context-passing/src/main/java/**/*,core-it-support/core-it-plugins/maven-it-plugin-core-stubs/maven-clean-plugin/src/main/java/**/*,core-it-support/core-it-plugins/maven-it-plugin-core-stubs/maven-compiler-plugin/src/main/java/**/*,core-it-support/core-it-plugins/maven-it-plugin-core-stubs/maven-deploy-plugin/src/main/java/**/*,core-it-support/core-it-plugins/maven-it-plugin-core-stubs/maven-ear-plugin/src/main/java/**/*,core-it-support/core-it-plugins/maven-it-plugin-core-stubs/maven-ejb-plugin/src/main/java/**/*,core-it-support/core-it-plugins/maven-it-plugin-core-stubs/maven-install-plugin/src/main/java/**/*,core-it-support/core-it-plugins/maven-it-plugin-core-stubs/maven-jar-plugin/src/main/java/**/*,core-it-support/core-it-plugins/maven-it-plugin-core-stubs/maven-javadoc-plugin/src/main/java/**/*,core-it-support/core-it-plugins/maven-it-plugin-core-stubs/maven-plugin-plugin/src/main/java/**/*,core-it-support/core-it-plugins/maven-it-plugin-core-stubs/maven-rar-plugin/src/main/java/**/*,core-it-support/core-it-plugins/maven-it-plugin-core-stubs/maven-resources-plugin/src/main/java/**/*,core-it-support/core-it-plugins/maven-it-plugin-core-stubs/maven-site-plugin/src/main/java/**/*,core-it-support/core-it-plugins/maven-it-plugin-core-stubs/maven-source-plugin/src/main/java/**/*,core-it-support/core-it-plugins/maven-it-plugin-core-stubs/maven-surefire-plugin/src/main/java/**/*,core-it-support/core-it-plugins/maven-it-plugin-core-stubs/maven-war-plugin/src/main/java/**/*,core-it-support/core-it-plugins/maven-it-plugin-dependency-collection/src/main/java/**/*,core-it-support/core-it-plugins/maven-it-plugin-dependency-resolution/src/main/java/**/*,core-it-support/core-it-plugins/maven-it-plugin-expression/src/main/java/**/*,core-it-support/core-it-plugins/maven-it-plugin-error/src/main/java/**/*,core-it-support/core-it-component/src/main/java/**/*,core-it-support/core-it-plugins/maven-it-plugin-extension-consumer/src/main/java/**/*,core-it-support/core-it-plugins/maven-it-plugin-extension-provider/src/main/java/**/*,core-it-support/core-it-plugins/maven-it-plugin-fork/src/main/java/**/*,core-it-support/core-it-plugins/maven-it-plugin-invalid-descriptor/src/main/java/**/*,core-it-support/core-it-plugins/maven-it-plugin-log-file/src/main/java/**/*,core-it-support/maven-it-helper/src/main/java/**/*,core-it-support/core-it-plugins/maven-it-plugin-model-interpolation/src/main/java/**/*,core-it-support/core-it-plugins/maven-it-plugin-no-default-comp/src/main/java/**/*,core-it-support/core-it-plugins/maven-it-plugin-no-project/src/main/java/**/*,core-it-support/core-it-plugins/maven-it-plugin-online/src/main/java/**/*,core-it-support/core-it-plugins/maven-it-plugin-optional-mojos/src/main/java/**/*,core-it-support/core-it-plugins/maven-it-plugin-packaging/src/main/java/**/*,core-it-support/core-it-plugins/maven-it-plugin-parameter-implementation/src/main/java/**/*,core-it-support/core-it-plugins/maven-it-plugin-plugin-dependency/src/main/java/**/*,core-it-support/core-it-plugins/maven-it-plugin-project/src/main/java/**/*,core-it-support/core-it-plugins/maven-it-plugin-project-interpolation/src/main/java/**/*,core-it-support/core-it-plugins/maven-it-plugin-setter/src/main/java/**/*,core-it-support/core-it-plugins/maven-it-plugin-singleton-component/src/main/java/**/*,core-it-support/core-it-plugins/maven-it-plugin-site/src/main/java/**/*,core-it-support/core-it-plugins/maven-it-plugin-toolchain/src/main/java/**/*,core-it-support/core-it-plugins/maven-it-plugin-touch/src/main/java/**/*,core-it-support/core-it-plugins/maven-it-plugin-uses-properties/src/main/java/**/*,core-it-support/core-it-plugins/maven-it-plugin-uses-wagon/src/main/java/**/*,core-it-support/core-it-plugins/maven-it-plugin-all/src/main/java/**/*,core-it-support/core-it-plugins/maven-it-plugin-plexus-utils-11/src/main/java/**/*,core-it-support/core-it-plugins/maven-it-plugin-plexus-utils-new/src/main/java/**/*,core-it-support/core-it-plugins/maven-it-plugin-plexus-component-api/src/main/java/**/*,core-it-support/core-it-plugins/maven-it-plugin-log4j/src/main/java/**/*,core-it-support/core-it-plugins/maven-it-plugin-extension1/src/main/java/**/*,core-it-support/core-it-plugins/maven-it-plugin-extension2/src/main/java/**/*,core-it-support/core-it-plugins/maven-it-plugin-plexus-lifecycle/src/main/java/**/*,core-it-support/core-it-plugins/maven-it-plugin-settings/src/main/java/**/*,core-it-support/core-it-plugins/mng5805-plugin/src/main/java/**/*,core-it-support/core-it-plugins/mng5805-plugin-dep/src/main/java/**/*,core-it-support/core-it-plugins/mng5958-extension/src/main/java/**/*,core-it-support/core-it-plugins/mng6759-plugin-resolves-project-dependencies/src/main/java/**/*,core-it-support/core-it-toolchain/src/main/java/**/*,core-it-support/core-it-wagon/src/main/java/**/*,core-it-support/core-it-javaagent/src/main/java/**/*' - excludes: null
[TASKS] Found 167 files to scan for tasks
[TASKS] Found 0 open tasks.
Skipping warnings blame since pipelines do not have an SCM link.%n
[TASKS] Computing warning deltas based on reference build #2
[DevOpticsMavenPublisher] dependencies consumed: 5, artifacts produced: 156
[withMaven] Publishers: Pipeline Graph Publisher: 22 ms, Generated Artifacts Publisher: 82601 ms, Invoker Publisher: 2 ms, Junit Publisher: 387309 ms, Concordion Publisher: 2 ms, Dependencies Fingerprint Publisher: 2775 ms, Findbugs Publisher: 1 ms, Jacoco Publisher: 1 ms, Open Task Scanner Publisher: 16876 ms, CloudBees DevOptics Gate Artifact Publisher: 366219 ms
[Pipeline] // withMaven
[Pipeline] fileExists
[Pipeline] zip
Writing zip file of /home/jenkins/workspace/_box_maven_system-line-separator/test/core-it-suite/target/test-classes to /home/jenkins/workspace/_box_maven_system-line-separator/test/core-it-suite-logs-linux-jdk11.zip
Zipped 8688 entries.
Archiving /home/jenkins/workspace/_box_maven_system-line-separator/test/core-it-suite-logs-linux-jdk11.zip
[Pipeline] fileExists
[withMaven] openTasksPublisher - Scan Tasks for Maven artifact org.apache.maven.its.plugins:maven-it-plugin-active-collection:maven-plugin:2.1-SNAPSHOT in source directory core-it-support/core-it-plugins/maven-it-plugin-active-collection/src/main/java
[Pipeline] zip
[withMaven] openTasksPublisher - Scan Tasks for Maven artifact org.apache.maven.its.plugins:maven-it-plugin-artifact:maven-plugin:2.1-SNAPSHOT in source directory core-it-support/core-it-plugins/maven-it-plugin-artifact/src/main/java
[withMaven] openTasksPublisher - Scan Tasks for Maven artifact org.apache.maven.its.plugins.class-loader:dep-a:jar:2.1-SNAPSHOT in source directory core-it-support/core-it-plugins/maven-it-plugin-class-loader/dep-a/src/main/java
[withMaven] openTasksPublisher - Scan Tasks for Maven artifact org.apache.maven.its.plugins.class-loader:dep-b:jar:2.1-SNAPSHOT in source directory core-it-support/core-it-plugins/maven-it-plugin-class-loader/dep-b/src/main/java
Writing zip file of /home/jenkins/workspace/_box_maven_system-line-separator/test/core-it-suite/target/surefire-reports to /home/jenkins/workspace/_box_maven_system-line-separator/test/core-it-suite-reports-linux-jdk11.zip
Zipped 4 entries.
Archiving /home/jenkins/workspace/_box_maven_system-line-separator/test/core-it-suite-reports-linux-jdk11.zip
[withMaven] openTasksPublisher - Scan Tasks for Maven artifact org.apache.maven.its.plugins:maven-it-plugin-class-loader:maven-plugin:2.1-SNAPSHOT in source directory core-it-support/core-it-plugins/maven-it-plugin-class-loader/maven-it-plugin-class-loader/src/main/java
[Pipeline] deleteDir
[withMaven] openTasksPublisher - Scan Tasks for Maven artifact org.apache.maven.its.plugins:maven-it-plugin-configuration:maven-plugin:2.1-SNAPSHOT in source directory core-it-support/core-it-plugins/maven-it-plugin-configuration/src/main/java
[withMaven] openTasksPublisher - Scan Tasks for Maven artifact org.apache.maven.its.plugins:maven-it-plugin-context-passing:maven-plugin:2.1-SNAPSHOT in source directory core-it-support/core-it-plugins/maven-it-plugin-context-passing/src/main/java
[withMaven] openTasksPublisher - Scan Tasks for Maven artifact org.apache.maven.plugins:maven-clean-plugin:maven-plugin:0.1-stub-SNAPSHOT in source directory core-it-support/core-it-plugins/maven-it-plugin-core-stubs/maven-clean-plugin/src/main/java
[withMaven] openTasksPublisher - Scan Tasks for Maven artifact org.apache.maven.plugins:maven-compiler-plugin:maven-plugin:0.1-stub-SNAPSHOT in source directory core-it-support/core-it-plugins/maven-it-plugin-core-stubs/maven-compiler-plugin/src/main/java
[withMaven] openTasksPublisher - Scan Tasks for Maven artifact org.apache.maven.plugins:maven-deploy-plugin:maven-plugin:0.1-stub-SNAPSHOT in source directory core-it-support/core-it-plugins/maven-it-plugin-core-stubs/maven-deploy-plugin/src/main/java
[withMaven] openTasksPublisher - Scan Tasks for Maven artifact org.apache.maven.plugins:maven-ear-plugin:maven-plugin:0.1-stub-SNAPSHOT in source directory core-it-support/core-it-plugins/maven-it-plugin-core-stubs/maven-ear-plugin/src/main/java
[withMaven] openTasksPublisher - Scan Tasks for Maven artifact org.apache.maven.plugins:maven-ejb-plugin:maven-plugin:0.1-stub-SNAPSHOT in source directory core-it-support/core-it-plugins/maven-it-plugin-core-stubs/maven-ejb-plugin/src/main/java
[Pipeline] }
[Pipeline] // dir
[Pipeline] }
[withMaven] openTasksPublisher - Scan Tasks for Maven artifact org.apache.maven.plugins:maven-install-plugin:maven-plugin:0.1-stub-SNAPSHOT in source directory core-it-support/core-it-plugins/maven-it-plugin-core-stubs/maven-install-plugin/src/main/java
[Pipeline] // stage
[Pipeline] }
[Pipeline] // node
[Pipeline] }
[withMaven] openTasksPublisher - Scan Tasks for Maven artifact org.apache.maven.plugins:maven-jar-plugin:maven-plugin:0.1-stub-SNAPSHOT in source directory core-it-support/core-it-plugins/maven-it-plugin-core-stubs/maven-jar-plugin/src/main/java
[withMaven] openTasksPublisher - Scan Tasks for Maven artifact org.apache.maven.plugins:maven-javadoc-plugin:maven-plugin:0.1-stub-SNAPSHOT in source directory core-it-support/core-it-plugins/maven-it-plugin-core-stubs/maven-javadoc-plugin/src/main/java
[withMaven] openTasksPublisher - Scan Tasks for Maven artifact org.apache.maven.plugins:maven-plugin-plugin:maven-plugin:0.1-stub-SNAPSHOT in source directory core-it-support/core-it-plugins/maven-it-plugin-core-stubs/maven-plugin-plugin/src/main/java
[withMaven] openTasksPublisher - Scan Tasks for Maven artifact org.apache.maven.plugins:maven-rar-plugin:maven-plugin:0.1-stub-SNAPSHOT in source directory core-it-support/core-it-plugins/maven-it-plugin-core-stubs/maven-rar-plugin/src/main/java
[withMaven] openTasksPublisher - Scan Tasks for Maven artifact org.apache.maven.plugins:maven-resources-plugin:maven-plugin:0.1-stub-SNAPSHOT in source directory core-it-support/core-it-plugins/maven-it-plugin-core-stubs/maven-resources-plugin/src/main/java
[withMaven] openTasksPublisher - Scan Tasks for Maven artifact org.apache.maven.plugins:maven-site-plugin:maven-plugin:0.1-stub-SNAPSHOT in source directory core-it-support/core-it-plugins/maven-it-plugin-core-stubs/maven-site-plugin/src/main/java
[withMaven] openTasksPublisher - Scan Tasks for Maven artifact org.apache.maven.plugins:maven-source-plugin:maven-plugin:0.1-stub-SNAPSHOT in source directory core-it-support/core-it-plugins/maven-it-plugin-core-stubs/maven-source-plugin/src/main/java
[withMaven] openTasksPublisher - Scan Tasks for Maven artifact org.apache.maven.plugins:maven-surefire-plugin:maven-plugin:0.1-stub-SNAPSHOT in source directory core-it-support/core-it-plugins/maven-it-plugin-core-stubs/maven-surefire-plugin/src/main/java
[withMaven] openTasksPublisher - Scan Tasks for Maven artifact org.apache.maven.plugins:maven-war-plugin:maven-plugin:0.1-stub-SNAPSHOT in source directory core-it-support/core-it-plugins/maven-it-plugin-core-stubs/maven-war-plugin/src/main/java
[withMaven] openTasksPublisher - Scan Tasks for Maven artifact org.apache.maven.its.plugins:maven-it-plugin-dependency-collection:maven-plugin:2.1-SNAPSHOT in source directory core-it-support/core-it-plugins/maven-it-plugin-dependency-collection/src/main/java
[withMaven] openTasksPublisher - Scan Tasks for Maven artifact org.apache.maven.its.plugins:maven-it-plugin-dependency-resolution:maven-plugin:2.1-SNAPSHOT in source directory core-it-support/core-it-plugins/maven-it-plugin-dependency-resolution/src/main/java
[withMaven] openTasksPublisher - Scan Tasks for Maven artifact org.apache.maven.its.plugins:maven-it-plugin-expression:maven-plugin:2.1-SNAPSHOT in source directory core-it-support/core-it-plugins/maven-it-plugin-expression/src/main/java
[withMaven] openTasksPublisher - Scan Tasks for Maven artifact org.apache.maven.its.plugins:maven-it-plugin-error:maven-plugin:2.1-SNAPSHOT in source directory core-it-support/core-it-plugins/maven-it-plugin-error/src/main/java
[withMaven] openTasksPublisher - Scan Tasks for Maven artifact org.apache.maven.its:core-it-component:jar:2.1-SNAPSHOT in source directory core-it-support/core-it-component/src/main/java
[withMaven] openTasksPublisher - Scan Tasks for Maven artifact org.apache.maven.its.plugins:maven-it-plugin-extension-consumer:maven-plugin:2.1-SNAPSHOT in source directory core-it-support/core-it-plugins/maven-it-plugin-extension-consumer/src/main/java
[withMaven] openTasksPublisher - Scan Tasks for Maven artifact org.apache.maven.its.plugins:maven-it-plugin-extension-provider:maven-plugin:2.1-SNAPSHOT in source directory core-it-support/core-it-plugins/maven-it-plugin-extension-provider/src/main/java
[withMaven] openTasksPublisher - Scan Tasks for Maven artifact org.apache.maven.its.plugins:maven-it-plugin-fork:maven-plugin:2.1-SNAPSHOT in source directory core-it-support/core-it-plugins/maven-it-plugin-fork/src/main/java
[withMaven] openTasksPublisher - Scan Tasks for Maven artifact org.apache.maven.its.plugins:maven-it-plugin-invalid-descriptor:maven-plugin:2.1-SNAPSHOT in source directory core-it-support/core-it-plugins/maven-it-plugin-invalid-descriptor/src/main/java
[withMaven] openTasksPublisher - Scan Tasks for Maven artifact org.apache.maven.its.plugins:maven-it-plugin-log-file:maven-plugin:2.1-SNAPSHOT in source directory core-it-support/core-it-plugins/maven-it-plugin-log-file/src/main/java
[withMaven] openTasksPublisher - Scan Tasks for Maven artifact org.apache.maven.its:maven-it-helper:jar:2.1-SNAPSHOT in source directory core-it-support/maven-it-helper/src/main/java
[withMaven] openTasksPublisher - Scan Tasks for Maven artifact org.apache.maven.its.plugins:maven-it-plugin-model-interpolation:maven-plugin:2.1-SNAPSHOT in source directory core-it-support/core-it-plugins/maven-it-plugin-model-interpolation/src/main/java
[withMaven] openTasksPublisher - Scan Tasks for Maven artifact org.apache.maven.its.plugins:maven-it-plugin-no-default-comp:maven-plugin:2.1-SNAPSHOT in source directory core-it-support/core-it-plugins/maven-it-plugin-no-default-comp/src/main/java
[withMaven] openTasksPublisher - Scan Tasks for Maven artifact org.apache.maven.its.plugins:maven-it-plugin-no-project:maven-plugin:2.1-SNAPSHOT in source directory core-it-support/core-it-plugins/maven-it-plugin-no-project/src/main/java
[withMaven] openTasksPublisher - Scan Tasks for Maven artifact org.apache.maven.its.plugins:maven-it-plugin-online:maven-plugin:2.1-SNAPSHOT in source directory core-it-support/core-it-plugins/maven-it-plugin-online/src/main/java
[withMaven] openTasksPublisher - Scan Tasks for Maven artifact org.apache.maven.its.plugins:maven-it-plugin-optional-mojos:maven-plugin:2.1-SNAPSHOT in source directory core-it-support/core-it-plugins/maven-it-plugin-optional-mojos/src/main/java
[withMaven] openTasksPublisher - Scan Tasks for Maven artifact org.apache.maven.its.plugins:maven-it-plugin-packaging:maven-plugin:2.1-SNAPSHOT in source directory core-it-support/core-it-plugins/maven-it-plugin-packaging/src/main/java
[withMaven] openTasksPublisher - Scan Tasks for Maven artifact org.apache.maven.its.plugins:maven-it-plugin-parameter-implementation:maven-plugin:2.1-SNAPSHOT in source directory core-it-support/core-it-plugins/maven-it-plugin-parameter-implementation/src/main/java
[withMaven] openTasksPublisher - Scan Tasks for Maven artifact org.apache.maven.its.plugins:maven-it-plugin-plugin-dependency:maven-plugin:2.1-SNAPSHOT in source directory core-it-support/core-it-plugins/maven-it-plugin-plugin-dependency/src/main/java
[withMaven] openTasksPublisher - Scan Tasks for Maven artifact org.apache.maven.its.plugins:maven-it-plugin-project:maven-plugin:2.1-SNAPSHOT in source directory core-it-support/core-it-plugins/maven-it-plugin-project/src/main/java
[withMaven] openTasksPublisher - Scan Tasks for Maven artifact org.apache.maven.its.plugins:maven-it-plugin-project-interpolation:maven-plugin:2.1-SNAPSHOT in source directory core-it-support/core-it-plugins/maven-it-plugin-project-interpolation/src/main/java
[withMaven] openTasksPublisher - Scan Tasks for Maven artifact org.apache.maven.its.plugins:maven-it-plugin-setter:maven-plugin:2.1-SNAPSHOT in source directory core-it-support/core-it-plugins/maven-it-plugin-setter/src/main/java
[withMaven] openTasksPublisher - Scan Tasks for Maven artifact org.apache.maven.its.plugins:maven-it-plugin-singleton-component:maven-plugin:2.1-SNAPSHOT in source directory core-it-support/core-it-plugins/maven-it-plugin-singleton-component/src/main/java
[withMaven] openTasksPublisher - Scan Tasks for Maven artifact org.apache.maven.its.plugins:maven-it-plugin-site:maven-plugin:2.1-SNAPSHOT in source directory core-it-support/core-it-plugins/maven-it-plugin-site/src/main/java
[withMaven] openTasksPublisher - Scan Tasks for Maven artifact org.apache.maven.its.plugins:maven-it-plugin-toolchain:maven-plugin:2.1-SNAPSHOT in source directory core-it-support/core-it-plugins/maven-it-plugin-toolchain/src/main/java
[withMaven] openTasksPublisher - Scan Tasks for Maven artifact org.apache.maven.its.plugins:maven-it-plugin-touch:maven-plugin:2.1-SNAPSHOT in source directory core-it-support/core-it-plugins/maven-it-plugin-touch/src/main/java
[withMaven] openTasksPublisher - Scan Tasks for Maven artifact org.apache.maven.its.plugins:maven-it-plugin-uses-properties:maven-plugin:2.1-SNAPSHOT in source directory core-it-support/core-it-plugins/maven-it-plugin-uses-properties/src/main/java
[withMaven] openTasksPublisher - Scan Tasks for Maven artifact org.apache.maven.its.plugins:maven-it-plugin-uses-wagon:maven-plugin:2.1-SNAPSHOT in source directory core-it-support/core-it-plugins/maven-it-plugin-uses-wagon/src/main/java
[withMaven] openTasksPublisher - Scan Tasks for Maven artifact org.apache.maven.its.plugins:maven-it-plugin-all:maven-plugin:2.1-SNAPSHOT in source directory core-it-support/core-it-plugins/maven-it-plugin-all/src/main/java
[withMaven] openTasksPublisher - Scan Tasks for Maven artifact org.apache.maven.its.plugins:maven-it-plugin-plexus-utils-11:maven-plugin:2.1-SNAPSHOT in source directory core-it-support/core-it-plugins/maven-it-plugin-plexus-utils-11/src/main/java
[withMaven] openTasksPublisher - Scan Tasks for Maven artifact org.apache.maven.its.plugins:maven-it-plugin-plexus-utils-new:maven-plugin:2.1-SNAPSHOT in source directory core-it-support/core-it-plugins/maven-it-plugin-plexus-utils-new/src/main/java
[withMaven] openTasksPublisher - Scan Tasks for Maven artifact org.apache.maven.its.plugins:maven-it-plugin-plexus-component-api:maven-plugin:2.1-SNAPSHOT in source directory core-it-support/core-it-plugins/maven-it-plugin-plexus-component-api/src/main/java
[withMaven] openTasksPublisher - Scan Tasks for Maven artifact org.apache.maven.its.plugins:maven-it-plugin-log4j:maven-plugin:2.1-SNAPSHOT in source directory core-it-support/core-it-plugins/maven-it-plugin-log4j/src/main/java
[withMaven] openTasksPublisher - Scan Tasks for Maven artifact org.apache.maven.its.plugins:maven-it-plugin-extension1:maven-plugin:2.1-SNAPSHOT in source directory core-it-support/core-it-plugins/maven-it-plugin-extension1/src/main/java
[withMaven] openTasksPublisher - Scan Tasks for Maven artifact org.apache.maven.its.plugins:maven-it-plugin-extension2:maven-plugin:2.1-SNAPSHOT in source directory core-it-support/core-it-plugins/maven-it-plugin-extension2/src/main/java
[withMaven] openTasksPublisher - Scan Tasks for Maven artifact org.apache.maven.its.plugins:maven-it-plugin-plexus-lifecycle:maven-plugin:2.1-SNAPSHOT in source directory core-it-support/core-it-plugins/maven-it-plugin-plexus-lifecycle/src/main/java
[withMaven] openTasksPublisher - Scan Tasks for Maven artifact org.apache.maven.its.plugins:maven-it-plugin-settings:maven-plugin:2.1-SNAPSHOT in source directory core-it-support/core-it-plugins/maven-it-plugin-settings/src/main/java
[withMaven] openTasksPublisher - Scan Tasks for Maven artifact org.apache.maven.its.plugins:mng-5805-pkg-type-mojo-configuration-plugin:maven-plugin:2.1-SNAPSHOT in source directory core-it-support/core-it-plugins/mng5805-plugin/src/main/java
[withMaven] openTasksPublisher - Scan Tasks for Maven artifact org.apache.maven.its.plugins:mng-5805-pkg-type-mojo-configuration-plugin-dep:jar:2.1-SNAPSHOT in source directory core-it-support/core-it-plugins/mng5805-plugin-dep/src/main/java
[withMaven] openTasksPublisher - Scan Tasks for Maven artifact org.apache.maven.its.plugins:mng-5958-pkg-type-extension:jar:2.1-SNAPSHOT in source directory core-it-support/core-it-plugins/mng5958-extension/src/main/java
[withMaven] openTasksPublisher - Scan Tasks for Maven artifact org.apache.maven.its.plugins:mng-6759-resolves-project-dependencies-plugin:maven-plugin:2.1-SNAPSHOT in source directory core-it-support/core-it-plugins/mng6759-plugin-resolves-project-dependencies/src/main/java
[withMaven] openTasksPublisher - Scan Tasks for Maven artifact org.apache.maven.its:core-it-toolchain:jar:2.1-SNAPSHOT in source directory core-it-support/core-it-toolchain/src/main/java
[withMaven] openTasksPublisher - Scan Tasks for Maven artifact org.apache.maven.its:core-it-wagon:jar:2.1-SNAPSHOT in source directory core-it-support/core-it-wagon/src/main/java
[withMaven] openTasksPublisher - Scan Tasks for Maven artifact mng-coreit:javaagent:jar:1.0-SNAPSHOT in source directory core-it-support/core-it-javaagent/src/main/java
[TASKS] Scanning folder '/home/jenkins/workspace/_box_maven_system-line-separator/test' for files matching the pattern 'core-it-support/core-it-plugins/maven-it-plugin-active-collection/src/main/java/**/*,core-it-support/core-it-plugins/maven-it-plugin-artifact/src/main/java/**/*,core-it-support/core-it-plugins/maven-it-plugin-class-loader/dep-a/src/main/java/**/*,core-it-support/core-it-plugins/maven-it-plugin-class-loader/dep-b/src/main/java/**/*,core-it-support/core-it-plugins/maven-it-plugin-class-loader/maven-it-plugin-class-loader/src/main/java/**/*,core-it-support/core-it-plugins/maven-it-plugin-configuration/src/main/java/**/*,core-it-support/core-it-plugins/maven-it-plugin-context-passing/src/main/java/**/*,core-it-support/core-it-plugins/maven-it-plugin-core-stubs/maven-clean-plugin/src/main/java/**/*,core-it-support/core-it-plugins/maven-it-plugin-core-stubs/maven-compiler-plugin/src/main/java/**/*,core-it-support/core-it-plugins/maven-it-plugin-core-stubs/maven-deploy-plugin/src/main/java/**/*,core-it-support/core-it-plugins/maven-it-plugin-core-stubs/maven-ear-plugin/src/main/java/**/*,core-it-support/core-it-plugins/maven-it-plugin-core-stubs/maven-ejb-plugin/src/main/java/**/*,core-it-support/core-it-plugins/maven-it-plugin-core-stubs/maven-install-plugin/src/main/java/**/*,core-it-support/core-it-plugins/maven-it-plugin-core-stubs/maven-jar-plugin/src/main/java/**/*,core-it-support/core-it-plugins/maven-it-plugin-core-stubs/maven-javadoc-plugin/src/main/java/**/*,core-it-support/core-it-plugins/maven-it-plugin-core-stubs/maven-plugin-plugin/src/main/java/**/*,core-it-support/core-it-plugins/maven-it-plugin-core-stubs/maven-rar-plugin/src/main/java/**/*,core-it-support/core-it-plugins/maven-it-plugin-core-stubs/maven-resources-plugin/src/main/java/**/*,core-it-support/core-it-plugins/maven-it-plugin-core-stubs/maven-site-plugin/src/main/java/**/*,core-it-support/core-it-plugins/maven-it-plugin-core-stubs/maven-source-plugin/src/main/java/**/*,core-it-support/core-it-plugins/maven-it-plugin-core-stubs/maven-surefire-plugin/src/main/java/**/*,core-it-support/core-it-plugins/maven-it-plugin-core-stubs/maven-war-plugin/src/main/java/**/*,core-it-support/core-it-plugins/maven-it-plugin-dependency-collection/src/main/java/**/*,core-it-support/core-it-plugins/maven-it-plugin-dependency-resolution/src/main/java/**/*,core-it-support/core-it-plugins/maven-it-plugin-expression/src/main/java/**/*,core-it-support/core-it-plugins/maven-it-plugin-error/src/main/java/**/*,core-it-support/core-it-component/src/main/java/**/*,core-it-support/core-it-plugins/maven-it-plugin-extension-consumer/src/main/java/**/*,core-it-support/core-it-plugins/maven-it-plugin-extension-provider/src/main/java/**/*,core-it-support/core-it-plugins/maven-it-plugin-fork/src/main/java/**/*,core-it-support/core-it-plugins/maven-it-plugin-invalid-descriptor/src/main/java/**/*,core-it-support/core-it-plugins/maven-it-plugin-log-file/src/main/java/**/*,core-it-support/maven-it-helper/src/main/java/**/*,core-it-support/core-it-plugins/maven-it-plugin-model-interpolation/src/main/java/**/*,core-it-support/core-it-plugins/maven-it-plugin-no-default-comp/src/main/java/**/*,core-it-support/core-it-plugins/maven-it-plugin-no-project/src/main/java/**/*,core-it-support/core-it-plugins/maven-it-plugin-online/src/main/java/**/*,core-it-support/core-it-plugins/maven-it-plugin-optional-mojos/src/main/java/**/*,core-it-support/core-it-plugins/maven-it-plugin-packaging/src/main/java/**/*,core-it-support/core-it-plugins/maven-it-plugin-parameter-implementation/src/main/java/**/*,core-it-support/core-it-plugins/maven-it-plugin-plugin-dependency/src/main/java/**/*,core-it-support/core-it-plugins/maven-it-plugin-project/src/main/java/**/*,core-it-support/core-it-plugins/maven-it-plugin-project-interpolation/src/main/java/**/*,core-it-support/core-it-plugins/maven-it-plugin-setter/src/main/java/**/*,core-it-support/core-it-plugins/maven-it-plugin-singleton-component/src/main/java/**/*,core-it-support/core-it-plugins/maven-it-plugin-site/src/main/java/**/*,core-it-support/core-it-plugins/maven-it-plugin-toolchain/src/main/java/**/*,core-it-support/core-it-plugins/maven-it-plugin-touch/src/main/java/**/*,core-it-support/core-it-plugins/maven-it-plugin-uses-properties/src/main/java/**/*,core-it-support/core-it-plugins/maven-it-plugin-uses-wagon/src/main/java/**/*,core-it-support/core-it-plugins/maven-it-plugin-all/src/main/java/**/*,core-it-support/core-it-plugins/maven-it-plugin-plexus-utils-11/src/main/java/**/*,core-it-support/core-it-plugins/maven-it-plugin-plexus-utils-new/src/main/java/**/*,core-it-support/core-it-plugins/maven-it-plugin-plexus-component-api/src/main/java/**/*,core-it-support/core-it-plugins/maven-it-plugin-log4j/src/main/java/**/*,core-it-support/core-it-plugins/maven-it-plugin-extension1/src/main/java/**/*,core-it-support/core-it-plugins/maven-it-plugin-extension2/src/main/java/**/*,core-it-support/core-it-plugins/maven-it-plugin-plexus-lifecycle/src/main/java/**/*,core-it-support/core-it-plugins/maven-it-plugin-settings/src/main/java/**/*,core-it-support/core-it-plugins/mng5805-plugin/src/main/java/**/*,core-it-support/core-it-plugins/mng5805-plugin-dep/src/main/java/**/*,core-it-support/core-it-plugins/mng5958-extension/src/main/java/**/*,core-it-support/core-it-plugins/mng6759-plugin-resolves-project-dependencies/src/main/java/**/*,core-it-support/core-it-toolchain/src/main/java/**/*,core-it-support/core-it-wagon/src/main/java/**/*,core-it-support/core-it-javaagent/src/main/java/**/*' - excludes: null
[TASKS] Found 167 files to scan for tasks
[TASKS] Found 0 open tasks.
Skipping warnings blame since pipelines do not have an SCM link.%n
[TASKS] Computing warning deltas based on reference build #2
[DevOpticsMavenPublisher] dependencies consumed: 5, artifacts produced: 156
[withMaven] Publishers: Pipeline Graph Publisher: 15 ms, Generated Artifacts Publisher: 76179 ms, Invoker Publisher: 2 ms, Junit Publisher: 978810 ms, Concordion Publisher: 2 ms, Dependencies Fingerprint Publisher: 5542 ms, Findbugs Publisher: 1 ms, JGiven Publisher: 1 ms, Jacoco Publisher: 1 ms, SpotBugs Publisher: 1 ms, Open Task Scanner Publisher: 27044 ms, CloudBees DevOptics Gate Artifact Publisher: 512054 ms
[Pipeline] // withMaven
[Pipeline] fileExists
[Pipeline] zip
Writing zip file of /home/jenkins/workspace/_box_maven_system-line-separator/test/core-it-suite/target/test-classes to /home/jenkins/workspace/_box_maven_system-line-separator/test/core-it-suite-logs-linux-jdk8.zip
Zipped 8688 entries.
Archiving /home/jenkins/workspace/_box_maven_system-line-separator/test/core-it-suite-logs-linux-jdk8.zip
[Pipeline] fileExists
[Pipeline] zip
Writing zip file of /home/jenkins/workspace/_box_maven_system-line-separator/test/core-it-suite/target/surefire-reports to /home/jenkins/workspace/_box_maven_system-line-separator/test/core-it-suite-reports-linux-jdk8.zip
Zipped 4 entries.
Archiving /home/jenkins/workspace/_box_maven_system-line-separator/test/core-it-suite-reports-linux-jdk8.zip
[Pipeline] deleteDir
[Pipeline] }
[Pipeline] // dir
[Pipeline] }
[Pipeline] // stage
[Pipeline] }
[Pipeline] // node
[Pipeline] }
[Pipeline] // parallel
[Pipeline] stage
[Pipeline] { (Notifications)
[Pipeline] echo
Build result: UNSTABLE
[Pipeline] jiraIssueSelector
[Pipeline] jiraComment
[Pipeline] jiraComment
[Pipeline] jiraComment
[Pipeline] echo
The authors of changes [michaelo, martinkanters].
[Pipeline] echo
Sending email ...
[Pipeline] emailext