Build unstable in Jenkins: Maven » Maven TLP » maven-scm » master #26

Previous Topic Next Topic
 
classic Classic list List threaded Threaded
1 message Options
Reply | Threaded
Open this post in threaded view
|

Build unstable in Jenkins: Maven » Maven TLP » maven-scm » master #26

Apache Jenkins Server-2
See https://ci-builds.apache.org/job/Maven/job/maven-box/job/maven-scm/job/master/26/

Changes:

* Next Maven version change 3.7.x -> 4.x.x
* Added Java 17

40 tests failed.
FAILED:  org.apache.maven.scm.provider.accurev.command.add.AccuRevAddCommandTest.linux-jdk16 / Build linux-jdk16 / testAdd

Error Message:
Could not initialize class org.mockito.internal.creation.cglib.ClassImposterizer$3

Stack Trace:
java.lang.NoClassDefFoundError: Could not initialize class org.mockito.internal.creation.cglib.ClassImposterizer$3


FAILED:  org.apache.maven.scm.provider.accurev.command.add.AccuRevAddCommandTest.linux-jdk16 / Build linux-jdk16 / testAddFailed

Error Message:
Could not initialize class org.mockito.internal.creation.cglib.ClassImposterizer$3

Stack Trace:
java.lang.NoClassDefFoundError: Could not initialize class org.mockito.internal.creation.cglib.ClassImposterizer$3


FAILED:  org.apache.maven.scm.provider.accurev.command.blame.AccuRevBlameCommandTest.linux-jdk16 / Build linux-jdk16 / testBlame

Error Message:
Could not initialize class org.mockito.internal.creation.cglib.ClassImposterizer$3

Stack Trace:
java.lang.NoClassDefFoundError: Could not initialize class org.mockito.internal.creation.cglib.ClassImposterizer$3


FAILED:  org.apache.maven.scm.provider.accurev.command.changelog.AccuRevChangeLogCommandTest.linux-jdk16 / Build linux-jdk16 / testChangeLogBetweenStreamsUnsupported

Error Message:
Could not initialize class org.mockito.internal.creation.cglib.ClassImposterizer$3

Stack Trace:
java.lang.NoClassDefFoundError: Could not initialize class org.mockito.internal.creation.cglib.ClassImposterizer$3


FAILED:  org.apache.maven.scm.provider.accurev.command.changelog.AccuRevChangeLogCommandTest.linux-jdk16 / Build linux-jdk16 / testStandardCase

Error Message:
Could not initialize class org.mockito.internal.creation.cglib.ClassImposterizer$3

Stack Trace:
java.lang.NoClassDefFoundError: Could not initialize class org.mockito.internal.creation.cglib.ClassImposterizer$3


FAILED:  org.apache.maven.scm.provider.accurev.command.changelog.AccuRevChangeLogCommandTest.linux-jdk16 / Build linux-jdk16 / testChangeLogToNow

Error Message:
Could not initialize class org.mockito.internal.creation.cglib.ClassImposterizer$3

Stack Trace:
java.lang.NoClassDefFoundError: Could not initialize class org.mockito.internal.creation.cglib.ClassImposterizer$3


FAILED:  org.apache.maven.scm.provider.accurev.command.changelog.AccuRevChangeLogCommandTest.linux-jdk16 / Build linux-jdk16 / testChangeLogFailed

Error Message:
Could not initialize class org.mockito.internal.creation.cglib.ClassImposterizer$3

Stack Trace:
java.lang.NoClassDefFoundError: Could not initialize class org.mockito.internal.creation.cglib.ClassImposterizer$3


FAILED:  org.apache.maven.scm.provider.accurev.command.changelog.AccuRevChangeLogCommandTest.linux-jdk16 / Build linux-jdk16 / testWorkspaceChangelog

Error Message:
Could not initialize class org.mockito.internal.creation.cglib.ClassImposterizer$3

Stack Trace:
java.lang.NoClassDefFoundError: Could not initialize class org.mockito.internal.creation.cglib.ClassImposterizer$3


FAILED:  org.apache.maven.scm.provider.accurev.command.checkin.AccuRevCheckInCommandTest.linux-jdk16 / Build linux-jdk16 / testCheckInFailure

Error Message:
Could not initialize class org.mockito.internal.creation.cglib.ClassImposterizer$3

Stack Trace:
java.lang.NoClassDefFoundError: Could not initialize class org.mockito.internal.creation.cglib.ClassImposterizer$3


FAILED:  org.apache.maven.scm.provider.accurev.command.checkin.AccuRevCheckInCommandTest.linux-jdk16 / Build linux-jdk16 / testCheckinRecursiveSubDirectoryNotSupported

Error Message:
Could not initialize class org.mockito.internal.creation.cglib.ClassImposterizer$3

Stack Trace:
java.lang.NoClassDefFoundError: Could not initialize class org.mockito.internal.creation.cglib.ClassImposterizer$3


FAILED:  org.apache.maven.scm.provider.accurev.command.checkin.AccuRevCheckInCommandTest.linux-jdk16 / Build linux-jdk16 / testCheckInRecursive

Error Message:
Could not initialize class org.mockito.internal.creation.cglib.ClassImposterizer$3

Stack Trace:
java.lang.NoClassDefFoundError: Could not initialize class org.mockito.internal.creation.cglib.ClassImposterizer$3


FAILED:  org.apache.maven.scm.provider.accurev.command.checkin.AccuRevCheckInCommandTest.linux-jdk16 / Build linux-jdk16 / testCheckinExplicitFiles

Error Message:
Could not initialize class org.mockito.internal.creation.cglib.ClassImposterizer$3

Stack Trace:
java.lang.NoClassDefFoundError: Could not initialize class org.mockito.internal.creation.cglib.ClassImposterizer$3


FAILED:  org.apache.maven.scm.provider.accurev.command.checkout.AccuRevCheckOutCommandTest.linux-jdk16 / Build linux-jdk16 / testCheckout

Error Message:
Could not initialize class org.mockito.internal.creation.cglib.ClassImposterizer$3

Stack Trace:
java.lang.NoClassDefFoundError: Could not initialize class org.mockito.internal.creation.cglib.ClassImposterizer$3


FAILED:  org.apache.maven.scm.provider.accurev.command.checkout.AccuRevCheckOutCommandTest.linux-jdk16 / Build linux-jdk16 / testCheckoutFailure

Error Message:
Could not initialize class org.mockito.internal.creation.cglib.ClassImposterizer$3

Stack Trace:
java.lang.NoClassDefFoundError: Could not initialize class org.mockito.internal.creation.cglib.ClassImposterizer$3


FAILED:  org.apache.maven.scm.provider.accurev.command.checkout.AccuRevCheckOutCommandTest.linux-jdk16 / Build linux-jdk16 / testCheckoutToVersionNewWorkspace

Error Message:
Could not initialize class org.mockito.internal.creation.cglib.ClassImposterizer$3

Stack Trace:
java.lang.NoClassDefFoundError: Could not initialize class org.mockito.internal.creation.cglib.ClassImposterizer$3


FAILED:  org.apache.maven.scm.provider.accurev.command.checkout.AccuRevCheckOutCommandTest.linux-jdk16 / Build linux-jdk16 / testCheckoutToVersionExistingWorkspace

Error Message:
Could not initialize class org.mockito.internal.creation.cglib.ClassImposterizer$3

Stack Trace:
java.lang.NoClassDefFoundError: Could not initialize class org.mockito.internal.creation.cglib.ClassImposterizer$3


FAILED:  org.apache.maven.scm.provider.accurev.command.checkout.AccuRevCheckOutCommandTest.linux-jdk16 / Build linux-jdk16 / testReCheckoutExistingWorkspaceDifferentBasis

Error Message:
Could not initialize class org.mockito.internal.creation.cglib.ClassImposterizer$3

Stack Trace:
java.lang.NoClassDefFoundError: Could not initialize class org.mockito.internal.creation.cglib.ClassImposterizer$3


FAILED:  org.apache.maven.scm.provider.accurev.command.checkout.AccuRevCheckOutCommandTest.linux-jdk16 / Build linux-jdk16 / testReCheckoutExistingWorkspaceSameBasis

Error Message:
Could not initialize class org.mockito.internal.creation.cglib.ClassImposterizer$3

Stack Trace:
java.lang.NoClassDefFoundError: Could not initialize class org.mockito.internal.creation.cglib.ClassImposterizer$3


FAILED:  org.apache.maven.scm.provider.accurev.command.checkout.AccuRevCheckOutCommandTest.linux-jdk16 / Build linux-jdk16 / testReCheckoutSubdirectoryOfExistingWorkspaceThrowsException

Error Message:
Could not initialize class org.mockito.internal.creation.cglib.ClassImposterizer$3

Stack Trace:
java.lang.NoClassDefFoundError: Could not initialize class org.mockito.internal.creation.cglib.ClassImposterizer$3


FAILED:  org.apache.maven.scm.provider.accurev.command.export.AccuRevExportCommandTest.linux-jdk16 / Build linux-jdk16 / testExportToVersion490

Error Message:
Could not initialize class org.mockito.internal.creation.cglib.ClassImposterizer$3

Stack Trace:
java.lang.NoClassDefFoundError: Could not initialize class org.mockito.internal.creation.cglib.ClassImposterizer$3


FAILED:  org.apache.maven.scm.provider.accurev.command.export.AccuRevExportCommandTest.linux-jdk16 / Build linux-jdk16 / testExportToVersionPre490

Error Message:
Could not initialize class org.mockito.internal.creation.cglib.ClassImposterizer$3

Stack Trace:
java.lang.NoClassDefFoundError: Could not initialize class org.mockito.internal.creation.cglib.ClassImposterizer$3


FAILED:  org.apache.maven.scm.provider.accurev.command.export.AccuRevExportCommandTest.linux-jdk16 / Build linux-jdk16 / testname

Error Message:
Could not initialize class org.mockito.internal.creation.cglib.ClassImposterizer$3

Stack Trace:
java.lang.NoClassDefFoundError: Could not initialize class org.mockito.internal.creation.cglib.ClassImposterizer$3


FAILED:  org.apache.maven.scm.provider.accurev.command.export.AccuRevExportCommandTest.linux-jdk16 / Build linux-jdk16 / testExportVersionOutSideWorkspace

Error Message:
Could not initialize class org.mockito.internal.creation.cglib.ClassImposterizer$3

Stack Trace:
java.lang.NoClassDefFoundError: Could not initialize class org.mockito.internal.creation.cglib.ClassImposterizer$3


FAILED:  org.apache.maven.scm.provider.accurev.command.export.AccuRevExportCommandTest.linux-jdk16 / Build linux-jdk16 / testNonPersistentWithinExistingWorkspace

Error Message:
Could not initialize class org.mockito.internal.creation.cglib.ClassImposterizer$3

Stack Trace:
java.lang.NoClassDefFoundError: Could not initialize class org.mockito.internal.creation.cglib.ClassImposterizer$3


FAILED:  org.apache.maven.scm.provider.accurev.command.export.AccuRevExportCommandTest.linux-jdk16 / Build linux-jdk16 / testExportFailure

Error Message:
Could not initialize class org.mockito.internal.creation.cglib.ClassImposterizer$3

Stack Trace:
java.lang.NoClassDefFoundError: Could not initialize class org.mockito.internal.creation.cglib.ClassImposterizer$3


FAILED:  org.apache.maven.scm.provider.accurev.command.export.AccuRevExportCommandTest.linux-jdk16 / Build linux-jdk16 / testNonPersistentCheckoutUsesExport

Error Message:
Could not initialize class org.mockito.internal.creation.cglib.ClassImposterizer$3

Stack Trace:
java.lang.NoClassDefFoundError: Could not initialize class org.mockito.internal.creation.cglib.ClassImposterizer$3


FAILED:  org.apache.maven.scm.provider.accurev.command.login.AccuRevLoginCommandTest.linux-jdk16 / Build linux-jdk16 / testWhenAlreadyLoggedInAsSomeoneElse

Error Message:
Could not initialize class org.mockito.internal.creation.cglib.ClassImposterizer$3

Stack Trace:
java.lang.NoClassDefFoundError: Could not initialize class org.mockito.internal.creation.cglib.ClassImposterizer$3


FAILED:  org.apache.maven.scm.provider.accurev.command.login.AccuRevLoginCommandTest.linux-jdk16 / Build linux-jdk16 / testWhenNoUserSuppliedAndAlreadyLoggedIn

Error Message:
Could not initialize class org.mockito.internal.creation.cglib.ClassImposterizer$3

Stack Trace:
java.lang.NoClassDefFoundError: Could not initialize class org.mockito.internal.creation.cglib.ClassImposterizer$3


FAILED:  org.apache.maven.scm.provider.accurev.command.login.AccuRevLoginCommandTest.linux-jdk16 / Build linux-jdk16 / testWhenAlreadyLoggedInAsRequiredUser

Error Message:
Could not initialize class org.mockito.internal.creation.cglib.ClassImposterizer$3

Stack Trace:
java.lang.NoClassDefFoundError: Could not initialize class org.mockito.internal.creation.cglib.ClassImposterizer$3


FAILED:  org.apache.maven.scm.provider.accurev.command.login.AccuRevLoginCommandTest.linux-jdk16 / Build linux-jdk16 / testWhenNotLoggedIn

Error Message:
Could not initialize class org.mockito.internal.creation.cglib.ClassImposterizer$3

Stack Trace:
java.lang.NoClassDefFoundError: Could not initialize class org.mockito.internal.creation.cglib.ClassImposterizer$3


FAILED:  org.apache.maven.scm.provider.accurev.command.login.AccuRevLoginCommandTest.linux-jdk16 / Build linux-jdk16 / testFailsWhenNoUserSuppliedAndNotLoggedIn

Error Message:
Could not initialize class org.mockito.internal.creation.cglib.ClassImposterizer$3

Stack Trace:
java.lang.NoClassDefFoundError: Could not initialize class org.mockito.internal.creation.cglib.ClassImposterizer$3


FAILED:  org.apache.maven.scm.provider.accurev.command.remove.AccuRevRemoveCommandTest.linux-jdk16 / Build linux-jdk16 / testAddFailed

Error Message:
Could not initialize class org.mockito.internal.creation.cglib.ClassImposterizer$3

Stack Trace:
java.lang.NoClassDefFoundError: Could not initialize class org.mockito.internal.creation.cglib.ClassImposterizer$3


FAILED:  org.apache.maven.scm.provider.accurev.command.remove.AccuRevRemoveCommandTest.linux-jdk16 / Build linux-jdk16 / testRemove

Error Message:
Could not initialize class org.mockito.internal.creation.cglib.ClassImposterizer$3

Stack Trace:
java.lang.NoClassDefFoundError: Could not initialize class org.mockito.internal.creation.cglib.ClassImposterizer$3


FAILED:  org.apache.maven.scm.provider.accurev.command.status.AccuRevStatusCommandTest.linux-jdk16 / Build linux-jdk16 / testFailure

Error Message:
Could not initialize class org.mockito.internal.creation.cglib.ClassImposterizer$3

Stack Trace:
java.lang.NoClassDefFoundError: Could not initialize class org.mockito.internal.creation.cglib.ClassImposterizer$3


FAILED:  org.apache.maven.scm.provider.accurev.command.status.AccuRevStatusCommandTest.linux-jdk16 / Build linux-jdk16 / testStatus

Error Message:
Could not initialize class org.mockito.internal.creation.cglib.ClassImposterizer$3

Stack Trace:
java.lang.NoClassDefFoundError: Could not initialize class org.mockito.internal.creation.cglib.ClassImposterizer$3


FAILED:  org.apache.maven.scm.provider.accurev.command.tag.AccuRevTagCommandTest.linux-jdk16 / Build linux-jdk16 / testTag

Error Message:
Could not initialize class org.mockito.internal.creation.cglib.ClassImposterizer$3

Stack Trace:
java.lang.NoClassDefFoundError: Could not initialize class org.mockito.internal.creation.cglib.ClassImposterizer$3


FAILED:  org.apache.maven.scm.provider.accurev.command.tag.AccuRevTagCommandTest.linux-jdk16 / Build linux-jdk16 / testAccuRevError

Error Message:
Could not initialize class org.mockito.internal.creation.cglib.ClassImposterizer$3

Stack Trace:
java.lang.NoClassDefFoundError: Could not initialize class org.mockito.internal.creation.cglib.ClassImposterizer$3


FAILED:  org.apache.maven.scm.provider.accurev.command.update.AccurevUpdateCommandTest.linux-jdk16 / Build linux-jdk16 / testUpdateWithChangeLog

Error Message:
null

Stack Trace:
java.lang.ExceptionInInitializerError
Caused by: java.lang.reflect.InaccessibleObjectException: Unable to make protected final java.lang.Class java.lang.ClassLoader.defineClass(java.lang.String,byte[],int,int,java.security.ProtectionDomain) throws java.lang.ClassFormatError accessible: module java.base does not "opens java.lang" to unnamed module @209c0b14


FAILED:  org.apache.maven.scm.provider.accurev.command.update.AccurevUpdateCommandTest.linux-jdk16 / Build linux-jdk16 / testAccuRevFailure

Error Message:
Could not initialize class org.mockito.internal.creation.cglib.ClassImposterizer$3

Stack Trace:
java.lang.NoClassDefFoundError: Could not initialize class org.mockito.internal.creation.cglib.ClassImposterizer$3


FAILED:  org.apache.maven.scm.provider.accurev.command.update.AccurevUpdateCommandTest.linux-jdk16 / Build linux-jdk16 / testUpdate

Error Message:
Could not initialize class org.mockito.internal.creation.cglib.ClassImposterizer$3

Stack Trace:
java.lang.NoClassDefFoundError: Could not initialize class org.mockito.internal.creation.cglib.ClassImposterizer$3




Build log:
[...truncated 75805 lines...]
[INFO] Maven SCM Subversion Provider - SVN Executable Impl. SUCCESS [  7.676 s]
[INFO] Maven SCM Synergy Provider ......................... SUCCESS [  4.003 s]
[INFO] Maven SCM Visual Source Safe Provider .............. SUCCESS [  3.773 s]
[INFO] Maven SCM TFS Provider ............................. SUCCESS [  3.282 s]
[INFO] Maven SCM MKS Integrity Provider ................... SUCCESS [  4.305 s]
[INFO] Maven SCM Jazz/Rational Team Concert Provider ...... SUCCESS [  4.593 s]
[INFO] Maven SCM Standard Providers ....................... SUCCESS [  1.484 s]
[INFO] Maven SCM Client ................................... SUCCESS [  3.822 s]
[INFO] Maven SCM Plugin ................................... SUCCESS [01:09 min]
[INFO] ------------------------------------------------------------------------
[INFO] BUILD SUCCESS
[INFO] ------------------------------------------------------------------------
[INFO] Total time:  04:58 min
[INFO] Finished at: 2021-01-10T06:27:56-08:00
[INFO] ------------------------------------------------------------------------
[WARNING] The requested profile "run-its" could not be activated because it does not exist.
[INFO] [jenkins-event-spy] Generated F:\jenkins\jenkins-slave\712657a4\workspace\Maven_maven-box_maven-scm_master@2@tmp\withMaven3bb14cb3\maven-spy-20210110-062257-5914661773060604133443.log
[Pipeline] }
[INFO] Installing F:\jenkins\jenkins-slave\712657a4\workspace\Maven_maven-box_maven-scm_master@2\m\maven-scm-providers\maven-scm-providers-svn\maven-scm-provider-svn-commons\pom.xml to F:\jenkins\jenkins-slave\712657a4\workspace\Maven_maven-box_maven-scm_master@2\m\maven-scm-plugin\target\local-repo\org\apache\maven\scm\maven-scm-provider-svn-commons\1.11.3-SNAPSHOT\maven-scm-provider-svn-commons-1.11.3-SNAPSHOT.pom
[INFO] Installing F:\jenkins\jenkins-slave\712657a4\workspace\Maven_maven-box_maven-scm_master@2\m\maven-scm-providers\maven-scm-providers-svn\maven-scm-provider-svn-commons\target\maven-scm-provider-svn-commons-1.11.3-SNAPSHOT.jar to F:\jenkins\jenkins-slave\712657a4\workspace\Maven_maven-box_maven-scm_master@2\m\maven-scm-plugin\target\local-repo\org\apache\maven\scm\maven-scm-provider-svn-commons\1.11.3-SNAPSHOT\maven-scm-provider-svn-commons-1.11.3-SNAPSHOT.jar
[INFO] Installing F:\jenkins\jenkins-slave\712657a4\workspace\Maven_maven-box_maven-scm_master@2\m\maven-scm-providers\maven-scm-providers-svn\pom.xml to F:\jenkins\jenkins-slave\712657a4\workspace\Maven_maven-box_maven-scm_master@2\m\maven-scm-plugin\target\local-repo\org\apache\maven\scm\maven-scm-providers-svn\1.11.3-SNAPSHOT\maven-scm-providers-svn-1.11.3-SNAPSHOT.pom
[INFO] Installing F:\jenkins\jenkins-slave\712657a4\workspace\Maven_maven-box_maven-scm_master@2\m\maven-scm-providers\pom.xml to F:\jenkins\jenkins-slave\712657a4\workspace\Maven_maven-box_maven-scm_master@2\m\maven-scm-plugin\target\local-repo\org\apache\maven\scm\maven-scm-providers\1.11.3-SNAPSHOT\maven-scm-providers-1.11.3-SNAPSHOT.pom
[INFO] Installing f:\jenkins\jenkins-slave\712657a4\workspace\Maven_maven-box_maven-scm_master@2\m\pom.xml to F:\jenkins\jenkins-slave\712657a4\workspace\Maven_maven-box_maven-scm_master@2\m\maven-scm-plugin\target\local-repo\org\apache\maven\scm\maven-scm\1.11.3-SNAPSHOT\maven-scm-1.11.3-SNAPSHOT.pom
[INFO] Installing F:\jenkins\jenkins-slave\712657a4\workspace\Maven_maven-box_maven-scm_master@2\m\maven-scm-api\pom.xml to F:\jenkins\jenkins-slave\712657a4\workspace\Maven_maven-box_maven-scm_master@2\m\maven-scm-plugin\target\local-repo\org\apache\maven\scm\maven-scm-api\1.11.3-SNAPSHOT\maven-scm-api-1.11.3-SNAPSHOT.pom
[INFO] Installing F:\jenkins\jenkins-slave\712657a4\workspace\Maven_maven-box_maven-scm_master@2\m\maven-scm-api\target\maven-scm-api-1.11.3-SNAPSHOT.jar to F:\jenkins\jenkins-slave\712657a4\workspace\Maven_maven-box_maven-scm_master@2\m\maven-scm-plugin\target\local-repo\org\apache\maven\scm\maven-scm-api\1.11.3-SNAPSHOT\maven-scm-api-1.11.3-SNAPSHOT.jar
[INFO] Installing F:\jenkins\jenkins-slave\712657a4\workspace\Maven_maven-box_maven-scm_master@2\m\maven-scm-test\pom.xml to F:\jenkins\jenkins-slave\712657a4\workspace\Maven_maven-box_maven-scm_master@2\m\maven-scm-plugin\target\local-repo\org\apache\maven\scm\maven-scm-test\1.11.3-SNAPSHOT\maven-scm-test-1.11.3-SNAPSHOT.pom
[INFO] Installing F:\jenkins\jenkins-slave\712657a4\workspace\Maven_maven-box_maven-scm_master@2\m\maven-scm-test\target\maven-scm-test-1.11.3-SNAPSHOT.jar to F:\jenkins\jenkins-slave\712657a4\workspace\Maven_maven-box_maven-scm_master@2\m\maven-scm-plugin\target\local-repo\org\apache\maven\scm\maven-scm-test\1.11.3-SNAPSHOT\maven-scm-test-1.11.3-SNAPSHOT.jar
[INFO] Installing F:\jenkins\jenkins-slave\712657a4\workspace\Maven_maven-box_maven-scm_master@2\m\maven-scm-managers\maven-scm-manager-plexus\pom.xml to F:\jenkins\jenkins-slave\712657a4\workspace\Maven_maven-box_maven-scm_master@2\m\maven-scm-plugin\target\local-repo\org\apache\maven\scm\maven-scm-manager-plexus\1.11.3-SNAPSHOT\maven-scm-manager-plexus-1.11.3-SNAPSHOT.pom
[INFO] Installing F:\jenkins\jenkins-slave\712657a4\workspace\Maven_maven-box_maven-scm_master@2\m\maven-scm-managers\maven-scm-manager-plexus\target\maven-scm-manager-plexus-1.11.3-SNAPSHOT.jar to F:\jenkins\jenkins-slave\712657a4\workspace\Maven_maven-box_maven-scm_master@2\m\maven-scm-plugin\target\local-repo\org\apache\maven\scm\maven-scm-manager-plexus\1.11.3-SNAPSHOT\maven-scm-manager-plexus-1.11.3-SNAPSHOT.jar
[INFO] Installing F:\jenkins\jenkins-slave\712657a4\workspace\Maven_maven-box_maven-scm_master@2\m\maven-scm-managers\pom.xml to F:\jenkins\jenkins-slave\712657a4\workspace\Maven_maven-box_maven-scm_master@2\m\maven-scm-plugin\target\local-repo\org\apache\maven\scm\maven-scm-managers\1.11.3-SNAPSHOT\maven-scm-managers-1.11.3-SNAPSHOT.pom
[INFO] Installing F:\jenkins\jenkins-slave\712657a4\workspace\Maven_maven-box_maven-scm_master@2\m\maven-scm-providers\maven-scm-providers-standard\pom.xml to F:\jenkins\jenkins-slave\712657a4\workspace\Maven_maven-box_maven-scm_master@2\m\maven-scm-plugin\target\local-repo\org\apache\maven\scm\maven-scm-providers-standard\1.11.3-SNAPSHOT\maven-scm-providers-standard-1.11.3-SNAPSHOT.pom
[INFO] Installing F:\jenkins\jenkins-slave\712657a4\workspace\Maven_maven-box_maven-scm_master@2\m\maven-scm-providers\maven-scm-provider-hg\pom.xml to F:\jenkins\jenkins-slave\712657a4\workspace\Maven_maven-box_maven-scm_master@2\m\maven-scm-plugin\target\local-repo\org\apache\maven\scm\maven-scm-provider-hg\1.11.3-SNAPSHOT\maven-scm-provider-hg-1.11.3-SNAPSHOT.pom
[INFO] Installing F:\jenkins\jenkins-slave\712657a4\workspace\Maven_maven-box_maven-scm_master@2\m\maven-scm-providers\maven-scm-provider-hg\target\maven-scm-provider-hg-1.11.3-SNAPSHOT.jar to F:\jenkins\jenkins-slave\712657a4\workspace\Maven_maven-box_maven-scm_master@2\m\maven-scm-plugin\target\local-repo\org\apache\maven\scm\maven-scm-provider-hg\1.11.3-SNAPSHOT\maven-scm-provider-hg-1.11.3-SNAPSHOT.jar
[INFO] Installing F:\jenkins\jenkins-slave\712657a4\workspace\Maven_maven-box_maven-scm_master@2\m\maven-scm-providers\maven-scm-providers-svn\maven-scm-provider-svnexe\pom.xml to F:\jenkins\jenkins-slave\712657a4\workspace\Maven_maven-box_maven-scm_master@2\m\maven-scm-plugin\target\local-repo\org\apache\maven\scm\maven-scm-provider-svnexe\1.11.3-SNAPSHOT\maven-scm-provider-svnexe-1.11.3-SNAPSHOT.pom
[INFO] Installing F:\jenkins\jenkins-slave\712657a4\workspace\Maven_maven-box_maven-scm_master@2\m\maven-scm-providers\maven-scm-providers-svn\maven-scm-provider-svnexe\target\maven-scm-provider-svnexe-1.11.3-SNAPSHOT.jar to F:\jenkins\jenkins-slave\712657a4\workspace\Maven_maven-box_maven-scm_master@2\m\maven-scm-plugin\target\local-repo\org\apache\maven\scm\maven-scm-provider-svnexe\1.11.3-SNAPSHOT\maven-scm-provider-svnexe-1.11.3-SNAPSHOT.jar
[INFO] Installing F:\jenkins\jenkins-slave\712657a4\workspace\Maven_maven-box_maven-scm_master@2\m\maven-scm-providers\maven-scm-providers-svn\maven-scm-provider-svntest\pom.xml to F:\jenkins\jenkins-slave\712657a4\workspace\Maven_maven-box_maven-scm_master@2\m\maven-scm-plugin\target\local-repo\org\apache\maven\scm\maven-scm-provider-svntest\1.11.3-SNAPSHOT\maven-scm-provider-svntest-1.11.3-SNAPSHOT.pom
[INFO] Installing F:\jenkins\jenkins-slave\712657a4\workspace\Maven_maven-box_maven-scm_master@2\m\maven-scm-providers\maven-scm-providers-svn\maven-scm-provider-svntest\target\maven-scm-provider-svntest-1.11.3-SNAPSHOT.jar to F:\jenkins\jenkins-slave\712657a4\workspace\Maven_maven-box_maven-scm_master@2\m\maven-scm-plugin\target\local-repo\org\apache\maven\scm\maven-scm-provider-svntest\1.11.3-SNAPSHOT\maven-scm-provider-svntest-1.11.3-SNAPSHOT.jar
[INFO] Installing F:\jenkins\jenkins-slave\712657a4\workspace\Maven_maven-box_maven-scm_master@2\m\maven-scm-providers\maven-scm-providers-cvs\maven-scm-provider-cvsjava\pom.xml to F:\jenkins\jenkins-slave\712657a4\workspace\Maven_maven-box_maven-scm_master@2\m\maven-scm-plugin\target\local-repo\org\apache\maven\scm\maven-scm-provider-cvsjava\1.11.3-SNAPSHOT\maven-scm-provider-cvsjava-1.11.3-SNAPSHOT.pom
[INFO] Installing F:\jenkins\jenkins-slave\712657a4\workspace\Maven_maven-box_maven-scm_master@2\m\maven-scm-providers\maven-scm-providers-cvs\maven-scm-provider-cvsjava\target\maven-scm-provider-cvsjava-1.11.3-SNAPSHOT.jar to F:\jenkins\jenkins-slave\712657a4\workspace\Maven_maven-box_maven-scm_master@2\m\maven-scm-plugin\target\local-repo\org\apache\maven\scm\maven-scm-provider-cvsjava\1.11.3-SNAPSHOT\maven-scm-provider-cvsjava-1.11.3-SNAPSHOT.jar
[INFO] Installing F:\jenkins\jenkins-slave\712657a4\workspace\Maven_maven-box_maven-scm_master@2\m\maven-scm-providers\maven-scm-providers-cvs\pom.xml to F:\jenkins\jenkins-slave\712657a4\workspace\Maven_maven-box_maven-scm_master@2\m\maven-scm-plugin\target\local-repo\org\apache\maven\scm\maven-scm-providers-cvs\1.11.3-SNAPSHOT\maven-scm-providers-cvs-1.11.3-SNAPSHOT.pom
[INFO] Installing F:\jenkins\jenkins-slave\712657a4\workspace\Maven_maven-box_maven-scm_master@2\m\maven-scm-providers\maven-scm-providers-cvs\maven-scm-provider-cvs-commons\pom.xml to F:\jenkins\jenkins-slave\712657a4\workspace\Maven_maven-box_maven-scm_master@2\m\maven-scm-plugin\target\local-repo\org\apache\maven\scm\maven-scm-provider-cvs-commons\1.11.3-SNAPSHOT\maven-scm-provider-cvs-commons-1.11.3-SNAPSHOT.pom
[INFO] Installing F:\jenkins\jenkins-slave\712657a4\workspace\Maven_maven-box_maven-scm_master@2\m\maven-scm-providers\maven-scm-providers-cvs\maven-scm-provider-cvs-commons\target\maven-scm-provider-cvs-commons-1.11.3-SNAPSHOT.jar to F:\jenkins\jenkins-slave\712657a4\workspace\Maven_maven-box_maven-scm_master@2\m\maven-scm-plugin\target\local-repo\org\apache\maven\scm\maven-scm-provider-cvs-commons\1.11.3-SNAPSHOT\maven-scm-provider-cvs-commons-1.11.3-SNAPSHOT.jar
[INFO] Installing F:\jenkins\jenkins-slave\712657a4\workspace\Maven_maven-box_maven-scm_master@2\m\maven-scm-providers\maven-scm-providers-cvs\maven-scm-provider-cvstest\pom.xml to F:\jenkins\jenkins-slave\712657a4\workspace\Maven_maven-box_maven-scm_master@2\m\maven-scm-plugin\target\local-repo\org\apache\maven\scm\maven-scm-provider-cvstest\1.11.3-SNAPSHOT\maven-scm-provider-cvstest-1.11.3-SNAPSHOT.pom
[INFO] Installing F:\jenkins\jenkins-slave\712657a4\workspace\Maven_maven-box_maven-scm_master@2\m\maven-scm-providers\maven-scm-providers-cvs\maven-scm-provider-cvstest\target\maven-scm-provider-cvstest-1.11.3-SNAPSHOT.jar to F:\jenkins\jenkins-slave\712657a4\workspace\Maven_maven-box_maven-scm_master@2\m\maven-scm-plugin\target\local-repo\org\apache\maven\scm\maven-scm-provider-cvstest\1.11.3-SNAPSHOT\maven-scm-provider-cvstest-1.11.3-SNAPSHOT.jar
[INFO] Installing F:\jenkins\jenkins-slave\712657a4\workspace\Maven_maven-box_maven-scm_master@2\m\maven-scm-providers\maven-scm-provider-integrity\pom.xml to F:\jenkins\jenkins-slave\712657a4\workspace\Maven_maven-box_maven-scm_master@2\m\maven-scm-plugin\target\local-repo\org\apache\maven\scm\maven-scm-provider-integrity\1.11.3-SNAPSHOT\maven-scm-provider-integrity-1.11.3-SNAPSHOT.pom
[INFO] Installing F:\jenkins\jenkins-slave\712657a4\workspace\Maven_maven-box_maven-scm_master@2\m\maven-scm-providers\maven-scm-provider-integrity\target\maven-scm-provider-integrity-1.11.3-SNAPSHOT.jar to F:\jenkins\jenkins-slave\712657a4\workspace\Maven_maven-box_maven-scm_master@2\m\maven-scm-plugin\target\local-repo\org\apache\maven\scm\maven-scm-provider-integrity\1.11.3-SNAPSHOT\maven-scm-provider-integrity-1.11.3-SNAPSHOT.jar
[INFO] Installing F:\jenkins\jenkins-slave\712657a4\workspace\Maven_maven-box_maven-scm_master@2\m\maven-scm-providers\maven-scm-provider-synergy\pom.xml to F:\jenkins\jenkins-slave\712657a4\workspace\Maven_maven-box_maven-scm_master@2\m\maven-scm-plugin\target\local-repo\org\apache\maven\scm\maven-scm-provider-synergy\1.11.3-SNAPSHOT\maven-scm-provider-synergy-1.11.3-SNAPSHOT.pom
[INFO] Installing F:\jenkins\jenkins-slave\712657a4\workspace\Maven_maven-box_maven-scm_master@2\m\maven-scm-providers\maven-scm-provider-synergy\target\maven-scm-provider-synergy-1.11.3-SNAPSHOT.jar to F:\jenkins\jenkins-slave\712657a4\workspace\Maven_maven-box_maven-scm_master@2\m\maven-scm-plugin\target\local-repo\org\apache\maven\scm\maven-scm-provider-synergy\1.11.3-SNAPSHOT\maven-scm-provider-synergy-1.11.3-SNAPSHOT.jar
[INFO] Installing F:\jenkins\jenkins-slave\712657a4\workspace\Maven_maven-box_maven-scm_master@2\m\maven-scm-providers\maven-scm-provider-perforce\pom.xml to F:\jenkins\jenkins-slave\712657a4\workspace\Maven_maven-box_maven-scm_master@2\m\maven-scm-plugin\target\local-repo\org\apache\maven\scm\maven-scm-provider-perforce\1.11.3-SNAPSHOT\maven-scm-provider-perforce-1.11.3-SNAPSHOT.pom
[INFO] Installing F:\jenkins\jenkins-slave\712657a4\workspace\Maven_maven-box_maven-scm_master@2\m\maven-scm-providers\maven-scm-provider-perforce\target\maven-scm-provider-perforce-1.11.3-SNAPSHOT.jar to F:\jenkins\jenkins-slave\712657a4\workspace\Maven_maven-box_maven-scm_master@2\m\maven-scm-plugin\target\local-repo\org\apache\maven\scm\maven-scm-provider-perforce\1.11.3-SNAPSHOT\maven-scm-provider-perforce-1.11.3-SNAPSHOT.jar
[INFO] Installing F:\jenkins\jenkins-slave\712657a4\workspace\Maven_maven-box_maven-scm_master@2\m\maven-scm-providers\maven-scm-provider-jazz\pom.xml to F:\jenkins\jenkins-slave\712657a4\workspace\Maven_maven-box_maven-scm_master@2\m\maven-scm-plugin\target\local-repo\org\apache\maven\scm\maven-scm-provider-jazz\1.11.3-SNAPSHOT\maven-scm-provider-jazz-1.11.3-SNAPSHOT.pom
[INFO] Installing F:\jenkins\jenkins-slave\712657a4\workspace\Maven_maven-box_maven-scm_master@2\m\maven-scm-providers\maven-scm-provider-jazz\target\maven-scm-provider-jazz-1.11.3-SNAPSHOT.jar to F:\jenkins\jenkins-slave\712657a4\workspace\Maven_maven-box_maven-scm_master@2\m\maven-scm-plugin\target\local-repo\org\apache\maven\scm\maven-scm-provider-jazz\1.11.3-SNAPSHOT\maven-scm-provider-jazz-1.11.3-SNAPSHOT.jar
[INFO] Installing F:\jenkins\jenkins-slave\712657a4\workspace\Maven_maven-box_maven-scm_master@2\m\maven-scm-providers\maven-scm-providers-git\maven-scm-provider-jgit\pom.xml to F:\jenkins\jenkins-slave\712657a4\workspace\Maven_maven-box_maven-scm_master@2\m\maven-scm-plugin\target\local-repo\org\apache\maven\scm\maven-scm-provider-jgit\1.11.3-SNAPSHOT\maven-scm-provider-jgit-1.11.3-SNAPSHOT.pom
[INFO] Installing F:\jenkins\jenkins-slave\712657a4\workspace\Maven_maven-box_maven-scm_master@2\m\maven-scm-providers\maven-scm-providers-git\maven-scm-provider-jgit\target\maven-scm-provider-jgit-1.11.3-SNAPSHOT.jar to F:\jenkins\jenkins-slave\712657a4\workspace\Maven_maven-box_maven-scm_master@2\m\maven-scm-plugin\target\local-repo\org\apache\maven\scm\maven-scm-provider-jgit\1.11.3-SNAPSHOT\maven-scm-provider-jgit-1.11.3-SNAPSHOT.jar
[INFO] Installing F:\jenkins\jenkins-slave\712657a4\workspace\Maven_maven-box_maven-scm_master@2\m\maven-scm-providers\maven-scm-providers-git\pom.xml to F:\jenkins\jenkins-slave\712657a4\workspace\Maven_maven-box_maven-scm_master@2\m\maven-scm-plugin\target\local-repo\org\apache\maven\scm\maven-scm-providers-git\1.11.3-SNAPSHOT\maven-scm-providers-git-1.11.3-SNAPSHOT.pom
[INFO] Installing F:\jenkins\jenkins-slave\712657a4\workspace\Maven_maven-box_maven-scm_master@2\m\maven-scm-providers\maven-scm-providers-git\maven-scm-provider-gittest\pom.xml to F:\jenkins\jenkins-slave\712657a4\workspace\Maven_maven-box_maven-scm_master@2\m\maven-scm-plugin\target\local-repo\org\apache\maven\scm\maven-scm-provider-gittest\1.11.3-SNAPSHOT\maven-scm-provider-gittest-1.11.3-SNAPSHOT.pom
[INFO] Installing F:\jenkins\jenkins-slave\712657a4\workspace\Maven_maven-box_maven-scm_master@2\m\maven-scm-providers\maven-scm-providers-git\maven-scm-provider-gittest\target\maven-scm-provider-gittest-1.11.3-SNAPSHOT.jar to F:\jenkins\jenkins-slave\712657a4\workspace\Maven_maven-box_maven-scm_master@2\m\maven-scm-plugin\target\local-repo\org\apache\maven\scm\maven-scm-provider-gittest\1.11.3-SNAPSHOT\maven-scm-provider-gittest-1.11.3-SNAPSHOT.jar
[INFO] Installing F:\jenkins\jenkins-slave\712657a4\workspace\Maven_maven-box_maven-scm_master@2\m\maven-scm-providers\maven-scm-providers-git\maven-scm-provider-git-commons\pom.xml to F:\jenkins\jenkins-slave\712657a4\workspace\Maven_maven-box_maven-scm_master@2\m\maven-scm-plugin\target\local-repo\org\apache\maven\scm\maven-scm-provider-git-commons\1.11.3-SNAPSHOT\maven-scm-provider-git-commons-1.11.3-SNAPSHOT.pom
[INFO] Installing F:\jenkins\jenkins-slave\712657a4\workspace\Maven_maven-box_maven-scm_master@2\m\maven-scm-providers\maven-scm-providers-git\maven-scm-provider-git-commons\target\maven-scm-provider-git-commons-1.11.3-SNAPSHOT.jar to F:\jenkins\jenkins-slave\712657a4\workspace\Maven_maven-box_maven-scm_master@2\m\maven-scm-plugin\target\local-repo\org\apache\maven\scm\maven-scm-provider-git-commons\1.11.3-SNAPSHOT\maven-scm-provider-git-commons-1.11.3-SNAPSHOT.jar
[INFO] Installing F:\jenkins\jenkins-slave\712657a4\workspace\Maven_maven-box_maven-scm_master@2\m\maven-scm-providers\maven-scm-provider-tfs\pom.xml to F:\jenkins\jenkins-slave\712657a4\workspace\Maven_maven-box_maven-scm_master@2\m\maven-scm-plugin\target\local-repo\org\apache\maven\scm\maven-scm-provider-tfs\1.11.3-SNAPSHOT\maven-scm-provider-tfs-1.11.3-SNAPSHOT.pom
[INFO] Installing F:\jenkins\jenkins-slave\712657a4\workspace\Maven_maven-box_maven-scm_master@2\m\maven-scm-providers\maven-scm-provider-tfs\target\maven-scm-provider-tfs-1.11.3-SNAPSHOT.jar to F:\jenkins\jenkins-slave\712657a4\workspace\Maven_maven-box_maven-scm_master@2\m\maven-scm-plugin\target\local-repo\org\apache\maven\scm\maven-scm-provider-tfs\1.11.3-SNAPSHOT\maven-scm-provider-tfs-1.11.3-SNAPSHOT.jar
[INFO] Installing F:\jenkins\jenkins-slave\712657a4\workspace\Maven_maven-box_maven-scm_master@2\m\maven-scm-providers\maven-scm-provider-clearcase\pom.xml to F:\jenkins\jenkins-slave\712657a4\workspace\Maven_maven-box_maven-scm_master@2\m\maven-scm-plugin\target\local-repo\org\apache\maven\scm\maven-scm-provider-clearcase\1.11.3-SNAPSHOT\maven-scm-provider-clearcase-1.11.3-SNAPSHOT.pom
[INFO] Installing F:\jenkins\jenkins-slave\712657a4\workspace\Maven_maven-box_maven-scm_master@2\m\maven-scm-providers\maven-scm-provider-clearcase\target\maven-scm-provider-clearcase-1.11.3-SNAPSHOT.jar to F:\jenkins\jenkins-slave\712657a4\workspace\Maven_maven-box_maven-scm_master@2\m\maven-scm-plugin\target\local-repo\org\apache\maven\scm\maven-scm-provider-clearcase\1.11.3-SNAPSHOT\maven-scm-provider-clearcase-1.11.3-SNAPSHOT.jar
[INFO] Installing F:\jenkins\jenkins-slave\712657a4\workspace\Maven_maven-box_maven-scm_master@2\m\maven-scm-providers\maven-scm-provider-bazaar\pom.xml to F:\jenkins\jenkins-slave\712657a4\workspace\Maven_maven-box_maven-scm_master@2\m\maven-scm-plugin\target\local-repo\org\apache\maven\scm\maven-scm-provider-bazaar\1.11.3-SNAPSHOT\maven-scm-provider-bazaar-1.11.3-SNAPSHOT.pom
[INFO] Installing F:\jenkins\jenkins-slave\712657a4\workspace\Maven_maven-box_maven-scm_master@2\m\maven-scm-providers\maven-scm-provider-bazaar\target\maven-scm-provider-bazaar-1.11.3-SNAPSHOT.jar to F:\jenkins\jenkins-slave\712657a4\workspace\Maven_maven-box_maven-scm_master@2\m\maven-scm-plugin\target\local-repo\org\apache\maven\scm\maven-scm-provider-bazaar\1.11.3-SNAPSHOT\maven-scm-provider-bazaar-1.11.3-SNAPSHOT.jar
[INFO] Installing F:\jenkins\jenkins-slave\712657a4\workspace\Maven_maven-box_maven-scm_master@2\m\maven-scm-providers\maven-scm-provider-starteam\pom.xml to F:\jenkins\jenkins-slave\712657a4\workspace\Maven_maven-box_maven-scm_master@2\m\maven-scm-plugin\target\local-repo\org\apache\maven\scm\maven-scm-provider-starteam\1.11.3-SNAPSHOT\maven-scm-provider-starteam-1.11.3-SNAPSHOT.pom
[INFO] Installing F:\jenkins\jenkins-slave\712657a4\workspace\Maven_maven-box_maven-scm_master@2\m\maven-scm-providers\maven-scm-provider-starteam\target\maven-scm-provider-starteam-1.11.3-SNAPSHOT.jar to F:\jenkins\jenkins-slave\712657a4\workspace\Maven_maven-box_maven-scm_master@2\m\maven-scm-plugin\target\local-repo\org\apache\maven\scm\maven-scm-provider-starteam\1.11.3-SNAPSHOT\maven-scm-provider-starteam-1.11.3-SNAPSHOT.jar
[INFO] Installing F:\jenkins\jenkins-slave\712657a4\workspace\Maven_maven-box_maven-scm_master@2\m\maven-scm-providers\maven-scm-provider-vss\pom.xml to F:\jenkins\jenkins-slave\712657a4\workspace\Maven_maven-box_maven-scm_master@2\m\maven-scm-plugin\target\local-repo\org\apache\maven\scm\maven-scm-provider-vss\1.11.3-SNAPSHOT\maven-scm-provider-vss-1.11.3-SNAPSHOT.pom
[INFO] Installing F:\jenkins\jenkins-slave\712657a4\workspace\Maven_maven-box_maven-scm_master@2\m\maven-scm-providers\maven-scm-provider-vss\target\maven-scm-provider-vss-1.11.3-SNAPSHOT.jar to F:\jenkins\jenkins-slave\712657a4\workspace\Maven_maven-box_maven-scm_master@2\m\maven-scm-plugin\target\local-repo\org\apache\maven\scm\maven-scm-provider-vss\1.11.3-SNAPSHOT\maven-scm-provider-vss-1.11.3-SNAPSHOT.jar
[INFO] Installing F:\jenkins\jenkins-slave\712657a4\workspace\Maven_maven-box_maven-scm_master@2\m\maven-scm-providers\maven-scm-providers-cvs\maven-scm-provider-cvsexe\pom.xml to F:\jenkins\jenkins-slave\712657a4\workspace\Maven_maven-box_maven-scm_master@2\m\maven-scm-plugin\target\local-repo\org\apache\maven\scm\maven-scm-provider-cvsexe\1.11.3-SNAPSHOT\maven-scm-provider-cvsexe-1.11.3-SNAPSHOT.pom
[INFO] Installing F:\jenkins\jenkins-slave\712657a4\workspace\Maven_maven-box_maven-scm_master@2\m\maven-scm-providers\maven-scm-providers-cvs\maven-scm-provider-cvsexe\target\maven-scm-provider-cvsexe-1.11.3-SNAPSHOT.jar to F:\jenkins\jenkins-slave\712657a4\workspace\Maven_maven-box_maven-scm_master@2\m\maven-scm-plugin\target\local-repo\org\apache\maven\scm\maven-scm-provider-cvsexe\1.11.3-SNAPSHOT\maven-scm-provider-cvsexe-1.11.3-SNAPSHOT.jar
[INFO] Installing F:\jenkins\jenkins-slave\712657a4\workspace\Maven_maven-box_maven-scm_master@2\m\maven-scm-providers\maven-scm-provider-accurev\pom.xml to F:\jenkins\jenkins-slave\712657a4\workspace\Maven_maven-box_maven-scm_master@2\m\maven-scm-plugin\target\local-repo\org\apache\maven\scm\maven-scm-provider-accurev\1.11.3-SNAPSHOT\maven-scm-provider-accurev-1.11.3-SNAPSHOT.pom
[INFO] Installing F:\jenkins\jenkins-slave\712657a4\workspace\Maven_maven-box_maven-scm_master@2\m\maven-scm-providers\maven-scm-provider-accurev\target\maven-scm-provider-accurev-1.11.3-SNAPSHOT.jar to F:\jenkins\jenkins-slave\712657a4\workspace\Maven_maven-box_maven-scm_master@2\m\maven-scm-plugin\target\local-repo\org\apache\maven\scm\maven-scm-provider-accurev\1.11.3-SNAPSHOT\maven-scm-provider-accurev-1.11.3-SNAPSHOT.jar
[INFO] Installing F:\jenkins\jenkins-slave\712657a4\workspace\Maven_maven-box_maven-scm_master@2\m\maven-scm-providers\maven-scm-providers-git\maven-scm-provider-gitexe\pom.xml to F:\jenkins\jenkins-slave\712657a4\workspace\Maven_maven-box_maven-scm_master@2\m\maven-scm-plugin\target\local-repo\org\apache\maven\scm\maven-scm-provider-gitexe\1.11.3-SNAPSHOT\maven-scm-provider-gitexe-1.11.3-SNAPSHOT.pom
[INFO] Installing F:\jenkins\jenkins-slave\712657a4\workspace\Maven_maven-box_maven-scm_master@2\m\maven-scm-providers\maven-scm-providers-git\maven-scm-provider-gitexe\target\maven-scm-provider-gitexe-1.11.3-SNAPSHOT.jar to F:\jenkins\jenkins-slave\712657a4\workspace\Maven_maven-box_maven-scm_master@2\m\maven-scm-plugin\target\local-repo\org\apache\maven\scm\maven-scm-provider-gitexe\1.11.3-SNAPSHOT\maven-scm-provider-gitexe-1.11.3-SNAPSHOT.jar
[INFO] Installing F:\jenkins\jenkins-slave\712657a4\workspace\Maven_maven-box_maven-scm_master@2\m\maven-scm-providers\maven-scm-provider-local\pom.xml to F:\jenkins\jenkins-slave\712657a4\workspace\Maven_maven-box_maven-scm_master@2\m\maven-scm-plugin\target\local-repo\org\apache\maven\scm\maven-scm-provider-local\1.11.3-SNAPSHOT\maven-scm-provider-local-1.11.3-SNAPSHOT.pom
[INFO] Installing F:\jenkins\jenkins-slave\712657a4\workspace\Maven_maven-box_maven-scm_master@2\m\maven-scm-providers\maven-scm-provider-local\target\maven-scm-provider-local-1.11.3-SNAPSHOT.jar to F:\jenkins\jenkins-slave\712657a4\workspace\Maven_maven-box_maven-scm_master@2\m\maven-scm-plugin\target\local-repo\org\apache\maven\scm\maven-scm-provider-local\1.11.3-SNAPSHOT\maven-scm-provider-local-1.11.3-SNAPSHOT.jar
[INFO] Installing F:\jenkins\jenkins-slave\712657a4\workspace\Maven_maven-box_maven-scm_master@2\m\maven-scm-plugin\pom.xml to F:\jenkins\jenkins-slave\712657a4\workspace\Maven_maven-box_maven-scm_master@2\m\maven-scm-plugin\target\local-repo\org\apache\maven\plugins\maven-scm-plugin\1.11.3-SNAPSHOT\maven-scm-plugin-1.11.3-SNAPSHOT.pom
[INFO] Installing F:\jenkins\jenkins-slave\712657a4\workspace\Maven_maven-box_maven-scm_master@2\m\maven-scm-plugin\target\maven-scm-plugin-1.11.3-SNAPSHOT.jar to F:\jenkins\jenkins-slave\712657a4\workspace\Maven_maven-box_maven-scm_master@2\m\maven-scm-plugin\target\local-repo\org\apache\maven\plugins\maven-scm-plugin\1.11.3-SNAPSHOT\maven-scm-plugin-1.11.3-SNAPSHOT.jar
[INFO]
[INFO] --- maven-invoker-plugin:3.2.1:run (integration-test) @ maven-scm-plugin ---
[INFO] No projects were selected for execution.
[INFO]
[INFO] --- maven-checkstyle-plugin:3.0.0:check (checkstyle-check) @ maven-scm-plugin ---
[INFO] ------------------------------------------------------------------------
[INFO] Reactor Summary for Maven SCM 1.11.3-SNAPSHOT:
[INFO]
[INFO] Maven SCM .......................................... SUCCESS [ 46.529 s]
[INFO] Maven SCM API ...................................... SUCCESS [ 13.550 s]
[INFO] Maven SCM Managers ................................. SUCCESS [  0.607 s]
[INFO] Maven SCM Manager for Plexus ....................... SUCCESS [  2.474 s]
[INFO] Maven SCM Test ..................................... SUCCESS [  3.622 s]
[INFO] Maven SCM Providers ................................ SUCCESS [  0.861 s]
[INFO] Maven SCM AccuRev Provider ......................... SUCCESS [  8.266 s]
[INFO] Maven SCM Bazaar Provider .......................... SUCCESS [  3.607 s]
[INFO] Maven SCM Clearcase Provider ....................... SUCCESS [  8.024 s]
[INFO] Maven SCM CVS Provider - Parent .................... SUCCESS [  0.816 s]
[INFO] Maven SCM CVS Provider TCK tests ................... SUCCESS [  2.581 s]
[INFO] Maven SCM CVS Provider - Common library ............ SUCCESS [  4.436 s]
[INFO] Maven SCM CVS Provider - CVS Executable Impl. ...... SUCCESS [  3.562 s]
[INFO] Maven SCM CVS Provider - CVS Java Impl. ............ SUCCESS [  4.486 s]
[INFO] Maven SCM Mercurial (Hg) Provider .................. SUCCESS [  3.676 s]
[INFO] Maven SCM Git Provider - Parent .................... SUCCESS [  0.716 s]
[INFO] Maven SCM Git Provider - Common library ............ SUCCESS [  3.400 s]
[INFO] Maven SCM Git Provider TCK Tests ................... SUCCESS [  1.588 s]
[INFO] Maven SCM Git Provider - Git Executable Impl. ...... SUCCESS [ 15.592 s]
[INFO] Maven SCM Git Provider - JGit Impl. ................ SUCCESS [ 47.653 s]
[INFO] Maven SCM Local Provider ........................... SUCCESS [  3.014 s]
[INFO] Maven SCM Perforce Provider ........................ SUCCESS [  5.280 s]
[INFO] Maven SCM Starteam Provider ........................ SUCCESS [  6.644 s]
[INFO] Maven SCM Subversion Provider - Parent ............. SUCCESS [  0.589 s]
[INFO] Maven SCM Subversion Provider - Common library ..... SUCCESS [  3.379 s]
[INFO] Maven SCM Subversion Provider TCK Tests ............ SUCCESS [  1.375 s]
[INFO] Maven SCM Subversion Provider - SVN Executable Impl. SUCCESS [  7.641 s]
[INFO] Maven SCM Synergy Provider ......................... SUCCESS [  4.076 s]
[INFO] Maven SCM Visual Source Safe Provider .............. SUCCESS [  3.765 s]
[INFO] Maven SCM TFS Provider ............................. SUCCESS [  3.486 s]
[INFO] Maven SCM MKS Integrity Provider ................... SUCCESS [  4.198 s]
[INFO] Maven SCM Jazz/Rational Team Concert Provider ...... SUCCESS [  4.541 s]
[INFO] Maven SCM Standard Providers ....................... SUCCESS [  1.723 s]
[INFO] Maven SCM Client ................................... SUCCESS [  3.700 s]
[INFO] Maven SCM Plugin ................................... SUCCESS [01:10 min]
[INFO] ------------------------------------------------------------------------
[INFO] BUILD SUCCESS
[INFO] ------------------------------------------------------------------------
[INFO] Total time:  05:01 min
[INFO] Finished at: 2021-01-10T06:27:59-08:00
[INFO] ------------------------------------------------------------------------
[WARNING] The requested profile "run-its" could not be activated because it does not exist.
[INFO] [jenkins-event-spy] Generated F:\jenkins\jenkins-slave\712657a4\workspace\Maven_maven-box_maven-scm_master@2@tmp\withMaven6fdea067\maven-spy-20210110-062257-2762624512308864835033.log
[withMaven] Publishers: Junit Publisher: 19085 ms
[Pipeline] // dir
[Pipeline] }
[Pipeline] }
[Pipeline] // dir
[Pipeline] }
[Pipeline] // withMaven
[Pipeline] cleanWs
[WS-CLEANUP] Deleting project workspace...
[WS-CLEANUP] Deferred wipeout is used...
[WS-CLEANUP] done
[Pipeline] }
[withMaven] junitPublisher - Archive test results for Maven artifact org.apache.maven.scm:maven-scm-api:jar:1.11.3-SNAPSHOT generated by maven-surefire-plugin:test (default-test): m\maven-scm-api\target\surefire-reports\*.xml
[withMaven] junitPublisher - Archive test results for Maven artifact org.apache.maven.scm:maven-scm-manager-plexus:jar:1.11.3-SNAPSHOT generated by maven-surefire-plugin:test (default-test): m\maven-scm-managers\maven-scm-manager-plexus\target\surefire-reports\*.xml
[withMaven] junitPublisher - Archive test results for Maven artifact org.apache.maven.scm:maven-scm-test:jar:1.11.3-SNAPSHOT generated by maven-surefire-plugin:test (default-test): m\maven-scm-test\target\surefire-reports\*.xml
[withMaven] junitPublisher - Archive test results for Maven artifact org.apache.maven.scm:maven-scm-provider-accurev:jar:1.11.3-SNAPSHOT generated by maven-surefire-plugin:test (default-test): m\maven-scm-providers\maven-scm-provider-accurev\target\surefire-reports\*.xml
[withMaven] junitPublisher - Archive test results for Maven artifact org.apache.maven.scm:maven-scm-provider-bazaar:jar:1.11.3-SNAPSHOT generated by maven-surefire-plugin:test (default-test): m\maven-scm-providers\maven-scm-provider-bazaar\target\surefire-reports\*.xml
[withMaven] junitPublisher - Archive test results for Maven artifact org.apache.maven.scm:maven-scm-provider-clearcase:jar:1.11.3-SNAPSHOT generated by maven-surefire-plugin:test (default-test): m\maven-scm-providers\maven-scm-provider-clearcase\target\surefire-reports\*.xml
[withMaven] junitPublisher - Archive test results for Maven artifact org.apache.maven.scm:maven-scm-provider-cvstest:jar:1.11.3-SNAPSHOT generated by maven-surefire-plugin:test (default-test): m\maven-scm-providers\maven-scm-providers-cvs\maven-scm-provider-cvstest\target\surefire-reports\*.xml
[withMaven] junitPublisher - Archive test results for Maven artifact org.apache.maven.scm:maven-scm-provider-cvs-commons:jar:1.11.3-SNAPSHOT generated by maven-surefire-plugin:test (default-test): m\maven-scm-providers\maven-scm-providers-cvs\maven-scm-provider-cvs-commons\target\surefire-reports\*.xml
[withMaven] junitPublisher - Archive test results for Maven artifact org.apache.maven.scm:maven-scm-provider-cvsexe:jar:1.11.3-SNAPSHOT generated by maven-surefire-plugin:test (default-test): m\maven-scm-providers\maven-scm-providers-cvs\maven-scm-provider-cvsexe\target\surefire-reports\*.xml
[withMaven] junitPublisher - Archive test results for Maven artifact org.apache.maven.scm:maven-scm-provider-cvsjava:jar:1.11.3-SNAPSHOT generated by maven-surefire-plugin:test (default-test): m\maven-scm-providers\maven-scm-providers-cvs\maven-scm-provider-cvsjava\target\surefire-reports\*.xml
[withMaven] junitPublisher - Archive test results for Maven artifact org.apache.maven.scm:maven-scm-provider-hg:jar:1.11.3-SNAPSHOT generated by maven-surefire-plugin:test (default-test): m\maven-scm-providers\maven-scm-provider-hg\target\surefire-reports\*.xml
[withMaven] junitPublisher - Archive test results for Maven artifact org.apache.maven.scm:maven-scm-provider-git-commons:jar:1.11.3-SNAPSHOT generated by maven-surefire-plugin:test (default-test): m\maven-scm-providers\maven-scm-providers-git\maven-scm-provider-git-commons\target\surefire-reports\*.xml
[withMaven] junitPublisher - Archive test results for Maven artifact org.apache.maven.scm:maven-scm-provider-gittest:jar:1.11.3-SNAPSHOT generated by maven-surefire-plugin:test (default-test): m\maven-scm-providers\maven-scm-providers-git\maven-scm-provider-gittest\target\surefire-reports\*.xml
[withMaven] junitPublisher - Archive test results for Maven artifact org.apache.maven.scm:maven-scm-provider-gitexe:jar:1.11.3-SNAPSHOT generated by maven-surefire-plugin:test (default-test): m\maven-scm-providers\maven-scm-providers-git\maven-scm-provider-gitexe\target\surefire-reports\*.xml
[withMaven] junitPublisher - Archive test results for Maven artifact org.apache.maven.scm:maven-scm-provider-jgit:jar:1.11.3-SNAPSHOT generated by maven-surefire-plugin:test (default-test): m\maven-scm-providers\maven-scm-providers-git\maven-scm-provider-jgit\target\surefire-reports\*.xml
[withMaven] junitPublisher - Archive test results for Maven artifact org.apache.maven.scm:maven-scm-provider-local:jar:1.11.3-SNAPSHOT generated by maven-surefire-plugin:test (default-test): m\maven-scm-providers\maven-scm-provider-local\target\surefire-reports\*.xml
[withMaven] junitPublisher - Archive test results for Maven artifact org.apache.maven.scm:maven-scm-provider-perforce:jar:1.11.3-SNAPSHOT generated by maven-surefire-plugin:test (default-test): m\maven-scm-providers\maven-scm-provider-perforce\target\surefire-reports\*.xml
[withMaven] junitPublisher - Archive test results for Maven artifact org.apache.maven.scm:maven-scm-provider-starteam:jar:1.11.3-SNAPSHOT generated by maven-surefire-plugin:test (default-test): m\maven-scm-providers\maven-scm-provider-starteam\target\surefire-reports\*.xml
[withMaven] junitPublisher - Archive test results for Maven artifact org.apache.maven.scm:maven-scm-provider-svn-commons:jar:1.11.3-SNAPSHOT generated by maven-surefire-plugin:test (default-test): m\maven-scm-providers\maven-scm-providers-svn\maven-scm-provider-svn-commons\target\surefire-reports\*.xml
[withMaven] junitPublisher - Archive test results for Maven artifact org.apache.maven.scm:maven-scm-provider-svntest:jar:1.11.3-SNAPSHOT generated by maven-surefire-plugin:test (default-test): m\maven-scm-providers\maven-scm-providers-svn\maven-scm-provider-svntest\target\surefire-reports\*.xml
[withMaven] junitPublisher - Archive test results for Maven artifact org.apache.maven.scm:maven-scm-provider-svnexe:jar:1.11.3-SNAPSHOT generated by maven-surefire-plugin:test (default-test): m\maven-scm-providers\maven-scm-providers-svn\maven-scm-provider-svnexe\target\surefire-reports\*.xml
[withMaven] junitPublisher - Archive test results for Maven artifact org.apache.maven.scm:maven-scm-provider-synergy:jar:1.11.3-SNAPSHOT generated by maven-surefire-plugin:test (default-test): m\maven-scm-providers\maven-scm-provider-synergy\target\surefire-reports\*.xml
[withMaven] junitPublisher - Archive test results for Maven artifact org.apache.maven.scm:maven-scm-provider-vss:jar:1.11.3-SNAPSHOT generated by maven-surefire-plugin:test (default-test): m\maven-scm-providers\maven-scm-provider-vss\target\surefire-reports\*.xml
[withMaven] junitPublisher - Archive test results for Maven artifact org.apache.maven.scm:maven-scm-provider-tfs:jar:1.11.3-SNAPSHOT generated by maven-surefire-plugin:test (default-test): m\maven-scm-providers\maven-scm-provider-tfs\target\surefire-reports\*.xml
[withMaven] junitPublisher - Archive test results for Maven artifact org.apache.maven.scm:maven-scm-provider-integrity:jar:1.11.3-SNAPSHOT generated by maven-surefire-plugin:test (default-test): m\maven-scm-providers\maven-scm-provider-integrity\target\surefire-reports\*.xml
[withMaven] junitPublisher - Archive test results for Maven artifact org.apache.maven.scm:maven-scm-provider-jazz:jar:1.11.3-SNAPSHOT generated by maven-surefire-plugin:test (default-test): m\maven-scm-providers\maven-scm-provider-jazz\target\surefire-reports\*.xml
[withMaven] junitPublisher - Archive test results for Maven artifact org.apache.maven.scm:maven-scm-client:jar:1.11.3-SNAPSHOT generated by maven-surefire-plugin:test (default-test): m\maven-scm-client\target\surefire-reports\*.xml
[withMaven] junitPublisher - Archive test results for Maven artifact org.apache.maven.plugins:maven-scm-plugin:maven-plugin:1.11.3-SNAPSHOT generated by maven-surefire-plugin:test (default-test): m\maven-scm-plugin\target\surefire-reports\*.xml
Recording test results
[Pipeline] // stage
[Pipeline] }
[Pipeline] // ws
[Pipeline] }
[Pipeline] // withEnv
[Pipeline] }
[Pipeline] // node
[Pipeline] }
[withMaven] junitPublisher - Archive test results for Maven artifact org.apache.maven.scm:maven-scm-api:jar:1.11.3-SNAPSHOT generated by maven-surefire-plugin:test (default-test): m\maven-scm-api\target\surefire-reports\*.xml
[withMaven] junitPublisher - Archive test results for Maven artifact org.apache.maven.scm:maven-scm-manager-plexus:jar:1.11.3-SNAPSHOT generated by maven-surefire-plugin:test (default-test): m\maven-scm-managers\maven-scm-manager-plexus\target\surefire-reports\*.xml
[withMaven] junitPublisher - Archive test results for Maven artifact org.apache.maven.scm:maven-scm-test:jar:1.11.3-SNAPSHOT generated by maven-surefire-plugin:test (default-test): m\maven-scm-test\target\surefire-reports\*.xml
[withMaven] junitPublisher - Archive test results for Maven artifact org.apache.maven.scm:maven-scm-provider-accurev:jar:1.11.3-SNAPSHOT generated by maven-surefire-plugin:test (default-test): m\maven-scm-providers\maven-scm-provider-accurev\target\surefire-reports\*.xml
[withMaven] junitPublisher - Archive test results for Maven artifact org.apache.maven.scm:maven-scm-provider-bazaar:jar:1.11.3-SNAPSHOT generated by maven-surefire-plugin:test (default-test): m\maven-scm-providers\maven-scm-provider-bazaar\target\surefire-reports\*.xml
[withMaven] junitPublisher - Archive test results for Maven artifact org.apache.maven.scm:maven-scm-provider-clearcase:jar:1.11.3-SNAPSHOT generated by maven-surefire-plugin:test (default-test): m\maven-scm-providers\maven-scm-provider-clearcase\target\surefire-reports\*.xml
[withMaven] junitPublisher - Archive test results for Maven artifact org.apache.maven.scm:maven-scm-provider-cvstest:jar:1.11.3-SNAPSHOT generated by maven-surefire-plugin:test (default-test): m\maven-scm-providers\maven-scm-providers-cvs\maven-scm-provider-cvstest\target\surefire-reports\*.xml
[withMaven] junitPublisher - Archive test results for Maven artifact org.apache.maven.scm:maven-scm-provider-cvs-commons:jar:1.11.3-SNAPSHOT generated by maven-surefire-plugin:test (default-test): m\maven-scm-providers\maven-scm-providers-cvs\maven-scm-provider-cvs-commons\target\surefire-reports\*.xml
[withMaven] junitPublisher - Archive test results for Maven artifact org.apache.maven.scm:maven-scm-provider-cvsexe:jar:1.11.3-SNAPSHOT generated by maven-surefire-plugin:test (default-test): m\maven-scm-providers\maven-scm-providers-cvs\maven-scm-provider-cvsexe\target\surefire-reports\*.xml
[withMaven] junitPublisher - Archive test results for Maven artifact org.apache.maven.scm:maven-scm-provider-cvsjava:jar:1.11.3-SNAPSHOT generated by maven-surefire-plugin:test (default-test): m\maven-scm-providers\maven-scm-providers-cvs\maven-scm-provider-cvsjava\target\surefire-reports\*.xml
[withMaven] junitPublisher - Archive test results for Maven artifact org.apache.maven.scm:maven-scm-provider-hg:jar:1.11.3-SNAPSHOT generated by maven-surefire-plugin:test (default-test): m\maven-scm-providers\maven-scm-provider-hg\target\surefire-reports\*.xml
[withMaven] junitPublisher - Archive test results for Maven artifact org.apache.maven.scm:maven-scm-provider-git-commons:jar:1.11.3-SNAPSHOT generated by maven-surefire-plugin:test (default-test): m\maven-scm-providers\maven-scm-providers-git\maven-scm-provider-git-commons\target\surefire-reports\*.xml
[withMaven] junitPublisher - Archive test results for Maven artifact org.apache.maven.scm:maven-scm-provider-gittest:jar:1.11.3-SNAPSHOT generated by maven-surefire-plugin:test (default-test): m\maven-scm-providers\maven-scm-providers-git\maven-scm-provider-gittest\target\surefire-reports\*.xml
[withMaven] junitPublisher - Archive test results for Maven artifact org.apache.maven.scm:maven-scm-provider-gitexe:jar:1.11.3-SNAPSHOT generated by maven-surefire-plugin:test (default-test): m\maven-scm-providers\maven-scm-providers-git\maven-scm-provider-gitexe\target\surefire-reports\*.xml
[withMaven] junitPublisher - Archive test results for Maven artifact org.apache.maven.scm:maven-scm-provider-jgit:jar:1.11.3-SNAPSHOT generated by maven-surefire-plugin:test (default-test): m\maven-scm-providers\maven-scm-providers-git\maven-scm-provider-jgit\target\surefire-reports\*.xml
[withMaven] junitPublisher - Archive test results for Maven artifact org.apache.maven.scm:maven-scm-provider-local:jar:1.11.3-SNAPSHOT generated by maven-surefire-plugin:test (default-test): m\maven-scm-providers\maven-scm-provider-local\target\surefire-reports\*.xml
[withMaven] junitPublisher - Archive test results for Maven artifact org.apache.maven.scm:maven-scm-provider-perforce:jar:1.11.3-SNAPSHOT generated by maven-surefire-plugin:test (default-test): m\maven-scm-providers\maven-scm-provider-perforce\target\surefire-reports\*.xml
[withMaven] junitPublisher - Archive test results for Maven artifact org.apache.maven.scm:maven-scm-provider-starteam:jar:1.11.3-SNAPSHOT generated by maven-surefire-plugin:test (default-test): m\maven-scm-providers\maven-scm-provider-starteam\target\surefire-reports\*.xml
[withMaven] junitPublisher - Archive test results for Maven artifact org.apache.maven.scm:maven-scm-provider-svn-commons:jar:1.11.3-SNAPSHOT generated by maven-surefire-plugin:test (default-test): m\maven-scm-providers\maven-scm-providers-svn\maven-scm-provider-svn-commons\target\surefire-reports\*.xml
[withMaven] junitPublisher - Archive test results for Maven artifact org.apache.maven.scm:maven-scm-provider-svntest:jar:1.11.3-SNAPSHOT generated by maven-surefire-plugin:test (default-test): m\maven-scm-providers\maven-scm-providers-svn\maven-scm-provider-svntest\target\surefire-reports\*.xml
[withMaven] junitPublisher - Archive test results for Maven artifact org.apache.maven.scm:maven-scm-provider-svnexe:jar:1.11.3-SNAPSHOT generated by maven-surefire-plugin:test (default-test): m\maven-scm-providers\maven-scm-providers-svn\maven-scm-provider-svnexe\target\surefire-reports\*.xml
[withMaven] junitPublisher - Archive test results for Maven artifact org.apache.maven.scm:maven-scm-provider-synergy:jar:1.11.3-SNAPSHOT generated by maven-surefire-plugin:test (default-test): m\maven-scm-providers\maven-scm-provider-synergy\target\surefire-reports\*.xml
[withMaven] junitPublisher - Archive test results for Maven artifact org.apache.maven.scm:maven-scm-provider-vss:jar:1.11.3-SNAPSHOT generated by maven-surefire-plugin:test (default-test): m\maven-scm-providers\maven-scm-provider-vss\target\surefire-reports\*.xml
[withMaven] junitPublisher - Archive test results for Maven artifact org.apache.maven.scm:maven-scm-provider-tfs:jar:1.11.3-SNAPSHOT generated by maven-surefire-plugin:test (default-test): m\maven-scm-providers\maven-scm-provider-tfs\target\surefire-reports\*.xml
[withMaven] junitPublisher - Archive test results for Maven artifact org.apache.maven.scm:maven-scm-provider-integrity:jar:1.11.3-SNAPSHOT generated by maven-surefire-plugin:test (default-test): m\maven-scm-providers\maven-scm-provider-integrity\target\surefire-reports\*.xml
[withMaven] junitPublisher - Archive test results for Maven artifact org.apache.maven.scm:maven-scm-provider-jazz:jar:1.11.3-SNAPSHOT generated by maven-surefire-plugin:test (default-test): m\maven-scm-providers\maven-scm-provider-jazz\target\surefire-reports\*.xml
[withMaven] junitPublisher - Archive test results for Maven artifact org.apache.maven.scm:maven-scm-client:jar:1.11.3-SNAPSHOT generated by maven-surefire-plugin:test (default-test): m\maven-scm-client\target\surefire-reports\*.xml
[withMaven] junitPublisher - Archive test results for Maven artifact org.apache.maven.plugins:maven-scm-plugin:maven-plugin:1.11.3-SNAPSHOT generated by maven-surefire-plugin:test (default-test): m\maven-scm-plugin\target\surefire-reports\*.xml
Recording test results
[withMaven] Publishers: Junit Publisher: 18652 ms
[Pipeline] // withMaven
[withMaven] Publishers: Junit Publisher: 36734 ms
[Pipeline] cleanWs
[Pipeline] // withMaven
[WS-CLEANUP] Deleting project workspace...
[WS-CLEANUP] Deferred wipeout is used...
[Pipeline] cleanWs
[WS-CLEANUP] Deleting project workspace...
[WS-CLEANUP] Deferred wipeout is used...
[WS-CLEANUP] done
[Pipeline] }
[WS-CLEANUP] done
[Pipeline] // stage
[Pipeline] }
[Pipeline] }
[Pipeline] // ws
[Pipeline] // stage
[Pipeline] }
[Pipeline] }
[Pipeline] // withEnv
[Pipeline] // ws
[Pipeline] }
[Pipeline] }
[Pipeline] // node
[Pipeline] // withEnv
[Pipeline] }
[Pipeline] }
[Pipeline] // node
[Pipeline] }
[Pipeline] // parallel
[Pipeline] stage
[Pipeline] { (Notifications)
[Pipeline] echo
Build result: UNSTABLE
[Pipeline] jiraIssueSelector
[Pipeline] echo
The authors of changes [slachiewicz].
[Pipeline] echo
Sending email ...
[Pipeline] emailext