Build unstable in Jenkins: Maven » Maven TLP » maven-release » master #19

Previous Topic Next Topic
 
classic Classic list List threaded Threaded
2 messages Options
Reply | Threaded
Open this post in threaded view
|

Build unstable in Jenkins: Maven » Maven TLP » maven-release » master #19

Apache Jenkins Server-2
See https://ci-builds.apache.org/job/Maven/job/maven-box/job/maven-release/job/master/19/

Changes:

* [MRELEASE-1046] Upgrade Plexus Utils to 3.3.0

13 tests failed.
FAILED:  org.apache.maven.shared.release.phase.RestoreBackupPomsPhaseTest.windows-jdk7-m3.2.x_build / Build windows-jdk7-m3.2.x_build / testMultiModulePom

Error Message:
Error restoring from backup POM: F:\jenkins\jenkins-slave\712657a4\workspace\n_maven-box_maven-release_master@2\windows-jdk7-m3.2.x_build\maven-release-manager\target\test-classes\projects\restore-backup-poms\pom-with-modules\pom.xml: The process cannot access the file because it is being used by another process.


Stack Trace:
org.apache.maven.shared.release.ReleaseExecutionException:
Error restoring from backup POM: F:\jenkins\jenkins-slave\712657a4\workspace\n_maven-box_maven-release_master@2\windows-jdk7-m3.2.x_build\maven-release-manager\target\test-classes\projects\restore-backup-poms\pom-with-modules\pom.xml: The process cannot access the file because it is being used by another process.

        at org.apache.maven.shared.release.phase.RestoreBackupPomsPhaseTest.runExecuteOnProjects(RestoreBackupPomsPhaseTest.java:89)
        at org.apache.maven.shared.release.phase.RestoreBackupPomsPhaseTest.testMultiModulePom(RestoreBackupPomsPhaseTest.java:79)
Caused by: java.nio.file.FileSystemException:
F:\jenkins\jenkins-slave\712657a4\workspace\n_maven-box_maven-release_master@2\windows-jdk7-m3.2.x_build\maven-release-manager\target\test-classes\projects\restore-backup-poms\pom-with-modules\pom.xml: The process cannot access the file because it is being used by another process.

        at org.apache.maven.shared.release.phase.RestoreBackupPomsPhaseTest.runExecuteOnProjects(RestoreBackupPomsPhaseTest.java:89)
        at org.apache.maven.shared.release.phase.RestoreBackupPomsPhaseTest.testMultiModulePom(RestoreBackupPomsPhaseTest.java:79)


FAILED:  org.apache.maven.shared.release.phase.RestoreBackupPomsPhaseTest.windows-jdk7-m3.3.x_build / Build windows-jdk7-m3.3.x_build / testBasicPom

Error Message:
Error restoring from backup POM: F:\jenkins\jenkins-slave\712657a4\workspace\n_maven-box_maven-release_master@2\windows-jdk7-m3.3.x_build\maven-release-manager\target\test-classes\projects\restore-backup-poms\basic-pom\pom.xml: The process cannot access the file because it is being used by another process.


Stack Trace:
org.apache.maven.shared.release.ReleaseExecutionException:
Error restoring from backup POM: F:\jenkins\jenkins-slave\712657a4\workspace\n_maven-box_maven-release_master@2\windows-jdk7-m3.3.x_build\maven-release-manager\target\test-classes\projects\restore-backup-poms\basic-pom\pom.xml: The process cannot access the file because it is being used by another process.

        at org.apache.maven.shared.release.phase.RestoreBackupPomsPhaseTest.runExecuteOnProjects(RestoreBackupPomsPhaseTest.java:89)
        at org.apache.maven.shared.release.phase.RestoreBackupPomsPhaseTest.testBasicPom(RestoreBackupPomsPhaseTest.java:63)
Caused by: java.nio.file.FileSystemException:
F:\jenkins\jenkins-slave\712657a4\workspace\n_maven-box_maven-release_master@2\windows-jdk7-m3.3.x_build\maven-release-manager\target\test-classes\projects\restore-backup-poms\basic-pom\pom.xml: The process cannot access the file because it is being used by another process.

        at org.apache.maven.shared.release.phase.RestoreBackupPomsPhaseTest.runExecuteOnProjects(RestoreBackupPomsPhaseTest.java:89)
        at org.apache.maven.shared.release.phase.RestoreBackupPomsPhaseTest.testBasicPom(RestoreBackupPomsPhaseTest.java:63)


FAILED:  org.apache.maven.shared.release.phase.RestoreBackupPomsPhaseTest.windows-jdk7-m3.3.x_build / Build windows-jdk7-m3.3.x_build / testMultiModulePom

Error Message:
Error restoring from backup POM: F:\jenkins\jenkins-slave\712657a4\workspace\n_maven-box_maven-release_master@2\windows-jdk7-m3.3.x_build\maven-release-manager\target\test-classes\projects\restore-backup-poms\pom-with-modules\pom.xml: The process cannot access the file because it is being used by another process.


Stack Trace:
org.apache.maven.shared.release.ReleaseExecutionException:
Error restoring from backup POM: F:\jenkins\jenkins-slave\712657a4\workspace\n_maven-box_maven-release_master@2\windows-jdk7-m3.3.x_build\maven-release-manager\target\test-classes\projects\restore-backup-poms\pom-with-modules\pom.xml: The process cannot access the file because it is being used by another process.

        at org.apache.maven.shared.release.phase.RestoreBackupPomsPhaseTest.runExecuteOnProjects(RestoreBackupPomsPhaseTest.java:89)
        at org.apache.maven.shared.release.phase.RestoreBackupPomsPhaseTest.testMultiModulePom(RestoreBackupPomsPhaseTest.java:79)
Caused by: java.nio.file.FileSystemException:
F:\jenkins\jenkins-slave\712657a4\workspace\n_maven-box_maven-release_master@2\windows-jdk7-m3.3.x_build\maven-release-manager\target\test-classes\projects\restore-backup-poms\pom-with-modules\pom.xml: The process cannot access the file because it is being used by another process.

        at org.apache.maven.shared.release.phase.RestoreBackupPomsPhaseTest.runExecuteOnProjects(RestoreBackupPomsPhaseTest.java:89)
        at org.apache.maven.shared.release.phase.RestoreBackupPomsPhaseTest.testMultiModulePom(RestoreBackupPomsPhaseTest.java:79)


FAILED:  org.apache.maven.shared.release.phase.RestoreBackupPomsPhaseTest.windows-jdk7-m3.6.x_build / Build windows-jdk7-m3.6.x_build / testBasicPom

Error Message:
Error restoring from backup POM: F:\jenkins\jenkins-slave\712657a4\workspace\n_maven-box_maven-release_master@2\windows-jdk7-m3.6.x_build\maven-release-manager\target\test-classes\projects\restore-backup-poms\basic-pom\pom.xml: The process cannot access the file because it is being used by another process.


Stack Trace:
org.apache.maven.shared.release.ReleaseExecutionException:
Error restoring from backup POM: F:\jenkins\jenkins-slave\712657a4\workspace\n_maven-box_maven-release_master@2\windows-jdk7-m3.6.x_build\maven-release-manager\target\test-classes\projects\restore-backup-poms\basic-pom\pom.xml: The process cannot access the file because it is being used by another process.

        at org.apache.maven.shared.release.phase.RestoreBackupPomsPhaseTest.runExecuteOnProjects(RestoreBackupPomsPhaseTest.java:89)
        at org.apache.maven.shared.release.phase.RestoreBackupPomsPhaseTest.testBasicPom(RestoreBackupPomsPhaseTest.java:63)
Caused by: java.nio.file.FileSystemException:
F:\jenkins\jenkins-slave\712657a4\workspace\n_maven-box_maven-release_master@2\windows-jdk7-m3.6.x_build\maven-release-manager\target\test-classes\projects\restore-backup-poms\basic-pom\pom.xml: The process cannot access the file because it is being used by another process.

        at org.apache.maven.shared.release.phase.RestoreBackupPomsPhaseTest.runExecuteOnProjects(RestoreBackupPomsPhaseTest.java:89)
        at org.apache.maven.shared.release.phase.RestoreBackupPomsPhaseTest.testBasicPom(RestoreBackupPomsPhaseTest.java:63)


FAILED:  org.apache.maven.shared.release.phase.RestoreBackupPomsPhaseTest.windows-jdk7-m3.6.x_build / Build windows-jdk7-m3.6.x_build / testMultiModulePom

Error Message:
Error restoring from backup POM: F:\jenkins\jenkins-slave\712657a4\workspace\n_maven-box_maven-release_master@2\windows-jdk7-m3.6.x_build\maven-release-manager\target\test-classes\projects\restore-backup-poms\pom-with-modules\pom.xml: The process cannot access the file because it is being used by another process.


Stack Trace:
org.apache.maven.shared.release.ReleaseExecutionException:
Error restoring from backup POM: F:\jenkins\jenkins-slave\712657a4\workspace\n_maven-box_maven-release_master@2\windows-jdk7-m3.6.x_build\maven-release-manager\target\test-classes\projects\restore-backup-poms\pom-with-modules\pom.xml: The process cannot access the file because it is being used by another process.

        at org.apache.maven.shared.release.phase.RestoreBackupPomsPhaseTest.runExecuteOnProjects(RestoreBackupPomsPhaseTest.java:89)
        at org.apache.maven.shared.release.phase.RestoreBackupPomsPhaseTest.testMultiModulePom(RestoreBackupPomsPhaseTest.java:79)
Caused by: java.nio.file.FileSystemException:
F:\jenkins\jenkins-slave\712657a4\workspace\n_maven-box_maven-release_master@2\windows-jdk7-m3.6.x_build\maven-release-manager\target\test-classes\projects\restore-backup-poms\pom-with-modules\pom.xml: The process cannot access the file because it is being used by another process.

        at org.apache.maven.shared.release.phase.RestoreBackupPomsPhaseTest.runExecuteOnProjects(RestoreBackupPomsPhaseTest.java:89)
        at org.apache.maven.shared.release.phase.RestoreBackupPomsPhaseTest.testMultiModulePom(RestoreBackupPomsPhaseTest.java:79)


FAILED:  org.apache.maven.shared.release.phase.RestoreBackupPomsPhaseTest.windows-jdk7-m3.5.x_build / Build windows-jdk7-m3.5.x_build / testBasicPom

Error Message:
Error restoring from backup POM: F:\jenkins\jenkins-slave\712657a4\workspace\n_maven-box_maven-release_master@2\windows-jdk7-m3.5.x_build\maven-release-manager\target\test-classes\projects\restore-backup-poms\basic-pom\pom.xml: The process cannot access the file because it is being used by another process.


Stack Trace:
org.apache.maven.shared.release.ReleaseExecutionException:
Error restoring from backup POM: F:\jenkins\jenkins-slave\712657a4\workspace\n_maven-box_maven-release_master@2\windows-jdk7-m3.5.x_build\maven-release-manager\target\test-classes\projects\restore-backup-poms\basic-pom\pom.xml: The process cannot access the file because it is being used by another process.

        at org.apache.maven.shared.release.phase.RestoreBackupPomsPhaseTest.runExecuteOnProjects(RestoreBackupPomsPhaseTest.java:89)
        at org.apache.maven.shared.release.phase.RestoreBackupPomsPhaseTest.testBasicPom(RestoreBackupPomsPhaseTest.java:63)
Caused by: java.nio.file.FileSystemException:
F:\jenkins\jenkins-slave\712657a4\workspace\n_maven-box_maven-release_master@2\windows-jdk7-m3.5.x_build\maven-release-manager\target\test-classes\projects\restore-backup-poms\basic-pom\pom.xml: The process cannot access the file because it is being used by another process.

        at org.apache.maven.shared.release.phase.RestoreBackupPomsPhaseTest.runExecuteOnProjects(RestoreBackupPomsPhaseTest.java:89)
        at org.apache.maven.shared.release.phase.RestoreBackupPomsPhaseTest.testBasicPom(RestoreBackupPomsPhaseTest.java:63)


FAILED:  org.apache.maven.shared.release.phase.RestoreBackupPomsPhaseTest.windows-jdk7-m3.5.x_build / Build windows-jdk7-m3.5.x_build / testMultiModulePom

Error Message:
Error restoring from backup POM: F:\jenkins\jenkins-slave\712657a4\workspace\n_maven-box_maven-release_master@2\windows-jdk7-m3.5.x_build\maven-release-manager\target\test-classes\projects\restore-backup-poms\pom-with-modules\pom.xml: The process cannot access the file because it is being used by another process.


Stack Trace:
org.apache.maven.shared.release.ReleaseExecutionException:
Error restoring from backup POM: F:\jenkins\jenkins-slave\712657a4\workspace\n_maven-box_maven-release_master@2\windows-jdk7-m3.5.x_build\maven-release-manager\target\test-classes\projects\restore-backup-poms\pom-with-modules\pom.xml: The process cannot access the file because it is being used by another process.

        at org.apache.maven.shared.release.phase.RestoreBackupPomsPhaseTest.runExecuteOnProjects(RestoreBackupPomsPhaseTest.java:89)
        at org.apache.maven.shared.release.phase.RestoreBackupPomsPhaseTest.testMultiModulePom(RestoreBackupPomsPhaseTest.java:79)
Caused by: java.nio.file.FileSystemException:
F:\jenkins\jenkins-slave\712657a4\workspace\n_maven-box_maven-release_master@2\windows-jdk7-m3.5.x_build\maven-release-manager\target\test-classes\projects\restore-backup-poms\pom-with-modules\pom.xml: The process cannot access the file because it is being used by another process.

        at org.apache.maven.shared.release.phase.RestoreBackupPomsPhaseTest.runExecuteOnProjects(RestoreBackupPomsPhaseTest.java:89)
        at org.apache.maven.shared.release.phase.RestoreBackupPomsPhaseTest.testMultiModulePom(RestoreBackupPomsPhaseTest.java:79)


FAILED:  org.apache.maven.shared.release.phase.RestoreBackupPomsPhaseTest.windows-jdk8-m3.6.x_build / Build windows-jdk8-m3.6.x_build / testBasicPom

Error Message:
Error restoring from backup POM: F:\jenkins\jenkins-slave\712657a4\workspace\n_maven-box_maven-release_master@2\windows-jdk8-m3.6.x_build\maven-release-manager\target\test-classes\projects\restore-backup-poms\basic-pom\pom.xml: The process cannot access the file because it is being used by another process.


Stack Trace:
org.apache.maven.shared.release.ReleaseExecutionException:
Error restoring from backup POM: F:\jenkins\jenkins-slave\712657a4\workspace\n_maven-box_maven-release_master@2\windows-jdk8-m3.6.x_build\maven-release-manager\target\test-classes\projects\restore-backup-poms\basic-pom\pom.xml: The process cannot access the file because it is being used by another process.

        at org.apache.maven.shared.release.phase.RestoreBackupPomsPhaseTest.runExecuteOnProjects(RestoreBackupPomsPhaseTest.java:89)
        at org.apache.maven.shared.release.phase.RestoreBackupPomsPhaseTest.testBasicPom(RestoreBackupPomsPhaseTest.java:63)
Caused by: java.nio.file.FileSystemException:
F:\jenkins\jenkins-slave\712657a4\workspace\n_maven-box_maven-release_master@2\windows-jdk8-m3.6.x_build\maven-release-manager\target\test-classes\projects\restore-backup-poms\basic-pom\pom.xml: The process cannot access the file because it is being used by another process.

        at org.apache.maven.shared.release.phase.RestoreBackupPomsPhaseTest.runExecuteOnProjects(RestoreBackupPomsPhaseTest.java:89)
        at org.apache.maven.shared.release.phase.RestoreBackupPomsPhaseTest.testBasicPom(RestoreBackupPomsPhaseTest.java:63)


FAILED:  org.apache.maven.shared.release.phase.RestoreBackupPomsPhaseTest.windows-jdk8-m3.6.x_build / Build windows-jdk8-m3.6.x_build / testMultiModulePom

Error Message:
Error restoring from backup POM: F:\jenkins\jenkins-slave\712657a4\workspace\n_maven-box_maven-release_master@2\windows-jdk8-m3.6.x_build\maven-release-manager\target\test-classes\projects\restore-backup-poms\pom-with-modules\pom.xml: The process cannot access the file because it is being used by another process.


Stack Trace:
org.apache.maven.shared.release.ReleaseExecutionException:
Error restoring from backup POM: F:\jenkins\jenkins-slave\712657a4\workspace\n_maven-box_maven-release_master@2\windows-jdk8-m3.6.x_build\maven-release-manager\target\test-classes\projects\restore-backup-poms\pom-with-modules\pom.xml: The process cannot access the file because it is being used by another process.

        at org.apache.maven.shared.release.phase.RestoreBackupPomsPhaseTest.runExecuteOnProjects(RestoreBackupPomsPhaseTest.java:89)
        at org.apache.maven.shared.release.phase.RestoreBackupPomsPhaseTest.testMultiModulePom(RestoreBackupPomsPhaseTest.java:79)
Caused by: java.nio.file.FileSystemException:
F:\jenkins\jenkins-slave\712657a4\workspace\n_maven-box_maven-release_master@2\windows-jdk8-m3.6.x_build\maven-release-manager\target\test-classes\projects\restore-backup-poms\pom-with-modules\pom.xml: The process cannot access the file because it is being used by another process.

        at org.apache.maven.shared.release.phase.RestoreBackupPomsPhaseTest.runExecuteOnProjects(RestoreBackupPomsPhaseTest.java:89)
        at org.apache.maven.shared.release.phase.RestoreBackupPomsPhaseTest.testMultiModulePom(RestoreBackupPomsPhaseTest.java:79)


FAILED:  org.apache.maven.shared.release.phase.RestoreBackupPomsPhaseTest.windows-jdk11-m3.6.x_build / Build windows-jdk11-m3.6.x_build / testBasicPom

Error Message:
Error restoring from backup POM: F:\jenkins\jenkins-slave\712657a4\workspace\n_maven-box_maven-release_master@2\windows-jdk11-m3.6.x_build\maven-release-manager\target\test-classes\projects\restore-backup-poms\basic-pom\pom.xml: The process cannot access the file because it is being used by another process.


Stack Trace:
org.apache.maven.shared.release.ReleaseExecutionException:
Error restoring from backup POM: F:\jenkins\jenkins-slave\712657a4\workspace\n_maven-box_maven-release_master@2\windows-jdk11-m3.6.x_build\maven-release-manager\target\test-classes\projects\restore-backup-poms\basic-pom\pom.xml: The process cannot access the file because it is being used by another process.

        at org.apache.maven.shared.release.phase.RestoreBackupPomsPhaseTest.runExecuteOnProjects(RestoreBackupPomsPhaseTest.java:89)
        at org.apache.maven.shared.release.phase.RestoreBackupPomsPhaseTest.testBasicPom(RestoreBackupPomsPhaseTest.java:63)
Caused by: java.nio.file.FileSystemException:
F:\jenkins\jenkins-slave\712657a4\workspace\n_maven-box_maven-release_master@2\windows-jdk11-m3.6.x_build\maven-release-manager\target\test-classes\projects\restore-backup-poms\basic-pom\pom.xml: The process cannot access the file because it is being used by another process.

        at org.apache.maven.shared.release.phase.RestoreBackupPomsPhaseTest.runExecuteOnProjects(RestoreBackupPomsPhaseTest.java:89)
        at org.apache.maven.shared.release.phase.RestoreBackupPomsPhaseTest.testBasicPom(RestoreBackupPomsPhaseTest.java:63)


FAILED:  org.apache.maven.shared.release.phase.RestoreBackupPomsPhaseTest.windows-jdk11-m3.6.x_build / Build windows-jdk11-m3.6.x_build / testMultiModulePom

Error Message:
Error restoring from backup POM: F:\jenkins\jenkins-slave\712657a4\workspace\n_maven-box_maven-release_master@2\windows-jdk11-m3.6.x_build\maven-release-manager\target\test-classes\projects\restore-backup-poms\pom-with-modules\pom.xml: The process cannot access the file because it is being used by another process.


Stack Trace:
org.apache.maven.shared.release.ReleaseExecutionException:
Error restoring from backup POM: F:\jenkins\jenkins-slave\712657a4\workspace\n_maven-box_maven-release_master@2\windows-jdk11-m3.6.x_build\maven-release-manager\target\test-classes\projects\restore-backup-poms\pom-with-modules\pom.xml: The process cannot access the file because it is being used by another process.

        at org.apache.maven.shared.release.phase.RestoreBackupPomsPhaseTest.runExecuteOnProjects(RestoreBackupPomsPhaseTest.java:89)
        at org.apache.maven.shared.release.phase.RestoreBackupPomsPhaseTest.testMultiModulePom(RestoreBackupPomsPhaseTest.java:79)
Caused by: java.nio.file.FileSystemException:
F:\jenkins\jenkins-slave\712657a4\workspace\n_maven-box_maven-release_master@2\windows-jdk11-m3.6.x_build\maven-release-manager\target\test-classes\projects\restore-backup-poms\pom-with-modules\pom.xml: The process cannot access the file because it is being used by another process.

        at org.apache.maven.shared.release.phase.RestoreBackupPomsPhaseTest.runExecuteOnProjects(RestoreBackupPomsPhaseTest.java:89)
        at org.apache.maven.shared.release.phase.RestoreBackupPomsPhaseTest.testMultiModulePom(RestoreBackupPomsPhaseTest.java:79)


FAILED:  org.apache.maven.shared.release.phase.RestoreBackupPomsPhaseTest.windows-jdk15-m3.6.x_build / Build windows-jdk15-m3.6.x_build / testBasicPom

Error Message:
Error restoring from backup POM: F:\jenkins\jenkins-slave\712657a4\workspace\n_maven-box_maven-release_master@2\windows-jdk15-m3.6.x_build\maven-release-manager\target\test-classes\projects\restore-backup-poms\basic-pom\pom.xml: The process cannot access the file because it is being used by another process

Stack Trace:
org.apache.maven.shared.release.ReleaseExecutionException: Error restoring from backup POM: F:\jenkins\jenkins-slave\712657a4\workspace\n_maven-box_maven-release_master@2\windows-jdk15-m3.6.x_build\maven-release-manager\target\test-classes\projects\restore-backup-poms\basic-pom\pom.xml: The process cannot access the file because it is being used by another process
        at org.apache.maven.shared.release.phase.RestoreBackupPomsPhaseTest.runExecuteOnProjects(RestoreBackupPomsPhaseTest.java:89)
        at org.apache.maven.shared.release.phase.RestoreBackupPomsPhaseTest.testBasicPom(RestoreBackupPomsPhaseTest.java:63)
Caused by: java.nio.file.FileSystemException: F:\jenkins\jenkins-slave\712657a4\workspace\n_maven-box_maven-release_master@2\windows-jdk15-m3.6.x_build\maven-release-manager\target\test-classes\projects\restore-backup-poms\basic-pom\pom.xml: The process cannot access the file because it is being used by another process
        at org.apache.maven.shared.release.phase.RestoreBackupPomsPhaseTest.runExecuteOnProjects(RestoreBackupPomsPhaseTest.java:89)
        at org.apache.maven.shared.release.phase.RestoreBackupPomsPhaseTest.testBasicPom(RestoreBackupPomsPhaseTest.java:63)


FAILED:  org.apache.maven.shared.release.phase.RestoreBackupPomsPhaseTest.windows-jdk15-m3.6.x_build / Build windows-jdk15-m3.6.x_build / testMultiModulePom

Error Message:
Error restoring from backup POM: F:\jenkins\jenkins-slave\712657a4\workspace\n_maven-box_maven-release_master@2\windows-jdk15-m3.6.x_build\maven-release-manager\target\test-classes\projects\restore-backup-poms\pom-with-modules\pom.xml: The process cannot access the file because it is being used by another process

Stack Trace:
org.apache.maven.shared.release.ReleaseExecutionException: Error restoring from backup POM: F:\jenkins\jenkins-slave\712657a4\workspace\n_maven-box_maven-release_master@2\windows-jdk15-m3.6.x_build\maven-release-manager\target\test-classes\projects\restore-backup-poms\pom-with-modules\pom.xml: The process cannot access the file because it is being used by another process
        at org.apache.maven.shared.release.phase.RestoreBackupPomsPhaseTest.runExecuteOnProjects(RestoreBackupPomsPhaseTest.java:89)
        at org.apache.maven.shared.release.phase.RestoreBackupPomsPhaseTest.testMultiModulePom(RestoreBackupPomsPhaseTest.java:79)
Caused by: java.nio.file.FileSystemException: F:\jenkins\jenkins-slave\712657a4\workspace\n_maven-box_maven-release_master@2\windows-jdk15-m3.6.x_build\maven-release-manager\target\test-classes\projects\restore-backup-poms\pom-with-modules\pom.xml: The process cannot access the file because it is being used by another process
        at org.apache.maven.shared.release.phase.RestoreBackupPomsPhaseTest.runExecuteOnProjects(RestoreBackupPomsPhaseTest.java:89)
        at org.apache.maven.shared.release.phase.RestoreBackupPomsPhaseTest.testMultiModulePom(RestoreBackupPomsPhaseTest.java:79)




Build log:
[...truncated 26529 lines...]
[INFO] Building: setup\maven-scm-provider-dummy\pom.xml
[INFO]           setup\maven-scm-provider-dummy\pom.xml ........... SUCCESS (8.2 s)
[INFO] Building: setup\maven-scm-provider-stub\pom.xml
[INFO]           setup\maven-scm-provider-stub\pom.xml ............ SUCCESS (5.8 s)
[INFO] Building: setup\maven-wagon-provider-dummy\pom.xml
[INFO]           setup\maven-wagon-provider-dummy\pom.xml ......... SUCCESS (6.0 s)
[INFO] Setup done.
[INFO] Building: projects\branch\MRELEASE-458\pom.xml
[INFO] run post-build script verify.bsh
WARNING: An illegal reflective access operation has occurred
WARNING: Illegal reflective access by bsh.reflect.ReflectManagerImpl (file:/f:/jenkins/jenkins-slave/712657a4/workspace/.maven_repositories/0/org/beanshell/bsh/2.0b4/bsh-2.0b4.jar) to method java.lang.AbstractStringBuilder.append(java.lang.String)
WARNING: Please consider reporting this to the maintainers of bsh.reflect.ReflectManagerImpl
WARNING: Use --illegal-access=warn to enable warnings of further illegal reflective access operations
WARNING: All illegal access operations will be denied in a future release
[INFO]           projects\branch\MRELEASE-458\pom.xml ............. SUCCESS (9.7 s)
[INFO] Building: projects\branch\MRELEASE-694\pom.xml
[INFO] run post-build script verify.groovy
[INFO]           projects\branch\MRELEASE-694\pom.xml ............. SUCCESS (8.7 s)
[INFO] Building: projects\branch\MRELEASE-745\pom.xml
[INFO] run post-build script verify.groovy
[INFO]           projects\branch\MRELEASE-745\pom.xml ............. SUCCESS (3.9 s)
[INFO] Building: projects\branch\MRELEASE-976\pom.xml
[withMaven] junitPublisher - Archive test results for Maven artifact org.apache.maven.release:maven-release-manager:jar:3.0.0-SNAPSHOT generated by maven-failsafe-plugin:integration-test (default): linux-jdk7-m3.5.x_build/maven-release-manager/target/failsafe-reports/*.xml
Recording test results
[withMaven] openTasksPublisher - Scan Tasks for Maven artifact org.apache.maven.release:maven-release-api:jar:3.0.0-SNAPSHOT in source directory linux-jdk7-m3.5.x_build/maven-release-api/src/main/java
[withMaven] openTasksPublisher - Scan Tasks for Maven artifact org.apache.maven.release:maven-release-manager:jar:3.0.0-SNAPSHOT in source directory linux-jdk7-m3.5.x_build/maven-release-manager/src/main/java
[withMaven] openTasksPublisher - Scan Tasks for Maven artifact org.apache.maven.release:maven-release-oddeven-policy:jar:3.0.0-SNAPSHOT in source directory linux-jdk7-m3.5.x_build/maven-release-policies/maven-release-oddeven-policy/src/main/java
[withMaven] openTasksPublisher - Scan Tasks for Maven artifact org.apache.maven.release:maven-release-semver-policy:jar:3.0.0-SNAPSHOT in source directory linux-jdk7-m3.5.x_build/maven-release-policies/maven-release-semver-policy/src/main/java
[withMaven] openTasksPublisher - Scan Tasks for Maven artifact org.apache.maven.plugins:maven-release-plugin:maven-plugin:3.0.0-SNAPSHOT in source directory linux-jdk7-m3.5.x_build/maven-release-plugin/src/main/java
[TASKS] Scanning folder '/home/jenkins/workspace/n_maven-box_maven-release_master@2@2' for files matching the pattern 'linux-jdk7-m3.5.x_build/maven-release-api/src/main/java/**/*,linux-jdk7-m3.5.x_build/maven-release-manager/src/main/java/**/*,linux-jdk7-m3.5.x_build/maven-release-policies/maven-release-oddeven-policy/src/main/java/**/*,linux-jdk7-m3.5.x_build/maven-release-policies/maven-release-semver-policy/src/main/java/**/*,linux-jdk7-m3.5.x_build/maven-release-plugin/src/main/java/**/*' - excludes: null
[TASKS] Found 131 files to scan for tasks
[TASKS] Found 24 open tasks.
Skipping warnings blame since pipelines do not have an SCM link.%n
[TASKS] Computing warning deltas based on reference build #18
[INFO] run post-build script verify.groovy
[INFO]           projects\branch\MRELEASE-976\pom.xml ............. SUCCESS (6.6 s)
[INFO] Building: projects\perform\MRELEASE-459\pom.xml
[withMaven] invokerPublisher - Archive invoker results for Maven artifact MavenArtifact{org.apache.maven.plugins:maven-release-plugin:maven-plugin:3.0.0-SNAPSHOT(version: 3.0.0-SNAPSHOT, snapshot:false) } generated by PluginInvocation{org.apache.maven.plugins:maven-invoker-plugin:3.2.0@run  integration-test-prepare}: linux-jdk7-m3.5.x_build/maven-release-plugin/target/invoker-reports/*.xml
[INFO] run post-build script verify.groovy
[INFO]           projects\perform\MRELEASE-459\pom.xml ............ SUCCESS (11.1 s)
[INFO] Building: projects\perform\MRELEASE-592\pom.xml
[INFO]           projects\perform\MRELEASE-592\pom.xml ............ SUCCESS (7.2 s)
[INFO] Building: projects\perform\MRELEASE-736\pom.xml
[withMaven] Publishers: Generated Artifacts Publisher: 8202 ms, Junit Publisher: 38674 ms, Open Task Scanner Publisher: 8075 ms, Dependencies Fingerprint Publisher: 4560 ms, Invoker Publisher: 83074 ms, Pipeline Graph Publisher: 2 ms
[Pipeline] // withMaven
[Pipeline] cleanWs
[INFO]           projects\perform\MRELEASE-736\pom.xml ............ SUCCESS (8.4 s)
[INFO] Building: projects\perform\MRELEASE-818\pom.xml
[WS-CLEANUP] Deleting project workspace...
[WS-CLEANUP] Deferred wipeout is used...
[WS-CLEANUP] done
[Pipeline] }
[Pipeline] // stage
[Pipeline] }
[Pipeline] // ws
[Pipeline] }
[Pipeline] // node
[Pipeline] }
[INFO] run post-build script verify.groovy
[INFO]           projects\perform\MRELEASE-818\pom.xml ............ SUCCESS (8.3 s)
[INFO] Building: projects\perform\MRELEASE-832\pom.xml
[INFO] run post-build script verify.groovy
[INFO]           projects\perform\MRELEASE-832\pom.xml ............ SUCCESS (3.9 s)
[INFO] Building: projects\prepare\completion-goals\pom.xml
[INFO] run post-build script verify.bsh
[INFO]           projects\prepare\completion-goals\pom.xml ........ SUCCESS (8.0 s)
[INFO] Building: projects\prepare\fail-on-snapshots\pom.xml
[INFO] run post-build script verify.groovy
[INFO]           projects\prepare\fail-on-snapshots\pom.xml ....... SUCCESS (5.4 s)
[INFO] Building: projects\prepare\flat-multi-module\parent-project\pom.xml
[INFO] run post-build script verify.bsh
[INFO]           projects\prepare\flat-multi-module\parent-project\pom.xml SUCCESS (12.8 s)
[INFO] Building: projects\prepare\forked-basic\pom.xml
[INFO]           projects\prepare\forked-basic\pom.xml ............ SUCCESS (6.0 s)
[INFO] Building: projects\prepare\invoker-basic\pom.xml
[INFO]           projects\prepare\invoker-basic\pom.xml ........... SUCCESS (6.2 s)
[INFO] Building: projects\prepare\MRELEASE-128\pom.xml
[INFO] run post-build script verify.groovy
[INFO]           projects\prepare\MRELEASE-128\pom.xml ............ SUCCESS (8.0 s)
[INFO] Building: projects\prepare\MRELEASE-156\pom.xml
[withMaven] Publishers: Generated Artifacts Publisher: 10795 ms, Junit Publisher: 55540 ms, Open Task Scanner Publisher: 7095 ms, Dependencies Fingerprint Publisher: 4566 ms, Invoker Publisher: 83948 ms, Pipeline Graph Publisher: 2 ms
[Pipeline] // withMaven
[Pipeline] cleanWs
[WS-CLEANUP] Deleting project workspace...
[WS-CLEANUP] Deferred wipeout is used...
[INFO] run post-build script verify.groovy
[INFO]           projects\prepare\MRELEASE-156\pom.xml ............ SUCCESS (8.1 s)
[INFO] Building: projects\prepare\MRELEASE-161\pom.xml
[WS-CLEANUP] done
[Pipeline] }
[Pipeline] // stage
[Pipeline] }
[Pipeline] // ws
[Pipeline] }
[Pipeline] // node
[Pipeline] }
[INFO] run post-build script verify.groovy
[INFO]           projects\prepare\MRELEASE-161\pom.xml ............ SUCCESS (11.3 s)
[INFO] Building: projects\prepare\MRELEASE-161-dependencyManagement\pom.xml
[INFO] run post-build script verify.groovy
[INFO]           projects\prepare\MRELEASE-161-dependencyManagement\pom.xml SUCCESS (9.5 s)
[INFO] Building: projects\prepare\MRELEASE-420\pom.xml
[INFO] run post-build script verify.groovy
[INFO]           projects\prepare\MRELEASE-420\pom.xml ............ SUCCESS (8.1 s)
[INFO] Building: projects\prepare\MRELEASE-483\pom.xml
[INFO] run post-build script verify.groovy
[INFO]           projects\prepare\MRELEASE-483\pom.xml ............ SUCCESS (7.7 s)
[INFO] Building: projects\prepare\MRELEASE-533\other-pom.xml
[INFO] run post-build script verify.groovy
[INFO]           projects\prepare\MRELEASE-533\other-pom.xml ...... SUCCESS (7.5 s)
[INFO] Building: projects\prepare\MRELEASE-571_M3\pom.xml
[INFO] run post-build script verify.groovy
[INFO]           projects\prepare\MRELEASE-571_M3\pom.xml ......... SUCCESS (8.9 s)
[INFO] Building: projects\prepare\MRELEASE-618\my-pom.xml
[INFO] run post-build script verify.groovy
[INFO]           projects\prepare\MRELEASE-618\my-pom.xml ......... SUCCESS (7.7 s)
[INFO] Building: projects\prepare\MRELEASE-667\pom.xml
[INFO] run post-build script verify.groovy
[INFO]           projects\prepare\MRELEASE-667\pom.xml ............ SUCCESS (8.4 s)
[INFO] Building: projects\prepare\MRELEASE-834\pom.xml
[INFO]           projects\prepare\MRELEASE-834\pom.xml ............ SUCCESS (6.3 s)
[INFO] Building: projects\prepare\MRELEASE-835\pom.xml
[INFO] run post-build script verify.groovy
[INFO]           projects\prepare\MRELEASE-835\pom.xml ............ SUCCESS (8.2 s)
[INFO] Building: projects\prepare\MRELEASE-966\my-pom.xml
[INFO] run post-build script verify.groovy
[INFO]           projects\prepare\MRELEASE-966\my-pom.xml ......... SUCCESS (8.0 s)
[INFO] Building: projects\prepare\MRELEASE-976\pom.xml
[INFO] run post-build script verify.groovy
[INFO]           projects\prepare\MRELEASE-976\pom.xml ............ SUCCESS (8.2 s)
[INFO] Building: projects\prepare\MRELEASE-985\pom.xml
[INFO] run post-build script verify.groovy
[INFO]           projects\prepare\MRELEASE-985\pom.xml ............ SUCCESS (9.6 s)
[INFO] Building: projects\prepare\namespace\pom.xml
[INFO] run post-build script verify.groovy
[INFO]           projects\prepare\namespace\pom.xml ............... SUCCESS (8.1 s)
[INFO] Building: projects\prepare\oddeven-policy\pom.xml
[INFO]           projects\prepare\oddeven-policy\pom.xml .......... SUCCESS (7.6 s)
[INFO] Building: projects\prepare\regular-multi-module\pom.xml
[INFO] run post-build script verify.bsh
[INFO]           projects\prepare\regular-multi-module\pom.xml .... SUCCESS (10.8 s)
[INFO] Building: projects\prepare\semver-policy\pom.xml
[INFO]           projects\prepare\semver-policy\pom.xml ........... SUCCESS (7.9 s)
[INFO] Building: projects\prepare-with-pom\finalname-basic\pom.xml
[INFO] run post-build script verify.groovy
[INFO]           projects\prepare-with-pom\finalname-basic\pom.xml  SUCCESS (8.1 s)
[INFO] Building: projects\prepare-with-pom\finalname-multimodule\pom.xml
[INFO] run post-build script verify.groovy
[INFO]           projects\prepare-with-pom\finalname-multimodule\pom.xml SUCCESS (8.4 s)
[INFO] Building: projects\prepare-with-pom\MRELEASE-808\pom.xml
[INFO] run post-build script verify.groovy
[INFO]           projects\prepare-with-pom\MRELEASE-808\pom.xml ... SUCCESS (8.4 s)
[INFO] Building: projects\update-versions\MRELEASE-555\pom.xml
[INFO] run post-build script verify.groovy
[INFO]           projects\update-versions\MRELEASE-555\pom.xml .... SUCCESS (3.9 s)
[INFO] Building: projects\update-versions\MRELEASE-611\pom.xml
[INFO] run post-build script verify.groovy
[INFO]           projects\update-versions\MRELEASE-611\pom.xml .... SUCCESS (3.8 s)
[INFO] Building: projects\update-versions\MRELEASE-783\pom.xml
[INFO]           projects\update-versions\MRELEASE-783\pom.xml .... SUCCESS (3.8 s)
[INFO] Building: projects\update-versions\MRELEASE-976\pom.xml
[INFO] run post-build script verify.groovy
[INFO]           projects\update-versions\MRELEASE-976\pom.xml .... SUCCESS (3.8 s)
[INFO] -------------------------------------------------
[INFO] Build Summary:
[INFO]   Passed: 40, Failed: 0, Errors: 0, Skipped: 0
[INFO] -------------------------------------------------
[INFO]
[INFO] --- mrm-maven-plugin:1.2.0:stop (default) @ maven-release-plugin ---
[INFO] Stopping Mock Repository Manager on http://localhost:49426
[INFO] Stopped SocketConnector@0.0.0.0:49426
[INFO] Mock Repository Manager http://localhost:49426 is stopped.
[INFO]
[INFO] --- maven-checkstyle-plugin:3.0.0:check (checkstyle-check) @ maven-release-plugin ---
[INFO] ------------------------------------------------------------------------
[INFO] Reactor Summary for Maven Release 3.0.0-SNAPSHOT:
[INFO]
[INFO] Maven Release ...................................... SUCCESS [  4.718 s]
[INFO] Maven Release APIs ................................. SUCCESS [  4.454 s]
[INFO] Maven Release Manager .............................. SUCCESS [02:02 min]
[INFO] Maven Release Odd-Even Policy ...................... SUCCESS [  2.026 s]
[INFO] Maven Release SemVer Policy ........................ SUCCESS [  2.370 s]
[INFO] Maven Release Plugin ............................... SUCCESS [06:11 min]
[INFO] ------------------------------------------------------------------------
[INFO] BUILD SUCCESS
[INFO] ------------------------------------------------------------------------
[INFO] Total time:  08:28 min
[INFO] Finished at: 2020-12-23T01:41:01-08:00
[INFO] ------------------------------------------------------------------------
[INFO] [jenkins-event-spy] Generated F:\jenkins\jenkins-slave\712657a4\workspace\n_maven-box_maven-release_master@2@tmp\withMavenb7498e85\maven-spy-20201223-013232-46814208527416499450438.log
[Pipeline] }
[Pipeline] // dir
[Pipeline] }
[withMaven] artifactsPublisher - Archive artifact windows-jdk15-m3.6.x_build\pom.xml under org\apache\maven\release\maven-release\3.0.0-SNAPSHOT\maven-release-3.0.0-SNAPSHOT.pom
[withMaven] artifactsPublisher - Archive artifact windows-jdk15-m3.6.x_build\target\maven-release-3.0.0-SNAPSHOT-site.xml under org\apache\maven\release\maven-release\3.0.0-SNAPSHOT\maven-release-3.0.0-SNAPSHOT-site.xml
[withMaven] artifactsPublisher - Archive artifact windows-jdk15-m3.6.x_build\maven-release-api\pom.xml under org\apache\maven\release\maven-release-api\3.0.0-SNAPSHOT\maven-release-api-3.0.0-SNAPSHOT.pom
[withMaven] artifactsPublisher - Archive artifact windows-jdk15-m3.6.x_build\maven-release-api\target\maven-release-api-3.0.0-SNAPSHOT.jar under org\apache\maven\release\maven-release-api\3.0.0-SNAPSHOT\maven-release-api-3.0.0-SNAPSHOT.jar
[withMaven] artifactsPublisher - Archive artifact windows-jdk15-m3.6.x_build\maven-release-manager\pom.xml under org\apache\maven\release\maven-release-manager\3.0.0-SNAPSHOT\maven-release-manager-3.0.0-SNAPSHOT.pom
[withMaven] artifactsPublisher - Archive artifact windows-jdk15-m3.6.x_build\maven-release-manager\target\maven-release-manager-3.0.0-SNAPSHOT.jar under org\apache\maven\release\maven-release-manager\3.0.0-SNAPSHOT\maven-release-manager-3.0.0-SNAPSHOT.jar
[withMaven] artifactsPublisher - Archive artifact windows-jdk15-m3.6.x_build\maven-release-policies\maven-release-oddeven-policy\pom.xml under org\apache\maven\release\maven-release-oddeven-policy\3.0.0-SNAPSHOT\maven-release-oddeven-policy-3.0.0-SNAPSHOT.pom
[withMaven] artifactsPublisher - Archive artifact windows-jdk15-m3.6.x_build\maven-release-policies\maven-release-oddeven-policy\target\maven-release-oddeven-policy-3.0.0-SNAPSHOT.jar under org\apache\maven\release\maven-release-oddeven-policy\3.0.0-SNAPSHOT\maven-release-oddeven-policy-3.0.0-SNAPSHOT.jar
[withMaven] artifactsPublisher - Archive artifact windows-jdk15-m3.6.x_build\maven-release-policies\maven-release-semver-policy\pom.xml under org\apache\maven\release\maven-release-semver-policy\3.0.0-SNAPSHOT\maven-release-semver-policy-3.0.0-SNAPSHOT.pom
[withMaven] artifactsPublisher - Archive artifact windows-jdk15-m3.6.x_build\maven-release-policies\maven-release-semver-policy\target\maven-release-semver-policy-3.0.0-SNAPSHOT.jar under org\apache\maven\release\maven-release-semver-policy\3.0.0-SNAPSHOT\maven-release-semver-policy-3.0.0-SNAPSHOT.jar
[withMaven] artifactsPublisher - Archive artifact windows-jdk15-m3.6.x_build\maven-release-plugin\pom.xml under org\apache\maven\plugins\maven-release-plugin\3.0.0-SNAPSHOT\maven-release-plugin-3.0.0-SNAPSHOT.pom
[withMaven] artifactsPublisher - Archive artifact windows-jdk15-m3.6.x_build\maven-release-plugin\target\maven-release-plugin-3.0.0-SNAPSHOT.jar under org\apache\maven\plugins\maven-release-plugin\3.0.0-SNAPSHOT\maven-release-plugin-3.0.0-SNAPSHOT.jar
[withMaven] junitPublisher - Archive test results for Maven artifact org.apache.maven.release:maven-release-api:jar:3.0.0-SNAPSHOT generated by maven-surefire-plugin:test (default-test): windows-jdk15-m3.6.x_build\maven-release-api\target\surefire-reports\*.xml
[withMaven] junitPublisher - Archive test results for Maven artifact org.apache.maven.release:maven-release-manager:jar:3.0.0-SNAPSHOT generated by maven-surefire-plugin:test (default-test): windows-jdk15-m3.6.x_build\maven-release-manager\target\surefire-reports\*.xml
[withMaven] junitPublisher - Archive test results for Maven artifact org.apache.maven.release:maven-release-oddeven-policy:jar:3.0.0-SNAPSHOT generated by maven-surefire-plugin:test (default-test): windows-jdk15-m3.6.x_build\maven-release-policies\maven-release-oddeven-policy\target\surefire-reports\*.xml
[withMaven] junitPublisher - Archive test results for Maven artifact org.apache.maven.release:maven-release-semver-policy:jar:3.0.0-SNAPSHOT generated by maven-surefire-plugin:test (default-test): windows-jdk15-m3.6.x_build\maven-release-policies\maven-release-semver-policy\target\surefire-reports\*.xml
[withMaven] junitPublisher - Archive test results for Maven artifact org.apache.maven.plugins:maven-release-plugin:maven-plugin:3.0.0-SNAPSHOT generated by maven-surefire-plugin:test (default-test): windows-jdk15-m3.6.x_build\maven-release-plugin\target\surefire-reports\*.xml
Recording test results
[withMaven] junitPublisher - Archive test results for Maven artifact org.apache.maven.release:maven-release-manager:jar:3.0.0-SNAPSHOT generated by maven-failsafe-plugin:integration-test (default): windows-jdk15-m3.6.x_build\maven-release-manager\target\failsafe-reports\*.xml
Recording test results
[withMaven] openTasksPublisher - Scan Tasks for Maven artifact org.apache.maven.release:maven-release-api:jar:3.0.0-SNAPSHOT in source directory windows-jdk15-m3.6.x_build\maven-release-api\src\main\java
[withMaven] openTasksPublisher - Scan Tasks for Maven artifact org.apache.maven.release:maven-release-manager:jar:3.0.0-SNAPSHOT in source directory windows-jdk15-m3.6.x_build\maven-release-manager\src\main\java
[withMaven] openTasksPublisher - Scan Tasks for Maven artifact org.apache.maven.release:maven-release-oddeven-policy:jar:3.0.0-SNAPSHOT in source directory windows-jdk15-m3.6.x_build\maven-release-policies\maven-release-oddeven-policy\src\main\java
[withMaven] openTasksPublisher - Scan Tasks for Maven artifact org.apache.maven.release:maven-release-semver-policy:jar:3.0.0-SNAPSHOT in source directory windows-jdk15-m3.6.x_build\maven-release-policies\maven-release-semver-policy\src\main\java
[withMaven] openTasksPublisher - Scan Tasks for Maven artifact org.apache.maven.plugins:maven-release-plugin:maven-plugin:3.0.0-SNAPSHOT in source directory windows-jdk15-m3.6.x_build\maven-release-plugin\src\main\java
[TASKS] Scanning folder 'f:\jenkins\jenkins-slave\712657a4\workspace\n_maven-box_maven-release_master@2' for files matching the pattern 'windows-jdk15-m3.6.x_build\maven-release-api\src\main\java\**\*,windows-jdk15-m3.6.x_build\maven-release-manager\src\main\java\**\*,windows-jdk15-m3.6.x_build\maven-release-policies\maven-release-oddeven-policy\src\main\java\**\*,windows-jdk15-m3.6.x_build\maven-release-policies\maven-release-semver-policy\src\main\java\**\*,windows-jdk15-m3.6.x_build\maven-release-plugin\src\main\java\**\*' - excludes: null
[TASKS] Found 131 files to scan for tasks
[TASKS] Found 24 open tasks.
Skipping warnings blame since pipelines do not have an SCM link.%n
[TASKS] Computing warning deltas based on reference build #18
[withMaven] invokerPublisher - Archive invoker results for Maven artifact MavenArtifact{org.apache.maven.plugins:maven-release-plugin:maven-plugin:3.0.0-SNAPSHOT(version: 3.0.0-SNAPSHOT, snapshot:false) } generated by PluginInvocation{org.apache.maven.plugins:maven-invoker-plugin:3.2.0@run  integration-test-prepare}: windows-jdk15-m3.6.x_build\maven-release-plugin\target\invoker-reports\*.xml
[withMaven] Publishers: Generated Artifacts Publisher: 1232 ms, Junit Publisher: 6108 ms, Open Task Scanner Publisher: 904 ms, Dependencies Fingerprint Publisher: 379 ms, Invoker Publisher: 26791 ms, Pipeline Graph Publisher: 7 ms
[Pipeline] // withMaven
[Pipeline] cleanWs
[WS-CLEANUP] Deleting project workspace...
[WS-CLEANUP] Deferred wipeout is used...
[WS-CLEANUP] done
[Pipeline] }
[Pipeline] // stage
[Pipeline] }
[Pipeline] // ws
[Pipeline] }
[Pipeline] // node
[Pipeline] }
[Pipeline] // parallel
[Pipeline] stage
[Pipeline] { (Notifications)
[Pipeline] echo
Build result: UNSTABLE
[Pipeline] jiraIssueSelector
[Pipeline] jiraComment
[Pipeline] echo
The authors of changes [michaelo].
[Pipeline] echo
Sending email ...
[Pipeline] emailext
Reply | Threaded
Open this post in threaded view
|

Build failed in Jenkins: Maven » Maven TLP » maven-release » master #20

Apache Jenkins Server-2
See https://ci-builds.apache.org/job/Maven/job/maven-box/job/maven-release/job/master/20/

Changes:

* Next Maven version change 3.7.x -> 4.x.x
* Added Java 17

14 tests failed.
FAILED:  org.apache.maven.shared.release.phase.RestoreBackupPomsPhaseTest.windows-jdk7-m3.2.x_build / Build windows-jdk7-m3.2.x_build / testBasicPom

Error Message:
Error restoring from backup POM: F:\jenkins\jenkins-slave\712657a4\workspace\n_maven-box_maven-release_master@2\windows-jdk7-m3.2.x_build\maven-release-manager\target\test-classes\projects\restore-backup-poms\basic-pom\pom.xml: The process cannot access the file because it is being used by another process.


Stack Trace:
org.apache.maven.shared.release.ReleaseExecutionException:
Error restoring from backup POM: F:\jenkins\jenkins-slave\712657a4\workspace\n_maven-box_maven-release_master@2\windows-jdk7-m3.2.x_build\maven-release-manager\target\test-classes\projects\restore-backup-poms\basic-pom\pom.xml: The process cannot access the file because it is being used by another process.

        at org.apache.maven.shared.release.phase.RestoreBackupPomsPhaseTest.runExecuteOnProjects(RestoreBackupPomsPhaseTest.java:89)
        at org.apache.maven.shared.release.phase.RestoreBackupPomsPhaseTest.testBasicPom(RestoreBackupPomsPhaseTest.java:63)
Caused by: java.nio.file.FileSystemException:
F:\jenkins\jenkins-slave\712657a4\workspace\n_maven-box_maven-release_master@2\windows-jdk7-m3.2.x_build\maven-release-manager\target\test-classes\projects\restore-backup-poms\basic-pom\pom.xml: The process cannot access the file because it is being used by another process.

        at org.apache.maven.shared.release.phase.RestoreBackupPomsPhaseTest.runExecuteOnProjects(RestoreBackupPomsPhaseTest.java:89)
        at org.apache.maven.shared.release.phase.RestoreBackupPomsPhaseTest.testBasicPom(RestoreBackupPomsPhaseTest.java:63)


FAILED:  org.apache.maven.shared.release.phase.RestoreBackupPomsPhaseTest.windows-jdk7-m3.2.x_build / Build windows-jdk7-m3.2.x_build / testMultiModulePom

Error Message:
Error restoring from backup POM: F:\jenkins\jenkins-slave\712657a4\workspace\n_maven-box_maven-release_master@2\windows-jdk7-m3.2.x_build\maven-release-manager\target\test-classes\projects\restore-backup-poms\pom-with-modules\pom.xml: The process cannot access the file because it is being used by another process.


Stack Trace:
org.apache.maven.shared.release.ReleaseExecutionException:
Error restoring from backup POM: F:\jenkins\jenkins-slave\712657a4\workspace\n_maven-box_maven-release_master@2\windows-jdk7-m3.2.x_build\maven-release-manager\target\test-classes\projects\restore-backup-poms\pom-with-modules\pom.xml: The process cannot access the file because it is being used by another process.

        at org.apache.maven.shared.release.phase.RestoreBackupPomsPhaseTest.runExecuteOnProjects(RestoreBackupPomsPhaseTest.java:89)
        at org.apache.maven.shared.release.phase.RestoreBackupPomsPhaseTest.testMultiModulePom(RestoreBackupPomsPhaseTest.java:79)
Caused by: java.nio.file.FileSystemException:
F:\jenkins\jenkins-slave\712657a4\workspace\n_maven-box_maven-release_master@2\windows-jdk7-m3.2.x_build\maven-release-manager\target\test-classes\projects\restore-backup-poms\pom-with-modules\pom.xml: The process cannot access the file because it is being used by another process.

        at org.apache.maven.shared.release.phase.RestoreBackupPomsPhaseTest.runExecuteOnProjects(RestoreBackupPomsPhaseTest.java:89)
        at org.apache.maven.shared.release.phase.RestoreBackupPomsPhaseTest.testMultiModulePom(RestoreBackupPomsPhaseTest.java:79)


FAILED:  org.apache.maven.shared.release.phase.RestoreBackupPomsPhaseTest.windows-jdk7-m3.3.x_build / Build windows-jdk7-m3.3.x_build / testBasicPom

Error Message:
Error restoring from backup POM: F:\jenkins\jenkins-slave\712657a4\workspace\n_maven-box_maven-release_master@2\windows-jdk7-m3.3.x_build\maven-release-manager\target\test-classes\projects\restore-backup-poms\basic-pom\pom.xml: The process cannot access the file because it is being used by another process.


Stack Trace:
org.apache.maven.shared.release.ReleaseExecutionException:
Error restoring from backup POM: F:\jenkins\jenkins-slave\712657a4\workspace\n_maven-box_maven-release_master@2\windows-jdk7-m3.3.x_build\maven-release-manager\target\test-classes\projects\restore-backup-poms\basic-pom\pom.xml: The process cannot access the file because it is being used by another process.

        at org.apache.maven.shared.release.phase.RestoreBackupPomsPhaseTest.runExecuteOnProjects(RestoreBackupPomsPhaseTest.java:89)
        at org.apache.maven.shared.release.phase.RestoreBackupPomsPhaseTest.testBasicPom(RestoreBackupPomsPhaseTest.java:63)
Caused by: java.nio.file.FileSystemException:
F:\jenkins\jenkins-slave\712657a4\workspace\n_maven-box_maven-release_master@2\windows-jdk7-m3.3.x_build\maven-release-manager\target\test-classes\projects\restore-backup-poms\basic-pom\pom.xml: The process cannot access the file because it is being used by another process.

        at org.apache.maven.shared.release.phase.RestoreBackupPomsPhaseTest.runExecuteOnProjects(RestoreBackupPomsPhaseTest.java:89)
        at org.apache.maven.shared.release.phase.RestoreBackupPomsPhaseTest.testBasicPom(RestoreBackupPomsPhaseTest.java:63)


FAILED:  org.apache.maven.shared.release.phase.RestoreBackupPomsPhaseTest.windows-jdk7-m3.3.x_build / Build windows-jdk7-m3.3.x_build / testMultiModulePom

Error Message:
Error restoring from backup POM: F:\jenkins\jenkins-slave\712657a4\workspace\n_maven-box_maven-release_master@2\windows-jdk7-m3.3.x_build\maven-release-manager\target\test-classes\projects\restore-backup-poms\pom-with-modules\pom.xml: The process cannot access the file because it is being used by another process.


Stack Trace:
org.apache.maven.shared.release.ReleaseExecutionException:
Error restoring from backup POM: F:\jenkins\jenkins-slave\712657a4\workspace\n_maven-box_maven-release_master@2\windows-jdk7-m3.3.x_build\maven-release-manager\target\test-classes\projects\restore-backup-poms\pom-with-modules\pom.xml: The process cannot access the file because it is being used by another process.

        at org.apache.maven.shared.release.phase.RestoreBackupPomsPhaseTest.runExecuteOnProjects(RestoreBackupPomsPhaseTest.java:89)
        at org.apache.maven.shared.release.phase.RestoreBackupPomsPhaseTest.testMultiModulePom(RestoreBackupPomsPhaseTest.java:79)
Caused by: java.nio.file.FileSystemException:
F:\jenkins\jenkins-slave\712657a4\workspace\n_maven-box_maven-release_master@2\windows-jdk7-m3.3.x_build\maven-release-manager\target\test-classes\projects\restore-backup-poms\pom-with-modules\pom.xml: The process cannot access the file because it is being used by another process.

        at org.apache.maven.shared.release.phase.RestoreBackupPomsPhaseTest.runExecuteOnProjects(RestoreBackupPomsPhaseTest.java:89)
        at org.apache.maven.shared.release.phase.RestoreBackupPomsPhaseTest.testMultiModulePom(RestoreBackupPomsPhaseTest.java:79)


FAILED:  org.apache.maven.shared.release.phase.RestoreBackupPomsPhaseTest.windows-jdk7-m3.5.x_build / Build windows-jdk7-m3.5.x_build / testBasicPom

Error Message:
Error restoring from backup POM: F:\jenkins\jenkins-slave\712657a4\workspace\n_maven-box_maven-release_master@2\windows-jdk7-m3.5.x_build\maven-release-manager\target\test-classes\projects\restore-backup-poms\basic-pom\pom.xml: The process cannot access the file because it is being used by another process.


Stack Trace:
org.apache.maven.shared.release.ReleaseExecutionException:
Error restoring from backup POM: F:\jenkins\jenkins-slave\712657a4\workspace\n_maven-box_maven-release_master@2\windows-jdk7-m3.5.x_build\maven-release-manager\target\test-classes\projects\restore-backup-poms\basic-pom\pom.xml: The process cannot access the file because it is being used by another process.

        at org.apache.maven.shared.release.phase.RestoreBackupPomsPhaseTest.runExecuteOnProjects(RestoreBackupPomsPhaseTest.java:89)
        at org.apache.maven.shared.release.phase.RestoreBackupPomsPhaseTest.testBasicPom(RestoreBackupPomsPhaseTest.java:63)
Caused by: java.nio.file.FileSystemException:
F:\jenkins\jenkins-slave\712657a4\workspace\n_maven-box_maven-release_master@2\windows-jdk7-m3.5.x_build\maven-release-manager\target\test-classes\projects\restore-backup-poms\basic-pom\pom.xml: The process cannot access the file because it is being used by another process.

        at org.apache.maven.shared.release.phase.RestoreBackupPomsPhaseTest.runExecuteOnProjects(RestoreBackupPomsPhaseTest.java:89)
        at org.apache.maven.shared.release.phase.RestoreBackupPomsPhaseTest.testBasicPom(RestoreBackupPomsPhaseTest.java:63)


FAILED:  org.apache.maven.shared.release.phase.RestoreBackupPomsPhaseTest.windows-jdk7-m3.5.x_build / Build windows-jdk7-m3.5.x_build / testMultiModulePom

Error Message:
Error restoring from backup POM: F:\jenkins\jenkins-slave\712657a4\workspace\n_maven-box_maven-release_master@2\windows-jdk7-m3.5.x_build\maven-release-manager\target\test-classes\projects\restore-backup-poms\pom-with-modules\pom.xml: The process cannot access the file because it is being used by another process.


Stack Trace:
org.apache.maven.shared.release.ReleaseExecutionException:
Error restoring from backup POM: F:\jenkins\jenkins-slave\712657a4\workspace\n_maven-box_maven-release_master@2\windows-jdk7-m3.5.x_build\maven-release-manager\target\test-classes\projects\restore-backup-poms\pom-with-modules\pom.xml: The process cannot access the file because it is being used by another process.

        at org.apache.maven.shared.release.phase.RestoreBackupPomsPhaseTest.runExecuteOnProjects(RestoreBackupPomsPhaseTest.java:89)
        at org.apache.maven.shared.release.phase.RestoreBackupPomsPhaseTest.testMultiModulePom(RestoreBackupPomsPhaseTest.java:79)
Caused by: java.nio.file.FileSystemException:
F:\jenkins\jenkins-slave\712657a4\workspace\n_maven-box_maven-release_master@2\windows-jdk7-m3.5.x_build\maven-release-manager\target\test-classes\projects\restore-backup-poms\pom-with-modules\pom.xml: The process cannot access the file because it is being used by another process.

        at org.apache.maven.shared.release.phase.RestoreBackupPomsPhaseTest.runExecuteOnProjects(RestoreBackupPomsPhaseTest.java:89)
        at org.apache.maven.shared.release.phase.RestoreBackupPomsPhaseTest.testMultiModulePom(RestoreBackupPomsPhaseTest.java:79)


FAILED:  org.apache.maven.shared.release.phase.RestoreBackupPomsPhaseTest.windows-jdk7-m3.6.x_build / Build windows-jdk7-m3.6.x_build / testBasicPom

Error Message:
Error restoring from backup POM: F:\jenkins\jenkins-slave\712657a4\workspace\n_maven-box_maven-release_master@2\windows-jdk7-m3.6.x_build\maven-release-manager\target\test-classes\projects\restore-backup-poms\basic-pom\pom.xml: The process cannot access the file because it is being used by another process.


Stack Trace:
org.apache.maven.shared.release.ReleaseExecutionException:
Error restoring from backup POM: F:\jenkins\jenkins-slave\712657a4\workspace\n_maven-box_maven-release_master@2\windows-jdk7-m3.6.x_build\maven-release-manager\target\test-classes\projects\restore-backup-poms\basic-pom\pom.xml: The process cannot access the file because it is being used by another process.

        at org.apache.maven.shared.release.phase.RestoreBackupPomsPhaseTest.runExecuteOnProjects(RestoreBackupPomsPhaseTest.java:89)
        at org.apache.maven.shared.release.phase.RestoreBackupPomsPhaseTest.testBasicPom(RestoreBackupPomsPhaseTest.java:63)
Caused by: java.nio.file.FileSystemException:
F:\jenkins\jenkins-slave\712657a4\workspace\n_maven-box_maven-release_master@2\windows-jdk7-m3.6.x_build\maven-release-manager\target\test-classes\projects\restore-backup-poms\basic-pom\pom.xml: The process cannot access the file because it is being used by another process.

        at org.apache.maven.shared.release.phase.RestoreBackupPomsPhaseTest.runExecuteOnProjects(RestoreBackupPomsPhaseTest.java:89)
        at org.apache.maven.shared.release.phase.RestoreBackupPomsPhaseTest.testBasicPom(RestoreBackupPomsPhaseTest.java:63)


FAILED:  org.apache.maven.shared.release.phase.RestoreBackupPomsPhaseTest.windows-jdk7-m3.6.x_build / Build windows-jdk7-m3.6.x_build / testMultiModulePom

Error Message:
Error restoring from backup POM: F:\jenkins\jenkins-slave\712657a4\workspace\n_maven-box_maven-release_master@2\windows-jdk7-m3.6.x_build\maven-release-manager\target\test-classes\projects\restore-backup-poms\pom-with-modules\pom.xml: The process cannot access the file because it is being used by another process.


Stack Trace:
org.apache.maven.shared.release.ReleaseExecutionException:
Error restoring from backup POM: F:\jenkins\jenkins-slave\712657a4\workspace\n_maven-box_maven-release_master@2\windows-jdk7-m3.6.x_build\maven-release-manager\target\test-classes\projects\restore-backup-poms\pom-with-modules\pom.xml: The process cannot access the file because it is being used by another process.

        at org.apache.maven.shared.release.phase.RestoreBackupPomsPhaseTest.runExecuteOnProjects(RestoreBackupPomsPhaseTest.java:89)
        at org.apache.maven.shared.release.phase.RestoreBackupPomsPhaseTest.testMultiModulePom(RestoreBackupPomsPhaseTest.java:79)
Caused by: java.nio.file.FileSystemException:
F:\jenkins\jenkins-slave\712657a4\workspace\n_maven-box_maven-release_master@2\windows-jdk7-m3.6.x_build\maven-release-manager\target\test-classes\projects\restore-backup-poms\pom-with-modules\pom.xml: The process cannot access the file because it is being used by another process.

        at org.apache.maven.shared.release.phase.RestoreBackupPomsPhaseTest.runExecuteOnProjects(RestoreBackupPomsPhaseTest.java:89)
        at org.apache.maven.shared.release.phase.RestoreBackupPomsPhaseTest.testMultiModulePom(RestoreBackupPomsPhaseTest.java:79)


FAILED:  org.apache.maven.shared.release.phase.RestoreBackupPomsPhaseTest.windows-jdk8-m3.6.x_build / Build windows-jdk8-m3.6.x_build / testBasicPom

Error Message:
Error restoring from backup POM: F:\jenkins\jenkins-slave\712657a4\workspace\n_maven-box_maven-release_master@2\windows-jdk8-m3.6.x_build\maven-release-manager\target\test-classes\projects\restore-backup-poms\basic-pom\pom.xml: The process cannot access the file because it is being used by another process.


Stack Trace:
org.apache.maven.shared.release.ReleaseExecutionException:
Error restoring from backup POM: F:\jenkins\jenkins-slave\712657a4\workspace\n_maven-box_maven-release_master@2\windows-jdk8-m3.6.x_build\maven-release-manager\target\test-classes\projects\restore-backup-poms\basic-pom\pom.xml: The process cannot access the file because it is being used by another process.

        at org.apache.maven.shared.release.phase.RestoreBackupPomsPhaseTest.runExecuteOnProjects(RestoreBackupPomsPhaseTest.java:89)
        at org.apache.maven.shared.release.phase.RestoreBackupPomsPhaseTest.testBasicPom(RestoreBackupPomsPhaseTest.java:63)
Caused by: java.nio.file.FileSystemException:
F:\jenkins\jenkins-slave\712657a4\workspace\n_maven-box_maven-release_master@2\windows-jdk8-m3.6.x_build\maven-release-manager\target\test-classes\projects\restore-backup-poms\basic-pom\pom.xml: The process cannot access the file because it is being used by another process.

        at org.apache.maven.shared.release.phase.RestoreBackupPomsPhaseTest.runExecuteOnProjects(RestoreBackupPomsPhaseTest.java:89)
        at org.apache.maven.shared.release.phase.RestoreBackupPomsPhaseTest.testBasicPom(RestoreBackupPomsPhaseTest.java:63)


FAILED:  org.apache.maven.shared.release.phase.RestoreBackupPomsPhaseTest.windows-jdk8-m3.6.x_build / Build windows-jdk8-m3.6.x_build / testMultiModulePom

Error Message:
Error restoring from backup POM: F:\jenkins\jenkins-slave\712657a4\workspace\n_maven-box_maven-release_master@2\windows-jdk8-m3.6.x_build\maven-release-manager\target\test-classes\projects\restore-backup-poms\pom-with-modules\pom.xml: The process cannot access the file because it is being used by another process.


Stack Trace:
org.apache.maven.shared.release.ReleaseExecutionException:
Error restoring from backup POM: F:\jenkins\jenkins-slave\712657a4\workspace\n_maven-box_maven-release_master@2\windows-jdk8-m3.6.x_build\maven-release-manager\target\test-classes\projects\restore-backup-poms\pom-with-modules\pom.xml: The process cannot access the file because it is being used by another process.

        at org.apache.maven.shared.release.phase.RestoreBackupPomsPhaseTest.runExecuteOnProjects(RestoreBackupPomsPhaseTest.java:89)
        at org.apache.maven.shared.release.phase.RestoreBackupPomsPhaseTest.testMultiModulePom(RestoreBackupPomsPhaseTest.java:79)
Caused by: java.nio.file.FileSystemException:
F:\jenkins\jenkins-slave\712657a4\workspace\n_maven-box_maven-release_master@2\windows-jdk8-m3.6.x_build\maven-release-manager\target\test-classes\projects\restore-backup-poms\pom-with-modules\pom.xml: The process cannot access the file because it is being used by another process.

        at org.apache.maven.shared.release.phase.RestoreBackupPomsPhaseTest.runExecuteOnProjects(RestoreBackupPomsPhaseTest.java:89)
        at org.apache.maven.shared.release.phase.RestoreBackupPomsPhaseTest.testMultiModulePom(RestoreBackupPomsPhaseTest.java:79)


FAILED:  org.apache.maven.shared.release.phase.RestoreBackupPomsPhaseTest.windows-jdk11-m3.6.x_build / Build windows-jdk11-m3.6.x_build / testBasicPom

Error Message:
Error restoring from backup POM: F:\jenkins\jenkins-slave\712657a4\workspace\n_maven-box_maven-release_master@2\windows-jdk11-m3.6.x_build\maven-release-manager\target\test-classes\projects\restore-backup-poms\basic-pom\pom.xml: The process cannot access the file because it is being used by another process.


Stack Trace:
org.apache.maven.shared.release.ReleaseExecutionException:
Error restoring from backup POM: F:\jenkins\jenkins-slave\712657a4\workspace\n_maven-box_maven-release_master@2\windows-jdk11-m3.6.x_build\maven-release-manager\target\test-classes\projects\restore-backup-poms\basic-pom\pom.xml: The process cannot access the file because it is being used by another process.

        at org.apache.maven.shared.release.phase.RestoreBackupPomsPhaseTest.runExecuteOnProjects(RestoreBackupPomsPhaseTest.java:89)
        at org.apache.maven.shared.release.phase.RestoreBackupPomsPhaseTest.testBasicPom(RestoreBackupPomsPhaseTest.java:63)
Caused by: java.nio.file.FileSystemException:
F:\jenkins\jenkins-slave\712657a4\workspace\n_maven-box_maven-release_master@2\windows-jdk11-m3.6.x_build\maven-release-manager\target\test-classes\projects\restore-backup-poms\basic-pom\pom.xml: The process cannot access the file because it is being used by another process.

        at org.apache.maven.shared.release.phase.RestoreBackupPomsPhaseTest.runExecuteOnProjects(RestoreBackupPomsPhaseTest.java:89)
        at org.apache.maven.shared.release.phase.RestoreBackupPomsPhaseTest.testBasicPom(RestoreBackupPomsPhaseTest.java:63)


FAILED:  org.apache.maven.shared.release.phase.RestoreBackupPomsPhaseTest.windows-jdk11-m3.6.x_build / Build windows-jdk11-m3.6.x_build / testMultiModulePom

Error Message:
Error restoring from backup POM: F:\jenkins\jenkins-slave\712657a4\workspace\n_maven-box_maven-release_master@2\windows-jdk11-m3.6.x_build\maven-release-manager\target\test-classes\projects\restore-backup-poms\pom-with-modules\pom.xml: The process cannot access the file because it is being used by another process.


Stack Trace:
org.apache.maven.shared.release.ReleaseExecutionException:
Error restoring from backup POM: F:\jenkins\jenkins-slave\712657a4\workspace\n_maven-box_maven-release_master@2\windows-jdk11-m3.6.x_build\maven-release-manager\target\test-classes\projects\restore-backup-poms\pom-with-modules\pom.xml: The process cannot access the file because it is being used by another process.

        at org.apache.maven.shared.release.phase.RestoreBackupPomsPhaseTest.runExecuteOnProjects(RestoreBackupPomsPhaseTest.java:89)
        at org.apache.maven.shared.release.phase.RestoreBackupPomsPhaseTest.testMultiModulePom(RestoreBackupPomsPhaseTest.java:79)
Caused by: java.nio.file.FileSystemException:
F:\jenkins\jenkins-slave\712657a4\workspace\n_maven-box_maven-release_master@2\windows-jdk11-m3.6.x_build\maven-release-manager\target\test-classes\projects\restore-backup-poms\pom-with-modules\pom.xml: The process cannot access the file because it is being used by another process.

        at org.apache.maven.shared.release.phase.RestoreBackupPomsPhaseTest.runExecuteOnProjects(RestoreBackupPomsPhaseTest.java:89)
        at org.apache.maven.shared.release.phase.RestoreBackupPomsPhaseTest.testMultiModulePom(RestoreBackupPomsPhaseTest.java:79)


FAILED:  org.apache.maven.shared.release.phase.RestoreBackupPomsPhaseTest.windows-jdk15-m3.6.x_build / Build windows-jdk15-m3.6.x_build / testBasicPom

Error Message:
Error restoring from backup POM: F:\jenkins\jenkins-slave\712657a4\workspace\n_maven-box_maven-release_master@2\windows-jdk15-m3.6.x_build\maven-release-manager\target\test-classes\projects\restore-backup-poms\basic-pom\pom.xml: The process cannot access the file because it is being used by another process

Stack Trace:
org.apache.maven.shared.release.ReleaseExecutionException: Error restoring from backup POM: F:\jenkins\jenkins-slave\712657a4\workspace\n_maven-box_maven-release_master@2\windows-jdk15-m3.6.x_build\maven-release-manager\target\test-classes\projects\restore-backup-poms\basic-pom\pom.xml: The process cannot access the file because it is being used by another process
        at org.apache.maven.shared.release.phase.RestoreBackupPomsPhaseTest.runExecuteOnProjects(RestoreBackupPomsPhaseTest.java:89)
        at org.apache.maven.shared.release.phase.RestoreBackupPomsPhaseTest.testBasicPom(RestoreBackupPomsPhaseTest.java:63)
Caused by: java.nio.file.FileSystemException: F:\jenkins\jenkins-slave\712657a4\workspace\n_maven-box_maven-release_master@2\windows-jdk15-m3.6.x_build\maven-release-manager\target\test-classes\projects\restore-backup-poms\basic-pom\pom.xml: The process cannot access the file because it is being used by another process
        at org.apache.maven.shared.release.phase.RestoreBackupPomsPhaseTest.runExecuteOnProjects(RestoreBackupPomsPhaseTest.java:89)
        at org.apache.maven.shared.release.phase.RestoreBackupPomsPhaseTest.testBasicPom(RestoreBackupPomsPhaseTest.java:63)


FAILED:  org.apache.maven.shared.release.phase.RestoreBackupPomsPhaseTest.windows-jdk15-m3.6.x_build / Build windows-jdk15-m3.6.x_build / testMultiModulePom

Error Message:
Error restoring from backup POM: F:\jenkins\jenkins-slave\712657a4\workspace\n_maven-box_maven-release_master@2\windows-jdk15-m3.6.x_build\maven-release-manager\target\test-classes\projects\restore-backup-poms\pom-with-modules\pom.xml: The process cannot access the file because it is being used by another process

Stack Trace:
org.apache.maven.shared.release.ReleaseExecutionException: Error restoring from backup POM: F:\jenkins\jenkins-slave\712657a4\workspace\n_maven-box_maven-release_master@2\windows-jdk15-m3.6.x_build\maven-release-manager\target\test-classes\projects\restore-backup-poms\pom-with-modules\pom.xml: The process cannot access the file because it is being used by another process
        at org.apache.maven.shared.release.phase.RestoreBackupPomsPhaseTest.runExecuteOnProjects(RestoreBackupPomsPhaseTest.java:89)
        at org.apache.maven.shared.release.phase.RestoreBackupPomsPhaseTest.testMultiModulePom(RestoreBackupPomsPhaseTest.java:79)
Caused by: java.nio.file.FileSystemException: F:\jenkins\jenkins-slave\712657a4\workspace\n_maven-box_maven-release_master@2\windows-jdk15-m3.6.x_build\maven-release-manager\target\test-classes\projects\restore-backup-poms\pom-with-modules\pom.xml: The process cannot access the file because it is being used by another process
        at org.apache.maven.shared.release.phase.RestoreBackupPomsPhaseTest.runExecuteOnProjects(RestoreBackupPomsPhaseTest.java:89)
        at org.apache.maven.shared.release.phase.RestoreBackupPomsPhaseTest.testMultiModulePom(RestoreBackupPomsPhaseTest.java:79)




Build log:
[...truncated 26568 lines...]
[INFO]           projects\prepare\MRELEASE-571_M3\pom.xml ......... SUCCESS (9.6 s)
[INFO] Building: projects\prepare\MRELEASE-618\my-pom.xml
[INFO] run post-build script verify.groovy
[INFO]           projects\prepare\MRELEASE-976\pom.xml ............ SUCCESS (8.2 s)
[INFO] Building: projects\prepare\MRELEASE-985\pom.xml
[INFO] run post-build script verify.groovy
[INFO]           projects\prepare\MRELEASE-618\my-pom.xml ......... SUCCESS (8.4 s)
[INFO] Building: projects\prepare\MRELEASE-667\pom.xml
[INFO] snapshot test:parent:1-SNAPSHOT: checking for updates from apache-snapshots
[INFO] snapshot test:parent:1-SNAPSHOT: checking for updates from Nexus
[INFO] artifact test.parent:1-SNAPSHOT: checking for updates from central
[INFO] run post-build script verify.groovy
[INFO]           projects\prepare\MRELEASE-985\pom.xml ............ SUCCESS (9.7 s)
[INFO] Building: projects\prepare\namespace\pom.xml
[INFO] run post-build script verify.groovy
[INFO]           projects\prepare\MRELEASE-667\pom.xml ............ SUCCESS (8.5 s)
[INFO] Building: projects\prepare\MRELEASE-834\pom.xml
[INFO]           projects\prepare\MRELEASE-834\pom.xml ............ SUCCESS (6.5 s)
[INFO] Building: projects\prepare\MRELEASE-835\pom.xml
[INFO] run post-build script verify.groovy
[INFO]           projects\prepare\namespace\pom.xml ............... SUCCESS (8.9 s)
[INFO] Building: projects\prepare\oddeven-policy\pom.xml
[INFO]           projects\prepare\oddeven-policy\pom.xml .......... SUCCESS (7.9 s)
[INFO] Building: projects\prepare\regular-multi-module\pom.xml
[INFO] run post-build script verify.groovy
[INFO]           projects\prepare\MRELEASE-835\pom.xml ............ SUCCESS (9.1 s)
[INFO] Building: projects\prepare\MRELEASE-966\my-pom.xml
[INFO] run post-build script verify.groovy
[INFO]           projects\prepare\MRELEASE-966\my-pom.xml ......... SUCCESS (8.0 s)
[INFO] Building: projects\prepare\MRELEASE-976\pom.xml
[INFO] run post-build script verify.bsh
[INFO]           projects\prepare\regular-multi-module\pom.xml .... SUCCESS (10.8 s)
[INFO] Building: projects\prepare\semver-policy\pom.xml
[INFO] run post-build script verify.groovy
[INFO]           projects\prepare\MRELEASE-976\pom.xml ............ SUCCESS (8.5 s)
[INFO] Building: projects\prepare\MRELEASE-985\pom.xml
[INFO]           projects\prepare\semver-policy\pom.xml ........... SUCCESS (8.3 s)
[INFO] Building: projects\prepare-with-pom\finalname-basic\pom.xml
[INFO] run post-build script verify.groovy
[INFO]           projects\prepare\MRELEASE-985\pom.xml ............ SUCCESS (9.9 s)
[INFO] Building: projects\prepare\namespace\pom.xml
[INFO] run post-build script verify.groovy
[INFO]           projects\prepare-with-pom\finalname-basic\pom.xml  SUCCESS (8.5 s)
[INFO] Building: projects\prepare-with-pom\finalname-multimodule\pom.xml
[INFO] run post-build script verify.groovy
[INFO]           projects\prepare\namespace\pom.xml ............... SUCCESS (8.4 s)
[INFO] Building: projects\prepare\oddeven-policy\pom.xml
[INFO] run post-build script verify.groovy
[INFO]           projects\prepare-with-pom\finalname-multimodule\pom.xml SUCCESS (8.4 s)
[INFO] Building: projects\prepare-with-pom\MRELEASE-808\pom.xml
[INFO]           projects\prepare\oddeven-policy\pom.xml .......... SUCCESS (8.1 s)
[INFO] Building: projects\prepare\regular-multi-module\pom.xml
[INFO] run post-build script verify.groovy
[INFO]           projects\prepare-with-pom\MRELEASE-808\pom.xml ... SUCCESS (8.6 s)
[INFO] Building: projects\update-versions\MRELEASE-555\pom.xml
[INFO] run post-build script verify.groovy
[INFO]           projects\update-versions\MRELEASE-555\pom.xml .... SUCCESS (4.4 s)
[INFO] Building: projects\update-versions\MRELEASE-611\pom.xml
[INFO] run post-build script verify.groovy
[INFO]           projects\update-versions\MRELEASE-611\pom.xml .... SUCCESS (4.0 s)
[INFO] Building: projects\update-versions\MRELEASE-783\pom.xml
[INFO] run post-build script verify.bsh
[INFO]           projects\prepare\regular-multi-module\pom.xml .... SUCCESS (10.8 s)
[INFO] Building: projects\prepare\semver-policy\pom.xml
[INFO]           projects\update-versions\MRELEASE-783\pom.xml .... SUCCESS (3.9 s)
[INFO] Building: projects\update-versions\MRELEASE-976\pom.xml
[INFO] run post-build script verify.groovy
[INFO]           projects\update-versions\MRELEASE-976\pom.xml .... SUCCESS (4.1 s)
[INFO] -------------------------------------------------
[INFO] Build Summary:
[INFO]   Passed: 40, Failed: 0, Errors: 0, Skipped: 0
[INFO] -------------------------------------------------
[INFO]
[INFO] --- mrm-maven-plugin:1.2.0:stop (default) @ maven-release-plugin ---
[INFO] Stopping Mock Repository Manager on http://localhost:52157
[INFO] Stopped SocketConnector@0.0.0.0:52157
[INFO] Mock Repository Manager http://localhost:52157 is stopped.
[INFO]
[INFO] --- maven-checkstyle-plugin:3.0.0:check (checkstyle-check) @ maven-release-plugin ---
[INFO] ------------------------------------------------------------------------
[INFO] Reactor Summary for Maven Release 3.0.0-SNAPSHOT:
[INFO]
[INFO] Maven Release ...................................... SUCCESS [  5.002 s]
[INFO] Maven Release APIs ................................. SUCCESS [  4.084 s]
[INFO] Maven Release Manager .............................. SUCCESS [02:10 min]
[INFO] Maven Release Odd-Even Policy ...................... SUCCESS [  1.746 s]
[INFO] Maven Release SemVer Policy ........................ SUCCESS [  3.008 s]
[INFO] Maven Release Plugin ............................... SUCCESS [06:26 min]
[INFO] ------------------------------------------------------------------------
[INFO] BUILD SUCCESS
[INFO] ------------------------------------------------------------------------
[INFO] Total time:  08:51 min
[INFO] Finished at: 2021-01-10T07:12:10-08:00
[INFO] ------------------------------------------------------------------------
[INFO] [jenkins-event-spy] Generated F:\jenkins\jenkins-slave\712657a4\workspace\n_maven-box_maven-release_master@2@tmp\withMaven8c8cddd7\maven-spy-20210110-070318-6688530974126068904647.log
[Pipeline] }
[Pipeline] // dir
[Pipeline] }
[withMaven] artifactsPublisher - Archive artifact windows-jdk11-m3.6.x_build\pom.xml under org\apache\maven\release\maven-release\3.0.0-SNAPSHOT\maven-release-3.0.0-SNAPSHOT.pom
[withMaven] artifactsPublisher - Archive artifact windows-jdk11-m3.6.x_build\target\maven-release-3.0.0-SNAPSHOT-site.xml under org\apache\maven\release\maven-release\3.0.0-SNAPSHOT\maven-release-3.0.0-SNAPSHOT-site.xml
[withMaven] artifactsPublisher - Archive artifact windows-jdk11-m3.6.x_build\maven-release-api\pom.xml under org\apache\maven\release\maven-release-api\3.0.0-SNAPSHOT\maven-release-api-3.0.0-SNAPSHOT.pom
[withMaven] artifactsPublisher - Archive artifact windows-jdk11-m3.6.x_build\maven-release-api\target\maven-release-api-3.0.0-SNAPSHOT.jar under org\apache\maven\release\maven-release-api\3.0.0-SNAPSHOT\maven-release-api-3.0.0-SNAPSHOT.jar
[withMaven] artifactsPublisher - Archive artifact windows-jdk11-m3.6.x_build\maven-release-manager\pom.xml under org\apache\maven\release\maven-release-manager\3.0.0-SNAPSHOT\maven-release-manager-3.0.0-SNAPSHOT.pom
[withMaven] artifactsPublisher - Archive artifact windows-jdk11-m3.6.x_build\maven-release-manager\target\maven-release-manager-3.0.0-SNAPSHOT.jar under org\apache\maven\release\maven-release-manager\3.0.0-SNAPSHOT\maven-release-manager-3.0.0-SNAPSHOT.jar
[INFO]           projects\prepare\semver-policy\pom.xml ........... SUCCESS (8.0 s)
[INFO] Building: projects\prepare-with-pom\finalname-basic\pom.xml
[withMaven] artifactsPublisher - Archive artifact windows-jdk11-m3.6.x_build\maven-release-policies\maven-release-oddeven-policy\pom.xml under org\apache\maven\release\maven-release-oddeven-policy\3.0.0-SNAPSHOT\maven-release-oddeven-policy-3.0.0-SNAPSHOT.pom
[withMaven] artifactsPublisher - Archive artifact windows-jdk11-m3.6.x_build\maven-release-policies\maven-release-oddeven-policy\target\maven-release-oddeven-policy-3.0.0-SNAPSHOT.jar under org\apache\maven\release\maven-release-oddeven-policy\3.0.0-SNAPSHOT\maven-release-oddeven-policy-3.0.0-SNAPSHOT.jar
[withMaven] artifactsPublisher - Archive artifact windows-jdk11-m3.6.x_build\maven-release-policies\maven-release-semver-policy\pom.xml under org\apache\maven\release\maven-release-semver-policy\3.0.0-SNAPSHOT\maven-release-semver-policy-3.0.0-SNAPSHOT.pom
[withMaven] artifactsPublisher - Archive artifact windows-jdk11-m3.6.x_build\maven-release-policies\maven-release-semver-policy\target\maven-release-semver-policy-3.0.0-SNAPSHOT.jar under org\apache\maven\release\maven-release-semver-policy\3.0.0-SNAPSHOT\maven-release-semver-policy-3.0.0-SNAPSHOT.jar
[withMaven] artifactsPublisher - Archive artifact windows-jdk11-m3.6.x_build\maven-release-plugin\pom.xml under org\apache\maven\plugins\maven-release-plugin\3.0.0-SNAPSHOT\maven-release-plugin-3.0.0-SNAPSHOT.pom
[withMaven] artifactsPublisher - Archive artifact windows-jdk11-m3.6.x_build\maven-release-plugin\target\maven-release-plugin-3.0.0-SNAPSHOT.jar under org\apache\maven\plugins\maven-release-plugin\3.0.0-SNAPSHOT\maven-release-plugin-3.0.0-SNAPSHOT.jar
[withMaven] junitPublisher - Archive test results for Maven artifact org.apache.maven.release:maven-release-api:jar:3.0.0-SNAPSHOT generated by maven-surefire-plugin:test (default-test): windows-jdk11-m3.6.x_build\maven-release-api\target\surefire-reports\*.xml
[withMaven] junitPublisher - Archive test results for Maven artifact org.apache.maven.release:maven-release-manager:jar:3.0.0-SNAPSHOT generated by maven-surefire-plugin:test (default-test): windows-jdk11-m3.6.x_build\maven-release-manager\target\surefire-reports\*.xml
[withMaven] junitPublisher - Archive test results for Maven artifact org.apache.maven.release:maven-release-oddeven-policy:jar:3.0.0-SNAPSHOT generated by maven-surefire-plugin:test (default-test): windows-jdk11-m3.6.x_build\maven-release-policies\maven-release-oddeven-policy\target\surefire-reports\*.xml
[withMaven] junitPublisher - Archive test results for Maven artifact org.apache.maven.release:maven-release-semver-policy:jar:3.0.0-SNAPSHOT generated by maven-surefire-plugin:test (default-test): windows-jdk11-m3.6.x_build\maven-release-policies\maven-release-semver-policy\target\surefire-reports\*.xml
[withMaven] junitPublisher - Archive test results for Maven artifact org.apache.maven.plugins:maven-release-plugin:maven-plugin:3.0.0-SNAPSHOT generated by maven-surefire-plugin:test (default-test): windows-jdk11-m3.6.x_build\maven-release-plugin\target\surefire-reports\*.xml
Recording test results
[withMaven] junitPublisher - Archive test results for Maven artifact org.apache.maven.release:maven-release-manager:jar:3.0.0-SNAPSHOT generated by maven-failsafe-plugin:integration-test (default): windows-jdk11-m3.6.x_build\maven-release-manager\target\failsafe-reports\*.xml
Recording test results
[withMaven] openTasksPublisher - Scan Tasks for Maven artifact org.apache.maven.release:maven-release-api:jar:3.0.0-SNAPSHOT in source directory windows-jdk11-m3.6.x_build\maven-release-api\src\main\java
[withMaven] openTasksPublisher - Scan Tasks for Maven artifact org.apache.maven.release:maven-release-manager:jar:3.0.0-SNAPSHOT in source directory windows-jdk11-m3.6.x_build\maven-release-manager\src\main\java
[withMaven] openTasksPublisher - Scan Tasks for Maven artifact org.apache.maven.release:maven-release-oddeven-policy:jar:3.0.0-SNAPSHOT in source directory windows-jdk11-m3.6.x_build\maven-release-policies\maven-release-oddeven-policy\src\main\java
[withMaven] openTasksPublisher - Scan Tasks for Maven artifact org.apache.maven.release:maven-release-semver-policy:jar:3.0.0-SNAPSHOT in source directory windows-jdk11-m3.6.x_build\maven-release-policies\maven-release-semver-policy\src\main\java
[withMaven] openTasksPublisher - Scan Tasks for Maven artifact org.apache.maven.plugins:maven-release-plugin:maven-plugin:3.0.0-SNAPSHOT in source directory windows-jdk11-m3.6.x_build\maven-release-plugin\src\main\java
[TASKS] Scanning folder 'f:\jenkins\jenkins-slave\712657a4\workspace\n_maven-box_maven-release_master@2' for files matching the pattern 'windows-jdk11-m3.6.x_build\maven-release-api\src\main\java\**\*,windows-jdk11-m3.6.x_build\maven-release-manager\src\main\java\**\*,windows-jdk11-m3.6.x_build\maven-release-policies\maven-release-oddeven-policy\src\main\java\**\*,windows-jdk11-m3.6.x_build\maven-release-policies\maven-release-semver-policy\src\main\java\**\*,windows-jdk11-m3.6.x_build\maven-release-plugin\src\main\java\**\*' - excludes: null
[TASKS] Found 131 files to scan for tasks
[TASKS] Found 24 open tasks.
Skipping warnings blame since pipelines do not have an SCM link.%n
[TASKS] Computing warning deltas based on reference build #19
[withMaven] invokerPublisher - Archive invoker results for Maven artifact MavenArtifact{org.apache.maven.plugins:maven-release-plugin:maven-plugin:3.0.0-SNAPSHOT(version: 3.0.0-SNAPSHOT, snapshot:false) } generated by PluginInvocation{org.apache.maven.plugins:maven-invoker-plugin:3.2.0@run  integration-test-prepare}: windows-jdk11-m3.6.x_build\maven-release-plugin\target\invoker-reports\*.xml
[INFO] run post-build script verify.groovy
[INFO]           projects\prepare-with-pom\finalname-basic\pom.xml  SUCCESS (8.4 s)
[INFO] Building: projects\prepare-with-pom\finalname-multimodule\pom.xml
[INFO] run post-build script verify.groovy
[INFO]           projects\prepare-with-pom\finalname-multimodule\pom.xml SUCCESS (8.6 s)
[INFO] Building: projects\prepare-with-pom\MRELEASE-808\pom.xml
[INFO] run post-build script verify.groovy
[INFO]           projects\prepare-with-pom\MRELEASE-808\pom.xml ... SUCCESS (8.6 s)
[INFO] Building: projects\update-versions\MRELEASE-555\pom.xml
[INFO] run post-build script verify.groovy
[INFO]           projects\update-versions\MRELEASE-555\pom.xml .... SUCCESS (4.3 s)
[INFO] Building: projects\update-versions\MRELEASE-611\pom.xml
[INFO] run post-build script verify.groovy
[INFO]           projects\update-versions\MRELEASE-611\pom.xml .... SUCCESS (3.4 s)
[INFO] Building: projects\update-versions\MRELEASE-783\pom.xml
[withMaven] Publishers: Generated Artifacts Publisher: 1070 ms, Junit Publisher: 5900 ms, Open Task Scanner Publisher: 862 ms, Dependencies Fingerprint Publisher: 381 ms, Invoker Publisher: 26575 ms, Pipeline Graph Publisher: 6 ms
[Pipeline] // withMaven
[Pipeline] cleanWs
[WS-CLEANUP] Deleting project workspace...
[WS-CLEANUP] Deferred wipeout is used...
[WS-CLEANUP] done
[Pipeline] }
[Pipeline] // stage
[Pipeline] }
[Pipeline] // ws
[Pipeline] }
[Pipeline] // node
[Pipeline] }
[INFO]           projects\update-versions\MRELEASE-783\pom.xml .... SUCCESS (4.1 s)
[INFO] Building: projects\update-versions\MRELEASE-976\pom.xml
[INFO] run post-build script verify.groovy
[INFO]           projects\update-versions\MRELEASE-976\pom.xml .... SUCCESS (4.1 s)
[INFO] -------------------------------------------------
[INFO] Build Summary:
[INFO]   Passed: 40, Failed: 0, Errors: 0, Skipped: 0
[INFO] -------------------------------------------------
[INFO]
[INFO] --- mrm-maven-plugin:1.2.0:stop (default) @ maven-release-plugin ---
[INFO] Stopping Mock Repository Manager on http://localhost:50632
[INFO] Stopped SocketConnector@0.0.0.0:50632
[INFO] Mock Repository Manager http://localhost:50632 is stopped.
[INFO]
[INFO] --- maven-checkstyle-plugin:3.0.0:check (checkstyle-check) @ maven-release-plugin ---
[INFO] ------------------------------------------------------------------------
[INFO] Reactor Summary for Maven Release 3.0.0-SNAPSHOT:
[INFO]
[INFO] Maven Release ...................................... SUCCESS [  5.381 s]
[INFO] Maven Release APIs ................................. SUCCESS [  4.679 s]
[INFO] Maven Release Manager .............................. SUCCESS [02:15 min]
[INFO] Maven Release Odd-Even Policy ...................... SUCCESS [  2.071 s]
[INFO] Maven Release SemVer Policy ........................ SUCCESS [  2.380 s]
[INFO] Maven Release Plugin ............................... SUCCESS [06:21 min]
[INFO] ------------------------------------------------------------------------
[INFO] BUILD SUCCESS
[INFO] ------------------------------------------------------------------------
[INFO] Total time:  08:51 min
[INFO] Finished at: 2021-01-10T07:12:52-08:00
[INFO] ------------------------------------------------------------------------
[INFO] [jenkins-event-spy] Generated F:\jenkins\jenkins-slave\712657a4\workspace\n_maven-box_maven-release_master@2@tmp\withMaven58366f0f\maven-spy-20210110-070400-53318273216676028795327.log
[Pipeline] }
[Pipeline] // dir
[Pipeline] }
[withMaven] artifactsPublisher - Archive artifact windows-jdk15-m3.6.x_build\pom.xml under org\apache\maven\release\maven-release\3.0.0-SNAPSHOT\maven-release-3.0.0-SNAPSHOT.pom
[withMaven] artifactsPublisher - Archive artifact windows-jdk15-m3.6.x_build\target\maven-release-3.0.0-SNAPSHOT-site.xml under org\apache\maven\release\maven-release\3.0.0-SNAPSHOT\maven-release-3.0.0-SNAPSHOT-site.xml
[withMaven] artifactsPublisher - Archive artifact windows-jdk15-m3.6.x_build\maven-release-api\pom.xml under org\apache\maven\release\maven-release-api\3.0.0-SNAPSHOT\maven-release-api-3.0.0-SNAPSHOT.pom
[withMaven] artifactsPublisher - Archive artifact windows-jdk15-m3.6.x_build\maven-release-api\target\maven-release-api-3.0.0-SNAPSHOT.jar under org\apache\maven\release\maven-release-api\3.0.0-SNAPSHOT\maven-release-api-3.0.0-SNAPSHOT.jar
[withMaven] artifactsPublisher - Archive artifact windows-jdk15-m3.6.x_build\maven-release-manager\pom.xml under org\apache\maven\release\maven-release-manager\3.0.0-SNAPSHOT\maven-release-manager-3.0.0-SNAPSHOT.pom
[withMaven] artifactsPublisher - Archive artifact windows-jdk15-m3.6.x_build\maven-release-manager\target\maven-release-manager-3.0.0-SNAPSHOT.jar under org\apache\maven\release\maven-release-manager\3.0.0-SNAPSHOT\maven-release-manager-3.0.0-SNAPSHOT.jar
[withMaven] artifactsPublisher - Archive artifact windows-jdk15-m3.6.x_build\maven-release-policies\maven-release-oddeven-policy\pom.xml under org\apache\maven\release\maven-release-oddeven-policy\3.0.0-SNAPSHOT\maven-release-oddeven-policy-3.0.0-SNAPSHOT.pom
[withMaven] artifactsPublisher - Archive artifact windows-jdk15-m3.6.x_build\maven-release-policies\maven-release-oddeven-policy\target\maven-release-oddeven-policy-3.0.0-SNAPSHOT.jar under org\apache\maven\release\maven-release-oddeven-policy\3.0.0-SNAPSHOT\maven-release-oddeven-policy-3.0.0-SNAPSHOT.jar
[withMaven] artifactsPublisher - Archive artifact windows-jdk15-m3.6.x_build\maven-release-policies\maven-release-semver-policy\pom.xml under org\apache\maven\release\maven-release-semver-policy\3.0.0-SNAPSHOT\maven-release-semver-policy-3.0.0-SNAPSHOT.pom
[withMaven] artifactsPublisher - Archive artifact windows-jdk15-m3.6.x_build\maven-release-policies\maven-release-semver-policy\target\maven-release-semver-policy-3.0.0-SNAPSHOT.jar under org\apache\maven\release\maven-release-semver-policy\3.0.0-SNAPSHOT\maven-release-semver-policy-3.0.0-SNAPSHOT.jar
[withMaven] artifactsPublisher - Archive artifact windows-jdk15-m3.6.x_build\maven-release-plugin\pom.xml under org\apache\maven\plugins\maven-release-plugin\3.0.0-SNAPSHOT\maven-release-plugin-3.0.0-SNAPSHOT.pom
[withMaven] artifactsPublisher - Archive artifact windows-jdk15-m3.6.x_build\maven-release-plugin\target\maven-release-plugin-3.0.0-SNAPSHOT.jar under org\apache\maven\plugins\maven-release-plugin\3.0.0-SNAPSHOT\maven-release-plugin-3.0.0-SNAPSHOT.jar
[Fast Archiver] Compressed 370.89 KB of artifacts by 94.9% relative to #19
[withMaven] junitPublisher - Archive test results for Maven artifact org.apache.maven.release:maven-release-api:jar:3.0.0-SNAPSHOT generated by maven-surefire-plugin:test (default-test): windows-jdk15-m3.6.x_build\maven-release-api\target\surefire-reports\*.xml
[withMaven] junitPublisher - Archive test results for Maven artifact org.apache.maven.release:maven-release-manager:jar:3.0.0-SNAPSHOT generated by maven-surefire-plugin:test (default-test): windows-jdk15-m3.6.x_build\maven-release-manager\target\surefire-reports\*.xml
[withMaven] junitPublisher - Archive test results for Maven artifact org.apache.maven.release:maven-release-oddeven-policy:jar:3.0.0-SNAPSHOT generated by maven-surefire-plugin:test (default-test): windows-jdk15-m3.6.x_build\maven-release-policies\maven-release-oddeven-policy\target\surefire-reports\*.xml
[withMaven] junitPublisher - Archive test results for Maven artifact org.apache.maven.release:maven-release-semver-policy:jar:3.0.0-SNAPSHOT generated by maven-surefire-plugin:test (default-test): windows-jdk15-m3.6.x_build\maven-release-policies\maven-release-semver-policy\target\surefire-reports\*.xml
[withMaven] junitPublisher - Archive test results for Maven artifact org.apache.maven.plugins:maven-release-plugin:maven-plugin:3.0.0-SNAPSHOT generated by maven-surefire-plugin:test (default-test): windows-jdk15-m3.6.x_build\maven-release-plugin\target\surefire-reports\*.xml
Recording test results
[withMaven] junitPublisher - Archive test results for Maven artifact org.apache.maven.release:maven-release-manager:jar:3.0.0-SNAPSHOT generated by maven-failsafe-plugin:integration-test (default): windows-jdk15-m3.6.x_build\maven-release-manager\target\failsafe-reports\*.xml
Recording test results
[withMaven] openTasksPublisher - Scan Tasks for Maven artifact org.apache.maven.release:maven-release-api:jar:3.0.0-SNAPSHOT in source directory windows-jdk15-m3.6.x_build\maven-release-api\src\main\java
[withMaven] openTasksPublisher - Scan Tasks for Maven artifact org.apache.maven.release:maven-release-manager:jar:3.0.0-SNAPSHOT in source directory windows-jdk15-m3.6.x_build\maven-release-manager\src\main\java
[withMaven] openTasksPublisher - Scan Tasks for Maven artifact org.apache.maven.release:maven-release-oddeven-policy:jar:3.0.0-SNAPSHOT in source directory windows-jdk15-m3.6.x_build\maven-release-policies\maven-release-oddeven-policy\src\main\java
[withMaven] openTasksPublisher - Scan Tasks for Maven artifact org.apache.maven.release:maven-release-semver-policy:jar:3.0.0-SNAPSHOT in source directory windows-jdk15-m3.6.x_build\maven-release-policies\maven-release-semver-policy\src\main\java
[withMaven] openTasksPublisher - Scan Tasks for Maven artifact org.apache.maven.plugins:maven-release-plugin:maven-plugin:3.0.0-SNAPSHOT in source directory windows-jdk15-m3.6.x_build\maven-release-plugin\src\main\java
[TASKS] Scanning folder 'f:\jenkins\jenkins-slave\712657a4\workspace\n_maven-box_maven-release_master@2' for files matching the pattern 'windows-jdk15-m3.6.x_build\maven-release-api\src\main\java\**\*,windows-jdk15-m3.6.x_build\maven-release-manager\src\main\java\**\*,windows-jdk15-m3.6.x_build\maven-release-policies\maven-release-oddeven-policy\src\main\java\**\*,windows-jdk15-m3.6.x_build\maven-release-policies\maven-release-semver-policy\src\main\java\**\*,windows-jdk15-m3.6.x_build\maven-release-plugin\src\main\java\**\*' - excludes: null
[TASKS] Found 131 files to scan for tasks
[TASKS] Found 24 open tasks.
Skipping warnings blame since pipelines do not have an SCM link.%n
[TASKS] Computing warning deltas based on reference build #19
[withMaven] invokerPublisher - Archive invoker results for Maven artifact MavenArtifact{org.apache.maven.plugins:maven-release-plugin:maven-plugin:3.0.0-SNAPSHOT(version: 3.0.0-SNAPSHOT, snapshot:false) } generated by PluginInvocation{org.apache.maven.plugins:maven-invoker-plugin:3.2.0@run  integration-test-prepare}: windows-jdk15-m3.6.x_build\maven-release-plugin\target\invoker-reports\*.xml
[withMaven] Publishers: Generated Artifacts Publisher: 885 ms, Junit Publisher: 5879 ms, Open Task Scanner Publisher: 786 ms, Dependencies Fingerprint Publisher: 380 ms, Invoker Publisher: 27071 ms, Pipeline Graph Publisher: 5 ms
[Pipeline] // withMaven
[Pipeline] cleanWs
[WS-CLEANUP] Deleting project workspace...
[WS-CLEANUP] Deferred wipeout is used...
[WS-CLEANUP] done
[Pipeline] }
[Pipeline] // stage
[Pipeline] }
[Pipeline] // ws
[Pipeline] }
[Pipeline] // node
[Pipeline] }
[Pipeline] // parallel
[Pipeline] stage
[Pipeline] { (Notifications)
[Pipeline] echo
Build result: FAILURE
[Pipeline] jiraIssueSelector
[Pipeline] echo
The authors of changes [slachiewicz].
[Pipeline] echo
Sending email ...
[Pipeline] emailext