Build unstable in Jenkins: Maven » Maven TLP » maven » master #85

Previous Topic Next Topic
 
classic Classic list List threaded Threaded
2 messages Options
Reply | Threaded
Open this post in threaded view
|

Build unstable in Jenkins: Maven » Maven TLP » maven » master #85

Apache Jenkins Server-2
See https://ci-builds.apache.org/job/Maven/job/maven-box/job/maven/job/master/85/

Changes:

* [MNG-7060] Let build fail fast in case any maven-gpg-plugin goal is called
* [MNG-5760] Add `-r/--resume` to automatically resume from the last failure point
* [MNG-6972] Allow access to org.apache.maven.graph
* Trim line endings as done by Maven Resolver
* Correct last remaining incorrect checksums

2 tests failed.
FAILED:  org.apache.maven.it.MavenITmng6972AllowAccessToGraphPackageTest.linux-jdk11 / Run ITs Linux Java 11 / testit

Error Message:
Exit code was non-zero: 1; command line and log =
/home/jenkins/workspace/Maven_maven-box_maven_master/test/core-it-suite/target/apache-maven/bin/mvn --global-settings /home/jenkins/workspace/Maven_maven-box_maven_master/test/core-it-suite/target/test-classes/settings.xml -e --batch-mode -Dmaven.repo.local=/home/jenkins/workspace/Maven_maven-box_maven_master/test/it-local-repo install
[INFO] [jenkins-event-spy] Jenkins Maven Event Spy is disabled
[INFO] Error stacktraces are turned on.
[INFO] Scanning for projects...
[INFO] Maven detected that the requested POM file is part of a multi module project, but could not find a pom.xml file in the multi module root directory: '/home/jenkins/workspace/Maven_maven-box_maven_master/test/core-it-suite/target/test-classes/mng-6972-allow-access-to-graph-package'.
[INFO] The reactor is limited to all projects under: /home/jenkins/workspace/Maven_maven-box_maven_master/test/core-it-suite/target/test-classes/mng-6972-allow-access-to-graph-package/build-plugin
[INFO]
[INFO] --------< mng-6972-allow-access-to-graph-package:build-plugin >---------
[INFO] Building build-plugin 1.0
[INFO] --------------------------------[ jar ]---------------------------------
[WARNING] Version not locked for default bindings plugins [maven-resources-plugin, maven-compiler-plugin, maven-surefire-plugin, maven-jar-plugin, maven-install-plugin], you should define versions in pluginManagement section of your pom.xml or parent
[INFO]
[INFO] --- maven-resources-plugin:3.2.0:resources (default-resources) @ build-plugin ---
[INFO] Using 'UTF-8' encoding to copy filtered resources.
[INFO] Using 'UTF-8' encoding to copy filtered properties files.
[INFO] skip non existing resourceDirectory /home/jenkins/workspace/Maven_maven-box_maven_master/test/core-it-suite/target/test-classes/mng-6972-allow-access-to-graph-package/build-plugin/src/main/resources
[INFO] skip non existing resourceDirectory /home/jenkins/workspace/Maven_maven-box_maven_master/test/core-it-suite/target/test-classes/mng-6972-allow-access-to-graph-package/build-plugin/src/main/resources-filtered
[INFO]
[INFO] --- maven-compiler-plugin:3.8.1:compile (default-compile) @ build-plugin ---
[INFO] Changes detected - recompiling the module!
[INFO] Compiling 1 source file to /home/jenkins/workspace/Maven_maven-box_maven_master/test/core-it-suite/target/test-classes/mng-6972-allow-access-to-graph-package/build-plugin/target/classes
[INFO] -------------------------------------------------------------
[ERROR] COMPILATION ERROR :
[INFO] -------------------------------------------------------------
[ERROR] /home/jenkins/workspace/Maven_maven-box_maven_master/test/core-it-suite/target/test-classes/mng-6972-allow-access-to-graph-package/build-plugin/src/main/java/com/example/BuildExtensionUsingGraphPackage.java:[4,17] cannot find symbol
  symbol:   class Objects
  location: package java.util
[INFO] 1 error
[INFO] -------------------------------------------------------------
[INFO] ------------------------------------------------------------------------
[INFO] BUILD FAILURE
[INFO] ------------------------------------------------------------------------
[INFO] Total time:  0.447 s
[INFO] Finished at: 2021-01-03T12:19:52Z
[INFO] ------------------------------------------------------------------------
[ERROR] Failed to execute goal org.apache.maven.plugins:maven-compiler-plugin:3.8.1:compile (default-compile) on project build-plugin: Compilation failure
[ERROR] /home/jenkins/workspace/Maven_maven-box_maven_master/test/core-it-suite/target/test-classes/mng-6972-allow-access-to-graph-package/build-plugin/src/main/java/com/example/BuildExtensionUsingGraphPackage.java:[4,17] cannot find symbol
[ERROR]   symbol:   class Objects
[ERROR]   location: package java.util
[ERROR] -> [Help 1]
org.apache.maven.lifecycle.LifecycleExecutionException: Failed to execute goal org.apache.maven.plugins:maven-compiler-plugin:3.8.1:compile (default-compile) on project build-plugin: Compilation failure
/home/jenkins/workspace/Maven_maven-box_maven_master/test/core-it-suite/target/test-classes/mng-6972-allow-access-to-graph-package/build-plugin/src/main/java/com/example/BuildExtensionUsingGraphPackage.java:[4,17] cannot find symbol
  symbol:   class Objects
  location: package java.util

    at org.apache.maven.lifecycle.internal.MojoExecutor.execute (MojoExecutor.java:218)
    at org.apache.maven.lifecycle.internal.MojoExecutor.execute (MojoExecutor.java:159)
    at org.apache.maven.lifecycle.internal.MojoExecutor.execute (MojoExecutor.java:151)
    at org.apache.maven.lifecycle.internal.LifecycleModuleBuilder.buildProject (LifecycleModuleBuilder.java:115)
    at org.apache.maven.lifecycle.internal.LifecycleModuleBuilder.buildProject (LifecycleModuleBuilder.java:79)
    at org.apache.maven.lifecycle.internal.builder.singlethreaded.SingleThreadedBuilder.build (SingleThreadedBuilder.java:64)
    at org.apache.maven.lifecycle.internal.LifecycleStarter.execute (LifecycleStarter.java:131)
    at org.apache.maven.DefaultMaven.doExecute (DefaultMaven.java:321)
    at org.apache.maven.DefaultMaven.doExecute (DefaultMaven.java:206)
    at org.apache.maven.DefaultMaven.execute (DefaultMaven.java:119)
    at org.apache.maven.cli.MavenCli.execute (MavenCli.java:979)
    at org.apache.maven.cli.MavenCli.doMain (MavenCli.java:293)
    at org.apache.maven.cli.MavenCli.doMain (MavenCli.java:248)
    at jdk.internal.reflect.NativeMethodAccessorImpl.invoke0 (Native Method)
    at jdk.internal.reflect.NativeMethodAccessorImpl.invoke (NativeMethodAccessorImpl.java:62)
    at jdk.internal.reflect.DelegatingMethodAccessorImpl.invoke (DelegatingMethodAccessorImpl.java:43)
    at java.lang.reflect.Method.invoke (Method.java:566)
    at org.apache.maven.it.Embedded3xLauncher.run (Embedded3xLauncher.java:215)
    at org.apache.maven.it.Verifier.executeGoals (Verifier.java:1339)
    at org.apache.maven.it.Verifier.executeGoal (Verifier.java:1239)
    at org.apache.maven.it.Verifier.executeGoal (Verifier.java:1233)
    at org.apache.maven.it.MavenITmng6972AllowAccessToGraphPackageTest.testit (MavenITmng6972AllowAccessToGraphPackageTest.java:60)
    at jdk.internal.reflect.NativeMethodAccessorImpl.invoke0 (Native Method)
    at jdk.internal.reflect.NativeMethodAccessorImpl.invoke (NativeMethodAccessorImpl.java:62)
    at jdk.internal.reflect.DelegatingMethodAccessorImpl.invoke (DelegatingMethodAccessorImpl.java:43)
    at java.lang.reflect.Method.invoke (Method.java:566)
    at junit.framework.TestCase.runTest (TestCase.java:176)
    at org.apache.maven.it.AbstractMavenIntegrationTestCase.runTest (AbstractMavenIntegrationTestCase.java:255)
    at junit.framework.TestCase.runBare (TestCase.java:141)
    at junit.framework.TestResult$1.protect (TestResult.java:122)
    at junit.framework.TestResult.runProtected (TestResult.java:142)
    at junit.framework.TestResult.run (TestResult.java:125)
    at junit.framework.TestCase.run (TestCase.java:129)
    at junit.framework.TestSuite.runTest (TestSuite.java:252)
    at junit.framework.TestSuite.run (TestSuite.java:247)
    at junit.framework.TestSuite.runTest (TestSuite.java:252)
    at junit.framework.TestSuite.run (TestSuite.java:247)
    at org.junit.internal.runners.JUnit38ClassRunner.run (JUnit38ClassRunner.java:86)
    at org.apache.maven.surefire.junit4.JUnit4Provider.execute (JUnit4Provider.java:365)
    at org.apache.maven.surefire.junit4.JUnit4Provider.executeWithRerun (JUnit4Provider.java:273)
    at org.apache.maven.surefire.junit4.JUnit4Provider.executeTestSet (JUnit4Provider.java:238)
    at org.apache.maven.surefire.junit4.JUnit4Provider.invoke (JUnit4Provider.java:159)
    at org.apache.maven.surefire.booter.ForkedBooter.invokeProviderInSameClassLoader (ForkedBooter.java:383)
    at org.apache.maven.surefire.booter.ForkedBooter.runSuitesInProcess (ForkedBooter.java:344)
    at org.apache.maven.surefire.booter.ForkedBooter.execute (ForkedBooter.java:125)
    at org.apache.maven.surefire.booter.ForkedBooter.main (ForkedBooter.java:417)
Caused by: org.apache.maven.plugin.compiler.CompilationFailureException: Compilation failure
/home/jenkins/workspace/Maven_maven-box_maven_master/test/core-it-suite/target/test-classes/mng-6972-allow-access-to-graph-package/build-plugin/src/main/java/com/example/BuildExtensionUsingGraphPackage.java:[4,17] cannot find symbol
  symbol:   class Objects
  location: package java.util

    at org.apache.maven.plugin.compiler.AbstractCompilerMojo.execute (AbstractCompilerMojo.java:1220)
    at org.apache.maven.plugin.compiler.CompilerMojo.execute (CompilerMojo.java:187)
    at org.apache.maven.plugin.DefaultBuildPluginManager.executeMojo (DefaultBuildPluginManager.java:136)
    at org.apache.maven.lifecycle.internal.MojoExecutor.execute (MojoExecutor.java:213)
    at org.apache.maven.lifecycle.internal.MojoExecutor.execute (MojoExecutor.java:159)
    at org.apache.maven.lifecycle.internal.MojoExecutor.execute (MojoExecutor.java:151)
    at org.apache.maven.lifecycle.internal.LifecycleModuleBuilder.buildProject (LifecycleModuleBuilder.java:115)
    at org.apache.maven.lifecycle.internal.LifecycleModuleBuilder.buildProject (LifecycleModuleBuilder.java:79)
    at org.apache.maven.lifecycle.internal.builder.singlethreaded.SingleThreadedBuilder.build (SingleThreadedBuilder.java:64)
    at org.apache.maven.lifecycle.internal.LifecycleStarter.execute (LifecycleStarter.java:131)
    at org.apache.maven.DefaultMaven.doExecute (DefaultMaven.java:321)
    at org.apache.maven.DefaultMaven.doExecute (DefaultMaven.java:206)
    at org.apache.maven.DefaultMaven.execute (DefaultMaven.java:119)
    at org.apache.maven.cli.MavenCli.execute (MavenCli.java:979)
    at org.apache.maven.cli.MavenCli.doMain (MavenCli.java:293)
    at org.apache.maven.cli.MavenCli.doMain (MavenCli.java:248)
    at jdk.internal.reflect.NativeMethodAccessorImpl.invoke0 (Native Method)
    at jdk.internal.reflect.NativeMethodAccessorImpl.invoke (NativeMethodAccessorImpl.java:62)
    at jdk.internal.reflect.DelegatingMethodAccessorImpl.invoke (DelegatingMethodAccessorImpl.java:43)
    at java.lang.reflect.Method.invoke (Method.java:566)
    at org.apache.maven.it.Embedded3xLauncher.run (Embedded3xLauncher.java:215)
    at org.apache.maven.it.Verifier.executeGoals (Verifier.java:1339)
    at org.apache.maven.it.Verifier.executeGoal (Verifier.java:1239)
    at org.apache.maven.it.Verifier.executeGoal (Verifier.java:1233)
    at org.apache.maven.it.MavenITmng6972AllowAccessToGraphPackageTest.testit (MavenITmng6972AllowAccessToGraphPackageTest.java:60)
    at jdk.internal.reflect.NativeMethodAccessorImpl.invoke0 (Native Method)
    at jdk.internal.reflect.NativeMethodAccessorImpl.invoke (NativeMethodAccessorImpl.java:62)
    at jdk.internal.reflect.DelegatingMethodAccessorImpl.invoke (DelegatingMethodAccessorImpl.java:43)
    at java.lang.reflect.Method.invoke (Method.java:566)
    at junit.framework.TestCase.runTest (TestCase.java:176)
    at org.apache.maven.it.AbstractMavenIntegrationTestCase.runTest (AbstractMavenIntegrationTestCase.java:255)
    at junit.framework.TestCase.runBare (TestCase.java:141)
    at junit.framework.TestResult$1.protect (TestResult.java:122)
    at junit.framework.TestResult.runProtected (TestResult.java:142)
    at junit.framework.TestResult.run (TestResult.java:125)
    at junit.framework.TestCase.run (TestCase.java:129)
    at junit.framework.TestSuite.runTest (TestSuite.java:252)
    at junit.framework.TestSuite.run (TestSuite.java:247)
    at junit.framework.TestSuite.runTest (TestSuite.java:252)
    at junit.framework.TestSuite.run (TestSuite.java:247)
    at org.junit.internal.runners.JUnit38ClassRunner.run (JUnit38ClassRunner.java:86)
    at org.apache.maven.surefire.junit4.JUnit4Provider.execute (JUnit4Provider.java:365)
    at org.apache.maven.surefire.junit4.JUnit4Provider.executeWithRerun (JUnit4Provider.java:273)
    at org.apache.maven.surefire.junit4.JUnit4Provider.executeTestSet (JUnit4Provider.java:238)
    at org.apache.maven.surefire.junit4.JUnit4Provider.invoke (JUnit4Provider.java:159)
    at org.apache.maven.surefire.booter.ForkedBooter.invokeProviderInSameClassLoader (ForkedBooter.java:383)
    at org.apache.maven.surefire.booter.ForkedBooter.runSuitesInProcess (ForkedBooter.java:344)
    at org.apache.maven.surefire.booter.ForkedBooter.execute (ForkedBooter.java:125)
    at org.apache.maven.surefire.booter.ForkedBooter.main (ForkedBooter.java:417)
[ERROR]
[ERROR] Re-run Maven using the -X switch to enable full debug logging.
[ERROR]
[ERROR] For more information about the errors and possible solutions, please read the following articles:
[ERROR] [Help 1] http://cwiki.apache.org/confluence/display/MAVEN/MojoFailureException


Stack Trace:
org.apache.maven.it.VerificationException:
Exit code was non-zero: 1; command line and log =
/home/jenkins/workspace/Maven_maven-box_maven_master/test/core-it-suite/target/apache-maven/bin/mvn --global-settings /home/jenkins/workspace/Maven_maven-box_maven_master/test/core-it-suite/target/test-classes/settings.xml -e --batch-mode -Dmaven.repo.local=/home/jenkins/workspace/Maven_maven-box_maven_master/test/it-local-repo install
[INFO] [jenkins-event-spy] Jenkins Maven Event Spy is disabled
[INFO] Error stacktraces are turned on.
[INFO] Scanning for projects...
[INFO] Maven detected that the requested POM file is part of a multi module project, but could not find a pom.xml file in the multi module root directory: '/home/jenkins/workspace/Maven_maven-box_maven_master/test/core-it-suite/target/test-classes/mng-6972-allow-access-to-graph-package'.
[INFO] The reactor is limited to all projects under: /home/jenkins/workspace/Maven_maven-box_maven_master/test/core-it-suite/target/test-classes/mng-6972-allow-access-to-graph-package/build-plugin
[INFO]
[INFO] --------< mng-6972-allow-access-to-graph-package:build-plugin >---------
[INFO] Building build-plugin 1.0
[INFO] --------------------------------[ jar ]---------------------------------
[WARNING] Version not locked for default bindings plugins [maven-resources-plugin, maven-compiler-plugin, maven-surefire-plugin, maven-jar-plugin, maven-install-plugin], you should define versions in pluginManagement section of your pom.xml or parent
[INFO]
[INFO] --- maven-resources-plugin:3.2.0:resources (default-resources) @ build-plugin ---
[INFO] Using 'UTF-8' encoding to copy filtered resources.
[INFO] Using 'UTF-8' encoding to copy filtered properties files.
[INFO] skip non existing resourceDirectory /home/jenkins/workspace/Maven_maven-box_maven_master/test/core-it-suite/target/test-classes/mng-6972-allow-access-to-graph-package/build-plugin/src/main/resources
[INFO] skip non existing resourceDirectory /home/jenkins/workspace/Maven_maven-box_maven_master/test/core-it-suite/target/test-classes/mng-6972-allow-access-to-graph-package/build-plugin/src/main/resources-filtered
[INFO]
[INFO] --- maven-compiler-plugin:3.8.1:compile (default-compile) @ build-plugin ---
[INFO] Changes detected - recompiling the module!
[INFO] Compiling 1 source file to /home/jenkins/workspace/Maven_maven-box_maven_master/test/core-it-suite/target/test-classes/mng-6972-allow-access-to-graph-package/build-plugin/target/classes
[INFO] -------------------------------------------------------------
[ERROR] COMPILATION ERROR :
[INFO] -------------------------------------------------------------
[ERROR] /home/jenkins/workspace/Maven_maven-box_maven_master/test/core-it-suite/target/test-classes/mng-6972-allow-access-to-graph-package/build-plugin/src/main/java/com/example/BuildExtensionUsingGraphPackage.java:[4,17] cannot find symbol
  symbol:   class Objects
  location: package java.util
[INFO] 1 error
[INFO] -------------------------------------------------------------
[INFO] ------------------------------------------------------------------------
[INFO] BUILD FAILURE
[INFO] ------------------------------------------------------------------------
[INFO] Total time:  0.447 s
[INFO] Finished at: 2021-01-03T12:19:52Z
[INFO] ------------------------------------------------------------------------
[ERROR] Failed to execute goal org.apache.maven.plugins:maven-compiler-plugin:3.8.1:compile (default-compile) on project build-plugin: Compilation failure
[ERROR] /home/jenkins/workspace/Maven_maven-box_maven_master/test/core-it-suite/target/test-classes/mng-6972-allow-access-to-graph-package/build-plugin/src/main/java/com/example/BuildExtensionUsingGraphPackage.java:[4,17] cannot find symbol
[ERROR]   symbol:   class Objects
[ERROR]   location: package java.util
[ERROR] -> [Help 1]
org.apache.maven.lifecycle.LifecycleExecutionException: Failed to execute goal org.apache.maven.plugins:maven-compiler-plugin:3.8.1:compile (default-compile) on project build-plugin: Compilation failure
/home/jenkins/workspace/Maven_maven-box_maven_master/test/core-it-suite/target/test-classes/mng-6972-allow-access-to-graph-package/build-plugin/src/main/java/com/example/BuildExtensionUsingGraphPackage.java:[4,17] cannot find symbol
  symbol:   class Objects
  location: package java.util

    at org.apache.maven.lifecycle.internal.MojoExecutor.execute (MojoExecutor.java:218)
    at org.apache.maven.lifecycle.internal.MojoExecutor.execute (MojoExecutor.java:159)
    at org.apache.maven.lifecycle.internal.MojoExecutor.execute (MojoExecutor.java:151)
    at org.apache.maven.lifecycle.internal.LifecycleModuleBuilder.buildProject (LifecycleModuleBuilder.java:115)
    at org.apache.maven.lifecycle.internal.LifecycleModuleBuilder.buildProject (LifecycleModuleBuilder.java:79)
    at org.apache.maven.lifecycle.internal.builder.singlethreaded.SingleThreadedBuilder.build (SingleThreadedBuilder.java:64)
    at org.apache.maven.lifecycle.internal.LifecycleStarter.execute (LifecycleStarter.java:131)
    at org.apache.maven.DefaultMaven.doExecute (DefaultMaven.java:321)
    at org.apache.maven.DefaultMaven.doExecute (DefaultMaven.java:206)
    at org.apache.maven.DefaultMaven.execute (DefaultMaven.java:119)
    at org.apache.maven.cli.MavenCli.execute (MavenCli.java:979)
    at org.apache.maven.cli.MavenCli.doMain (MavenCli.java:293)
    at org.apache.maven.cli.MavenCli.doMain (MavenCli.java:248)
    at jdk.internal.reflect.NativeMethodAccessorImpl.invoke0 (Native Method)
    at jdk.internal.reflect.NativeMethodAccessorImpl.invoke (NativeMethodAccessorImpl.java:62)
    at jdk.internal.reflect.DelegatingMethodAccessorImpl.invoke (DelegatingMethodAccessorImpl.java:43)
    at java.lang.reflect.Method.invoke (Method.java:566)
    at org.apache.maven.it.Embedded3xLauncher.run (Embedded3xLauncher.java:215)
    at org.apache.maven.it.Verifier.executeGoals (Verifier.java:1339)
    at org.apache.maven.it.Verifier.executeGoal (Verifier.java:1239)
    at org.apache.maven.it.Verifier.executeGoal (Verifier.java:1233)
    at org.apache.maven.it.MavenITmng6972AllowAccessToGraphPackageTest.testit (MavenITmng6972AllowAccessToGraphPackageTest.java:60)
    at jdk.internal.reflect.NativeMethodAccessorImpl.invoke0 (Native Method)
    at jdk.internal.reflect.NativeMethodAccessorImpl.invoke (NativeMethodAccessorImpl.java:62)
    at jdk.internal.reflect.DelegatingMethodAccessorImpl.invoke (DelegatingMethodAccessorImpl.java:43)
    at java.lang.reflect.Method.invoke (Method.java:566)
    at junit.framework.TestCase.runTest (TestCase.java:176)
    at org.apache.maven.it.AbstractMavenIntegrationTestCase.runTest (AbstractMavenIntegrationTestCase.java:255)
    at junit.framework.TestCase.runBare (TestCase.java:141)
    at junit.framework.TestResult$1.protect (TestResult.java:122)
    at junit.framework.TestResult.runProtected (TestResult.java:142)
    at junit.framework.TestResult.run (TestResult.java:125)
    at junit.framework.TestCase.run (TestCase.java:129)
    at junit.framework.TestSuite.runTest (TestSuite.java:252)
    at junit.framework.TestSuite.run (TestSuite.java:247)
    at junit.framework.TestSuite.runTest (TestSuite.java:252)
    at junit.framework.TestSuite.run (TestSuite.java:247)
    at org.junit.internal.runners.JUnit38ClassRunner.run (JUnit38ClassRunner.java:86)
    at org.apache.maven.surefire.junit4.JUnit4Provider.execute (JUnit4Provider.java:365)
    at org.apache.maven.surefire.junit4.JUnit4Provider.executeWithRerun (JUnit4Provider.java:273)
    at org.apache.maven.surefire.junit4.JUnit4Provider.executeTestSet (JUnit4Provider.java:238)
    at org.apache.maven.surefire.junit4.JUnit4Provider.invoke (JUnit4Provider.java:159)
    at org.apache.maven.surefire.booter.ForkedBooter.invokeProviderInSameClassLoader (ForkedBooter.java:383)
    at org.apache.maven.surefire.booter.ForkedBooter.runSuitesInProcess (ForkedBooter.java:344)
    at org.apache.maven.surefire.booter.ForkedBooter.execute (ForkedBooter.java:125)
    at org.apache.maven.surefire.booter.ForkedBooter.main (ForkedBooter.java:417)
Caused by: org.apache.maven.plugin.compiler.CompilationFailureException: Compilation failure
/home/jenkins/workspace/Maven_maven-box_maven_master/test/core-it-suite/target/test-classes/mng-6972-allow-access-to-graph-package/build-plugin/src/main/java/com/example/BuildExtensionUsingGraphPackage.java:[4,17] cannot find symbol
  symbol:   class Objects
  location: package java.util

    at org.apache.maven.plugin.compiler.AbstractCompilerMojo.execute (AbstractCompilerMojo.java:1220)
    at org.apache.maven.plugin.compiler.CompilerMojo.execute (CompilerMojo.java:187)
    at org.apache.maven.plugin.DefaultBuildPluginManager.executeMojo (DefaultBuildPluginManager.java:136)
    at org.apache.maven.lifecycle.internal.MojoExecutor.execute (MojoExecutor.java:213)
    at org.apache.maven.lifecycle.internal.MojoExecutor.execute (MojoExecutor.java:159)
    at org.apache.maven.lifecycle.internal.MojoExecutor.execute (MojoExecutor.java:151)
    at org.apache.maven.lifecycle.internal.LifecycleModuleBuilder.buildProject (LifecycleModuleBuilder.java:115)
    at org.apache.maven.lifecycle.internal.LifecycleModuleBuilder.buildProject (LifecycleModuleBuilder.java:79)
    at org.apache.maven.lifecycle.internal.builder.singlethreaded.SingleThreadedBuilder.build (SingleThreadedBuilder.java:64)
    at org.apache.maven.lifecycle.internal.LifecycleStarter.execute (LifecycleStarter.java:131)
    at org.apache.maven.DefaultMaven.doExecute (DefaultMaven.java:321)
    at org.apache.maven.DefaultMaven.doExecute (DefaultMaven.java:206)
    at org.apache.maven.DefaultMaven.execute (DefaultMaven.java:119)
    at org.apache.maven.cli.MavenCli.execute (MavenCli.java:979)
    at org.apache.maven.cli.MavenCli.doMain (MavenCli.java:293)
    at org.apache.maven.cli.MavenCli.doMain (MavenCli.java:248)
    at jdk.internal.reflect.NativeMethodAccessorImpl.invoke0 (Native Method)
    at jdk.internal.reflect.NativeMethodAccessorImpl.invoke (NativeMethodAccessorImpl.java:62)
    at jdk.internal.reflect.DelegatingMethodAccessorImpl.invoke (DelegatingMethodAccessorImpl.java:43)
    at java.lang.reflect.Method.invoke (Method.java:566)
    at org.apache.maven.it.Embedded3xLauncher.run (Embedded3xLauncher.java:215)
    at org.apache.maven.it.Verifier.executeGoals (Verifier.java:1339)
    at org.apache.maven.it.Verifier.executeGoal (Verifier.java:1239)
    at org.apache.maven.it.Verifier.executeGoal (Verifier.java:1233)
    at org.apache.maven.it.MavenITmng6972AllowAccessToGraphPackageTest.testit (MavenITmng6972AllowAccessToGraphPackageTest.java:60)
    at jdk.internal.reflect.NativeMethodAccessorImpl.invoke0 (Native Method)
    at jdk.internal.reflect.NativeMethodAccessorImpl.invoke (NativeMethodAccessorImpl.java:62)
    at jdk.internal.reflect.DelegatingMethodAccessorImpl.invoke (DelegatingMethodAccessorImpl.java:43)
    at java.lang.reflect.Method.invoke (Method.java:566)
    at junit.framework.TestCase.runTest (TestCase.java:176)
    at org.apache.maven.it.AbstractMavenIntegrationTestCase.runTest (AbstractMavenIntegrationTestCase.java:255)
    at junit.framework.TestCase.runBare (TestCase.java:141)
    at junit.framework.TestResult$1.protect (TestResult.java:122)
    at junit.framework.TestResult.runProtected (TestResult.java:142)
    at junit.framework.TestResult.run (TestResult.java:125)
    at junit.framework.TestCase.run (TestCase.java:129)
    at junit.framework.TestSuite.runTest (TestSuite.java:252)
    at junit.framework.TestSuite.run (TestSuite.java:247)
    at junit.framework.TestSuite.runTest (TestSuite.java:252)
    at junit.framework.TestSuite.run (TestSuite.java:247)
    at org.junit.internal.runners.JUnit38ClassRunner.run (JUnit38ClassRunner.java:86)
    at org.apache.maven.surefire.junit4.JUnit4Provider.execute (JUnit4Provider.java:365)
    at org.apache.maven.surefire.junit4.JUnit4Provider.executeWithRerun (JUnit4Provider.java:273)
    at org.apache.maven.surefire.junit4.JUnit4Provider.executeTestSet (JUnit4Provider.java:238)
    at org.apache.maven.surefire.junit4.JUnit4Provider.invoke (JUnit4Provider.java:159)
    at org.apache.maven.surefire.booter.ForkedBooter.invokeProviderInSameClassLoader (ForkedBooter.java:383)
    at org.apache.maven.surefire.booter.ForkedBooter.runSuitesInProcess (ForkedBooter.java:344)
    at org.apache.maven.surefire.booter.ForkedBooter.execute (ForkedBooter.java:125)
    at org.apache.maven.surefire.booter.ForkedBooter.main (ForkedBooter.java:417)
[ERROR]
[ERROR] Re-run Maven using the -X switch to enable full debug logging.
[ERROR]
[ERROR] For more information about the errors and possible solutions, please read the following articles:
[ERROR] [Help 1] http://cwiki.apache.org/confluence/display/MAVEN/MojoFailureException

        at org.apache.maven.it.MavenITmng6972AllowAccessToGraphPackageTest.testit(MavenITmng6972AllowAccessToGraphPackageTest.java:60)


FAILED:  org.apache.maven.it.MavenITmng6972AllowAccessToGraphPackageTest.windows-jdk11 / Run ITs Windows Java 11 / testit

Error Message:
Exit code was non-zero: 1; command line and log =
C:\mvn-it-0.tmp\core-it-suite\target\apache-maven\bin\mvn --global-settings C:\mvn-it-0.tmp\core-it-suite\target\test-classes\settings.xml -e --batch-mode -Dmaven.repo.local=c:\mvn-it-0.tmp\it-local-repo install
[INFO] [jenkins-event-spy] Jenkins Maven Event Spy is disabled
[INFO] Error stacktraces are turned on.
[INFO] Scanning for projects...
[INFO] Maven detected that the requested POM file is part of a multi module project, but could not find a pom.xml file in the multi module root directory: 'C:\mvn-it-0.tmp\core-it-suite\target\test-classes\mng-6972-allow-access-to-graph-package'.
[INFO] The reactor is limited to all projects under: C:\mvn-it-0.tmp\core-it-suite\target\test-classes\mng-6972-allow-access-to-graph-package\build-plugin
[INFO]
[INFO] --------< mng-6972-allow-access-to-graph-package:build-plugin >---------
[INFO] Building build-plugin 1.0
[INFO] --------------------------------[ jar ]---------------------------------
[WARNING] Version not locked for default bindings plugins [maven-resources-plugin, maven-compiler-plugin, maven-surefire-plugin, maven-jar-plugin, maven-install-plugin], you should define versions in pluginManagement section of your pom.xml or parent
[INFO]
[INFO] --- maven-resources-plugin:3.2.0:resources (default-resources) @ build-plugin ---
[INFO] Using 'UTF-8' encoding to copy filtered resources.
[INFO] Using 'UTF-8' encoding to copy filtered properties files.
[INFO] skip non existing resourceDirectory C:\mvn-it-0.tmp\core-it-suite\target\test-classes\mng-6972-allow-access-to-graph-package\build-plugin\src\main\resources
[INFO] skip non existing resourceDirectory C:\mvn-it-0.tmp\core-it-suite\target\test-classes\mng-6972-allow-access-to-graph-package\build-plugin\src\main\resources-filtered
[INFO]
[INFO] --- maven-compiler-plugin:3.8.1:compile (default-compile) @ build-plugin ---
[INFO] Changes detected - recompiling the module!
[INFO] Compiling 1 source file to C:\mvn-it-0.tmp\core-it-suite\target\test-classes\mng-6972-allow-access-to-graph-package\build-plugin\target\classes
[INFO] -------------------------------------------------------------
[ERROR] COMPILATION ERROR :
[INFO] -------------------------------------------------------------
[ERROR] /C:/mvn-it-0.tmp/core-it-suite/target/test-classes/mng-6972-allow-access-to-graph-package/build-plugin/src/main/java/com/example/BuildExtensionUsingGraphPackage.java:[4,17] cannot find symbol
  symbol:   class Objects
  location: package java.util
[INFO] 1 error
[INFO] -------------------------------------------------------------
[INFO] ------------------------------------------------------------------------
[INFO] BUILD FAILURE
[INFO] ------------------------------------------------------------------------
[INFO] Total time:  0.882 s
[INFO] Finished at: 2021-01-03T04:47:34-08:00
[INFO] ------------------------------------------------------------------------
[ERROR] Failed to execute goal org.apache.maven.plugins:maven-compiler-plugin:3.8.1:compile (default-compile) on project build-plugin: Compilation failure
[ERROR] /C:/mvn-it-0.tmp/core-it-suite/target/test-classes/mng-6972-allow-access-to-graph-package/build-plugin/src/main/java/com/example/BuildExtensionUsingGraphPackage.java:[4,17] cannot find symbol
[ERROR]   symbol:   class Objects
[ERROR]   location: package java.util
[ERROR] -> [Help 1]
org.apache.maven.lifecycle.LifecycleExecutionException: Failed to execute goal org.apache.maven.plugins:maven-compiler-plugin:3.8.1:compile (default-compile) on project build-plugin: Compilation failure
/C:/mvn-it-0.tmp/core-it-suite/target/test-classes/mng-6972-allow-access-to-graph-package/build-plugin/src/main/java/com/example/BuildExtensionUsingGraphPackage.java:[4,17] cannot find symbol
  symbol:   class Objects
  location: package java.util

    at org.apache.maven.lifecycle.internal.MojoExecutor.execute (MojoExecutor.java:218)
    at org.apache.maven.lifecycle.internal.MojoExecutor.execute (MojoExecutor.java:159)
    at org.apache.maven.lifecycle.internal.MojoExecutor.execute (MojoExecutor.java:151)
    at org.apache.maven.lifecycle.internal.LifecycleModuleBuilder.buildProject (LifecycleModuleBuilder.java:115)
    at org.apache.maven.lifecycle.internal.LifecycleModuleBuilder.buildProject (LifecycleModuleBuilder.java:79)
    at org.apache.maven.lifecycle.internal.builder.singlethreaded.SingleThreadedBuilder.build (SingleThreadedBuilder.java:64)
    at org.apache.maven.lifecycle.internal.LifecycleStarter.execute (LifecycleStarter.java:131)
    at org.apache.maven.DefaultMaven.doExecute (DefaultMaven.java:321)
    at org.apache.maven.DefaultMaven.doExecute (DefaultMaven.java:206)
    at org.apache.maven.DefaultMaven.execute (DefaultMaven.java:119)
    at org.apache.maven.cli.MavenCli.execute (MavenCli.java:979)
    at org.apache.maven.cli.MavenCli.doMain (MavenCli.java:293)
    at org.apache.maven.cli.MavenCli.doMain (MavenCli.java:248)
    at jdk.internal.reflect.NativeMethodAccessorImpl.invoke0 (Native Method)
    at jdk.internal.reflect.NativeMethodAccessorImpl.invoke (NativeMethodAccessorImpl.java:62)
    at jdk.internal.reflect.DelegatingMethodAccessorImpl.invoke (DelegatingMethodAccessorImpl.java:43)
    at java.lang.reflect.Method.invoke (Method.java:566)
    at org.apache.maven.it.Embedded3xLauncher.run (Embedded3xLauncher.java:215)
    at org.apache.maven.it.Verifier.executeGoals (Verifier.java:1339)
    at org.apache.maven.it.Verifier.executeGoal (Verifier.java:1239)
    at org.apache.maven.it.Verifier.executeGoal (Verifier.java:1233)
    at org.apache.maven.it.MavenITmng6972AllowAccessToGraphPackageTest.testit (MavenITmng6972AllowAccessToGraphPackageTest.java:60)
    at jdk.internal.reflect.NativeMethodAccessorImpl.invoke0 (Native Method)
    at jdk.internal.reflect.NativeMethodAccessorImpl.invoke (NativeMethodAccessorImpl.java:62)
    at jdk.internal.reflect.DelegatingMethodAccessorImpl.invoke (DelegatingMethodAccessorImpl.java:43)
    at java.lang.reflect.Method.invoke (Method.java:566)
    at junit.framework.TestCase.runTest (TestCase.java:176)
    at org.apache.maven.it.AbstractMavenIntegrationTestCase.runTest (AbstractMavenIntegrationTestCase.java:255)
    at junit.framework.TestCase.runBare (TestCase.java:141)
    at junit.framework.TestResult$1.protect (TestResult.java:122)
    at junit.framework.TestResult.runProtected (TestResult.java:142)
    at junit.framework.TestResult.run (TestResult.java:125)
    at junit.framework.TestCase.run (TestCase.java:129)
    at junit.framework.TestSuite.runTest (TestSuite.java:252)
    at junit.framework.TestSuite.run (TestSuite.java:247)
    at junit.framework.TestSuite.runTest (TestSuite.java:252)
    at junit.framework.TestSuite.run (TestSuite.java:247)
    at org.junit.internal.runners.JUnit38ClassRunner.run (JUnit38ClassRunner.java:86)
    at org.apache.maven.surefire.junit4.JUnit4Provider.execute (JUnit4Provider.java:365)
    at org.apache.maven.surefire.junit4.JUnit4Provider.executeWithRerun (JUnit4Provider.java:273)
    at org.apache.maven.surefire.junit4.JUnit4Provider.executeTestSet (JUnit4Provider.java:238)
    at org.apache.maven.surefire.junit4.JUnit4Provider.invoke (JUnit4Provider.java:159)
    at org.apache.maven.surefire.booter.ForkedBooter.invokeProviderInSameClassLoader (ForkedBooter.java:383)
    at org.apache.maven.surefire.booter.ForkedBooter.runSuitesInProcess (ForkedBooter.java:344)
    at org.apache.maven.surefire.booter.ForkedBooter.execute (ForkedBooter.java:125)
    at org.apache.maven.surefire.booter.ForkedBooter.main (ForkedBooter.java:417)
Caused by: org.apache.maven.plugin.compiler.CompilationFailureException: Compilation failure
/C:/mvn-it-0.tmp/core-it-suite/target/test-classes/mng-6972-allow-access-to-graph-package/build-plugin/src/main/java/com/example/BuildExtensionUsingGraphPackage.java:[4,17] cannot find symbol
  symbol:   class Objects
  location: package java.util

    at org.apache.maven.plugin.compiler.AbstractCompilerMojo.execute (AbstractCompilerMojo.java:1220)
    at org.apache.maven.plugin.compiler.CompilerMojo.execute (CompilerMojo.java:187)
    at org.apache.maven.plugin.DefaultBuildPluginManager.executeMojo (DefaultBuildPluginManager.java:136)
    at org.apache.maven.lifecycle.internal.MojoExecutor.execute (MojoExecutor.java:213)
    at org.apache.maven.lifecycle.internal.MojoExecutor.execute (MojoExecutor.java:159)
    at org.apache.maven.lifecycle.internal.MojoExecutor.execute (MojoExecutor.java:151)
    at org.apache.maven.lifecycle.internal.LifecycleModuleBuilder.buildProject (LifecycleModuleBuilder.java:115)
    at org.apache.maven.lifecycle.internal.LifecycleModuleBuilder.buildProject (LifecycleModuleBuilder.java:79)
    at org.apache.maven.lifecycle.internal.builder.singlethreaded.SingleThreadedBuilder.build (SingleThreadedBuilder.java:64)
    at org.apache.maven.lifecycle.internal.LifecycleStarter.execute (LifecycleStarter.java:131)
    at org.apache.maven.DefaultMaven.doExecute (DefaultMaven.java:321)
    at org.apache.maven.DefaultMaven.doExecute (DefaultMaven.java:206)
    at org.apache.maven.DefaultMaven.execute (DefaultMaven.java:119)
    at org.apache.maven.cli.MavenCli.execute (MavenCli.java:979)
    at org.apache.maven.cli.MavenCli.doMain (MavenCli.java:293)
    at org.apache.maven.cli.MavenCli.doMain (MavenCli.java:248)
    at jdk.internal.reflect.NativeMethodAccessorImpl.invoke0 (Native Method)
    at jdk.internal.reflect.NativeMethodAccessorImpl.invoke (NativeMethodAccessorImpl.java:62)
    at jdk.internal.reflect.DelegatingMethodAccessorImpl.invoke (DelegatingMethodAccessorImpl.java:43)
    at java.lang.reflect.Method.invoke (Method.java:566)
    at org.apache.maven.it.Embedded3xLauncher.run (Embedded3xLauncher.java:215)
    at org.apache.maven.it.Verifier.executeGoals (Verifier.java:1339)
    at org.apache.maven.it.Verifier.executeGoal (Verifier.java:1239)
    at org.apache.maven.it.Verifier.executeGoal (Verifier.java:1233)
    at org.apache.maven.it.MavenITmng6972AllowAccessToGraphPackageTest.testit (MavenITmng6972AllowAccessToGraphPackageTest.java:60)
    at jdk.internal.reflect.NativeMethodAccessorImpl.invoke0 (Native Method)
    at jdk.internal.reflect.NativeMethodAccessorImpl.invoke (NativeMethodAccessorImpl.java:62)
    at jdk.internal.reflect.DelegatingMethodAccessorImpl.invoke (DelegatingMethodAccessorImpl.java:43)
    at java.lang.reflect.Method.invoke (Method.java:566)
    at junit.framework.TestCase.runTest (TestCase.java:176)
    at org.apache.maven.it.AbstractMavenIntegrationTestCase.runTest (AbstractMavenIntegrationTestCase.java:255)
    at junit.framework.TestCase.runBare (TestCase.java:141)
    at junit.framework.TestResult$1.protect (TestResult.java:122)
    at junit.framework.TestResult.runProtected (TestResult.java:142)
    at junit.framework.TestResult.run (TestResult.java:125)
    at junit.framework.TestCase.run (TestCase.java:129)
    at junit.framework.TestSuite.runTest (TestSuite.java:252)
    at junit.framework.TestSuite.run (TestSuite.java:247)
    at junit.framework.TestSuite.runTest (TestSuite.java:252)
    at junit.framework.TestSuite.run (TestSuite.java:247)
    at org.junit.internal.runners.JUnit38ClassRunner.run (JUnit38ClassRunner.java:86)
    at org.apache.maven.surefire.junit4.JUnit4Provider.execute (JUnit4Provider.java:365)
    at org.apache.maven.surefire.junit4.JUnit4Provider.executeWithRerun (JUnit4Provider.java:273)
    at org.apache.maven.surefire.junit4.JUnit4Provider.executeTestSet (JUnit4Provider.java:238)
    at org.apache.maven.surefire.junit4.JUnit4Provider.invoke (JUnit4Provider.java:159)
    at org.apache.maven.surefire.booter.ForkedBooter.invokeProviderInSameClassLoader (ForkedBooter.java:383)
    at org.apache.maven.surefire.booter.ForkedBooter.runSuitesInProcess (ForkedBooter.java:344)
    at org.apache.maven.surefire.booter.ForkedBooter.execute (ForkedBooter.java:125)
    at org.apache.maven.surefire.booter.ForkedBooter.main (ForkedBooter.java:417)
[ERROR]
[ERROR] Re-run Maven using the -X switch to enable full debug logging.
[ERROR]
[ERROR] For more information about the errors and possible solutions, please read the following articles:
[ERROR] [Help 1] http://cwiki.apache.org/confluence/display/MAVEN/MojoFailureException


Stack Trace:
org.apache.maven.it.VerificationException:
Exit code was non-zero: 1; command line and log =
C:\mvn-it-0.tmp\core-it-suite\target\apache-maven\bin\mvn --global-settings C:\mvn-it-0.tmp\core-it-suite\target\test-classes\settings.xml -e --batch-mode -Dmaven.repo.local=c:\mvn-it-0.tmp\it-local-repo install
[INFO] [jenkins-event-spy] Jenkins Maven Event Spy is disabled
[INFO] Error stacktraces are turned on.
[INFO] Scanning for projects...
[INFO] Maven detected that the requested POM file is part of a multi module project, but could not find a pom.xml file in the multi module root directory: 'C:\mvn-it-0.tmp\core-it-suite\target\test-classes\mng-6972-allow-access-to-graph-package'.
[INFO] The reactor is limited to all projects under: C:\mvn-it-0.tmp\core-it-suite\target\test-classes\mng-6972-allow-access-to-graph-package\build-plugin
[INFO]
[INFO] --------< mng-6972-allow-access-to-graph-package:build-plugin >---------
[INFO] Building build-plugin 1.0
[INFO] --------------------------------[ jar ]---------------------------------
[WARNING] Version not locked for default bindings plugins [maven-resources-plugin, maven-compiler-plugin, maven-surefire-plugin, maven-jar-plugin, maven-install-plugin], you should define versions in pluginManagement section of your pom.xml or parent
[INFO]
[INFO] --- maven-resources-plugin:3.2.0:resources (default-resources) @ build-plugin ---
[INFO] Using 'UTF-8' encoding to copy filtered resources.
[INFO] Using 'UTF-8' encoding to copy filtered properties files.
[INFO] skip non existing resourceDirectory C:\mvn-it-0.tmp\core-it-suite\target\test-classes\mng-6972-allow-access-to-graph-package\build-plugin\src\main\resources
[INFO] skip non existing resourceDirectory C:\mvn-it-0.tmp\core-it-suite\target\test-classes\mng-6972-allow-access-to-graph-package\build-plugin\src\main\resources-filtered
[INFO]
[INFO] --- maven-compiler-plugin:3.8.1:compile (default-compile) @ build-plugin ---
[INFO] Changes detected - recompiling the module!
[INFO] Compiling 1 source file to C:\mvn-it-0.tmp\core-it-suite\target\test-classes\mng-6972-allow-access-to-graph-package\build-plugin\target\classes
[INFO] -------------------------------------------------------------
[ERROR] COMPILATION ERROR :
[INFO] -------------------------------------------------------------
[ERROR] /C:/mvn-it-0.tmp/core-it-suite/target/test-classes/mng-6972-allow-access-to-graph-package/build-plugin/src/main/java/com/example/BuildExtensionUsingGraphPackage.java:[4,17] cannot find symbol
  symbol:   class Objects
  location: package java.util
[INFO] 1 error
[INFO] -------------------------------------------------------------
[INFO] ------------------------------------------------------------------------
[INFO] BUILD FAILURE
[INFO] ------------------------------------------------------------------------
[INFO] Total time:  0.882 s
[INFO] Finished at: 2021-01-03T04:47:34-08:00
[INFO] ------------------------------------------------------------------------
[ERROR] Failed to execute goal org.apache.maven.plugins:maven-compiler-plugin:3.8.1:compile (default-compile) on project build-plugin: Compilation failure
[ERROR] /C:/mvn-it-0.tmp/core-it-suite/target/test-classes/mng-6972-allow-access-to-graph-package/build-plugin/src/main/java/com/example/BuildExtensionUsingGraphPackage.java:[4,17] cannot find symbol
[ERROR]   symbol:   class Objects
[ERROR]   location: package java.util
[ERROR] -> [Help 1]
org.apache.maven.lifecycle.LifecycleExecutionException: Failed to execute goal org.apache.maven.plugins:maven-compiler-plugin:3.8.1:compile (default-compile) on project build-plugin: Compilation failure
/C:/mvn-it-0.tmp/core-it-suite/target/test-classes/mng-6972-allow-access-to-graph-package/build-plugin/src/main/java/com/example/BuildExtensionUsingGraphPackage.java:[4,17] cannot find symbol
  symbol:   class Objects
  location: package java.util

    at org.apache.maven.lifecycle.internal.MojoExecutor.execute (MojoExecutor.java:218)
    at org.apache.maven.lifecycle.internal.MojoExecutor.execute (MojoExecutor.java:159)
    at org.apache.maven.lifecycle.internal.MojoExecutor.execute (MojoExecutor.java:151)
    at org.apache.maven.lifecycle.internal.LifecycleModuleBuilder.buildProject (LifecycleModuleBuilder.java:115)
    at org.apache.maven.lifecycle.internal.LifecycleModuleBuilder.buildProject (LifecycleModuleBuilder.java:79)
    at org.apache.maven.lifecycle.internal.builder.singlethreaded.SingleThreadedBuilder.build (SingleThreadedBuilder.java:64)
    at org.apache.maven.lifecycle.internal.LifecycleStarter.execute (LifecycleStarter.java:131)
    at org.apache.maven.DefaultMaven.doExecute (DefaultMaven.java:321)
    at org.apache.maven.DefaultMaven.doExecute (DefaultMaven.java:206)
    at org.apache.maven.DefaultMaven.execute (DefaultMaven.java:119)
    at org.apache.maven.cli.MavenCli.execute (MavenCli.java:979)
    at org.apache.maven.cli.MavenCli.doMain (MavenCli.java:293)
    at org.apache.maven.cli.MavenCli.doMain (MavenCli.java:248)
    at jdk.internal.reflect.NativeMethodAccessorImpl.invoke0 (Native Method)
    at jdk.internal.reflect.NativeMethodAccessorImpl.invoke (NativeMethodAccessorImpl.java:62)
    at jdk.internal.reflect.DelegatingMethodAccessorImpl.invoke (DelegatingMethodAccessorImpl.java:43)
    at java.lang.reflect.Method.invoke (Method.java:566)
    at org.apache.maven.it.Embedded3xLauncher.run (Embedded3xLauncher.java:215)
    at org.apache.maven.it.Verifier.executeGoals (Verifier.java:1339)
    at org.apache.maven.it.Verifier.executeGoal (Verifier.java:1239)
    at org.apache.maven.it.Verifier.executeGoal (Verifier.java:1233)
    at org.apache.maven.it.MavenITmng6972AllowAccessToGraphPackageTest.testit (MavenITmng6972AllowAccessToGraphPackageTest.java:60)
    at jdk.internal.reflect.NativeMethodAccessorImpl.invoke0 (Native Method)
    at jdk.internal.reflect.NativeMethodAccessorImpl.invoke (NativeMethodAccessorImpl.java:62)
    at jdk.internal.reflect.DelegatingMethodAccessorImpl.invoke (DelegatingMethodAccessorImpl.java:43)
    at java.lang.reflect.Method.invoke (Method.java:566)
    at junit.framework.TestCase.runTest (TestCase.java:176)
    at org.apache.maven.it.AbstractMavenIntegrationTestCase.runTest (AbstractMavenIntegrationTestCase.java:255)
    at junit.framework.TestCase.runBare (TestCase.java:141)
    at junit.framework.TestResult$1.protect (TestResult.java:122)
    at junit.framework.TestResult.runProtected (TestResult.java:142)
    at junit.framework.TestResult.run (TestResult.java:125)
    at junit.framework.TestCase.run (TestCase.java:129)
    at junit.framework.TestSuite.runTest (TestSuite.java:252)
    at junit.framework.TestSuite.run (TestSuite.java:247)
    at junit.framework.TestSuite.runTest (TestSuite.java:252)
    at junit.framework.TestSuite.run (TestSuite.java:247)
    at org.junit.internal.runners.JUnit38ClassRunner.run (JUnit38ClassRunner.java:86)
    at org.apache.maven.surefire.junit4.JUnit4Provider.execute (JUnit4Provider.java:365)
    at org.apache.maven.surefire.junit4.JUnit4Provider.executeWithRerun (JUnit4Provider.java:273)
    at org.apache.maven.surefire.junit4.JUnit4Provider.executeTestSet (JUnit4Provider.java:238)
    at org.apache.maven.surefire.junit4.JUnit4Provider.invoke (JUnit4Provider.java:159)
    at org.apache.maven.surefire.booter.ForkedBooter.invokeProviderInSameClassLoader (ForkedBooter.java:383)
    at org.apache.maven.surefire.booter.ForkedBooter.runSuitesInProcess (ForkedBooter.java:344)
    at org.apache.maven.surefire.booter.ForkedBooter.execute (ForkedBooter.java:125)
    at org.apache.maven.surefire.booter.ForkedBooter.main (ForkedBooter.java:417)
Caused by: org.apache.maven.plugin.compiler.CompilationFailureException: Compilation failure
/C:/mvn-it-0.tmp/core-it-suite/target/test-classes/mng-6972-allow-access-to-graph-package/build-plugin/src/main/java/com/example/BuildExtensionUsingGraphPackage.java:[4,17] cannot find symbol
  symbol:   class Objects
  location: package java.util

    at org.apache.maven.plugin.compiler.AbstractCompilerMojo.execute (AbstractCompilerMojo.java:1220)
    at org.apache.maven.plugin.compiler.CompilerMojo.execute (CompilerMojo.java:187)
    at org.apache.maven.plugin.DefaultBuildPluginManager.executeMojo (DefaultBuildPluginManager.java:136)
    at org.apache.maven.lifecycle.internal.MojoExecutor.execute (MojoExecutor.java:213)
    at org.apache.maven.lifecycle.internal.MojoExecutor.execute (MojoExecutor.java:159)
    at org.apache.maven.lifecycle.internal.MojoExecutor.execute (MojoExecutor.java:151)
    at org.apache.maven.lifecycle.internal.LifecycleModuleBuilder.buildProject (LifecycleModuleBuilder.java:115)
    at org.apache.maven.lifecycle.internal.LifecycleModuleBuilder.buildProject (LifecycleModuleBuilder.java:79)
    at org.apache.maven.lifecycle.internal.builder.singlethreaded.SingleThreadedBuilder.build (SingleThreadedBuilder.java:64)
    at org.apache.maven.lifecycle.internal.LifecycleStarter.execute (LifecycleStarter.java:131)
    at org.apache.maven.DefaultMaven.doExecute (DefaultMaven.java:321)
    at org.apache.maven.DefaultMaven.doExecute (DefaultMaven.java:206)
    at org.apache.maven.DefaultMaven.execute (DefaultMaven.java:119)
    at org.apache.maven.cli.MavenCli.execute (MavenCli.java:979)
    at org.apache.maven.cli.MavenCli.doMain (MavenCli.java:293)
    at org.apache.maven.cli.MavenCli.doMain (MavenCli.java:248)
    at jdk.internal.reflect.NativeMethodAccessorImpl.invoke0 (Native Method)
    at jdk.internal.reflect.NativeMethodAccessorImpl.invoke (NativeMethodAccessorImpl.java:62)
    at jdk.internal.reflect.DelegatingMethodAccessorImpl.invoke (DelegatingMethodAccessorImpl.java:43)
    at java.lang.reflect.Method.invoke (Method.java:566)
    at org.apache.maven.it.Embedded3xLauncher.run (Embedded3xLauncher.java:215)
    at org.apache.maven.it.Verifier.executeGoals (Verifier.java:1339)
    at org.apache.maven.it.Verifier.executeGoal (Verifier.java:1239)
    at org.apache.maven.it.Verifier.executeGoal (Verifier.java:1233)
    at org.apache.maven.it.MavenITmng6972AllowAccessToGraphPackageTest.testit (MavenITmng6972AllowAccessToGraphPackageTest.java:60)
    at jdk.internal.reflect.NativeMethodAccessorImpl.invoke0 (Native Method)
    at jdk.internal.reflect.NativeMethodAccessorImpl.invoke (NativeMethodAccessorImpl.java:62)
    at jdk.internal.reflect.DelegatingMethodAccessorImpl.invoke (DelegatingMethodAccessorImpl.java:43)
    at java.lang.reflect.Method.invoke (Method.java:566)
    at junit.framework.TestCase.runTest (TestCase.java:176)
    at org.apache.maven.it.AbstractMavenIntegrationTestCase.runTest (AbstractMavenIntegrationTestCase.java:255)
    at junit.framework.TestCase.runBare (TestCase.java:141)
    at junit.framework.TestResult$1.protect (TestResult.java:122)
    at junit.framework.TestResult.runProtected (TestResult.java:142)
    at junit.framework.TestResult.run (TestResult.java:125)
    at junit.framework.TestCase.run (TestCase.java:129)
    at junit.framework.TestSuite.runTest (TestSuite.java:252)
    at junit.framework.TestSuite.run (TestSuite.java:247)
    at junit.framework.TestSuite.runTest (TestSuite.java:252)
    at junit.framework.TestSuite.run (TestSuite.java:247)
    at org.junit.internal.runners.JUnit38ClassRunner.run (JUnit38ClassRunner.java:86)
    at org.apache.maven.surefire.junit4.JUnit4Provider.execute (JUnit4Provider.java:365)
    at org.apache.maven.surefire.junit4.JUnit4Provider.executeWithRerun (JUnit4Provider.java:273)
    at org.apache.maven.surefire.junit4.JUnit4Provider.executeTestSet (JUnit4Provider.java:238)
    at org.apache.maven.surefire.junit4.JUnit4Provider.invoke (JUnit4Provider.java:159)
    at org.apache.maven.surefire.booter.ForkedBooter.invokeProviderInSameClassLoader (ForkedBooter.java:383)
    at org.apache.maven.surefire.booter.ForkedBooter.runSuitesInProcess (ForkedBooter.java:344)
    at org.apache.maven.surefire.booter.ForkedBooter.execute (ForkedBooter.java:125)
    at org.apache.maven.surefire.booter.ForkedBooter.main (ForkedBooter.java:417)
[ERROR]
[ERROR] Re-run Maven using the -X switch to enable full debug logging.
[ERROR]
[ERROR] For more information about the errors and possible solutions, please read the following articles:
[ERROR] [Help 1] http://cwiki.apache.org/confluence/display/MAVEN/MojoFailureException

        at org.apache.maven.it.MavenITmng6972AllowAccessToGraphPackageTest.testit(MavenITmng6972AllowAccessToGraphPackageTest.java:60)




Build log:
[...truncated 43350 lines...]
[withMaven] artifactsPublisher - Archive artifact core-it-support\core-it-plugins\maven-it-plugin-online\target\maven-it-plugin-online-2.1-SNAPSHOT.jar under org\apache\maven\its\plugins\maven-it-plugin-online\2.1-SNAPSHOT\maven-it-plugin-online-2.1-SNAPSHOT.jar
[withMaven] artifactsPublisher - Archive artifact core-it-support\core-it-plugins\maven-it-plugin-optional-mojos\pom.xml under org\apache\maven\its\plugins\maven-it-plugin-optional-mojos\2.1-SNAPSHOT\maven-it-plugin-optional-mojos-2.1-SNAPSHOT.pom
[withMaven] artifactsPublisher - Archive artifact core-it-support\core-it-plugins\maven-it-plugin-optional-mojos\target\maven-it-plugin-optional-mojos-2.1-SNAPSHOT.jar under org\apache\maven\its\plugins\maven-it-plugin-optional-mojos\2.1-SNAPSHOT\maven-it-plugin-optional-mojos-2.1-SNAPSHOT.jar
[withMaven] artifactsPublisher - Archive artifact core-it-support\core-it-plugins\maven-it-plugin-packaging\pom.xml under org\apache\maven\its\plugins\maven-it-plugin-packaging\2.1-SNAPSHOT\maven-it-plugin-packaging-2.1-SNAPSHOT.pom
[withMaven] artifactsPublisher - Archive artifact core-it-support\core-it-plugins\maven-it-plugin-packaging\target\maven-it-plugin-packaging-2.1-SNAPSHOT.jar under org\apache\maven\its\plugins\maven-it-plugin-packaging\2.1-SNAPSHOT\maven-it-plugin-packaging-2.1-SNAPSHOT.jar
[withMaven] artifactsPublisher - Archive artifact core-it-support\core-it-plugins\maven-it-plugin-parameter-implementation\pom.xml under org\apache\maven\its\plugins\maven-it-plugin-parameter-implementation\2.1-SNAPSHOT\maven-it-plugin-parameter-implementation-2.1-SNAPSHOT.pom
[withMaven] artifactsPublisher - Archive artifact core-it-support\core-it-plugins\maven-it-plugin-parameter-implementation\target\maven-it-plugin-parameter-implementation-2.1-SNAPSHOT.jar under org\apache\maven\its\plugins\maven-it-plugin-parameter-implementation\2.1-SNAPSHOT\maven-it-plugin-parameter-implementation-2.1-SNAPSHOT.jar
[withMaven] artifactsPublisher - Archive artifact core-it-support\core-it-plugins\maven-it-plugin-plugin-dependency\pom.xml under org\apache\maven\its\plugins\maven-it-plugin-plugin-dependency\2.1-SNAPSHOT\maven-it-plugin-plugin-dependency-2.1-SNAPSHOT.pom
[withMaven] artifactsPublisher - Archive artifact core-it-support\core-it-plugins\maven-it-plugin-plugin-dependency\target\maven-it-plugin-plugin-dependency-2.1-SNAPSHOT.jar under org\apache\maven\its\plugins\maven-it-plugin-plugin-dependency\2.1-SNAPSHOT\maven-it-plugin-plugin-dependency-2.1-SNAPSHOT.jar
[withMaven] artifactsPublisher - Archive artifact core-it-support\core-it-plugins\maven-it-plugin-project\pom.xml under org\apache\maven\its\plugins\maven-it-plugin-project\2.1-SNAPSHOT\maven-it-plugin-project-2.1-SNAPSHOT.pom
[withMaven] artifactsPublisher - Archive artifact core-it-support\core-it-plugins\maven-it-plugin-project\target\maven-it-plugin-project-2.1-SNAPSHOT.jar under org\apache\maven\its\plugins\maven-it-plugin-project\2.1-SNAPSHOT\maven-it-plugin-project-2.1-SNAPSHOT.jar
[withMaven] artifactsPublisher - Archive artifact core-it-support\core-it-plugins\maven-it-plugin-project-interpolation\pom.xml under org\apache\maven\its\plugins\maven-it-plugin-project-interpolation\2.1-SNAPSHOT\maven-it-plugin-project-interpolation-2.1-SNAPSHOT.pom
[withMaven] artifactsPublisher - Archive artifact core-it-support\core-it-plugins\maven-it-plugin-project-interpolation\target\maven-it-plugin-project-interpolation-2.1-SNAPSHOT.jar under org\apache\maven\its\plugins\maven-it-plugin-project-interpolation\2.1-SNAPSHOT\maven-it-plugin-project-interpolation-2.1-SNAPSHOT.jar
[withMaven] artifactsPublisher - Archive artifact core-it-support\core-it-plugins\maven-it-plugin-setter\pom.xml under org\apache\maven\its\plugins\maven-it-plugin-setter\2.1-SNAPSHOT\maven-it-plugin-setter-2.1-SNAPSHOT.pom
[withMaven] artifactsPublisher - Archive artifact core-it-support\core-it-plugins\maven-it-plugin-setter\target\maven-it-plugin-setter-2.1-SNAPSHOT.jar under org\apache\maven\its\plugins\maven-it-plugin-setter\2.1-SNAPSHOT\maven-it-plugin-setter-2.1-SNAPSHOT.jar
[withMaven] artifactsPublisher - Archive artifact core-it-support\core-it-plugins\maven-it-plugin-singleton-component\pom.xml under org\apache\maven\its\plugins\maven-it-plugin-singleton-component\2.1-SNAPSHOT\maven-it-plugin-singleton-component-2.1-SNAPSHOT.pom
[withMaven] artifactsPublisher - Archive artifact core-it-support\core-it-plugins\maven-it-plugin-singleton-component\target\maven-it-plugin-singleton-component-2.1-SNAPSHOT.jar under org\apache\maven\its\plugins\maven-it-plugin-singleton-component\2.1-SNAPSHOT\maven-it-plugin-singleton-component-2.1-SNAPSHOT.jar
[withMaven] artifactsPublisher - Archive artifact core-it-support\core-it-plugins\maven-it-plugin-site\pom.xml under org\apache\maven\its\plugins\maven-it-plugin-site\2.1-SNAPSHOT\maven-it-plugin-site-2.1-SNAPSHOT.pom
[withMaven] artifactsPublisher - Archive artifact core-it-support\core-it-plugins\maven-it-plugin-site\target\maven-it-plugin-site-2.1-SNAPSHOT.jar under org\apache\maven\its\plugins\maven-it-plugin-site\2.1-SNAPSHOT\maven-it-plugin-site-2.1-SNAPSHOT.jar
[withMaven] artifactsPublisher - Archive artifact core-it-support\core-it-plugins\maven-it-plugin-toolchain\pom.xml under org\apache\maven\its\plugins\maven-it-plugin-toolchain\2.1-SNAPSHOT\maven-it-plugin-toolchain-2.1-SNAPSHOT.pom
[withMaven] artifactsPublisher - Archive artifact core-it-support\core-it-plugins\maven-it-plugin-toolchain\target\maven-it-plugin-toolchain-2.1-SNAPSHOT.jar under org\apache\maven\its\plugins\maven-it-plugin-toolchain\2.1-SNAPSHOT\maven-it-plugin-toolchain-2.1-SNAPSHOT.jar
[withMaven] artifactsPublisher - Archive artifact core-it-support\core-it-plugins\maven-it-plugin-touch\pom.xml under org\apache\maven\its\plugins\maven-it-plugin-touch\2.1-SNAPSHOT\maven-it-plugin-touch-2.1-SNAPSHOT.pom
[withMaven] artifactsPublisher - Archive artifact core-it-support\core-it-plugins\maven-it-plugin-touch\target\maven-it-plugin-touch-2.1-SNAPSHOT.jar under org\apache\maven\its\plugins\maven-it-plugin-touch\2.1-SNAPSHOT\maven-it-plugin-touch-2.1-SNAPSHOT.jar
[withMaven] artifactsPublisher - Archive artifact core-it-support\core-it-plugins\maven-it-plugin-uses-properties\pom.xml under org\apache\maven\its\plugins\maven-it-plugin-uses-properties\2.1-SNAPSHOT\maven-it-plugin-uses-properties-2.1-SNAPSHOT.pom
[withMaven] artifactsPublisher - Archive artifact core-it-support\core-it-plugins\maven-it-plugin-uses-properties\target\maven-it-plugin-uses-properties-2.1-SNAPSHOT.jar under org\apache\maven\its\plugins\maven-it-plugin-uses-properties\2.1-SNAPSHOT\maven-it-plugin-uses-properties-2.1-SNAPSHOT.jar
[withMaven] artifactsPublisher - Archive artifact core-it-support\core-it-plugins\maven-it-plugin-uses-wagon\pom.xml under org\apache\maven\its\plugins\maven-it-plugin-uses-wagon\2.1-SNAPSHOT\maven-it-plugin-uses-wagon-2.1-SNAPSHOT.pom
[withMaven] artifactsPublisher - Archive artifact core-it-support\core-it-plugins\maven-it-plugin-uses-wagon\target\maven-it-plugin-uses-wagon-2.1-SNAPSHOT.jar under org\apache\maven\its\plugins\maven-it-plugin-uses-wagon\2.1-SNAPSHOT\maven-it-plugin-uses-wagon-2.1-SNAPSHOT.jar
[withMaven] artifactsPublisher - Archive artifact core-it-support\core-it-plugins\maven-it-plugin-all\pom.xml under org\apache\maven\its\plugins\maven-it-plugin-all\2.1-SNAPSHOT\maven-it-plugin-all-2.1-SNAPSHOT.pom
[withMaven] artifactsPublisher - Archive artifact core-it-support\core-it-plugins\maven-it-plugin-all\target\maven-it-plugin-all-2.1-SNAPSHOT.jar under org\apache\maven\its\plugins\maven-it-plugin-all\2.1-SNAPSHOT\maven-it-plugin-all-2.1-SNAPSHOT.jar
[withMaven] artifactsPublisher - Archive artifact core-it-support\core-it-plugins\maven-it-plugin-plexus-utils-11\pom.xml under org\apache\maven\its\plugins\maven-it-plugin-plexus-utils-11\2.1-SNAPSHOT\maven-it-plugin-plexus-utils-11-2.1-SNAPSHOT.pom
[withMaven] artifactsPublisher - Archive artifact core-it-support\core-it-plugins\maven-it-plugin-plexus-utils-11\target\maven-it-plugin-plexus-utils-11-2.1-SNAPSHOT.jar under org\apache\maven\its\plugins\maven-it-plugin-plexus-utils-11\2.1-SNAPSHOT\maven-it-plugin-plexus-utils-11-2.1-SNAPSHOT.jar
[withMaven] artifactsPublisher - Archive artifact core-it-support\core-it-plugins\maven-it-plugin-plexus-utils-new\pom.xml under org\apache\maven\its\plugins\maven-it-plugin-plexus-utils-new\2.1-SNAPSHOT\maven-it-plugin-plexus-utils-new-2.1-SNAPSHOT.pom
[withMaven] artifactsPublisher - Archive artifact core-it-support\core-it-plugins\maven-it-plugin-plexus-utils-new\target\maven-it-plugin-plexus-utils-new-2.1-SNAPSHOT.jar under org\apache\maven\its\plugins\maven-it-plugin-plexus-utils-new\2.1-SNAPSHOT\maven-it-plugin-plexus-utils-new-2.1-SNAPSHOT.jar
[withMaven] artifactsPublisher - Archive artifact core-it-support\core-it-plugins\maven-it-plugin-plexus-component-api\pom.xml under org\apache\maven\its\plugins\maven-it-plugin-plexus-component-api\2.1-SNAPSHOT\maven-it-plugin-plexus-component-api-2.1-SNAPSHOT.pom
[withMaven] artifactsPublisher - Archive artifact core-it-support\core-it-plugins\maven-it-plugin-plexus-component-api\target\maven-it-plugin-plexus-component-api-2.1-SNAPSHOT.jar under org\apache\maven\its\plugins\maven-it-plugin-plexus-component-api\2.1-SNAPSHOT\maven-it-plugin-plexus-component-api-2.1-SNAPSHOT.jar
[withMaven] artifactsPublisher - Archive artifact core-it-support\core-it-plugins\maven-it-plugin-log4j\pom.xml under org\apache\maven\its\plugins\maven-it-plugin-log4j\2.1-SNAPSHOT\maven-it-plugin-log4j-2.1-SNAPSHOT.pom
[withMaven] artifactsPublisher - Archive artifact core-it-support\core-it-plugins\maven-it-plugin-log4j\target\maven-it-plugin-log4j-2.1-SNAPSHOT.jar under org\apache\maven\its\plugins\maven-it-plugin-log4j\2.1-SNAPSHOT\maven-it-plugin-log4j-2.1-SNAPSHOT.jar
[withMaven] artifactsPublisher - Archive artifact core-it-support\core-it-plugins\maven-it-plugin-extension1\pom.xml under org\apache\maven\its\plugins\maven-it-plugin-extension1\2.1-SNAPSHOT\maven-it-plugin-extension1-2.1-SNAPSHOT.pom
[withMaven] artifactsPublisher - Archive artifact core-it-support\core-it-plugins\maven-it-plugin-extension1\target\maven-it-plugin-extension1-2.1-SNAPSHOT.jar under org\apache\maven\its\plugins\maven-it-plugin-extension1\2.1-SNAPSHOT\maven-it-plugin-extension1-2.1-SNAPSHOT.jar
[withMaven] artifactsPublisher - Archive artifact core-it-support\core-it-plugins\maven-it-plugin-extension2\pom.xml under org\apache\maven\its\plugins\maven-it-plugin-extension2\2.1-SNAPSHOT\maven-it-plugin-extension2-2.1-SNAPSHOT.pom
[withMaven] artifactsPublisher - Archive artifact core-it-support\core-it-plugins\maven-it-plugin-extension2\target\maven-it-plugin-extension2-2.1-SNAPSHOT.jar under org\apache\maven\its\plugins\maven-it-plugin-extension2\2.1-SNAPSHOT\maven-it-plugin-extension2-2.1-SNAPSHOT.jar
[withMaven] artifactsPublisher - Archive artifact core-it-support\core-it-plugins\maven-it-plugin-plexus-lifecycle\pom.xml under org\apache\maven\its\plugins\maven-it-plugin-plexus-lifecycle\2.1-SNAPSHOT\maven-it-plugin-plexus-lifecycle-2.1-SNAPSHOT.pom
[withMaven] artifactsPublisher - Archive artifact core-it-support\core-it-plugins\maven-it-plugin-plexus-lifecycle\target\maven-it-plugin-plexus-lifecycle-2.1-SNAPSHOT.jar under org\apache\maven\its\plugins\maven-it-plugin-plexus-lifecycle\2.1-SNAPSHOT\maven-it-plugin-plexus-lifecycle-2.1-SNAPSHOT.jar
[withMaven] artifactsPublisher - Archive artifact core-it-support\core-it-plugins\maven-it-plugin-settings\pom.xml under org\apache\maven\its\plugins\maven-it-plugin-settings\2.1-SNAPSHOT\maven-it-plugin-settings-2.1-SNAPSHOT.pom
[withMaven] artifactsPublisher - Archive artifact core-it-support\core-it-plugins\maven-it-plugin-settings\target\maven-it-plugin-settings-2.1-SNAPSHOT.jar under org\apache\maven\its\plugins\maven-it-plugin-settings\2.1-SNAPSHOT\maven-it-plugin-settings-2.1-SNAPSHOT.jar
[withMaven] artifactsPublisher - Archive artifact core-it-support\core-it-plugins\mng5805-extension\pom.xml under org\apache\maven\its\plugins\mng-5805-pkg-type-mojo-configuration-extension\2.1-SNAPSHOT\mng-5805-pkg-type-mojo-configuration-extension-2.1-SNAPSHOT.pom
[withMaven] artifactsPublisher - Archive artifact core-it-support\core-it-plugins\mng5805-extension\target\mng-5805-pkg-type-mojo-configuration-extension-2.1-SNAPSHOT.jar under org\apache\maven\its\plugins\mng-5805-pkg-type-mojo-configuration-extension\2.1-SNAPSHOT\mng-5805-pkg-type-mojo-configuration-extension-2.1-SNAPSHOT.jar
[withMaven] artifactsPublisher - Archive artifact core-it-support\core-it-plugins\mng5805-extension2\pom.xml under org\apache\maven\its\plugins\mng-5805-pkg-type-mojo-configuration-extension2\2.1-SNAPSHOT\mng-5805-pkg-type-mojo-configuration-extension2-2.1-SNAPSHOT.pom
[withMaven] artifactsPublisher - Archive artifact core-it-support\core-it-plugins\mng5805-extension2\target\mng-5805-pkg-type-mojo-configuration-extension2-2.1-SNAPSHOT.jar under org\apache\maven\its\plugins\mng-5805-pkg-type-mojo-configuration-extension2\2.1-SNAPSHOT\mng-5805-pkg-type-mojo-configuration-extension2-2.1-SNAPSHOT.jar
[withMaven] artifactsPublisher - Archive artifact core-it-support\core-it-plugins\mng5805-plugin\pom.xml under org\apache\maven\its\plugins\mng-5805-pkg-type-mojo-configuration-plugin\2.1-SNAPSHOT\mng-5805-pkg-type-mojo-configuration-plugin-2.1-SNAPSHOT.pom
[withMaven] artifactsPublisher - Archive artifact core-it-support\core-it-plugins\mng5805-plugin\target\mng-5805-pkg-type-mojo-configuration-plugin-2.1-SNAPSHOT.jar under org\apache\maven\its\plugins\mng-5805-pkg-type-mojo-configuration-plugin\2.1-SNAPSHOT\mng-5805-pkg-type-mojo-configuration-plugin-2.1-SNAPSHOT.jar
[withMaven] artifactsPublisher - Archive artifact core-it-support\core-it-plugins\mng5805-plugin-dep\pom.xml under org\apache\maven\its\plugins\mng-5805-pkg-type-mojo-configuration-plugin-dep\2.1-SNAPSHOT\mng-5805-pkg-type-mojo-configuration-plugin-dep-2.1-SNAPSHOT.pom
[withMaven] artifactsPublisher - Archive artifact core-it-support\core-it-plugins\mng5805-plugin-dep\target\mng-5805-pkg-type-mojo-configuration-plugin-dep-2.1-SNAPSHOT.jar under org\apache\maven\its\plugins\mng-5805-pkg-type-mojo-configuration-plugin-dep\2.1-SNAPSHOT\mng-5805-pkg-type-mojo-configuration-plugin-dep-2.1-SNAPSHOT.jar
[withMaven] artifactsPublisher - Archive artifact core-it-support\core-it-plugins\mng5958-extension\pom.xml under org\apache\maven\its\plugins\mng-5958-pkg-type-extension\2.1-SNAPSHOT\mng-5958-pkg-type-extension-2.1-SNAPSHOT.pom
[withMaven] artifactsPublisher - Archive artifact core-it-support\core-it-plugins\mng5958-extension\target\mng-5958-pkg-type-extension-2.1-SNAPSHOT.jar under org\apache\maven\its\plugins\mng-5958-pkg-type-extension\2.1-SNAPSHOT\mng-5958-pkg-type-extension-2.1-SNAPSHOT.jar
[withMaven] artifactsPublisher - Archive artifact core-it-support\core-it-plugins\mng6759-plugin-resolves-project-dependencies\pom.xml under org\apache\maven\its\plugins\mng-6759-resolves-project-dependencies-plugin\2.1-SNAPSHOT\mng-6759-resolves-project-dependencies-plugin-2.1-SNAPSHOT.pom
[withMaven] artifactsPublisher - Archive artifact core-it-support\core-it-plugins\mng6759-plugin-resolves-project-dependencies\target\mng-6759-resolves-project-dependencies-plugin-2.1-SNAPSHOT.jar under org\apache\maven\its\plugins\mng-6759-resolves-project-dependencies-plugin\2.1-SNAPSHOT\mng-6759-resolves-project-dependencies-plugin-2.1-SNAPSHOT.jar
[withMaven] artifactsPublisher - Archive artifact core-it-support\core-it-toolchain\pom.xml under org\apache\maven\its\core-it-toolchain\2.1-SNAPSHOT\core-it-toolchain-2.1-SNAPSHOT.pom
[withMaven] artifactsPublisher - Archive artifact core-it-support\core-it-toolchain\target\core-it-toolchain-2.1-SNAPSHOT.jar under org\apache\maven\its\core-it-toolchain\2.1-SNAPSHOT\core-it-toolchain-2.1-SNAPSHOT.jar
[withMaven] artifactsPublisher - Archive artifact core-it-support\core-it-wagon\pom.xml under org\apache\maven\its\core-it-wagon\2.1-SNAPSHOT\core-it-wagon-2.1-SNAPSHOT.pom
[withMaven] artifactsPublisher - Archive artifact core-it-support\core-it-wagon\target\core-it-wagon-2.1-SNAPSHOT.jar under org\apache\maven\its\core-it-wagon\2.1-SNAPSHOT\core-it-wagon-2.1-SNAPSHOT.jar
[withMaven] artifactsPublisher - Archive artifact core-it-support\core-it-support-artifacts\pom.xml under org\apache\maven\its\core-it-support-artifacts\2.1-SNAPSHOT\core-it-support-artifacts-2.1-SNAPSHOT.pom
[withMaven] artifactsPublisher - Archive artifact core-it-support\core-it-support-artifacts\target\core-it-support-artifacts-2.1-SNAPSHOT-repo.zip under org\apache\maven\its\core-it-support-artifacts\2.1-SNAPSHOT\core-it-support-artifacts-2.1-SNAPSHOT-repo.zip
[withMaven] artifactsPublisher - Archive artifact core-it-support\core-it-extension\pom.xml under org\apache\maven\its\core-it-extension\2.1-SNAPSHOT\core-it-extension-2.1-SNAPSHOT.pom
[withMaven] artifactsPublisher - Archive artifact core-it-support\core-it-extension\target\core-it-extension-2.1-SNAPSHOT.jar under org\apache\maven\its\core-it-extension\2.1-SNAPSHOT\core-it-extension-2.1-SNAPSHOT.jar
[withMaven] artifactsPublisher - Archive artifact core-it-support\core-it-javaagent\pom.xml under mng-coreit\javaagent\1.0-SNAPSHOT\javaagent-1.0-SNAPSHOT.pom
[withMaven] artifactsPublisher - Archive artifact core-it-support\core-it-javaagent\target\javaagent-1.0-SNAPSHOT.jar under mng-coreit\javaagent\1.0-SNAPSHOT\javaagent-1.0-SNAPSHOT.jar
[withMaven] artifactsPublisher - Archive artifact core-it-suite\pom.xml under org\apache\maven\its\core-it-suite\2.1-SNAPSHOT\core-it-suite-2.1-SNAPSHOT.pom
[withMaven] artifactsPublisher - Archive artifact core-it-suite\target\core-it-suite-2.1-SNAPSHOT.jar under org\apache\maven\its\core-it-suite\2.1-SNAPSHOT\core-it-suite-2.1-SNAPSHOT.jar
[withMaven] artifactsPublisher - Archive artifact core-it-suite\target\core-it-suite-2.1-SNAPSHOT-tests.jar under org\apache\maven\its\core-it-suite\2.1-SNAPSHOT\core-it-suite-2.1-SNAPSHOT-tests.jar
[withMaven] junitPublisher - Archive test results for Maven artifact org.apache.maven.its.plugins:maven-it-plugin-active-collection:maven-plugin:2.1-SNAPSHOT generated by maven-surefire-plugin:test (default-test): core-it-support\core-it-plugins\maven-it-plugin-active-collection\target\surefire-reports\*.xml
[withMaven] junitPublisher - Archive test results for Maven artifact org.apache.maven.its.plugins:maven-it-plugin-ant-based:maven-plugin:2.1-SNAPSHOT generated by maven-surefire-plugin:test (default-test): core-it-support\core-it-plugins\maven-it-plugin-ant-based\target\surefire-reports\*.xml
[withMaven] junitPublisher - Archive test results for Maven artifact org.apache.maven.its.plugins:maven-it-plugin-artifact:maven-plugin:2.1-SNAPSHOT generated by maven-surefire-plugin:test (default-test): core-it-support\core-it-plugins\maven-it-plugin-artifact\target\surefire-reports\*.xml
[withMaven] junitPublisher - Archive test results for Maven artifact org.apache.maven.its.plugins.class-loader:dep-a:jar:2.1-SNAPSHOT generated by maven-surefire-plugin:test (default-test): core-it-support\core-it-plugins\maven-it-plugin-class-loader\dep-a\target\surefire-reports\*.xml
[withMaven] junitPublisher - Archive test results for Maven artifact org.apache.maven.its.plugins.class-loader:dep-b:jar:2.1-SNAPSHOT generated by maven-surefire-plugin:test (default-test): core-it-support\core-it-plugins\maven-it-plugin-class-loader\dep-b\target\surefire-reports\*.xml
[withMaven] junitPublisher - Archive test results for Maven artifact org.apache.maven.its.plugins.class-loader:dep-c:jar:2.1-SNAPSHOT generated by maven-surefire-plugin:test (default-test): core-it-support\core-it-plugins\maven-it-plugin-class-loader\dep-c\target\surefire-reports\*.xml
[withMaven] junitPublisher - Archive test results for Maven artifact org.apache.maven.its.plugins:maven-it-plugin-class-loader:maven-plugin:2.1-SNAPSHOT generated by maven-surefire-plugin:test (default-test): core-it-support\core-it-plugins\maven-it-plugin-class-loader\maven-it-plugin-class-loader\target\surefire-reports\*.xml
[withMaven] junitPublisher - Archive test results for Maven artifact org.apache.maven.its.plugins:maven-it-plugin-configuration:maven-plugin:2.1-SNAPSHOT generated by maven-surefire-plugin:test (default-test): core-it-support\core-it-plugins\maven-it-plugin-configuration\target\surefire-reports\*.xml
[withMaven] junitPublisher - Archive test results for Maven artifact org.apache.maven.its.plugins:maven-it-plugin-context-passing:maven-plugin:2.1-SNAPSHOT generated by maven-surefire-plugin:test (default-test): core-it-support\core-it-plugins\maven-it-plugin-context-passing\target\surefire-reports\*.xml
[withMaven] junitPublisher - Archive test results for Maven artifact org.apache.maven.plugins:maven-clean-plugin:maven-plugin:0.1-stub-SNAPSHOT generated by maven-surefire-plugin:test (default-test): core-it-support\core-it-plugins\maven-it-plugin-core-stubs\maven-clean-plugin\target\surefire-reports\*.xml
[withMaven] junitPublisher - Archive test results for Maven artifact org.apache.maven.plugins:maven-compiler-plugin:maven-plugin:0.1-stub-SNAPSHOT generated by maven-surefire-plugin:test (default-test): core-it-support\core-it-plugins\maven-it-plugin-core-stubs\maven-compiler-plugin\target\surefire-reports\*.xml
[withMaven] junitPublisher - Archive test results for Maven artifact org.apache.maven.plugins:maven-deploy-plugin:maven-plugin:0.1-stub-SNAPSHOT generated by maven-surefire-plugin:test (default-test): core-it-support\core-it-plugins\maven-it-plugin-core-stubs\maven-deploy-plugin\target\surefire-reports\*.xml
[withMaven] junitPublisher - Archive test results for Maven artifact org.apache.maven.plugins:maven-ear-plugin:maven-plugin:0.1-stub-SNAPSHOT generated by maven-surefire-plugin:test (default-test): core-it-support\core-it-plugins\maven-it-plugin-core-stubs\maven-ear-plugin\target\surefire-reports\*.xml
[withMaven] junitPublisher - Archive test results for Maven artifact org.apache.maven.plugins:maven-ejb-plugin:maven-plugin:0.1-stub-SNAPSHOT generated by maven-surefire-plugin:test (default-test): core-it-support\core-it-plugins\maven-it-plugin-core-stubs\maven-ejb-plugin\target\surefire-reports\*.xml
[withMaven] junitPublisher - Archive test results for Maven artifact org.apache.maven.plugins:maven-install-plugin:maven-plugin:0.1-stub-SNAPSHOT generated by maven-surefire-plugin:test (default-test): core-it-support\core-it-plugins\maven-it-plugin-core-stubs\maven-install-plugin\target\surefire-reports\*.xml
[withMaven] junitPublisher - Archive test results for Maven artifact org.apache.maven.plugins:maven-jar-plugin:maven-plugin:0.1-stub-SNAPSHOT generated by maven-surefire-plugin:test (default-test): core-it-support\core-it-plugins\maven-it-plugin-core-stubs\maven-jar-plugin\target\surefire-reports\*.xml
[withMaven] junitPublisher - Archive test results for Maven artifact org.apache.maven.plugins:maven-javadoc-plugin:maven-plugin:0.1-stub-SNAPSHOT generated by maven-surefire-plugin:test (default-test): core-it-support\core-it-plugins\maven-it-plugin-core-stubs\maven-javadoc-plugin\target\surefire-reports\*.xml
[withMaven] junitPublisher - Archive test results for Maven artifact org.apache.maven.plugins:maven-plugin-plugin:maven-plugin:0.1-stub-SNAPSHOT generated by maven-surefire-plugin:test (default-test): core-it-support\core-it-plugins\maven-it-plugin-core-stubs\maven-plugin-plugin\target\surefire-reports\*.xml
[withMaven] junitPublisher - Archive test results for Maven artifact org.apache.maven.plugins:maven-rar-plugin:maven-plugin:0.1-stub-SNAPSHOT generated by maven-surefire-plugin:test (default-test): core-it-support\core-it-plugins\maven-it-plugin-core-stubs\maven-rar-plugin\target\surefire-reports\*.xml
[withMaven] junitPublisher - Archive test results for Maven artifact org.apache.maven.plugins:maven-resources-plugin:maven-plugin:0.1-stub-SNAPSHOT generated by maven-surefire-plugin:test (default-test): core-it-support\core-it-plugins\maven-it-plugin-core-stubs\maven-resources-plugin\target\surefire-reports\*.xml
[withMaven] junitPublisher - Archive test results for Maven artifact org.apache.maven.plugins:maven-site-plugin:maven-plugin:0.1-stub-SNAPSHOT generated by maven-surefire-plugin:test (default-test): core-it-support\core-it-plugins\maven-it-plugin-core-stubs\maven-site-plugin\target\surefire-reports\*.xml
[withMaven] junitPublisher - Archive test results for Maven artifact org.apache.maven.plugins:maven-source-plugin:maven-plugin:0.1-stub-SNAPSHOT generated by maven-surefire-plugin:test (default-test): core-it-support\core-it-plugins\maven-it-plugin-core-stubs\maven-source-plugin\target\surefire-reports\*.xml
[withMaven] junitPublisher - Archive test results for Maven artifact org.apache.maven.plugins:maven-surefire-plugin:maven-plugin:0.1-stub-SNAPSHOT generated by maven-surefire-plugin:test (default-test): core-it-support\core-it-plugins\maven-it-plugin-core-stubs\maven-surefire-plugin\target\surefire-reports\*.xml
[withMaven] junitPublisher - Archive test results for Maven artifact org.apache.maven.plugins:maven-war-plugin:maven-plugin:0.1-stub-SNAPSHOT generated by maven-surefire-plugin:test (default-test): core-it-support\core-it-plugins\maven-it-plugin-core-stubs\maven-war-plugin\target\surefire-reports\*.xml
[withMaven] junitPublisher - Archive test results for Maven artifact org.apache.maven.its.plugins:maven-it-plugin-dependency-collection:maven-plugin:2.1-SNAPSHOT generated by maven-surefire-plugin:test (default-test): core-it-support\core-it-plugins\maven-it-plugin-dependency-collection\target\surefire-reports\*.xml
[withMaven] junitPublisher - Archive test results for Maven artifact org.apache.maven.its.plugins:maven-it-plugin-dependency-resolution:maven-plugin:2.1-SNAPSHOT generated by maven-surefire-plugin:test (default-test): core-it-support\core-it-plugins\maven-it-plugin-dependency-resolution\target\surefire-reports\*.xml
[withMaven] junitPublisher - Archive test results for Maven artifact org.apache.maven.its.plugins:maven-it-plugin-expression:maven-plugin:2.1-SNAPSHOT generated by maven-surefire-plugin:test (default-test): core-it-support\core-it-plugins\maven-it-plugin-expression\target\surefire-reports\*.xml
[withMaven] junitPublisher - Archive test results for Maven artifact org.apache.maven.its.plugins:maven-it-plugin-error:maven-plugin:2.1-SNAPSHOT generated by maven-surefire-plugin:test (default-test): core-it-support\core-it-plugins\maven-it-plugin-error\target\surefire-reports\*.xml
[withMaven] junitPublisher - Archive test results for Maven artifact org.apache.maven.its:core-it-component:jar:2.1-SNAPSHOT generated by maven-surefire-plugin:test (default-test): core-it-support\core-it-component\target\surefire-reports\*.xml
[withMaven] junitPublisher - Archive test results for Maven artifact org.apache.maven.its.plugins:maven-it-plugin-extension-consumer:maven-plugin:2.1-SNAPSHOT generated by maven-surefire-plugin:test (default-test): core-it-support\core-it-plugins\maven-it-plugin-extension-consumer\target\surefire-reports\*.xml
[withMaven] junitPublisher - Archive test results for Maven artifact org.apache.maven.its.plugins:maven-it-plugin-extension-provider:maven-plugin:2.1-SNAPSHOT generated by maven-surefire-plugin:test (default-test): core-it-support\core-it-plugins\maven-it-plugin-extension-provider\target\surefire-reports\*.xml
[withMaven] junitPublisher - Archive test results for Maven artifact org.apache.maven.its.plugins:maven-it-plugin-fork:maven-plugin:2.1-SNAPSHOT generated by maven-surefire-plugin:test (default-test): core-it-support\core-it-plugins\maven-it-plugin-fork\target\surefire-reports\*.xml
[withMaven] junitPublisher - Archive test results for Maven artifact org.apache.maven.its.plugins:maven-it-plugin-invalid-descriptor:maven-plugin:2.1-SNAPSHOT generated by maven-surefire-plugin:test (default-test): core-it-support\core-it-plugins\maven-it-plugin-invalid-descriptor\target\surefire-reports\*.xml
[withMaven] junitPublisher - Archive test results for Maven artifact org.apache.maven.its.plugins:maven-it-plugin-log-file:maven-plugin:2.1-SNAPSHOT generated by maven-surefire-plugin:test (default-test): core-it-support\core-it-plugins\maven-it-plugin-log-file\target\surefire-reports\*.xml
[withMaven] junitPublisher - Archive test results for Maven artifact org.apache.maven.its:maven-it-helper:jar:2.1-SNAPSHOT generated by maven-surefire-plugin:test (default-test): core-it-support\maven-it-helper\target\surefire-reports\*.xml
[withMaven] junitPublisher - Archive test results for Maven artifact org.apache.maven.its.plugins:maven-it-plugin-model-interpolation:maven-plugin:2.1-SNAPSHOT generated by maven-surefire-plugin:test (default-test): core-it-support\core-it-plugins\maven-it-plugin-model-interpolation\target\surefire-reports\*.xml
[withMaven] junitPublisher - Archive test results for Maven artifact org.apache.maven.its.plugins:maven-it-plugin-no-default-comp:maven-plugin:2.1-SNAPSHOT generated by maven-surefire-plugin:test (default-test): core-it-support\core-it-plugins\maven-it-plugin-no-default-comp\target\surefire-reports\*.xml
[withMaven] junitPublisher - Archive test results for Maven artifact org.apache.maven.its.plugins:maven-it-plugin-no-project:maven-plugin:2.1-SNAPSHOT generated by maven-surefire-plugin:test (default-test): core-it-support\core-it-plugins\maven-it-plugin-no-project\target\surefire-reports\*.xml
[withMaven] junitPublisher - Archive test results for Maven artifact org.apache.maven.its.plugins:maven-it-plugin-online:maven-plugin:2.1-SNAPSHOT generated by maven-surefire-plugin:test (default-test): core-it-support\core-it-plugins\maven-it-plugin-online\target\surefire-reports\*.xml
[withMaven] junitPublisher - Archive test results for Maven artifact org.apache.maven.its.plugins:maven-it-plugin-optional-mojos:maven-plugin:2.1-SNAPSHOT generated by maven-surefire-plugin:test (default-test): core-it-support\core-it-plugins\maven-it-plugin-optional-mojos\target\surefire-reports\*.xml
[withMaven] junitPublisher - Archive test results for Maven artifact org.apache.maven.its.plugins:maven-it-plugin-packaging:maven-plugin:2.1-SNAPSHOT generated by maven-surefire-plugin:test (default-test): core-it-support\core-it-plugins\maven-it-plugin-packaging\target\surefire-reports\*.xml
[withMaven] junitPublisher - Archive test results for Maven artifact org.apache.maven.its.plugins:maven-it-plugin-parameter-implementation:maven-plugin:2.1-SNAPSHOT generated by maven-surefire-plugin:test (default-test): core-it-support\core-it-plugins\maven-it-plugin-parameter-implementation\target\surefire-reports\*.xml
[withMaven] junitPublisher - Archive test results for Maven artifact org.apache.maven.its.plugins:maven-it-plugin-plugin-dependency:maven-plugin:2.1-SNAPSHOT generated by maven-surefire-plugin:test (default-test): core-it-support\core-it-plugins\maven-it-plugin-plugin-dependency\target\surefire-reports\*.xml
[withMaven] junitPublisher - Archive test results for Maven artifact org.apache.maven.its.plugins:maven-it-plugin-project:maven-plugin:2.1-SNAPSHOT generated by maven-surefire-plugin:test (default-test): core-it-support\core-it-plugins\maven-it-plugin-project\target\surefire-reports\*.xml
[withMaven] junitPublisher - Archive test results for Maven artifact org.apache.maven.its.plugins:maven-it-plugin-project-interpolation:maven-plugin:2.1-SNAPSHOT generated by maven-surefire-plugin:test (default-test): core-it-support\core-it-plugins\maven-it-plugin-project-interpolation\target\surefire-reports\*.xml
[withMaven] junitPublisher - Archive test results for Maven artifact org.apache.maven.its.plugins:maven-it-plugin-setter:maven-plugin:2.1-SNAPSHOT generated by maven-surefire-plugin:test (default-test): core-it-support\core-it-plugins\maven-it-plugin-setter\target\surefire-reports\*.xml
[withMaven] junitPublisher - Archive test results for Maven artifact org.apache.maven.its.plugins:maven-it-plugin-singleton-component:maven-plugin:2.1-SNAPSHOT generated by maven-surefire-plugin:test (default-test): core-it-support\core-it-plugins\maven-it-plugin-singleton-component\target\surefire-reports\*.xml
[withMaven] junitPublisher - Archive test results for Maven artifact org.apache.maven.its.plugins:maven-it-plugin-site:maven-plugin:2.1-SNAPSHOT generated by maven-surefire-plugin:test (default-test): core-it-support\core-it-plugins\maven-it-plugin-site\target\surefire-reports\*.xml
[withMaven] junitPublisher - Archive test results for Maven artifact org.apache.maven.its.plugins:maven-it-plugin-toolchain:maven-plugin:2.1-SNAPSHOT generated by maven-surefire-plugin:test (default-test): core-it-support\core-it-plugins\maven-it-plugin-toolchain\target\surefire-reports\*.xml
[withMaven] junitPublisher - Archive test results for Maven artifact org.apache.maven.its.plugins:maven-it-plugin-touch:maven-plugin:2.1-SNAPSHOT generated by maven-surefire-plugin:test (default-test): core-it-support\core-it-plugins\maven-it-plugin-touch\target\surefire-reports\*.xml
[withMaven] junitPublisher - Archive test results for Maven artifact org.apache.maven.its.plugins:maven-it-plugin-uses-properties:maven-plugin:2.1-SNAPSHOT generated by maven-surefire-plugin:test (default-test): core-it-support\core-it-plugins\maven-it-plugin-uses-properties\target\surefire-reports\*.xml
[withMaven] junitPublisher - Archive test results for Maven artifact org.apache.maven.its.plugins:maven-it-plugin-uses-wagon:maven-plugin:2.1-SNAPSHOT generated by maven-surefire-plugin:test (default-test): core-it-support\core-it-plugins\maven-it-plugin-uses-wagon\target\surefire-reports\*.xml
[withMaven] junitPublisher - Archive test results for Maven artifact org.apache.maven.its.plugins:maven-it-plugin-all:maven-plugin:2.1-SNAPSHOT generated by maven-surefire-plugin:test (default-test): core-it-support\core-it-plugins\maven-it-plugin-all\target\surefire-reports\*.xml
[withMaven] junitPublisher - Archive test results for Maven artifact org.apache.maven.its.plugins:maven-it-plugin-plexus-utils-11:maven-plugin:2.1-SNAPSHOT generated by maven-surefire-plugin:test (default-test): core-it-support\core-it-plugins\maven-it-plugin-plexus-utils-11\target\surefire-reports\*.xml
[withMaven] junitPublisher - Archive test results for Maven artifact org.apache.maven.its.plugins:maven-it-plugin-plexus-utils-new:maven-plugin:2.1-SNAPSHOT generated by maven-surefire-plugin:test (default-test): core-it-support\core-it-plugins\maven-it-plugin-plexus-utils-new\target\surefire-reports\*.xml
[withMaven] junitPublisher - Archive test results for Maven artifact org.apache.maven.its.plugins:maven-it-plugin-plexus-component-api:maven-plugin:2.1-SNAPSHOT generated by maven-surefire-plugin:test (default-test): core-it-support\core-it-plugins\maven-it-plugin-plexus-component-api\target\surefire-reports\*.xml
[withMaven] junitPublisher - Archive test results for Maven artifact org.apache.maven.its.plugins:maven-it-plugin-log4j:maven-plugin:2.1-SNAPSHOT generated by maven-surefire-plugin:test (default-test): core-it-support\core-it-plugins\maven-it-plugin-log4j\target\surefire-reports\*.xml
[withMaven] junitPublisher - Archive test results for Maven artifact org.apache.maven.its.plugins:maven-it-plugin-extension1:maven-plugin:2.1-SNAPSHOT generated by maven-surefire-plugin:test (default-test): core-it-support\core-it-plugins\maven-it-plugin-extension1\target\surefire-reports\*.xml
[withMaven] junitPublisher - Archive test results for Maven artifact org.apache.maven.its.plugins:maven-it-plugin-extension2:maven-plugin:2.1-SNAPSHOT generated by maven-surefire-plugin:test (default-test): core-it-support\core-it-plugins\maven-it-plugin-extension2\target\surefire-reports\*.xml
[withMaven] junitPublisher - Archive test results for Maven artifact org.apache.maven.its.plugins:maven-it-plugin-plexus-lifecycle:maven-plugin:2.1-SNAPSHOT generated by maven-surefire-plugin:test (default-test): core-it-support\core-it-plugins\maven-it-plugin-plexus-lifecycle\target\surefire-reports\*.xml
[withMaven] junitPublisher - Archive test results for Maven artifact org.apache.maven.its.plugins:maven-it-plugin-settings:maven-plugin:2.1-SNAPSHOT generated by maven-surefire-plugin:test (default-test): core-it-support\core-it-plugins\maven-it-plugin-settings\target\surefire-reports\*.xml
[withMaven] junitPublisher - Archive test results for Maven artifact org.apache.maven.its.plugins:mng-5805-pkg-type-mojo-configuration-extension:jar:2.1-SNAPSHOT generated by maven-surefire-plugin:test (default-test): core-it-support\core-it-plugins\mng5805-extension\target\surefire-reports\*.xml
[withMaven] junitPublisher - Archive test results for Maven artifact org.apache.maven.its.plugins:mng-5805-pkg-type-mojo-configuration-extension2:jar:2.1-SNAPSHOT generated by maven-surefire-plugin:test (default-test): core-it-support\core-it-plugins\mng5805-extension2\target\surefire-reports\*.xml
[withMaven] junitPublisher - Archive test results for Maven artifact org.apache.maven.its.plugins:mng-5805-pkg-type-mojo-configuration-plugin:maven-plugin:2.1-SNAPSHOT generated by maven-surefire-plugin:test (default-test): core-it-support\core-it-plugins\mng5805-plugin\target\surefire-reports\*.xml
[withMaven] junitPublisher - Archive test results for Maven artifact org.apache.maven.its.plugins:mng-5805-pkg-type-mojo-configuration-plugin-dep:jar:2.1-SNAPSHOT generated by maven-surefire-plugin:test (default-test): core-it-support\core-it-plugins\mng5805-plugin-dep\target\surefire-reports\*.xml
[withMaven] junitPublisher - Archive test results for Maven artifact org.apache.maven.its.plugins:mng-5958-pkg-type-extension:jar:2.1-SNAPSHOT generated by maven-surefire-plugin:test (default-test): core-it-support\core-it-plugins\mng5958-extension\target\surefire-reports\*.xml
[withMaven] junitPublisher - Archive test results for Maven artifact org.apache.maven.its.plugins:mng-6759-resolves-project-dependencies-plugin:maven-plugin:2.1-SNAPSHOT generated by maven-surefire-plugin:test (default-test): core-it-support\core-it-plugins\mng6759-plugin-resolves-project-dependencies\target\surefire-reports\*.xml
[withMaven] junitPublisher - Archive test results for Maven artifact org.apache.maven.its:core-it-toolchain:jar:2.1-SNAPSHOT generated by maven-surefire-plugin:test (default-test): core-it-support\core-it-toolchain\target\surefire-reports\*.xml
[withMaven] junitPublisher - Archive test results for Maven artifact org.apache.maven.its:core-it-wagon:jar:2.1-SNAPSHOT generated by maven-surefire-plugin:test (default-test): core-it-support\core-it-wagon\target\surefire-reports\*.xml
[withMaven] junitPublisher - Archive test results for Maven artifact org.apache.maven.its:core-it-extension:jar:2.1-SNAPSHOT generated by maven-surefire-plugin:test (default-test): core-it-support\core-it-extension\target\surefire-reports\*.xml
[withMaven] junitPublisher - Archive test results for Maven artifact mng-coreit:javaagent:jar:1.0-SNAPSHOT generated by maven-surefire-plugin:test (default-test): core-it-support\core-it-javaagent\target\surefire-reports\*.xml
[withMaven] junitPublisher - Archive test results for Maven artifact org.apache.maven.its:core-it-suite:jar:2.1-SNAPSHOT generated by maven-surefire-plugin:test (default-test): core-it-suite\target\surefire-reports\*.xml
Recording test results
[withMaven] openTasksPublisher - Scan Tasks for Maven artifact org.apache.maven.its.plugins:maven-it-plugin-active-collection:maven-plugin:2.1-SNAPSHOT in source directory core-it-support\core-it-plugins\maven-it-plugin-active-collection\src\main\java
[withMaven] openTasksPublisher - Scan Tasks for Maven artifact org.apache.maven.its.plugins:maven-it-plugin-artifact:maven-plugin:2.1-SNAPSHOT in source directory core-it-support\core-it-plugins\maven-it-plugin-artifact\src\main\java
[withMaven] openTasksPublisher - Scan Tasks for Maven artifact org.apache.maven.its.plugins.class-loader:dep-a:jar:2.1-SNAPSHOT in source directory core-it-support\core-it-plugins\maven-it-plugin-class-loader\dep-a\src\main\java
[withMaven] openTasksPublisher - Scan Tasks for Maven artifact org.apache.maven.its.plugins.class-loader:dep-b:jar:2.1-SNAPSHOT in source directory core-it-support\core-it-plugins\maven-it-plugin-class-loader\dep-b\src\main\java
[withMaven] openTasksPublisher - Scan Tasks for Maven artifact org.apache.maven.its.plugins:maven-it-plugin-class-loader:maven-plugin:2.1-SNAPSHOT in source directory core-it-support\core-it-plugins\maven-it-plugin-class-loader\maven-it-plugin-class-loader\src\main\java
[withMaven] openTasksPublisher - Scan Tasks for Maven artifact org.apache.maven.its.plugins:maven-it-plugin-configuration:maven-plugin:2.1-SNAPSHOT in source directory core-it-support\core-it-plugins\maven-it-plugin-configuration\src\main\java
[withMaven] openTasksPublisher - Scan Tasks for Maven artifact org.apache.maven.its.plugins:maven-it-plugin-context-passing:maven-plugin:2.1-SNAPSHOT in source directory core-it-support\core-it-plugins\maven-it-plugin-context-passing\src\main\java
[withMaven] openTasksPublisher - Scan Tasks for Maven artifact org.apache.maven.plugins:maven-clean-plugin:maven-plugin:0.1-stub-SNAPSHOT in source directory core-it-support\core-it-plugins\maven-it-plugin-core-stubs\maven-clean-plugin\src\main\java
[withMaven] openTasksPublisher - Scan Tasks for Maven artifact org.apache.maven.plugins:maven-compiler-plugin:maven-plugin:0.1-stub-SNAPSHOT in source directory core-it-support\core-it-plugins\maven-it-plugin-core-stubs\maven-compiler-plugin\src\main\java
[withMaven] openTasksPublisher - Scan Tasks for Maven artifact org.apache.maven.plugins:maven-deploy-plugin:maven-plugin:0.1-stub-SNAPSHOT in source directory core-it-support\core-it-plugins\maven-it-plugin-core-stubs\maven-deploy-plugin\src\main\java
[withMaven] openTasksPublisher - Scan Tasks for Maven artifact org.apache.maven.plugins:maven-ear-plugin:maven-plugin:0.1-stub-SNAPSHOT in source directory core-it-support\core-it-plugins\maven-it-plugin-core-stubs\maven-ear-plugin\src\main\java
[withMaven] openTasksPublisher - Scan Tasks for Maven artifact org.apache.maven.plugins:maven-ejb-plugin:maven-plugin:0.1-stub-SNAPSHOT in source directory core-it-support\core-it-plugins\maven-it-plugin-core-stubs\maven-ejb-plugin\src\main\java
[withMaven] openTasksPublisher - Scan Tasks for Maven artifact org.apache.maven.plugins:maven-install-plugin:maven-plugin:0.1-stub-SNAPSHOT in source directory core-it-support\core-it-plugins\maven-it-plugin-core-stubs\maven-install-plugin\src\main\java
[withMaven] openTasksPublisher - Scan Tasks for Maven artifact org.apache.maven.plugins:maven-jar-plugin:maven-plugin:0.1-stub-SNAPSHOT in source directory core-it-support\core-it-plugins\maven-it-plugin-core-stubs\maven-jar-plugin\src\main\java
[withMaven] openTasksPublisher - Scan Tasks for Maven artifact org.apache.maven.plugins:maven-javadoc-plugin:maven-plugin:0.1-stub-SNAPSHOT in source directory core-it-support\core-it-plugins\maven-it-plugin-core-stubs\maven-javadoc-plugin\src\main\java
[withMaven] openTasksPublisher - Scan Tasks for Maven artifact org.apache.maven.plugins:maven-plugin-plugin:maven-plugin:0.1-stub-SNAPSHOT in source directory core-it-support\core-it-plugins\maven-it-plugin-core-stubs\maven-plugin-plugin\src\main\java
[withMaven] openTasksPublisher - Scan Tasks for Maven artifact org.apache.maven.plugins:maven-rar-plugin:maven-plugin:0.1-stub-SNAPSHOT in source directory core-it-support\core-it-plugins\maven-it-plugin-core-stubs\maven-rar-plugin\src\main\java
[withMaven] openTasksPublisher - Scan Tasks for Maven artifact org.apache.maven.plugins:maven-resources-plugin:maven-plugin:0.1-stub-SNAPSHOT in source directory core-it-support\core-it-plugins\maven-it-plugin-core-stubs\maven-resources-plugin\src\main\java
[withMaven] openTasksPublisher - Scan Tasks for Maven artifact org.apache.maven.plugins:maven-site-plugin:maven-plugin:0.1-stub-SNAPSHOT in source directory core-it-support\core-it-plugins\maven-it-plugin-core-stubs\maven-site-plugin\src\main\java
[withMaven] openTasksPublisher - Scan Tasks for Maven artifact org.apache.maven.plugins:maven-source-plugin:maven-plugin:0.1-stub-SNAPSHOT in source directory core-it-support\core-it-plugins\maven-it-plugin-core-stubs\maven-source-plugin\src\main\java
[withMaven] openTasksPublisher - Scan Tasks for Maven artifact org.apache.maven.plugins:maven-surefire-plugin:maven-plugin:0.1-stub-SNAPSHOT in source directory core-it-support\core-it-plugins\maven-it-plugin-core-stubs\maven-surefire-plugin\src\main\java
[withMaven] openTasksPublisher - Scan Tasks for Maven artifact org.apache.maven.plugins:maven-war-plugin:maven-plugin:0.1-stub-SNAPSHOT in source directory core-it-support\core-it-plugins\maven-it-plugin-core-stubs\maven-war-plugin\src\main\java
[withMaven] openTasksPublisher - Scan Tasks for Maven artifact org.apache.maven.its.plugins:maven-it-plugin-dependency-collection:maven-plugin:2.1-SNAPSHOT in source directory core-it-support\core-it-plugins\maven-it-plugin-dependency-collection\src\main\java
[withMaven] openTasksPublisher - Scan Tasks for Maven artifact org.apache.maven.its.plugins:maven-it-plugin-dependency-resolution:maven-plugin:2.1-SNAPSHOT in source directory core-it-support\core-it-plugins\maven-it-plugin-dependency-resolution\src\main\java
[withMaven] openTasksPublisher - Scan Tasks for Maven artifact org.apache.maven.its.plugins:maven-it-plugin-expression:maven-plugin:2.1-SNAPSHOT in source directory core-it-support\core-it-plugins\maven-it-plugin-expression\src\main\java
[withMaven] openTasksPublisher - Scan Tasks for Maven artifact org.apache.maven.its.plugins:maven-it-plugin-error:maven-plugin:2.1-SNAPSHOT in source directory core-it-support\core-it-plugins\maven-it-plugin-error\src\main\java
[withMaven] openTasksPublisher - Scan Tasks for Maven artifact org.apache.maven.its:core-it-component:jar:2.1-SNAPSHOT in source directory core-it-support\core-it-component\src\main\java
[withMaven] openTasksPublisher - Scan Tasks for Maven artifact org.apache.maven.its.plugins:maven-it-plugin-extension-consumer:maven-plugin:2.1-SNAPSHOT in source directory core-it-support\core-it-plugins\maven-it-plugin-extension-consumer\src\main\java
[withMaven] openTasksPublisher - Scan Tasks for Maven artifact org.apache.maven.its.plugins:maven-it-plugin-extension-provider:maven-plugin:2.1-SNAPSHOT in source directory core-it-support\core-it-plugins\maven-it-plugin-extension-provider\src\main\java
[withMaven] openTasksPublisher - Scan Tasks for Maven artifact org.apache.maven.its.plugins:maven-it-plugin-fork:maven-plugin:2.1-SNAPSHOT in source directory core-it-support\core-it-plugins\maven-it-plugin-fork\src\main\java
[withMaven] openTasksPublisher - Scan Tasks for Maven artifact org.apache.maven.its.plugins:maven-it-plugin-invalid-descriptor:maven-plugin:2.1-SNAPSHOT in source directory core-it-support\core-it-plugins\maven-it-plugin-invalid-descriptor\src\main\java
[withMaven] openTasksPublisher - Scan Tasks for Maven artifact org.apache.maven.its.plugins:maven-it-plugin-log-file:maven-plugin:2.1-SNAPSHOT in source directory core-it-support\core-it-plugins\maven-it-plugin-log-file\src\main\java
[withMaven] openTasksPublisher - Scan Tasks for Maven artifact org.apache.maven.its:maven-it-helper:jar:2.1-SNAPSHOT in source directory core-it-support\maven-it-helper\src\main\java
[withMaven] openTasksPublisher - Scan Tasks for Maven artifact org.apache.maven.its.plugins:maven-it-plugin-model-interpolation:maven-plugin:2.1-SNAPSHOT in source directory core-it-support\core-it-plugins\maven-it-plugin-model-interpolation\src\main\java
[withMaven] openTasksPublisher - Scan Tasks for Maven artifact org.apache.maven.its.plugins:maven-it-plugin-no-default-comp:maven-plugin:2.1-SNAPSHOT in source directory core-it-support\core-it-plugins\maven-it-plugin-no-default-comp\src\main\java
[withMaven] openTasksPublisher - Scan Tasks for Maven artifact org.apache.maven.its.plugins:maven-it-plugin-no-project:maven-plugin:2.1-SNAPSHOT in source directory core-it-support\core-it-plugins\maven-it-plugin-no-project\src\main\java
[withMaven] openTasksPublisher - Scan Tasks for Maven artifact org.apache.maven.its.plugins:maven-it-plugin-online:maven-plugin:2.1-SNAPSHOT in source directory core-it-support\core-it-plugins\maven-it-plugin-online\src\main\java
[withMaven] openTasksPublisher - Scan Tasks for Maven artifact org.apache.maven.its.plugins:maven-it-plugin-optional-mojos:maven-plugin:2.1-SNAPSHOT in source directory core-it-support\core-it-plugins\maven-it-plugin-optional-mojos\src\main\java
[withMaven] openTasksPublisher - Scan Tasks for Maven artifact org.apache.maven.its.plugins:maven-it-plugin-packaging:maven-plugin:2.1-SNAPSHOT in source directory core-it-support\core-it-plugins\maven-it-plugin-packaging\src\main\java
[withMaven] openTasksPublisher - Scan Tasks for Maven artifact org.apache.maven.its.plugins:maven-it-plugin-parameter-implementation:maven-plugin:2.1-SNAPSHOT in source directory core-it-support\core-it-plugins\maven-it-plugin-parameter-implementation\src\main\java
[withMaven] openTasksPublisher - Scan Tasks for Maven artifact org.apache.maven.its.plugins:maven-it-plugin-plugin-dependency:maven-plugin:2.1-SNAPSHOT in source directory core-it-support\core-it-plugins\maven-it-plugin-plugin-dependency\src\main\java
[withMaven] openTasksPublisher - Scan Tasks for Maven artifact org.apache.maven.its.plugins:maven-it-plugin-project:maven-plugin:2.1-SNAPSHOT in source directory core-it-support\core-it-plugins\maven-it-plugin-project\src\main\java
[withMaven] openTasksPublisher - Scan Tasks for Maven artifact org.apache.maven.its.plugins:maven-it-plugin-project-interpolation:maven-plugin:2.1-SNAPSHOT in source directory core-it-support\core-it-plugins\maven-it-plugin-project-interpolation\src\main\java
[withMaven] openTasksPublisher - Scan Tasks for Maven artifact org.apache.maven.its.plugins:maven-it-plugin-setter:maven-plugin:2.1-SNAPSHOT in source directory core-it-support\core-it-plugins\maven-it-plugin-setter\src\main\java
[withMaven] openTasksPublisher - Scan Tasks for Maven artifact org.apache.maven.its.plugins:maven-it-plugin-singleton-component:maven-plugin:2.1-SNAPSHOT in source directory core-it-support\core-it-plugins\maven-it-plugin-singleton-component\src\main\java
[withMaven] openTasksPublisher - Scan Tasks for Maven artifact org.apache.maven.its.plugins:maven-it-plugin-site:maven-plugin:2.1-SNAPSHOT in source directory core-it-support\core-it-plugins\maven-it-plugin-site\src\main\java
[withMaven] openTasksPublisher - Scan Tasks for Maven artifact org.apache.maven.its.plugins:maven-it-plugin-toolchain:maven-plugin:2.1-SNAPSHOT in source directory core-it-support\core-it-plugins\maven-it-plugin-toolchain\src\main\java
[withMaven] openTasksPublisher - Scan Tasks for Maven artifact org.apache.maven.its.plugins:maven-it-plugin-touch:maven-plugin:2.1-SNAPSHOT in source directory core-it-support\core-it-plugins\maven-it-plugin-touch\src\main\java
[withMaven] openTasksPublisher - Scan Tasks for Maven artifact org.apache.maven.its.plugins:maven-it-plugin-uses-properties:maven-plugin:2.1-SNAPSHOT in source directory core-it-support\core-it-plugins\maven-it-plugin-uses-properties\src\main\java
[withMaven] openTasksPublisher - Scan Tasks for Maven artifact org.apache.maven.its.plugins:maven-it-plugin-uses-wagon:maven-plugin:2.1-SNAPSHOT in source directory core-it-support\core-it-plugins\maven-it-plugin-uses-wagon\src\main\java
[withMaven] openTasksPublisher - Scan Tasks for Maven artifact org.apache.maven.its.plugins:maven-it-plugin-all:maven-plugin:2.1-SNAPSHOT in source directory core-it-support\core-it-plugins\maven-it-plugin-all\src\main\java
[withMaven] openTasksPublisher - Scan Tasks for Maven artifact org.apache.maven.its.plugins:maven-it-plugin-plexus-utils-11:maven-plugin:2.1-SNAPSHOT in source directory core-it-support\core-it-plugins\maven-it-plugin-plexus-utils-11\src\main\java
[withMaven] openTasksPublisher - Scan Tasks for Maven artifact org.apache.maven.its.plugins:maven-it-plugin-plexus-utils-new:maven-plugin:2.1-SNAPSHOT in source directory core-it-support\core-it-plugins\maven-it-plugin-plexus-utils-new\src\main\java
[withMaven] openTasksPublisher - Scan Tasks for Maven artifact org.apache.maven.its.plugins:maven-it-plugin-plexus-component-api:maven-plugin:2.1-SNAPSHOT in source directory core-it-support\core-it-plugins\maven-it-plugin-plexus-component-api\src\main\java
[withMaven] openTasksPublisher - Scan Tasks for Maven artifact org.apache.maven.its.plugins:maven-it-plugin-log4j:maven-plugin:2.1-SNAPSHOT in source directory core-it-support\core-it-plugins\maven-it-plugin-log4j\src\main\java
[withMaven] openTasksPublisher - Scan Tasks for Maven artifact org.apache.maven.its.plugins:maven-it-plugin-extension1:maven-plugin:2.1-SNAPSHOT in source directory core-it-support\core-it-plugins\maven-it-plugin-extension1\src\main\java
[withMaven] openTasksPublisher - Scan Tasks for Maven artifact org.apache.maven.its.plugins:maven-it-plugin-extension2:maven-plugin:2.1-SNAPSHOT in source directory core-it-support\core-it-plugins\maven-it-plugin-extension2\src\main\java
[withMaven] openTasksPublisher - Scan Tasks for Maven artifact org.apache.maven.its.plugins:maven-it-plugin-plexus-lifecycle:maven-plugin:2.1-SNAPSHOT in source directory core-it-support\core-it-plugins\maven-it-plugin-plexus-lifecycle\src\main\java
[withMaven] openTasksPublisher - Scan Tasks for Maven artifact org.apache.maven.its.plugins:maven-it-plugin-settings:maven-plugin:2.1-SNAPSHOT in source directory core-it-support\core-it-plugins\maven-it-plugin-settings\src\main\java
[withMaven] openTasksPublisher - Scan Tasks for Maven artifact org.apache.maven.its.plugins:mng-5805-pkg-type-mojo-configuration-plugin:maven-plugin:2.1-SNAPSHOT in source directory core-it-support\core-it-plugins\mng5805-plugin\src\main\java
[withMaven] openTasksPublisher - Scan Tasks for Maven artifact org.apache.maven.its.plugins:mng-5805-pkg-type-mojo-configuration-plugin-dep:jar:2.1-SNAPSHOT in source directory core-it-support\core-it-plugins\mng5805-plugin-dep\src\main\java
[withMaven] openTasksPublisher - Scan Tasks for Maven artifact org.apache.maven.its.plugins:mng-5958-pkg-type-extension:jar:2.1-SNAPSHOT in source directory core-it-support\core-it-plugins\mng5958-extension\src\main\java
[withMaven] openTasksPublisher - Scan Tasks for Maven artifact org.apache.maven.its.plugins:mng-6759-resolves-project-dependencies-plugin:maven-plugin:2.1-SNAPSHOT in source directory core-it-support\core-it-plugins\mng6759-plugin-resolves-project-dependencies\src\main\java
[withMaven] openTasksPublisher - Scan Tasks for Maven artifact org.apache.maven.its:core-it-toolchain:jar:2.1-SNAPSHOT in source directory core-it-support\core-it-toolchain\src\main\java
[withMaven] openTasksPublisher - Scan Tasks for Maven artifact org.apache.maven.its:core-it-wagon:jar:2.1-SNAPSHOT in source directory core-it-support\core-it-wagon\src\main\java
[withMaven] openTasksPublisher - Scan Tasks for Maven artifact mng-coreit:javaagent:jar:1.0-SNAPSHOT in source directory core-it-support\core-it-javaagent\src\main\java
[TASKS] Scanning folder 'c:\mvn-it-0.tmp' for files matching the pattern 'core-it-support\core-it-plugins\maven-it-plugin-active-collection\src\main\java\**\*,core-it-support\core-it-plugins\maven-it-plugin-artifact\src\main\java\**\*,core-it-support\core-it-plugins\maven-it-plugin-class-loader\dep-a\src\main\java\**\*,core-it-support\core-it-plugins\maven-it-plugin-class-loader\dep-b\src\main\java\**\*,core-it-support\core-it-plugins\maven-it-plugin-class-loader\maven-it-plugin-class-loader\src\main\java\**\*,core-it-support\core-it-plugins\maven-it-plugin-configuration\src\main\java\**\*,core-it-support\core-it-plugins\maven-it-plugin-context-passing\src\main\java\**\*,core-it-support\core-it-plugins\maven-it-plugin-core-stubs\maven-clean-plugin\src\main\java\**\*,core-it-support\core-it-plugins\maven-it-plugin-core-stubs\maven-compiler-plugin\src\main\java\**\*,core-it-support\core-it-plugins\maven-it-plugin-core-stubs\maven-deploy-plugin\src\main\java\**\*,core-it-support\core-it-plugins\maven-it-plugin-core-stubs\maven-ear-plugin\src\main\java\**\*,core-it-support\core-it-plugins\maven-it-plugin-core-stubs\maven-ejb-plugin\src\main\java\**\*,core-it-support\core-it-plugins\maven-it-plugin-core-stubs\maven-install-plugin\src\main\java\**\*,core-it-support\core-it-plugins\maven-it-plugin-core-stubs\maven-jar-plugin\src\main\java\**\*,core-it-support\core-it-plugins\maven-it-plugin-core-stubs\maven-javadoc-plugin\src\main\java\**\*,core-it-support\core-it-plugins\maven-it-plugin-core-stubs\maven-plugin-plugin\src\main\java\**\*,core-it-support\core-it-plugins\maven-it-plugin-core-stubs\maven-rar-plugin\src\main\java\**\*,core-it-support\core-it-plugins\maven-it-plugin-core-stubs\maven-resources-plugin\src\main\java\**\*,core-it-support\core-it-plugins\maven-it-plugin-core-stubs\maven-site-plugin\src\main\java\**\*,core-it-support\core-it-plugins\maven-it-plugin-core-stubs\maven-source-plugin\src\main\java\**\*,core-it-support\core-it-plugins\maven-it-plugin-core-stubs\maven-surefire-plugin\src\main\java\**\*,core-it-support\core-it-plugins\maven-it-plugin-core-stubs\maven-war-plugin\src\main\java\**\*,core-it-support\core-it-plugins\maven-it-plugin-dependency-collection\src\main\java\**\*,core-it-support\core-it-plugins\maven-it-plugin-dependency-resolution\src\main\java\**\*,core-it-support\core-it-plugins\maven-it-plugin-expression\src\main\java\**\*,core-it-support\core-it-plugins\maven-it-plugin-error\src\main\java\**\*,core-it-support\core-it-component\src\main\java\**\*,core-it-support\core-it-plugins\maven-it-plugin-extension-consumer\src\main\java\**\*,core-it-support\core-it-plugins\maven-it-plugin-extension-provider\src\main\java\**\*,core-it-support\core-it-plugins\maven-it-plugin-fork\src\main\java\**\*,core-it-support\core-it-plugins\maven-it-plugin-invalid-descriptor\src\main\java\**\*,core-it-support\core-it-plugins\maven-it-plugin-log-file\src\main\java\**\*,core-it-support\maven-it-helper\src\main\java\**\*,core-it-support\core-it-plugins\maven-it-plugin-model-interpolation\src\main\java\**\*,core-it-support\core-it-plugins\maven-it-plugin-no-default-comp\src\main\java\**\*,core-it-support\core-it-plugins\maven-it-plugin-no-project\src\main\java\**\*,core-it-support\core-it-plugins\maven-it-plugin-online\src\main\java\**\*,core-it-support\core-it-plugins\maven-it-plugin-optional-mojos\src\main\java\**\*,core-it-support\core-it-plugins\maven-it-plugin-packaging\src\main\java\**\*,core-it-support\core-it-plugins\maven-it-plugin-parameter-implementation\src\main\java\**\*,core-it-support\core-it-plugins\maven-it-plugin-plugin-dependency\src\main\java\**\*,core-it-support\core-it-plugins\maven-it-plugin-project\src\main\java\**\*,core-it-support\core-it-plugins\maven-it-plugin-project-interpolation\src\main\java\**\*,core-it-support\core-it-plugins\maven-it-plugin-setter\src\main\java\**\*,core-it-support\core-it-plugins\maven-it-plugin-singleton-component\src\main\java\**\*,core-it-support\core-it-plugins\maven-it-plugin-site\src\main\java\**\*,core-it-support\core-it-plugins\maven-it-plugin-toolchain\src\main\java\**\*,core-it-support\core-it-plugins\maven-it-plugin-touch\src\main\java\**\*,core-it-support\core-it-plugins\maven-it-plugin-uses-properties\src\main\java\**\*,core-it-support\core-it-plugins\maven-it-plugin-uses-wagon\src\main\java\**\*,core-it-support\core-it-plugins\maven-it-plugin-all\src\main\java\**\*,core-it-support\core-it-plugins\maven-it-plugin-plexus-utils-11\src\main\java\**\*,core-it-support\core-it-plugins\maven-it-plugin-plexus-utils-new\src\main\java\**\*,core-it-support\core-it-plugins\maven-it-plugin-plexus-component-api\src\main\java\**\*,core-it-support\core-it-plugins\maven-it-plugin-log4j\src\main\java\**\*,core-it-support\core-it-plugins\maven-it-plugin-extension1\src\main\java\**\*,core-it-support\core-it-plugins\maven-it-plugin-extension2\src\main\java\**\*,core-it-support\core-it-plugins\maven-it-plugin-plexus-lifecycle\src\main\java\**\*,core-it-support\core-it-plugins\maven-it-plugin-settings\src\main\java\**\*,core-it-support\core-it-plugins\mng5805-plugin\src\main\java\**\*,core-it-support\core-it-plugins\mng5805-plugin-dep\src\main\java\**\*,core-it-support\core-it-plugins\mng5958-extension\src\main\java\**\*,core-it-support\core-it-plugins\mng6759-plugin-resolves-project-dependencies\src\main\java\**\*,core-it-support\core-it-toolchain\src\main\java\**\*,core-it-support\core-it-wagon\src\main\java\**\*,core-it-support\core-it-javaagent\src\main\java\**\*' - excludes: null
[TASKS] Found 167 files to scan for tasks
[TASKS] Found 0 open tasks.
Skipping warnings blame since pipelines do not have an SCM link.%n
[TASKS] Computing warning deltas based on reference build #84
[DevOpticsMavenPublisher] dependencies consumed: 5, artifacts produced: 156
[withMaven] Publishers: Pipeline Graph Publisher: 28 ms, Generated Artifacts Publisher: 13632 ms, Invoker Publisher: 3 ms, Junit Publisher: 55639 ms, Concordion Publisher: 2 ms, Dependencies Fingerprint Publisher: 472 ms, Findbugs Publisher: 1 ms, JGiven Publisher: 1 ms, Jacoco Publisher: 1 ms, SpotBugs Publisher: 1 ms, Open Task Scanner Publisher: 3291 ms, CloudBees DevOptics Gate Artifact Publisher: 93688 ms
[Pipeline] // withMaven
[Pipeline] fileExists
[Pipeline] zip
Writing zip file of c:\mvn-it-0.tmp\core-it-suite\target\test-classes to c:\mvn-it-0.tmp\core-it-suite-logs-windows-jdk11.zip
Zipped 8643 entries.
Archiving c:\mvn-it-0.tmp\core-it-suite-logs-windows-jdk11.zip
[Pipeline] fileExists
[Pipeline] zip
Writing zip file of c:\mvn-it-0.tmp\core-it-suite\target\surefire-reports to c:\mvn-it-0.tmp\core-it-suite-reports-windows-jdk11.zip
Zipped 4 entries.
Archiving c:\mvn-it-0.tmp\core-it-suite-reports-windows-jdk11.zip
[Pipeline] deleteDir
[Pipeline] }
[Pipeline] // dir
[Pipeline] }
[Pipeline] // stage
[Pipeline] }
[Pipeline] // node
[Pipeline] }
[Pipeline] // parallel
[Pipeline] stage
[Pipeline] { (Notifications)
[Pipeline] echo
Build result: UNSTABLE
[Pipeline] jiraIssueSelector
[Pipeline] jiraComment
[Pipeline] jiraComment
[Pipeline] jiraComment
[Pipeline] echo
The authors of changes [rfscholte, michaelo].
[Pipeline] echo
Sending email ...
[Pipeline] emailext
Reply | Threaded
Open this post in threaded view
|

Build unstable in Jenkins: Maven » Maven TLP » maven » master #86

Apache Jenkins Server-2
See https://ci-builds.apache.org/job/Maven/job/maven-box/job/maven/job/master/86/

Changes:

* [MNG-7064] Use HTTPS for schema location in global settings.xml

2 tests failed.
FAILED:  org.apache.maven.it.MavenITmng6972AllowAccessToGraphPackageTest.linux-jdk11 / Run ITs Linux Java 11 / testit

Error Message:
Exit code was non-zero: 1; command line and log =
/home/jenkins/workspace/Maven_maven-box_maven_master/test/core-it-suite/target/apache-maven/bin/mvn --global-settings /home/jenkins/workspace/Maven_maven-box_maven_master/test/core-it-suite/target/test-classes/settings.xml -e --batch-mode -Dmaven.repo.local=/home/jenkins/workspace/Maven_maven-box_maven_master/test/it-local-repo install
[INFO] [jenkins-event-spy] Jenkins Maven Event Spy is disabled
[INFO] Error stacktraces are turned on.
[INFO] Scanning for projects...
[INFO] Maven detected that the requested POM file is part of a multi module project, but could not find a pom.xml file in the multi module root directory: '/home/jenkins/workspace/Maven_maven-box_maven_master/test/core-it-suite/target/test-classes/mng-6972-allow-access-to-graph-package'.
[INFO] The reactor is limited to all projects under: /home/jenkins/workspace/Maven_maven-box_maven_master/test/core-it-suite/target/test-classes/mng-6972-allow-access-to-graph-package/build-plugin
[INFO]
[INFO] --------< mng-6972-allow-access-to-graph-package:build-plugin >---------
[INFO] Building build-plugin 1.0
[INFO] --------------------------------[ jar ]---------------------------------
[WARNING] Version not locked for default bindings plugins [maven-resources-plugin, maven-compiler-plugin, maven-surefire-plugin, maven-jar-plugin, maven-install-plugin], you should define versions in pluginManagement section of your pom.xml or parent
[INFO]
[INFO] --- maven-resources-plugin:3.2.0:resources (default-resources) @ build-plugin ---
[INFO] Using 'UTF-8' encoding to copy filtered resources.
[INFO] Using 'UTF-8' encoding to copy filtered properties files.
[INFO] skip non existing resourceDirectory /home/jenkins/workspace/Maven_maven-box_maven_master/test/core-it-suite/target/test-classes/mng-6972-allow-access-to-graph-package/build-plugin/src/main/resources
[INFO] skip non existing resourceDirectory /home/jenkins/workspace/Maven_maven-box_maven_master/test/core-it-suite/target/test-classes/mng-6972-allow-access-to-graph-package/build-plugin/src/main/resources-filtered
[INFO]
[INFO] --- maven-compiler-plugin:3.8.1:compile (default-compile) @ build-plugin ---
[INFO] Changes detected - recompiling the module!
[INFO] Compiling 1 source file to /home/jenkins/workspace/Maven_maven-box_maven_master/test/core-it-suite/target/test-classes/mng-6972-allow-access-to-graph-package/build-plugin/target/classes
[INFO] -------------------------------------------------------------
[ERROR] COMPILATION ERROR :
[INFO] -------------------------------------------------------------
[ERROR] /home/jenkins/workspace/Maven_maven-box_maven_master/test/core-it-suite/target/test-classes/mng-6972-allow-access-to-graph-package/build-plugin/src/main/java/com/example/BuildExtensionUsingGraphPackage.java:[4,17] cannot find symbol
  symbol:   class Objects
  location: package java.util
[INFO] 1 error
[INFO] -------------------------------------------------------------
[INFO] ------------------------------------------------------------------------
[INFO] BUILD FAILURE
[INFO] ------------------------------------------------------------------------
[INFO] Total time:  0.475 s
[INFO] Finished at: 2021-01-04T19:46:33Z
[INFO] ------------------------------------------------------------------------
[ERROR] Failed to execute goal org.apache.maven.plugins:maven-compiler-plugin:3.8.1:compile (default-compile) on project build-plugin: Compilation failure
[ERROR] /home/jenkins/workspace/Maven_maven-box_maven_master/test/core-it-suite/target/test-classes/mng-6972-allow-access-to-graph-package/build-plugin/src/main/java/com/example/BuildExtensionUsingGraphPackage.java:[4,17] cannot find symbol
[ERROR]   symbol:   class Objects
[ERROR]   location: package java.util
[ERROR] -> [Help 1]
org.apache.maven.lifecycle.LifecycleExecutionException: Failed to execute goal org.apache.maven.plugins:maven-compiler-plugin:3.8.1:compile (default-compile) on project build-plugin: Compilation failure
/home/jenkins/workspace/Maven_maven-box_maven_master/test/core-it-suite/target/test-classes/mng-6972-allow-access-to-graph-package/build-plugin/src/main/java/com/example/BuildExtensionUsingGraphPackage.java:[4,17] cannot find symbol
  symbol:   class Objects
  location: package java.util

    at org.apache.maven.lifecycle.internal.MojoExecutor.execute (MojoExecutor.java:218)
    at org.apache.maven.lifecycle.internal.MojoExecutor.execute (MojoExecutor.java:159)
    at org.apache.maven.lifecycle.internal.MojoExecutor.execute (MojoExecutor.java:151)
    at org.apache.maven.lifecycle.internal.LifecycleModuleBuilder.buildProject (LifecycleModuleBuilder.java:115)
    at org.apache.maven.lifecycle.internal.LifecycleModuleBuilder.buildProject (LifecycleModuleBuilder.java:79)
    at org.apache.maven.lifecycle.internal.builder.singlethreaded.SingleThreadedBuilder.build (SingleThreadedBuilder.java:64)
    at org.apache.maven.lifecycle.internal.LifecycleStarter.execute (LifecycleStarter.java:131)
    at org.apache.maven.DefaultMaven.doExecute (DefaultMaven.java:321)
    at org.apache.maven.DefaultMaven.doExecute (DefaultMaven.java:206)
    at org.apache.maven.DefaultMaven.execute (DefaultMaven.java:119)
    at org.apache.maven.cli.MavenCli.execute (MavenCli.java:979)
    at org.apache.maven.cli.MavenCli.doMain (MavenCli.java:293)
    at org.apache.maven.cli.MavenCli.doMain (MavenCli.java:248)
    at jdk.internal.reflect.NativeMethodAccessorImpl.invoke0 (Native Method)
    at jdk.internal.reflect.NativeMethodAccessorImpl.invoke (NativeMethodAccessorImpl.java:62)
    at jdk.internal.reflect.DelegatingMethodAccessorImpl.invoke (DelegatingMethodAccessorImpl.java:43)
    at java.lang.reflect.Method.invoke (Method.java:566)
    at org.apache.maven.it.Embedded3xLauncher.run (Embedded3xLauncher.java:215)
    at org.apache.maven.it.Verifier.executeGoals (Verifier.java:1339)
    at org.apache.maven.it.Verifier.executeGoal (Verifier.java:1239)
    at org.apache.maven.it.Verifier.executeGoal (Verifier.java:1233)
    at org.apache.maven.it.MavenITmng6972AllowAccessToGraphPackageTest.testit (MavenITmng6972AllowAccessToGraphPackageTest.java:60)
    at jdk.internal.reflect.NativeMethodAccessorImpl.invoke0 (Native Method)
    at jdk.internal.reflect.NativeMethodAccessorImpl.invoke (NativeMethodAccessorImpl.java:62)
    at jdk.internal.reflect.DelegatingMethodAccessorImpl.invoke (DelegatingMethodAccessorImpl.java:43)
    at java.lang.reflect.Method.invoke (Method.java:566)
    at junit.framework.TestCase.runTest (TestCase.java:176)
    at org.apache.maven.it.AbstractMavenIntegrationTestCase.runTest (AbstractMavenIntegrationTestCase.java:255)
    at junit.framework.TestCase.runBare (TestCase.java:141)
    at junit.framework.TestResult$1.protect (TestResult.java:122)
    at junit.framework.TestResult.runProtected (TestResult.java:142)
    at junit.framework.TestResult.run (TestResult.java:125)
    at junit.framework.TestCase.run (TestCase.java:129)
    at junit.framework.TestSuite.runTest (TestSuite.java:252)
    at junit.framework.TestSuite.run (TestSuite.java:247)
    at junit.framework.TestSuite.runTest (TestSuite.java:252)
    at junit.framework.TestSuite.run (TestSuite.java:247)
    at org.junit.internal.runners.JUnit38ClassRunner.run (JUnit38ClassRunner.java:86)
    at org.apache.maven.surefire.junit4.JUnit4Provider.execute (JUnit4Provider.java:365)
    at org.apache.maven.surefire.junit4.JUnit4Provider.executeWithRerun (JUnit4Provider.java:273)
    at org.apache.maven.surefire.junit4.JUnit4Provider.executeTestSet (JUnit4Provider.java:238)
    at org.apache.maven.surefire.junit4.JUnit4Provider.invoke (JUnit4Provider.java:159)
    at org.apache.maven.surefire.booter.ForkedBooter.invokeProviderInSameClassLoader (ForkedBooter.java:383)
    at org.apache.maven.surefire.booter.ForkedBooter.runSuitesInProcess (ForkedBooter.java:344)
    at org.apache.maven.surefire.booter.ForkedBooter.execute (ForkedBooter.java:125)
    at org.apache.maven.surefire.booter.ForkedBooter.main (ForkedBooter.java:417)
Caused by: org.apache.maven.plugin.compiler.CompilationFailureException: Compilation failure
/home/jenkins/workspace/Maven_maven-box_maven_master/test/core-it-suite/target/test-classes/mng-6972-allow-access-to-graph-package/build-plugin/src/main/java/com/example/BuildExtensionUsingGraphPackage.java:[4,17] cannot find symbol
  symbol:   class Objects
  location: package java.util

    at org.apache.maven.plugin.compiler.AbstractCompilerMojo.execute (AbstractCompilerMojo.java:1220)
    at org.apache.maven.plugin.compiler.CompilerMojo.execute (CompilerMojo.java:187)
    at org.apache.maven.plugin.DefaultBuildPluginManager.executeMojo (DefaultBuildPluginManager.java:136)
    at org.apache.maven.lifecycle.internal.MojoExecutor.execute (MojoExecutor.java:213)
    at org.apache.maven.lifecycle.internal.MojoExecutor.execute (MojoExecutor.java:159)
    at org.apache.maven.lifecycle.internal.MojoExecutor.execute (MojoExecutor.java:151)
    at org.apache.maven.lifecycle.internal.LifecycleModuleBuilder.buildProject (LifecycleModuleBuilder.java:115)
    at org.apache.maven.lifecycle.internal.LifecycleModuleBuilder.buildProject (LifecycleModuleBuilder.java:79)
    at org.apache.maven.lifecycle.internal.builder.singlethreaded.SingleThreadedBuilder.build (SingleThreadedBuilder.java:64)
    at org.apache.maven.lifecycle.internal.LifecycleStarter.execute (LifecycleStarter.java:131)
    at org.apache.maven.DefaultMaven.doExecute (DefaultMaven.java:321)
    at org.apache.maven.DefaultMaven.doExecute (DefaultMaven.java:206)
    at org.apache.maven.DefaultMaven.execute (DefaultMaven.java:119)
    at org.apache.maven.cli.MavenCli.execute (MavenCli.java:979)
    at org.apache.maven.cli.MavenCli.doMain (MavenCli.java:293)
    at org.apache.maven.cli.MavenCli.doMain (MavenCli.java:248)
    at jdk.internal.reflect.NativeMethodAccessorImpl.invoke0 (Native Method)
    at jdk.internal.reflect.NativeMethodAccessorImpl.invoke (NativeMethodAccessorImpl.java:62)
    at jdk.internal.reflect.DelegatingMethodAccessorImpl.invoke (DelegatingMethodAccessorImpl.java:43)
    at java.lang.reflect.Method.invoke (Method.java:566)
    at org.apache.maven.it.Embedded3xLauncher.run (Embedded3xLauncher.java:215)
    at org.apache.maven.it.Verifier.executeGoals (Verifier.java:1339)
    at org.apache.maven.it.Verifier.executeGoal (Verifier.java:1239)
    at org.apache.maven.it.Verifier.executeGoal (Verifier.java:1233)
    at org.apache.maven.it.MavenITmng6972AllowAccessToGraphPackageTest.testit (MavenITmng6972AllowAccessToGraphPackageTest.java:60)
    at jdk.internal.reflect.NativeMethodAccessorImpl.invoke0 (Native Method)
    at jdk.internal.reflect.NativeMethodAccessorImpl.invoke (NativeMethodAccessorImpl.java:62)
    at jdk.internal.reflect.DelegatingMethodAccessorImpl.invoke (DelegatingMethodAccessorImpl.java:43)
    at java.lang.reflect.Method.invoke (Method.java:566)
    at junit.framework.TestCase.runTest (TestCase.java:176)
    at org.apache.maven.it.AbstractMavenIntegrationTestCase.runTest (AbstractMavenIntegrationTestCase.java:255)
    at junit.framework.TestCase.runBare (TestCase.java:141)
    at junit.framework.TestResult$1.protect (TestResult.java:122)
    at junit.framework.TestResult.runProtected (TestResult.java:142)
    at junit.framework.TestResult.run (TestResult.java:125)
    at junit.framework.TestCase.run (TestCase.java:129)
    at junit.framework.TestSuite.runTest (TestSuite.java:252)
    at junit.framework.TestSuite.run (TestSuite.java:247)
    at junit.framework.TestSuite.runTest (TestSuite.java:252)
    at junit.framework.TestSuite.run (TestSuite.java:247)
    at org.junit.internal.runners.JUnit38ClassRunner.run (JUnit38ClassRunner.java:86)
    at org.apache.maven.surefire.junit4.JUnit4Provider.execute (JUnit4Provider.java:365)
    at org.apache.maven.surefire.junit4.JUnit4Provider.executeWithRerun (JUnit4Provider.java:273)
    at org.apache.maven.surefire.junit4.JUnit4Provider.executeTestSet (JUnit4Provider.java:238)
    at org.apache.maven.surefire.junit4.JUnit4Provider.invoke (JUnit4Provider.java:159)
    at org.apache.maven.surefire.booter.ForkedBooter.invokeProviderInSameClassLoader (ForkedBooter.java:383)
    at org.apache.maven.surefire.booter.ForkedBooter.runSuitesInProcess (ForkedBooter.java:344)
    at org.apache.maven.surefire.booter.ForkedBooter.execute (ForkedBooter.java:125)
    at org.apache.maven.surefire.booter.ForkedBooter.main (ForkedBooter.java:417)
[ERROR]
[ERROR] Re-run Maven using the -X switch to enable full debug logging.
[ERROR]
[ERROR] For more information about the errors and possible solutions, please read the following articles:
[ERROR] [Help 1] http://cwiki.apache.org/confluence/display/MAVEN/MojoFailureException


Stack Trace:
org.apache.maven.it.VerificationException:
Exit code was non-zero: 1; command line and log =
/home/jenkins/workspace/Maven_maven-box_maven_master/test/core-it-suite/target/apache-maven/bin/mvn --global-settings /home/jenkins/workspace/Maven_maven-box_maven_master/test/core-it-suite/target/test-classes/settings.xml -e --batch-mode -Dmaven.repo.local=/home/jenkins/workspace/Maven_maven-box_maven_master/test/it-local-repo install
[INFO] [jenkins-event-spy] Jenkins Maven Event Spy is disabled
[INFO] Error stacktraces are turned on.
[INFO] Scanning for projects...
[INFO] Maven detected that the requested POM file is part of a multi module project, but could not find a pom.xml file in the multi module root directory: '/home/jenkins/workspace/Maven_maven-box_maven_master/test/core-it-suite/target/test-classes/mng-6972-allow-access-to-graph-package'.
[INFO] The reactor is limited to all projects under: /home/jenkins/workspace/Maven_maven-box_maven_master/test/core-it-suite/target/test-classes/mng-6972-allow-access-to-graph-package/build-plugin
[INFO]
[INFO] --------< mng-6972-allow-access-to-graph-package:build-plugin >---------
[INFO] Building build-plugin 1.0
[INFO] --------------------------------[ jar ]---------------------------------
[WARNING] Version not locked for default bindings plugins [maven-resources-plugin, maven-compiler-plugin, maven-surefire-plugin, maven-jar-plugin, maven-install-plugin], you should define versions in pluginManagement section of your pom.xml or parent
[INFO]
[INFO] --- maven-resources-plugin:3.2.0:resources (default-resources) @ build-plugin ---
[INFO] Using 'UTF-8' encoding to copy filtered resources.
[INFO] Using 'UTF-8' encoding to copy filtered properties files.
[INFO] skip non existing resourceDirectory /home/jenkins/workspace/Maven_maven-box_maven_master/test/core-it-suite/target/test-classes/mng-6972-allow-access-to-graph-package/build-plugin/src/main/resources
[INFO] skip non existing resourceDirectory /home/jenkins/workspace/Maven_maven-box_maven_master/test/core-it-suite/target/test-classes/mng-6972-allow-access-to-graph-package/build-plugin/src/main/resources-filtered
[INFO]
[INFO] --- maven-compiler-plugin:3.8.1:compile (default-compile) @ build-plugin ---
[INFO] Changes detected - recompiling the module!
[INFO] Compiling 1 source file to /home/jenkins/workspace/Maven_maven-box_maven_master/test/core-it-suite/target/test-classes/mng-6972-allow-access-to-graph-package/build-plugin/target/classes
[INFO] -------------------------------------------------------------
[ERROR] COMPILATION ERROR :
[INFO] -------------------------------------------------------------
[ERROR] /home/jenkins/workspace/Maven_maven-box_maven_master/test/core-it-suite/target/test-classes/mng-6972-allow-access-to-graph-package/build-plugin/src/main/java/com/example/BuildExtensionUsingGraphPackage.java:[4,17] cannot find symbol
  symbol:   class Objects
  location: package java.util
[INFO] 1 error
[INFO] -------------------------------------------------------------
[INFO] ------------------------------------------------------------------------
[INFO] BUILD FAILURE
[INFO] ------------------------------------------------------------------------
[INFO] Total time:  0.475 s
[INFO] Finished at: 2021-01-04T19:46:33Z
[INFO] ------------------------------------------------------------------------
[ERROR] Failed to execute goal org.apache.maven.plugins:maven-compiler-plugin:3.8.1:compile (default-compile) on project build-plugin: Compilation failure
[ERROR] /home/jenkins/workspace/Maven_maven-box_maven_master/test/core-it-suite/target/test-classes/mng-6972-allow-access-to-graph-package/build-plugin/src/main/java/com/example/BuildExtensionUsingGraphPackage.java:[4,17] cannot find symbol
[ERROR]   symbol:   class Objects
[ERROR]   location: package java.util
[ERROR] -> [Help 1]
org.apache.maven.lifecycle.LifecycleExecutionException: Failed to execute goal org.apache.maven.plugins:maven-compiler-plugin:3.8.1:compile (default-compile) on project build-plugin: Compilation failure
/home/jenkins/workspace/Maven_maven-box_maven_master/test/core-it-suite/target/test-classes/mng-6972-allow-access-to-graph-package/build-plugin/src/main/java/com/example/BuildExtensionUsingGraphPackage.java:[4,17] cannot find symbol
  symbol:   class Objects
  location: package java.util

    at org.apache.maven.lifecycle.internal.MojoExecutor.execute (MojoExecutor.java:218)
    at org.apache.maven.lifecycle.internal.MojoExecutor.execute (MojoExecutor.java:159)
    at org.apache.maven.lifecycle.internal.MojoExecutor.execute (MojoExecutor.java:151)
    at org.apache.maven.lifecycle.internal.LifecycleModuleBuilder.buildProject (LifecycleModuleBuilder.java:115)
    at org.apache.maven.lifecycle.internal.LifecycleModuleBuilder.buildProject (LifecycleModuleBuilder.java:79)
    at org.apache.maven.lifecycle.internal.builder.singlethreaded.SingleThreadedBuilder.build (SingleThreadedBuilder.java:64)
    at org.apache.maven.lifecycle.internal.LifecycleStarter.execute (LifecycleStarter.java:131)
    at org.apache.maven.DefaultMaven.doExecute (DefaultMaven.java:321)
    at org.apache.maven.DefaultMaven.doExecute (DefaultMaven.java:206)
    at org.apache.maven.DefaultMaven.execute (DefaultMaven.java:119)
    at org.apache.maven.cli.MavenCli.execute (MavenCli.java:979)
    at org.apache.maven.cli.MavenCli.doMain (MavenCli.java:293)
    at org.apache.maven.cli.MavenCli.doMain (MavenCli.java:248)
    at jdk.internal.reflect.NativeMethodAccessorImpl.invoke0 (Native Method)
    at jdk.internal.reflect.NativeMethodAccessorImpl.invoke (NativeMethodAccessorImpl.java:62)
    at jdk.internal.reflect.DelegatingMethodAccessorImpl.invoke (DelegatingMethodAccessorImpl.java:43)
    at java.lang.reflect.Method.invoke (Method.java:566)
    at org.apache.maven.it.Embedded3xLauncher.run (Embedded3xLauncher.java:215)
    at org.apache.maven.it.Verifier.executeGoals (Verifier.java:1339)
    at org.apache.maven.it.Verifier.executeGoal (Verifier.java:1239)
    at org.apache.maven.it.Verifier.executeGoal (Verifier.java:1233)
    at org.apache.maven.it.MavenITmng6972AllowAccessToGraphPackageTest.testit (MavenITmng6972AllowAccessToGraphPackageTest.java:60)
    at jdk.internal.reflect.NativeMethodAccessorImpl.invoke0 (Native Method)
    at jdk.internal.reflect.NativeMethodAccessorImpl.invoke (NativeMethodAccessorImpl.java:62)
    at jdk.internal.reflect.DelegatingMethodAccessorImpl.invoke (DelegatingMethodAccessorImpl.java:43)
    at java.lang.reflect.Method.invoke (Method.java:566)
    at junit.framework.TestCase.runTest (TestCase.java:176)
    at org.apache.maven.it.AbstractMavenIntegrationTestCase.runTest (AbstractMavenIntegrationTestCase.java:255)
    at junit.framework.TestCase.runBare (TestCase.java:141)
    at junit.framework.TestResult$1.protect (TestResult.java:122)
    at junit.framework.TestResult.runProtected (TestResult.java:142)
    at junit.framework.TestResult.run (TestResult.java:125)
    at junit.framework.TestCase.run (TestCase.java:129)
    at junit.framework.TestSuite.runTest (TestSuite.java:252)
    at junit.framework.TestSuite.run (TestSuite.java:247)
    at junit.framework.TestSuite.runTest (TestSuite.java:252)
    at junit.framework.TestSuite.run (TestSuite.java:247)
    at org.junit.internal.runners.JUnit38ClassRunner.run (JUnit38ClassRunner.java:86)
    at org.apache.maven.surefire.junit4.JUnit4Provider.execute (JUnit4Provider.java:365)
    at org.apache.maven.surefire.junit4.JUnit4Provider.executeWithRerun (JUnit4Provider.java:273)
    at org.apache.maven.surefire.junit4.JUnit4Provider.executeTestSet (JUnit4Provider.java:238)
    at org.apache.maven.surefire.junit4.JUnit4Provider.invoke (JUnit4Provider.java:159)
    at org.apache.maven.surefire.booter.ForkedBooter.invokeProviderInSameClassLoader (ForkedBooter.java:383)
    at org.apache.maven.surefire.booter.ForkedBooter.runSuitesInProcess (ForkedBooter.java:344)
    at org.apache.maven.surefire.booter.ForkedBooter.execute (ForkedBooter.java:125)
    at org.apache.maven.surefire.booter.ForkedBooter.main (ForkedBooter.java:417)
Caused by: org.apache.maven.plugin.compiler.CompilationFailureException: Compilation failure
/home/jenkins/workspace/Maven_maven-box_maven_master/test/core-it-suite/target/test-classes/mng-6972-allow-access-to-graph-package/build-plugin/src/main/java/com/example/BuildExtensionUsingGraphPackage.java:[4,17] cannot find symbol
  symbol:   class Objects
  location: package java.util

    at org.apache.maven.plugin.compiler.AbstractCompilerMojo.execute (AbstractCompilerMojo.java:1220)
    at org.apache.maven.plugin.compiler.CompilerMojo.execute (CompilerMojo.java:187)
    at org.apache.maven.plugin.DefaultBuildPluginManager.executeMojo (DefaultBuildPluginManager.java:136)
    at org.apache.maven.lifecycle.internal.MojoExecutor.execute (MojoExecutor.java:213)
    at org.apache.maven.lifecycle.internal.MojoExecutor.execute (MojoExecutor.java:159)
    at org.apache.maven.lifecycle.internal.MojoExecutor.execute (MojoExecutor.java:151)
    at org.apache.maven.lifecycle.internal.LifecycleModuleBuilder.buildProject (LifecycleModuleBuilder.java:115)
    at org.apache.maven.lifecycle.internal.LifecycleModuleBuilder.buildProject (LifecycleModuleBuilder.java:79)
    at org.apache.maven.lifecycle.internal.builder.singlethreaded.SingleThreadedBuilder.build (SingleThreadedBuilder.java:64)
    at org.apache.maven.lifecycle.internal.LifecycleStarter.execute (LifecycleStarter.java:131)
    at org.apache.maven.DefaultMaven.doExecute (DefaultMaven.java:321)
    at org.apache.maven.DefaultMaven.doExecute (DefaultMaven.java:206)
    at org.apache.maven.DefaultMaven.execute (DefaultMaven.java:119)
    at org.apache.maven.cli.MavenCli.execute (MavenCli.java:979)
    at org.apache.maven.cli.MavenCli.doMain (MavenCli.java:293)
    at org.apache.maven.cli.MavenCli.doMain (MavenCli.java:248)
    at jdk.internal.reflect.NativeMethodAccessorImpl.invoke0 (Native Method)
    at jdk.internal.reflect.NativeMethodAccessorImpl.invoke (NativeMethodAccessorImpl.java:62)
    at jdk.internal.reflect.DelegatingMethodAccessorImpl.invoke (DelegatingMethodAccessorImpl.java:43)
    at java.lang.reflect.Method.invoke (Method.java:566)
    at org.apache.maven.it.Embedded3xLauncher.run (Embedded3xLauncher.java:215)
    at org.apache.maven.it.Verifier.executeGoals (Verifier.java:1339)
    at org.apache.maven.it.Verifier.executeGoal (Verifier.java:1239)
    at org.apache.maven.it.Verifier.executeGoal (Verifier.java:1233)
    at org.apache.maven.it.MavenITmng6972AllowAccessToGraphPackageTest.testit (MavenITmng6972AllowAccessToGraphPackageTest.java:60)
    at jdk.internal.reflect.NativeMethodAccessorImpl.invoke0 (Native Method)
    at jdk.internal.reflect.NativeMethodAccessorImpl.invoke (NativeMethodAccessorImpl.java:62)
    at jdk.internal.reflect.DelegatingMethodAccessorImpl.invoke (DelegatingMethodAccessorImpl.java:43)
    at java.lang.reflect.Method.invoke (Method.java:566)
    at junit.framework.TestCase.runTest (TestCase.java:176)
    at org.apache.maven.it.AbstractMavenIntegrationTestCase.runTest (AbstractMavenIntegrationTestCase.java:255)
    at junit.framework.TestCase.runBare (TestCase.java:141)
    at junit.framework.TestResult$1.protect (TestResult.java:122)
    at junit.framework.TestResult.runProtected (TestResult.java:142)
    at junit.framework.TestResult.run (TestResult.java:125)
    at junit.framework.TestCase.run (TestCase.java:129)
    at junit.framework.TestSuite.runTest (TestSuite.java:252)
    at junit.framework.TestSuite.run (TestSuite.java:247)
    at junit.framework.TestSuite.runTest (TestSuite.java:252)
    at junit.framework.TestSuite.run (TestSuite.java:247)
    at org.junit.internal.runners.JUnit38ClassRunner.run (JUnit38ClassRunner.java:86)
    at org.apache.maven.surefire.junit4.JUnit4Provider.execute (JUnit4Provider.java:365)
    at org.apache.maven.surefire.junit4.JUnit4Provider.executeWithRerun (JUnit4Provider.java:273)
    at org.apache.maven.surefire.junit4.JUnit4Provider.executeTestSet (JUnit4Provider.java:238)
    at org.apache.maven.surefire.junit4.JUnit4Provider.invoke (JUnit4Provider.java:159)
    at org.apache.maven.surefire.booter.ForkedBooter.invokeProviderInSameClassLoader (ForkedBooter.java:383)
    at org.apache.maven.surefire.booter.ForkedBooter.runSuitesInProcess (ForkedBooter.java:344)
    at org.apache.maven.surefire.booter.ForkedBooter.execute (ForkedBooter.java:125)
    at org.apache.maven.surefire.booter.ForkedBooter.main (ForkedBooter.java:417)
[ERROR]
[ERROR] Re-run Maven using the -X switch to enable full debug logging.
[ERROR]
[ERROR] For more information about the errors and possible solutions, please read the following articles:
[ERROR] [Help 1] http://cwiki.apache.org/confluence/display/MAVEN/MojoFailureException

        at org.apache.maven.it.MavenITmng6972AllowAccessToGraphPackageTest.testit(MavenITmng6972AllowAccessToGraphPackageTest.java:60)


FAILED:  org.apache.maven.it.MavenITmng6972AllowAccessToGraphPackageTest.windows-jdk11 / Run ITs Windows Java 11 / testit

Error Message:
Exit code was non-zero: 1; command line and log =
C:\mvn-it-0.tmp\core-it-suite\target\apache-maven\bin\mvn --global-settings C:\mvn-it-0.tmp\core-it-suite\target\test-classes\settings.xml -e --batch-mode -Dmaven.repo.local=c:\mvn-it-0.tmp\it-local-repo install
[INFO] [jenkins-event-spy] Jenkins Maven Event Spy is disabled
[INFO] Error stacktraces are turned on.
[INFO] Scanning for projects...
[INFO] Maven detected that the requested POM file is part of a multi module project, but could not find a pom.xml file in the multi module root directory: 'C:\mvn-it-0.tmp\core-it-suite\target\test-classes\mng-6972-allow-access-to-graph-package'.
[INFO] The reactor is limited to all projects under: C:\mvn-it-0.tmp\core-it-suite\target\test-classes\mng-6972-allow-access-to-graph-package\build-plugin
[INFO]
[INFO] --------< mng-6972-allow-access-to-graph-package:build-plugin >---------
[INFO] Building build-plugin 1.0
[INFO] --------------------------------[ jar ]---------------------------------
[WARNING] Version not locked for default bindings plugins [maven-resources-plugin, maven-compiler-plugin, maven-surefire-plugin, maven-jar-plugin, maven-install-plugin], you should define versions in pluginManagement section of your pom.xml or parent
[INFO]
[INFO] --- maven-resources-plugin:3.2.0:resources (default-resources) @ build-plugin ---
[INFO] Using 'UTF-8' encoding to copy filtered resources.
[INFO] Using 'UTF-8' encoding to copy filtered properties files.
[INFO] skip non existing resourceDirectory C:\mvn-it-0.tmp\core-it-suite\target\test-classes\mng-6972-allow-access-to-graph-package\build-plugin\src\main\resources
[INFO] skip non existing resourceDirectory C:\mvn-it-0.tmp\core-it-suite\target\test-classes\mng-6972-allow-access-to-graph-package\build-plugin\src\main\resources-filtered
[INFO]
[INFO] --- maven-compiler-plugin:3.8.1:compile (default-compile) @ build-plugin ---
[INFO] Changes detected - recompiling the module!
[INFO] Compiling 1 source file to C:\mvn-it-0.tmp\core-it-suite\target\test-classes\mng-6972-allow-access-to-graph-package\build-plugin\target\classes
[INFO] -------------------------------------------------------------
[ERROR] COMPILATION ERROR :
[INFO] -------------------------------------------------------------
[ERROR] /C:/mvn-it-0.tmp/core-it-suite/target/test-classes/mng-6972-allow-access-to-graph-package/build-plugin/src/main/java/com/example/BuildExtensionUsingGraphPackage.java:[4,17] cannot find symbol
  symbol:   class Objects
  location: package java.util
[INFO] 1 error
[INFO] -------------------------------------------------------------
[INFO] ------------------------------------------------------------------------
[INFO] BUILD FAILURE
[INFO] ------------------------------------------------------------------------
[INFO] Total time:  0.972 s
[INFO] Finished at: 2021-01-04T11:50:14-08:00
[INFO] ------------------------------------------------------------------------
[ERROR] Failed to execute goal org.apache.maven.plugins:maven-compiler-plugin:3.8.1:compile (default-compile) on project build-plugin: Compilation failure
[ERROR] /C:/mvn-it-0.tmp/core-it-suite/target/test-classes/mng-6972-allow-access-to-graph-package/build-plugin/src/main/java/com/example/BuildExtensionUsingGraphPackage.java:[4,17] cannot find symbol
[ERROR]   symbol:   class Objects
[ERROR]   location: package java.util
[ERROR] -> [Help 1]
org.apache.maven.lifecycle.LifecycleExecutionException: Failed to execute goal org.apache.maven.plugins:maven-compiler-plugin:3.8.1:compile (default-compile) on project build-plugin: Compilation failure
/C:/mvn-it-0.tmp/core-it-suite/target/test-classes/mng-6972-allow-access-to-graph-package/build-plugin/src/main/java/com/example/BuildExtensionUsingGraphPackage.java:[4,17] cannot find symbol
  symbol:   class Objects
  location: package java.util

    at org.apache.maven.lifecycle.internal.MojoExecutor.execute (MojoExecutor.java:218)
    at org.apache.maven.lifecycle.internal.MojoExecutor.execute (MojoExecutor.java:159)
    at org.apache.maven.lifecycle.internal.MojoExecutor.execute (MojoExecutor.java:151)
    at org.apache.maven.lifecycle.internal.LifecycleModuleBuilder.buildProject (LifecycleModuleBuilder.java:115)
    at org.apache.maven.lifecycle.internal.LifecycleModuleBuilder.buildProject (LifecycleModuleBuilder.java:79)
    at org.apache.maven.lifecycle.internal.builder.singlethreaded.SingleThreadedBuilder.build (SingleThreadedBuilder.java:64)
    at org.apache.maven.lifecycle.internal.LifecycleStarter.execute (LifecycleStarter.java:131)
    at org.apache.maven.DefaultMaven.doExecute (DefaultMaven.java:321)
    at org.apache.maven.DefaultMaven.doExecute (DefaultMaven.java:206)
    at org.apache.maven.DefaultMaven.execute (DefaultMaven.java:119)
    at org.apache.maven.cli.MavenCli.execute (MavenCli.java:979)
    at org.apache.maven.cli.MavenCli.doMain (MavenCli.java:293)
    at org.apache.maven.cli.MavenCli.doMain (MavenCli.java:248)
    at jdk.internal.reflect.NativeMethodAccessorImpl.invoke0 (Native Method)
    at jdk.internal.reflect.NativeMethodAccessorImpl.invoke (NativeMethodAccessorImpl.java:62)
    at jdk.internal.reflect.DelegatingMethodAccessorImpl.invoke (DelegatingMethodAccessorImpl.java:43)
    at java.lang.reflect.Method.invoke (Method.java:566)
    at org.apache.maven.it.Embedded3xLauncher.run (Embedded3xLauncher.java:215)
    at org.apache.maven.it.Verifier.executeGoals (Verifier.java:1339)
    at org.apache.maven.it.Verifier.executeGoal (Verifier.java:1239)
    at org.apache.maven.it.Verifier.executeGoal (Verifier.java:1233)
    at org.apache.maven.it.MavenITmng6972AllowAccessToGraphPackageTest.testit (MavenITmng6972AllowAccessToGraphPackageTest.java:60)
    at jdk.internal.reflect.NativeMethodAccessorImpl.invoke0 (Native Method)
    at jdk.internal.reflect.NativeMethodAccessorImpl.invoke (NativeMethodAccessorImpl.java:62)
    at jdk.internal.reflect.DelegatingMethodAccessorImpl.invoke (DelegatingMethodAccessorImpl.java:43)
    at java.lang.reflect.Method.invoke (Method.java:566)
    at junit.framework.TestCase.runTest (TestCase.java:176)
    at org.apache.maven.it.AbstractMavenIntegrationTestCase.runTest (AbstractMavenIntegrationTestCase.java:255)
    at junit.framework.TestCase.runBare (TestCase.java:141)
    at junit.framework.TestResult$1.protect (TestResult.java:122)
    at junit.framework.TestResult.runProtected (TestResult.java:142)
    at junit.framework.TestResult.run (TestResult.java:125)
    at junit.framework.TestCase.run (TestCase.java:129)
    at junit.framework.TestSuite.runTest (TestSuite.java:252)
    at junit.framework.TestSuite.run (TestSuite.java:247)
    at junit.framework.TestSuite.runTest (TestSuite.java:252)
    at junit.framework.TestSuite.run (TestSuite.java:247)
    at org.junit.internal.runners.JUnit38ClassRunner.run (JUnit38ClassRunner.java:86)
    at org.apache.maven.surefire.junit4.JUnit4Provider.execute (JUnit4Provider.java:365)
    at org.apache.maven.surefire.junit4.JUnit4Provider.executeWithRerun (JUnit4Provider.java:273)
    at org.apache.maven.surefire.junit4.JUnit4Provider.executeTestSet (JUnit4Provider.java:238)
    at org.apache.maven.surefire.junit4.JUnit4Provider.invoke (JUnit4Provider.java:159)
    at org.apache.maven.surefire.booter.ForkedBooter.invokeProviderInSameClassLoader (ForkedBooter.java:383)
    at org.apache.maven.surefire.booter.ForkedBooter.runSuitesInProcess (ForkedBooter.java:344)
    at org.apache.maven.surefire.booter.ForkedBooter.execute (ForkedBooter.java:125)
    at org.apache.maven.surefire.booter.ForkedBooter.main (ForkedBooter.java:417)
Caused by: org.apache.maven.plugin.compiler.CompilationFailureException: Compilation failure
/C:/mvn-it-0.tmp/core-it-suite/target/test-classes/mng-6972-allow-access-to-graph-package/build-plugin/src/main/java/com/example/BuildExtensionUsingGraphPackage.java:[4,17] cannot find symbol
  symbol:   class Objects
  location: package java.util

    at org.apache.maven.plugin.compiler.AbstractCompilerMojo.execute (AbstractCompilerMojo.java:1220)
    at org.apache.maven.plugin.compiler.CompilerMojo.execute (CompilerMojo.java:187)
    at org.apache.maven.plugin.DefaultBuildPluginManager.executeMojo (DefaultBuildPluginManager.java:136)
    at org.apache.maven.lifecycle.internal.MojoExecutor.execute (MojoExecutor.java:213)
    at org.apache.maven.lifecycle.internal.MojoExecutor.execute (MojoExecutor.java:159)
    at org.apache.maven.lifecycle.internal.MojoExecutor.execute (MojoExecutor.java:151)
    at org.apache.maven.lifecycle.internal.LifecycleModuleBuilder.buildProject (LifecycleModuleBuilder.java:115)
    at org.apache.maven.lifecycle.internal.LifecycleModuleBuilder.buildProject (LifecycleModuleBuilder.java:79)
    at org.apache.maven.lifecycle.internal.builder.singlethreaded.SingleThreadedBuilder.build (SingleThreadedBuilder.java:64)
    at org.apache.maven.lifecycle.internal.LifecycleStarter.execute (LifecycleStarter.java:131)
    at org.apache.maven.DefaultMaven.doExecute (DefaultMaven.java:321)
    at org.apache.maven.DefaultMaven.doExecute (DefaultMaven.java:206)
    at org.apache.maven.DefaultMaven.execute (DefaultMaven.java:119)
    at org.apache.maven.cli.MavenCli.execute (MavenCli.java:979)
    at org.apache.maven.cli.MavenCli.doMain (MavenCli.java:293)
    at org.apache.maven.cli.MavenCli.doMain (MavenCli.java:248)
    at jdk.internal.reflect.NativeMethodAccessorImpl.invoke0 (Native Method)
    at jdk.internal.reflect.NativeMethodAccessorImpl.invoke (NativeMethodAccessorImpl.java:62)
    at jdk.internal.reflect.DelegatingMethodAccessorImpl.invoke (DelegatingMethodAccessorImpl.java:43)
    at java.lang.reflect.Method.invoke (Method.java:566)
    at org.apache.maven.it.Embedded3xLauncher.run (Embedded3xLauncher.java:215)
    at org.apache.maven.it.Verifier.executeGoals (Verifier.java:1339)
    at org.apache.maven.it.Verifier.executeGoal (Verifier.java:1239)
    at org.apache.maven.it.Verifier.executeGoal (Verifier.java:1233)
    at org.apache.maven.it.MavenITmng6972AllowAccessToGraphPackageTest.testit (MavenITmng6972AllowAccessToGraphPackageTest.java:60)
    at jdk.internal.reflect.NativeMethodAccessorImpl.invoke0 (Native Method)
    at jdk.internal.reflect.NativeMethodAccessorImpl.invoke (NativeMethodAccessorImpl.java:62)
    at jdk.internal.reflect.DelegatingMethodAccessorImpl.invoke (DelegatingMethodAccessorImpl.java:43)
    at java.lang.reflect.Method.invoke (Method.java:566)
    at junit.framework.TestCase.runTest (TestCase.java:176)
    at org.apache.maven.it.AbstractMavenIntegrationTestCase.runTest (AbstractMavenIntegrationTestCase.java:255)
    at junit.framework.TestCase.runBare (TestCase.java:141)
    at junit.framework.TestResult$1.protect (TestResult.java:122)
    at junit.framework.TestResult.runProtected (TestResult.java:142)
    at junit.framework.TestResult.run (TestResult.java:125)
    at junit.framework.TestCase.run (TestCase.java:129)
    at junit.framework.TestSuite.runTest (TestSuite.java:252)
    at junit.framework.TestSuite.run (TestSuite.java:247)
    at junit.framework.TestSuite.runTest (TestSuite.java:252)
    at junit.framework.TestSuite.run (TestSuite.java:247)
    at org.junit.internal.runners.JUnit38ClassRunner.run (JUnit38ClassRunner.java:86)
    at org.apache.maven.surefire.junit4.JUnit4Provider.execute (JUnit4Provider.java:365)
    at org.apache.maven.surefire.junit4.JUnit4Provider.executeWithRerun (JUnit4Provider.java:273)
    at org.apache.maven.surefire.junit4.JUnit4Provider.executeTestSet (JUnit4Provider.java:238)
    at org.apache.maven.surefire.junit4.JUnit4Provider.invoke (JUnit4Provider.java:159)
    at org.apache.maven.surefire.booter.ForkedBooter.invokeProviderInSameClassLoader (ForkedBooter.java:383)
    at org.apache.maven.surefire.booter.ForkedBooter.runSuitesInProcess (ForkedBooter.java:344)
    at org.apache.maven.surefire.booter.ForkedBooter.execute (ForkedBooter.java:125)
    at org.apache.maven.surefire.booter.ForkedBooter.main (ForkedBooter.java:417)
[ERROR]
[ERROR] Re-run Maven using the -X switch to enable full debug logging.
[ERROR]
[ERROR] For more information about the errors and possible solutions, please read the following articles:
[ERROR] [Help 1] http://cwiki.apache.org/confluence/display/MAVEN/MojoFailureException


Stack Trace:
org.apache.maven.it.VerificationException:
Exit code was non-zero: 1; command line and log =
C:\mvn-it-0.tmp\core-it-suite\target\apache-maven\bin\mvn --global-settings C:\mvn-it-0.tmp\core-it-suite\target\test-classes\settings.xml -e --batch-mode -Dmaven.repo.local=c:\mvn-it-0.tmp\it-local-repo install
[INFO] [jenkins-event-spy] Jenkins Maven Event Spy is disabled
[INFO] Error stacktraces are turned on.
[INFO] Scanning for projects...
[INFO] Maven detected that the requested POM file is part of a multi module project, but could not find a pom.xml file in the multi module root directory: 'C:\mvn-it-0.tmp\core-it-suite\target\test-classes\mng-6972-allow-access-to-graph-package'.
[INFO] The reactor is limited to all projects under: C:\mvn-it-0.tmp\core-it-suite\target\test-classes\mng-6972-allow-access-to-graph-package\build-plugin
[INFO]
[INFO] --------< mng-6972-allow-access-to-graph-package:build-plugin >---------
[INFO] Building build-plugin 1.0
[INFO] --------------------------------[ jar ]---------------------------------
[WARNING] Version not locked for default bindings plugins [maven-resources-plugin, maven-compiler-plugin, maven-surefire-plugin, maven-jar-plugin, maven-install-plugin], you should define versions in pluginManagement section of your pom.xml or parent
[INFO]
[INFO] --- maven-resources-plugin:3.2.0:resources (default-resources) @ build-plugin ---
[INFO] Using 'UTF-8' encoding to copy filtered resources.
[INFO] Using 'UTF-8' encoding to copy filtered properties files.
[INFO] skip non existing resourceDirectory C:\mvn-it-0.tmp\core-it-suite\target\test-classes\mng-6972-allow-access-to-graph-package\build-plugin\src\main\resources
[INFO] skip non existing resourceDirectory C:\mvn-it-0.tmp\core-it-suite\target\test-classes\mng-6972-allow-access-to-graph-package\build-plugin\src\main\resources-filtered
[INFO]
[INFO] --- maven-compiler-plugin:3.8.1:compile (default-compile) @ build-plugin ---
[INFO] Changes detected - recompiling the module!
[INFO] Compiling 1 source file to C:\mvn-it-0.tmp\core-it-suite\target\test-classes\mng-6972-allow-access-to-graph-package\build-plugin\target\classes
[INFO] -------------------------------------------------------------
[ERROR] COMPILATION ERROR :
[INFO] -------------------------------------------------------------
[ERROR] /C:/mvn-it-0.tmp/core-it-suite/target/test-classes/mng-6972-allow-access-to-graph-package/build-plugin/src/main/java/com/example/BuildExtensionUsingGraphPackage.java:[4,17] cannot find symbol
  symbol:   class Objects
  location: package java.util
[INFO] 1 error
[INFO] -------------------------------------------------------------
[INFO] ------------------------------------------------------------------------
[INFO] BUILD FAILURE
[INFO] ------------------------------------------------------------------------
[INFO] Total time:  0.972 s
[INFO] Finished at: 2021-01-04T11:50:14-08:00
[INFO] ------------------------------------------------------------------------
[ERROR] Failed to execute goal org.apache.maven.plugins:maven-compiler-plugin:3.8.1:compile (default-compile) on project build-plugin: Compilation failure
[ERROR] /C:/mvn-it-0.tmp/core-it-suite/target/test-classes/mng-6972-allow-access-to-graph-package/build-plugin/src/main/java/com/example/BuildExtensionUsingGraphPackage.java:[4,17] cannot find symbol
[ERROR]   symbol:   class Objects
[ERROR]   location: package java.util
[ERROR] -> [Help 1]
org.apache.maven.lifecycle.LifecycleExecutionException: Failed to execute goal org.apache.maven.plugins:maven-compiler-plugin:3.8.1:compile (default-compile) on project build-plugin: Compilation failure
/C:/mvn-it-0.tmp/core-it-suite/target/test-classes/mng-6972-allow-access-to-graph-package/build-plugin/src/main/java/com/example/BuildExtensionUsingGraphPackage.java:[4,17] cannot find symbol
  symbol:   class Objects
  location: package java.util

    at org.apache.maven.lifecycle.internal.MojoExecutor.execute (MojoExecutor.java:218)
    at org.apache.maven.lifecycle.internal.MojoExecutor.execute (MojoExecutor.java:159)
    at org.apache.maven.lifecycle.internal.MojoExecutor.execute (MojoExecutor.java:151)
    at org.apache.maven.lifecycle.internal.LifecycleModuleBuilder.buildProject (LifecycleModuleBuilder.java:115)
    at org.apache.maven.lifecycle.internal.LifecycleModuleBuilder.buildProject (LifecycleModuleBuilder.java:79)
    at org.apache.maven.lifecycle.internal.builder.singlethreaded.SingleThreadedBuilder.build (SingleThreadedBuilder.java:64)
    at org.apache.maven.lifecycle.internal.LifecycleStarter.execute (LifecycleStarter.java:131)
    at org.apache.maven.DefaultMaven.doExecute (DefaultMaven.java:321)
    at org.apache.maven.DefaultMaven.doExecute (DefaultMaven.java:206)
    at org.apache.maven.DefaultMaven.execute (DefaultMaven.java:119)
    at org.apache.maven.cli.MavenCli.execute (MavenCli.java:979)
    at org.apache.maven.cli.MavenCli.doMain (MavenCli.java:293)
    at org.apache.maven.cli.MavenCli.doMain (MavenCli.java:248)
    at jdk.internal.reflect.NativeMethodAccessorImpl.invoke0 (Native Method)
    at jdk.internal.reflect.NativeMethodAccessorImpl.invoke (NativeMethodAccessorImpl.java:62)
    at jdk.internal.reflect.DelegatingMethodAccessorImpl.invoke (DelegatingMethodAccessorImpl.java:43)
    at java.lang.reflect.Method.invoke (Method.java:566)
    at org.apache.maven.it.Embedded3xLauncher.run (Embedded3xLauncher.java:215)
    at org.apache.maven.it.Verifier.executeGoals (Verifier.java:1339)
    at org.apache.maven.it.Verifier.executeGoal (Verifier.java:1239)
    at org.apache.maven.it.Verifier.executeGoal (Verifier.java:1233)
    at org.apache.maven.it.MavenITmng6972AllowAccessToGraphPackageTest.testit (MavenITmng6972AllowAccessToGraphPackageTest.java:60)
    at jdk.internal.reflect.NativeMethodAccessorImpl.invoke0 (Native Method)
    at jdk.internal.reflect.NativeMethodAccessorImpl.invoke (NativeMethodAccessorImpl.java:62)
    at jdk.internal.reflect.DelegatingMethodAccessorImpl.invoke (DelegatingMethodAccessorImpl.java:43)
    at java.lang.reflect.Method.invoke (Method.java:566)
    at junit.framework.TestCase.runTest (TestCase.java:176)
    at org.apache.maven.it.AbstractMavenIntegrationTestCase.runTest (AbstractMavenIntegrationTestCase.java:255)
    at junit.framework.TestCase.runBare (TestCase.java:141)
    at junit.framework.TestResult$1.protect (TestResult.java:122)
    at junit.framework.TestResult.runProtected (TestResult.java:142)
    at junit.framework.TestResult.run (TestResult.java:125)
    at junit.framework.TestCase.run (TestCase.java:129)
    at junit.framework.TestSuite.runTest (TestSuite.java:252)
    at junit.framework.TestSuite.run (TestSuite.java:247)
    at junit.framework.TestSuite.runTest (TestSuite.java:252)
    at junit.framework.TestSuite.run (TestSuite.java:247)
    at org.junit.internal.runners.JUnit38ClassRunner.run (JUnit38ClassRunner.java:86)
    at org.apache.maven.surefire.junit4.JUnit4Provider.execute (JUnit4Provider.java:365)
    at org.apache.maven.surefire.junit4.JUnit4Provider.executeWithRerun (JUnit4Provider.java:273)
    at org.apache.maven.surefire.junit4.JUnit4Provider.executeTestSet (JUnit4Provider.java:238)
    at org.apache.maven.surefire.junit4.JUnit4Provider.invoke (JUnit4Provider.java:159)
    at org.apache.maven.surefire.booter.ForkedBooter.invokeProviderInSameClassLoader (ForkedBooter.java:383)
    at org.apache.maven.surefire.booter.ForkedBooter.runSuitesInProcess (ForkedBooter.java:344)
    at org.apache.maven.surefire.booter.ForkedBooter.execute (ForkedBooter.java:125)
    at org.apache.maven.surefire.booter.ForkedBooter.main (ForkedBooter.java:417)
Caused by: org.apache.maven.plugin.compiler.CompilationFailureException: Compilation failure
/C:/mvn-it-0.tmp/core-it-suite/target/test-classes/mng-6972-allow-access-to-graph-package/build-plugin/src/main/java/com/example/BuildExtensionUsingGraphPackage.java:[4,17] cannot find symbol
  symbol:   class Objects
  location: package java.util

    at org.apache.maven.plugin.compiler.AbstractCompilerMojo.execute (AbstractCompilerMojo.java:1220)
    at org.apache.maven.plugin.compiler.CompilerMojo.execute (CompilerMojo.java:187)
    at org.apache.maven.plugin.DefaultBuildPluginManager.executeMojo (DefaultBuildPluginManager.java:136)
    at org.apache.maven.lifecycle.internal.MojoExecutor.execute (MojoExecutor.java:213)
    at org.apache.maven.lifecycle.internal.MojoExecutor.execute (MojoExecutor.java:159)
    at org.apache.maven.lifecycle.internal.MojoExecutor.execute (MojoExecutor.java:151)
    at org.apache.maven.lifecycle.internal.LifecycleModuleBuilder.buildProject (LifecycleModuleBuilder.java:115)
    at org.apache.maven.lifecycle.internal.LifecycleModuleBuilder.buildProject (LifecycleModuleBuilder.java:79)
    at org.apache.maven.lifecycle.internal.builder.singlethreaded.SingleThreadedBuilder.build (SingleThreadedBuilder.java:64)
    at org.apache.maven.lifecycle.internal.LifecycleStarter.execute (LifecycleStarter.java:131)
    at org.apache.maven.DefaultMaven.doExecute (DefaultMaven.java:321)
    at org.apache.maven.DefaultMaven.doExecute (DefaultMaven.java:206)
    at org.apache.maven.DefaultMaven.execute (DefaultMaven.java:119)
    at org.apache.maven.cli.MavenCli.execute (MavenCli.java:979)
    at org.apache.maven.cli.MavenCli.doMain (MavenCli.java:293)
    at org.apache.maven.cli.MavenCli.doMain (MavenCli.java:248)
    at jdk.internal.reflect.NativeMethodAccessorImpl.invoke0 (Native Method)
    at jdk.internal.reflect.NativeMethodAccessorImpl.invoke (NativeMethodAccessorImpl.java:62)
    at jdk.internal.reflect.DelegatingMethodAccessorImpl.invoke (DelegatingMethodAccessorImpl.java:43)
    at java.lang.reflect.Method.invoke (Method.java:566)
    at org.apache.maven.it.Embedded3xLauncher.run (Embedded3xLauncher.java:215)
    at org.apache.maven.it.Verifier.executeGoals (Verifier.java:1339)
    at org.apache.maven.it.Verifier.executeGoal (Verifier.java:1239)
    at org.apache.maven.it.Verifier.executeGoal (Verifier.java:1233)
    at org.apache.maven.it.MavenITmng6972AllowAccessToGraphPackageTest.testit (MavenITmng6972AllowAccessToGraphPackageTest.java:60)
    at jdk.internal.reflect.NativeMethodAccessorImpl.invoke0 (Native Method)
    at jdk.internal.reflect.NativeMethodAccessorImpl.invoke (NativeMethodAccessorImpl.java:62)
    at jdk.internal.reflect.DelegatingMethodAccessorImpl.invoke (DelegatingMethodAccessorImpl.java:43)
    at java.lang.reflect.Method.invoke (Method.java:566)
    at junit.framework.TestCase.runTest (TestCase.java:176)
    at org.apache.maven.it.AbstractMavenIntegrationTestCase.runTest (AbstractMavenIntegrationTestCase.java:255)
    at junit.framework.TestCase.runBare (TestCase.java:141)
    at junit.framework.TestResult$1.protect (TestResult.java:122)
    at junit.framework.TestResult.runProtected (TestResult.java:142)
    at junit.framework.TestResult.run (TestResult.java:125)
    at junit.framework.TestCase.run (TestCase.java:129)
    at junit.framework.TestSuite.runTest (TestSuite.java:252)
    at junit.framework.TestSuite.run (TestSuite.java:247)
    at junit.framework.TestSuite.runTest (TestSuite.java:252)
    at junit.framework.TestSuite.run (TestSuite.java:247)
    at org.junit.internal.runners.JUnit38ClassRunner.run (JUnit38ClassRunner.java:86)
    at org.apache.maven.surefire.junit4.JUnit4Provider.execute (JUnit4Provider.java:365)
    at org.apache.maven.surefire.junit4.JUnit4Provider.executeWithRerun (JUnit4Provider.java:273)
    at org.apache.maven.surefire.junit4.JUnit4Provider.executeTestSet (JUnit4Provider.java:238)
    at org.apache.maven.surefire.junit4.JUnit4Provider.invoke (JUnit4Provider.java:159)
    at org.apache.maven.surefire.booter.ForkedBooter.invokeProviderInSameClassLoader (ForkedBooter.java:383)
    at org.apache.maven.surefire.booter.ForkedBooter.runSuitesInProcess (ForkedBooter.java:344)
    at org.apache.maven.surefire.booter.ForkedBooter.execute (ForkedBooter.java:125)
    at org.apache.maven.surefire.booter.ForkedBooter.main (ForkedBooter.java:417)
[ERROR]
[ERROR] Re-run Maven using the -X switch to enable full debug logging.
[ERROR]
[ERROR] For more information about the errors and possible solutions, please read the following articles:
[ERROR] [Help 1] http://cwiki.apache.org/confluence/display/MAVEN/MojoFailureException

        at org.apache.maven.it.MavenITmng6972AllowAccessToGraphPackageTest.testit(MavenITmng6972AllowAccessToGraphPackageTest.java:60)




Build log:
[...truncated 43356 lines...]
[withMaven] junitPublisher - Archive test results for Maven artifact org.apache.maven.its.plugins:mng-5805-pkg-type-mojo-configuration-extension2:jar:2.1-SNAPSHOT generated by maven-surefire-plugin:test (default-test): core-it-support/core-it-plugins/mng5805-extension2/target/surefire-reports/*.xml
[withMaven] junitPublisher - Archive test results for Maven artifact org.apache.maven.its.plugins:mng-5805-pkg-type-mojo-configuration-plugin:maven-plugin:2.1-SNAPSHOT generated by maven-surefire-plugin:test (default-test): core-it-support/core-it-plugins/mng5805-plugin/target/surefire-reports/*.xml
[withMaven] junitPublisher - Archive test results for Maven artifact org.apache.maven.its.plugins:mng-5805-pkg-type-mojo-configuration-plugin-dep:jar:2.1-SNAPSHOT generated by maven-surefire-plugin:test (default-test): core-it-support/core-it-plugins/mng5805-plugin-dep/target/surefire-reports/*.xml
[withMaven] junitPublisher - Archive test results for Maven artifact org.apache.maven.its.plugins:mng-5958-pkg-type-extension:jar:2.1-SNAPSHOT generated by maven-surefire-plugin:test (default-test): core-it-support/core-it-plugins/mng5958-extension/target/surefire-reports/*.xml
[withMaven] junitPublisher - Archive test results for Maven artifact org.apache.maven.its.plugins:mng-6759-resolves-project-dependencies-plugin:maven-plugin:2.1-SNAPSHOT generated by maven-surefire-plugin:test (default-test): core-it-support/core-it-plugins/mng6759-plugin-resolves-project-dependencies/target/surefire-reports/*.xml
[withMaven] junitPublisher - Archive test results for Maven artifact org.apache.maven.its:core-it-toolchain:jar:2.1-SNAPSHOT generated by maven-surefire-plugin:test (default-test): core-it-support/core-it-toolchain/target/surefire-reports/*.xml
[withMaven] junitPublisher - Archive test results for Maven artifact org.apache.maven.its:core-it-wagon:jar:2.1-SNAPSHOT generated by maven-surefire-plugin:test (default-test): core-it-support/core-it-wagon/target/surefire-reports/*.xml
[withMaven] junitPublisher - Archive test results for Maven artifact org.apache.maven.its:core-it-extension:jar:2.1-SNAPSHOT generated by maven-surefire-plugin:test (default-test): core-it-support/core-it-extension/target/surefire-reports/*.xml
[withMaven] junitPublisher - Archive test results for Maven artifact mng-coreit:javaagent:jar:1.0-SNAPSHOT generated by maven-surefire-plugin:test (default-test): core-it-support/core-it-javaagent/target/surefire-reports/*.xml
[withMaven] junitPublisher - Archive test results for Maven artifact org.apache.maven.its:core-it-suite:jar:2.1-SNAPSHOT generated by maven-surefire-plugin:test (default-test): core-it-suite/target/surefire-reports/*.xml
Recording test results
[withMaven] openTasksPublisher - Scan Tasks for Maven artifact org.apache.maven.its.plugins:maven-it-plugin-active-collection:maven-plugin:2.1-SNAPSHOT in source directory core-it-support\core-it-plugins\maven-it-plugin-active-collection\src\main\java
[withMaven] openTasksPublisher - Scan Tasks for Maven artifact org.apache.maven.its.plugins:maven-it-plugin-artifact:maven-plugin:2.1-SNAPSHOT in source directory core-it-support\core-it-plugins\maven-it-plugin-artifact\src\main\java
[withMaven] openTasksPublisher - Scan Tasks for Maven artifact org.apache.maven.its.plugins.class-loader:dep-a:jar:2.1-SNAPSHOT in source directory core-it-support\core-it-plugins\maven-it-plugin-class-loader\dep-a\src\main\java
[withMaven] openTasksPublisher - Scan Tasks for Maven artifact org.apache.maven.its.plugins.class-loader:dep-b:jar:2.1-SNAPSHOT in source directory core-it-support\core-it-plugins\maven-it-plugin-class-loader\dep-b\src\main\java
[withMaven] openTasksPublisher - Scan Tasks for Maven artifact org.apache.maven.its.plugins:maven-it-plugin-class-loader:maven-plugin:2.1-SNAPSHOT in source directory core-it-support\core-it-plugins\maven-it-plugin-class-loader\maven-it-plugin-class-loader\src\main\java
[withMaven] openTasksPublisher - Scan Tasks for Maven artifact org.apache.maven.its.plugins:maven-it-plugin-configuration:maven-plugin:2.1-SNAPSHOT in source directory core-it-support\core-it-plugins\maven-it-plugin-configuration\src\main\java
[withMaven] openTasksPublisher - Scan Tasks for Maven artifact org.apache.maven.its.plugins:maven-it-plugin-context-passing:maven-plugin:2.1-SNAPSHOT in source directory core-it-support\core-it-plugins\maven-it-plugin-context-passing\src\main\java
[withMaven] openTasksPublisher - Scan Tasks for Maven artifact org.apache.maven.plugins:maven-clean-plugin:maven-plugin:0.1-stub-SNAPSHOT in source directory core-it-support\core-it-plugins\maven-it-plugin-core-stubs\maven-clean-plugin\src\main\java
[withMaven] openTasksPublisher - Scan Tasks for Maven artifact org.apache.maven.plugins:maven-compiler-plugin:maven-plugin:0.1-stub-SNAPSHOT in source directory core-it-support\core-it-plugins\maven-it-plugin-core-stubs\maven-compiler-plugin\src\main\java
[withMaven] openTasksPublisher - Scan Tasks for Maven artifact org.apache.maven.plugins:maven-deploy-plugin:maven-plugin:0.1-stub-SNAPSHOT in source directory core-it-support\core-it-plugins\maven-it-plugin-core-stubs\maven-deploy-plugin\src\main\java
[withMaven] openTasksPublisher - Scan Tasks for Maven artifact org.apache.maven.plugins:maven-ear-plugin:maven-plugin:0.1-stub-SNAPSHOT in source directory core-it-support\core-it-plugins\maven-it-plugin-core-stubs\maven-ear-plugin\src\main\java
[withMaven] openTasksPublisher - Scan Tasks for Maven artifact org.apache.maven.plugins:maven-ejb-plugin:maven-plugin:0.1-stub-SNAPSHOT in source directory core-it-support\core-it-plugins\maven-it-plugin-core-stubs\maven-ejb-plugin\src\main\java
[withMaven] openTasksPublisher - Scan Tasks for Maven artifact org.apache.maven.plugins:maven-install-plugin:maven-plugin:0.1-stub-SNAPSHOT in source directory core-it-support\core-it-plugins\maven-it-plugin-core-stubs\maven-install-plugin\src\main\java
[withMaven] openTasksPublisher - Scan Tasks for Maven artifact org.apache.maven.plugins:maven-jar-plugin:maven-plugin:0.1-stub-SNAPSHOT in source directory core-it-support\core-it-plugins\maven-it-plugin-core-stubs\maven-jar-plugin\src\main\java
[withMaven] openTasksPublisher - Scan Tasks for Maven artifact org.apache.maven.plugins:maven-javadoc-plugin:maven-plugin:0.1-stub-SNAPSHOT in source directory core-it-support\core-it-plugins\maven-it-plugin-core-stubs\maven-javadoc-plugin\src\main\java
[withMaven] openTasksPublisher - Scan Tasks for Maven artifact org.apache.maven.plugins:maven-plugin-plugin:maven-plugin:0.1-stub-SNAPSHOT in source directory core-it-support\core-it-plugins\maven-it-plugin-core-stubs\maven-plugin-plugin\src\main\java
[withMaven] openTasksPublisher - Scan Tasks for Maven artifact org.apache.maven.plugins:maven-rar-plugin:maven-plugin:0.1-stub-SNAPSHOT in source directory core-it-support\core-it-plugins\maven-it-plugin-core-stubs\maven-rar-plugin\src\main\java
[withMaven] openTasksPublisher - Scan Tasks for Maven artifact org.apache.maven.plugins:maven-resources-plugin:maven-plugin:0.1-stub-SNAPSHOT in source directory core-it-support\core-it-plugins\maven-it-plugin-core-stubs\maven-resources-plugin\src\main\java
[withMaven] openTasksPublisher - Scan Tasks for Maven artifact org.apache.maven.plugins:maven-site-plugin:maven-plugin:0.1-stub-SNAPSHOT in source directory core-it-support\core-it-plugins\maven-it-plugin-core-stubs\maven-site-plugin\src\main\java
[withMaven] openTasksPublisher - Scan Tasks for Maven artifact org.apache.maven.plugins:maven-source-plugin:maven-plugin:0.1-stub-SNAPSHOT in source directory core-it-support\core-it-plugins\maven-it-plugin-core-stubs\maven-source-plugin\src\main\java
[withMaven] openTasksPublisher - Scan Tasks for Maven artifact org.apache.maven.plugins:maven-surefire-plugin:maven-plugin:0.1-stub-SNAPSHOT in source directory core-it-support\core-it-plugins\maven-it-plugin-core-stubs\maven-surefire-plugin\src\main\java
[withMaven] openTasksPublisher - Scan Tasks for Maven artifact org.apache.maven.plugins:maven-war-plugin:maven-plugin:0.1-stub-SNAPSHOT in source directory core-it-support\core-it-plugins\maven-it-plugin-core-stubs\maven-war-plugin\src\main\java
[withMaven] openTasksPublisher - Scan Tasks for Maven artifact org.apache.maven.its.plugins:maven-it-plugin-dependency-collection:maven-plugin:2.1-SNAPSHOT in source directory core-it-support\core-it-plugins\maven-it-plugin-dependency-collection\src\main\java
[withMaven] openTasksPublisher - Scan Tasks for Maven artifact org.apache.maven.its.plugins:maven-it-plugin-dependency-resolution:maven-plugin:2.1-SNAPSHOT in source directory core-it-support\core-it-plugins\maven-it-plugin-dependency-resolution\src\main\java
[withMaven] openTasksPublisher - Scan Tasks for Maven artifact org.apache.maven.its.plugins:maven-it-plugin-expression:maven-plugin:2.1-SNAPSHOT in source directory core-it-support\core-it-plugins\maven-it-plugin-expression\src\main\java
[withMaven] openTasksPublisher - Scan Tasks for Maven artifact org.apache.maven.its.plugins:maven-it-plugin-error:maven-plugin:2.1-SNAPSHOT in source directory core-it-support\core-it-plugins\maven-it-plugin-error\src\main\java
[withMaven] openTasksPublisher - Scan Tasks for Maven artifact org.apache.maven.its:core-it-component:jar:2.1-SNAPSHOT in source directory core-it-support\core-it-component\src\main\java
[withMaven] openTasksPublisher - Scan Tasks for Maven artifact org.apache.maven.its.plugins:maven-it-plugin-extension-consumer:maven-plugin:2.1-SNAPSHOT in source directory core-it-support\core-it-plugins\maven-it-plugin-extension-consumer\src\main\java
[withMaven] openTasksPublisher - Scan Tasks for Maven artifact org.apache.maven.its.plugins:maven-it-plugin-extension-provider:maven-plugin:2.1-SNAPSHOT in source directory core-it-support\core-it-plugins\maven-it-plugin-extension-provider\src\main\java
[withMaven] openTasksPublisher - Scan Tasks for Maven artifact org.apache.maven.its.plugins:maven-it-plugin-fork:maven-plugin:2.1-SNAPSHOT in source directory core-it-support\core-it-plugins\maven-it-plugin-fork\src\main\java
[withMaven] openTasksPublisher - Scan Tasks for Maven artifact org.apache.maven.its.plugins:maven-it-plugin-invalid-descriptor:maven-plugin:2.1-SNAPSHOT in source directory core-it-support\core-it-plugins\maven-it-plugin-invalid-descriptor\src\main\java
[withMaven] openTasksPublisher - Scan Tasks for Maven artifact org.apache.maven.its.plugins:maven-it-plugin-log-file:maven-plugin:2.1-SNAPSHOT in source directory core-it-support\core-it-plugins\maven-it-plugin-log-file\src\main\java
[withMaven] openTasksPublisher - Scan Tasks for Maven artifact org.apache.maven.its:maven-it-helper:jar:2.1-SNAPSHOT in source directory core-it-support\maven-it-helper\src\main\java
[withMaven] openTasksPublisher - Scan Tasks for Maven artifact org.apache.maven.its.plugins:maven-it-plugin-model-interpolation:maven-plugin:2.1-SNAPSHOT in source directory core-it-support\core-it-plugins\maven-it-plugin-model-interpolation\src\main\java
[withMaven] openTasksPublisher - Scan Tasks for Maven artifact org.apache.maven.its.plugins:maven-it-plugin-no-default-comp:maven-plugin:2.1-SNAPSHOT in source directory core-it-support\core-it-plugins\maven-it-plugin-no-default-comp\src\main\java
[withMaven] openTasksPublisher - Scan Tasks for Maven artifact org.apache.maven.its.plugins:maven-it-plugin-no-project:maven-plugin:2.1-SNAPSHOT in source directory core-it-support\core-it-plugins\maven-it-plugin-no-project\src\main\java
[withMaven] openTasksPublisher - Scan Tasks for Maven artifact org.apache.maven.its.plugins:maven-it-plugin-online:maven-plugin:2.1-SNAPSHOT in source directory core-it-support\core-it-plugins\maven-it-plugin-online\src\main\java
[withMaven] openTasksPublisher - Scan Tasks for Maven artifact org.apache.maven.its.plugins:maven-it-plugin-optional-mojos:maven-plugin:2.1-SNAPSHOT in source directory core-it-support\core-it-plugins\maven-it-plugin-optional-mojos\src\main\java
[withMaven] openTasksPublisher - Scan Tasks for Maven artifact org.apache.maven.its.plugins:maven-it-plugin-packaging:maven-plugin:2.1-SNAPSHOT in source directory core-it-support\core-it-plugins\maven-it-plugin-packaging\src\main\java
[withMaven] openTasksPublisher - Scan Tasks for Maven artifact org.apache.maven.its.plugins:maven-it-plugin-parameter-implementation:maven-plugin:2.1-SNAPSHOT in source directory core-it-support\core-it-plugins\maven-it-plugin-parameter-implementation\src\main\java
[withMaven] openTasksPublisher - Scan Tasks for Maven artifact org.apache.maven.its.plugins:maven-it-plugin-plugin-dependency:maven-plugin:2.1-SNAPSHOT in source directory core-it-support\core-it-plugins\maven-it-plugin-plugin-dependency\src\main\java
[withMaven] openTasksPublisher - Scan Tasks for Maven artifact org.apache.maven.its.plugins:maven-it-plugin-project:maven-plugin:2.1-SNAPSHOT in source directory core-it-support\core-it-plugins\maven-it-plugin-project\src\main\java
[withMaven] openTasksPublisher - Scan Tasks for Maven artifact org.apache.maven.its.plugins:maven-it-plugin-project-interpolation:maven-plugin:2.1-SNAPSHOT in source directory core-it-support\core-it-plugins\maven-it-plugin-project-interpolation\src\main\java
[withMaven] openTasksPublisher - Scan Tasks for Maven artifact org.apache.maven.its.plugins:maven-it-plugin-setter:maven-plugin:2.1-SNAPSHOT in source directory core-it-support\core-it-plugins\maven-it-plugin-setter\src\main\java
[withMaven] openTasksPublisher - Scan Tasks for Maven artifact org.apache.maven.its.plugins:maven-it-plugin-singleton-component:maven-plugin:2.1-SNAPSHOT in source directory core-it-support\core-it-plugins\maven-it-plugin-singleton-component\src\main\java
[withMaven] openTasksPublisher - Scan Tasks for Maven artifact org.apache.maven.its.plugins:maven-it-plugin-site:maven-plugin:2.1-SNAPSHOT in source directory core-it-support\core-it-plugins\maven-it-plugin-site\src\main\java
[withMaven] openTasksPublisher - Scan Tasks for Maven artifact org.apache.maven.its.plugins:maven-it-plugin-toolchain:maven-plugin:2.1-SNAPSHOT in source directory core-it-support\core-it-plugins\maven-it-plugin-toolchain\src\main\java
[withMaven] openTasksPublisher - Scan Tasks for Maven artifact org.apache.maven.its.plugins:maven-it-plugin-touch:maven-plugin:2.1-SNAPSHOT in source directory core-it-support\core-it-plugins\maven-it-plugin-touch\src\main\java
[withMaven] openTasksPublisher - Scan Tasks for Maven artifact org.apache.maven.its.plugins:maven-it-plugin-uses-properties:maven-plugin:2.1-SNAPSHOT in source directory core-it-support\core-it-plugins\maven-it-plugin-uses-properties\src\main\java
[withMaven] openTasksPublisher - Scan Tasks for Maven artifact org.apache.maven.its.plugins:maven-it-plugin-uses-wagon:maven-plugin:2.1-SNAPSHOT in source directory core-it-support\core-it-plugins\maven-it-plugin-uses-wagon\src\main\java
[withMaven] openTasksPublisher - Scan Tasks for Maven artifact org.apache.maven.its.plugins:maven-it-plugin-all:maven-plugin:2.1-SNAPSHOT in source directory core-it-support\core-it-plugins\maven-it-plugin-all\src\main\java
[withMaven] openTasksPublisher - Scan Tasks for Maven artifact org.apache.maven.its.plugins:maven-it-plugin-plexus-utils-11:maven-plugin:2.1-SNAPSHOT in source directory core-it-support\core-it-plugins\maven-it-plugin-plexus-utils-11\src\main\java
[withMaven] openTasksPublisher - Scan Tasks for Maven artifact org.apache.maven.its.plugins:maven-it-plugin-plexus-utils-new:maven-plugin:2.1-SNAPSHOT in source directory core-it-support\core-it-plugins\maven-it-plugin-plexus-utils-new\src\main\java
[withMaven] openTasksPublisher - Scan Tasks for Maven artifact org.apache.maven.its.plugins:maven-it-plugin-plexus-component-api:maven-plugin:2.1-SNAPSHOT in source directory core-it-support\core-it-plugins\maven-it-plugin-plexus-component-api\src\main\java
[withMaven] openTasksPublisher - Scan Tasks for Maven artifact org.apache.maven.its.plugins:maven-it-plugin-log4j:maven-plugin:2.1-SNAPSHOT in source directory core-it-support\core-it-plugins\maven-it-plugin-log4j\src\main\java
[withMaven] openTasksPublisher - Scan Tasks for Maven artifact org.apache.maven.its.plugins:maven-it-plugin-extension1:maven-plugin:2.1-SNAPSHOT in source directory core-it-support\core-it-plugins\maven-it-plugin-extension1\src\main\java
[withMaven] openTasksPublisher - Scan Tasks for Maven artifact org.apache.maven.its.plugins:maven-it-plugin-extension2:maven-plugin:2.1-SNAPSHOT in source directory core-it-support\core-it-plugins\maven-it-plugin-extension2\src\main\java
[withMaven] openTasksPublisher - Scan Tasks for Maven artifact org.apache.maven.its.plugins:maven-it-plugin-plexus-lifecycle:maven-plugin:2.1-SNAPSHOT in source directory core-it-support\core-it-plugins\maven-it-plugin-plexus-lifecycle\src\main\java
[withMaven] openTasksPublisher - Scan Tasks for Maven artifact org.apache.maven.its.plugins:maven-it-plugin-settings:maven-plugin:2.1-SNAPSHOT in source directory core-it-support\core-it-plugins\maven-it-plugin-settings\src\main\java
[withMaven] openTasksPublisher - Scan Tasks for Maven artifact org.apache.maven.its.plugins:mng-5805-pkg-type-mojo-configuration-plugin:maven-plugin:2.1-SNAPSHOT in source directory core-it-support\core-it-plugins\mng5805-plugin\src\main\java
[withMaven] openTasksPublisher - Scan Tasks for Maven artifact org.apache.maven.its.plugins:mng-5805-pkg-type-mojo-configuration-plugin-dep:jar:2.1-SNAPSHOT in source directory core-it-support\core-it-plugins\mng5805-plugin-dep\src\main\java
[withMaven] openTasksPublisher - Scan Tasks for Maven artifact org.apache.maven.its.plugins:mng-5958-pkg-type-extension:jar:2.1-SNAPSHOT in source directory core-it-support\core-it-plugins\mng5958-extension\src\main\java
[withMaven] openTasksPublisher - Scan Tasks for Maven artifact org.apache.maven.its.plugins:mng-6759-resolves-project-dependencies-plugin:maven-plugin:2.1-SNAPSHOT in source directory core-it-support\core-it-plugins\mng6759-plugin-resolves-project-dependencies\src\main\java
[withMaven] openTasksPublisher - Scan Tasks for Maven artifact org.apache.maven.its:core-it-toolchain:jar:2.1-SNAPSHOT in source directory core-it-support\core-it-toolchain\src\main\java
[withMaven] openTasksPublisher - Scan Tasks for Maven artifact org.apache.maven.its:core-it-wagon:jar:2.1-SNAPSHOT in source directory core-it-support\core-it-wagon\src\main\java
[withMaven] openTasksPublisher - Scan Tasks for Maven artifact mng-coreit:javaagent:jar:1.0-SNAPSHOT in source directory core-it-support\core-it-javaagent\src\main\java
[TASKS] Scanning folder 'c:\mvn-it-0.tmp' for files matching the pattern 'core-it-support\core-it-plugins\maven-it-plugin-active-collection\src\main\java\**\*,core-it-support\core-it-plugins\maven-it-plugin-artifact\src\main\java\**\*,core-it-support\core-it-plugins\maven-it-plugin-class-loader\dep-a\src\main\java\**\*,core-it-support\core-it-plugins\maven-it-plugin-class-loader\dep-b\src\main\java\**\*,core-it-support\core-it-plugins\maven-it-plugin-class-loader\maven-it-plugin-class-loader\src\main\java\**\*,core-it-support\core-it-plugins\maven-it-plugin-configuration\src\main\java\**\*,core-it-support\core-it-plugins\maven-it-plugin-context-passing\src\main\java\**\*,core-it-support\core-it-plugins\maven-it-plugin-core-stubs\maven-clean-plugin\src\main\java\**\*,core-it-support\core-it-plugins\maven-it-plugin-core-stubs\maven-compiler-plugin\src\main\java\**\*,core-it-support\core-it-plugins\maven-it-plugin-core-stubs\maven-deploy-plugin\src\main\java\**\*,core-it-support\core-it-plugins\maven-it-plugin-core-stubs\maven-ear-plugin\src\main\java\**\*,core-it-support\core-it-plugins\maven-it-plugin-core-stubs\maven-ejb-plugin\src\main\java\**\*,core-it-support\core-it-plugins\maven-it-plugin-core-stubs\maven-install-plugin\src\main\java\**\*,core-it-support\core-it-plugins\maven-it-plugin-core-stubs\maven-jar-plugin\src\main\java\**\*,core-it-support\core-it-plugins\maven-it-plugin-core-stubs\maven-javadoc-plugin\src\main\java\**\*,core-it-support\core-it-plugins\maven-it-plugin-core-stubs\maven-plugin-plugin\src\main\java\**\*,core-it-support\core-it-plugins\maven-it-plugin-core-stubs\maven-rar-plugin\src\main\java\**\*,core-it-support\core-it-plugins\maven-it-plugin-core-stubs\maven-resources-plugin\src\main\java\**\*,core-it-support\core-it-plugins\maven-it-plugin-core-stubs\maven-site-plugin\src\main\java\**\*,core-it-support\core-it-plugins\maven-it-plugin-core-stubs\maven-source-plugin\src\main\java\**\*,core-it-support\core-it-plugins\maven-it-plugin-core-stubs\maven-surefire-plugin\src\main\java\**\*,core-it-support\core-it-plugins\maven-it-plugin-core-stubs\maven-war-plugin\src\main\java\**\*,core-it-support\core-it-plugins\maven-it-plugin-dependency-collection\src\main\java\**\*,core-it-support\core-it-plugins\maven-it-plugin-dependency-resolution\src\main\java\**\*,core-it-support\core-it-plugins\maven-it-plugin-expression\src\main\java\**\*,core-it-support\core-it-plugins\maven-it-plugin-error\src\main\java\**\*,core-it-support\core-it-component\src\main\java\**\*,core-it-support\core-it-plugins\maven-it-plugin-extension-consumer\src\main\java\**\*,core-it-support\core-it-plugins\maven-it-plugin-extension-provider\src\main\java\**\*,core-it-support\core-it-plugins\maven-it-plugin-fork\src\main\java\**\*,core-it-support\core-it-plugins\maven-it-plugin-invalid-descriptor\src\main\java\**\*,core-it-support\core-it-plugins\maven-it-plugin-log-file\src\main\java\**\*,core-it-support\maven-it-helper\src\main\java\**\*,core-it-support\core-it-plugins\maven-it-plugin-model-interpolation\src\main\java\**\*,core-it-support\core-it-plugins\maven-it-plugin-no-default-comp\src\main\java\**\*,core-it-support\core-it-plugins\maven-it-plugin-no-project\src\main\java\**\*,core-it-support\core-it-plugins\maven-it-plugin-online\src\main\java\**\*,core-it-support\core-it-plugins\maven-it-plugin-optional-mojos\src\main\java\**\*,core-it-support\core-it-plugins\maven-it-plugin-packaging\src\main\java\**\*,core-it-support\core-it-plugins\maven-it-plugin-parameter-implementation\src\main\java\**\*,core-it-support\core-it-plugins\maven-it-plugin-plugin-dependency\src\main\java\**\*,core-it-support\core-it-plugins\maven-it-plugin-project\src\main\java\**\*,core-it-support\core-it-plugins\maven-it-plugin-project-interpolation\src\main\java\**\*,core-it-support\core-it-plugins\maven-it-plugin-setter\src\main\java\**\*,core-it-support\core-it-plugins\maven-it-plugin-singleton-component\src\main\java\**\*,core-it-support\core-it-plugins\maven-it-plugin-site\src\main\java\**\*,core-it-support\core-it-plugins\maven-it-plugin-toolchain\src\main\java\**\*,core-it-support\core-it-plugins\maven-it-plugin-touch\src\main\java\**\*,core-it-support\core-it-plugins\maven-it-plugin-uses-properties\src\main\java\**\*,core-it-support\core-it-plugins\maven-it-plugin-uses-wagon\src\main\java\**\*,core-it-support\core-it-plugins\maven-it-plugin-all\src\main\java\**\*,core-it-support\core-it-plugins\maven-it-plugin-plexus-utils-11\src\main\java\**\*,core-it-support\core-it-plugins\maven-it-plugin-plexus-utils-new\src\main\java\**\*,core-it-support\core-it-plugins\maven-it-plugin-plexus-component-api\src\main\java\**\*,core-it-support\core-it-plugins\maven-it-plugin-log4j\src\main\java\**\*,core-it-support\core-it-plugins\maven-it-plugin-extension1\src\main\java\**\*,core-it-support\core-it-plugins\maven-it-plugin-extension2\src\main\java\**\*,core-it-support\core-it-plugins\maven-it-plugin-plexus-lifecycle\src\main\java\**\*,core-it-support\core-it-plugins\maven-it-plugin-settings\src\main\java\**\*,core-it-support\core-it-plugins\mng5805-plugin\src\main\java\**\*,core-it-support\core-it-plugins\mng5805-plugin-dep\src\main\java\**\*,core-it-support\core-it-plugins\mng5958-extension\src\main\java\**\*,core-it-support\core-it-plugins\mng6759-plugin-resolves-project-dependencies\src\main\java\**\*,core-it-support\core-it-toolchain\src\main\java\**\*,core-it-support\core-it-wagon\src\main\java\**\*,core-it-support\core-it-javaagent\src\main\java\**\*' - excludes: null
[TASKS] Found 167 files to scan for tasks
[TASKS] Found 0 open tasks.
Skipping warnings blame since pipelines do not have an SCM link.%n
[TASKS] Computing warning deltas based on reference build #85
[DevOpticsMavenPublisher] dependencies consumed: 188, artifacts produced: 156
[withMaven] Publishers: Pipeline Graph Publisher: 14 ms, Generated Artifacts Publisher: 14031 ms, Invoker Publisher: 4 ms, Junit Publisher: 52505 ms, Concordion Publisher: 2 ms, Dependencies Fingerprint Publisher: 432 ms, Findbugs Publisher: 1 ms, JGiven Publisher: 1 ms, Jacoco Publisher: 1 ms, SpotBugs Publisher: 1 ms, Open Task Scanner Publisher: 3344 ms, CloudBees DevOptics Gate Artifact Publisher: 93369 ms
[Pipeline] // withMaven
[DevOpticsMavenPublisher] dependencies consumed: 5, artifacts produced: 156
[withMaven] Publishers: Pipeline Graph Publisher: 19 ms, Generated Artifacts Publisher: 14369 ms, Invoker Publisher: 4 ms, Junit Publisher: 104235 ms, Concordion Publisher: 2 ms, Dependencies Fingerprint Publisher: 432 ms, Findbugs Publisher: 1 ms, JGiven Publisher: 1 ms, Open Task Scanner Publisher: 3221 ms, CloudBees DevOptics Gate Artifact Publisher: 91820 ms
[DevOpticsMavenPublisher] dependencies consumed: 27, artifacts produced: 156
[withMaven] Publishers: Pipeline Graph Publisher: 25 ms, Generated Artifacts Publisher: 116179 ms, Invoker Publisher: 3 ms, Junit Publisher: 489499 ms, Concordion Publisher: 2 ms, Dependencies Fingerprint Publisher: 3929 ms, Findbugs Publisher: 1 ms, JGiven Publisher: 1 ms, Jacoco Publisher: 1 ms, SpotBugs Publisher: 1 ms, Open Task Scanner Publisher: 21502 ms, CloudBees DevOptics Gate Artifact Publisher: 484462 ms
[Pipeline] // withMaven
[Pipeline] // withMaven
[Pipeline] fileExists
[Pipeline] fileExists
[Pipeline] fileExists
[Pipeline] zip
[Pipeline] zip
Writing zip file of c:\mvn-it-0.tmp\core-it-suite\target\test-classes to c:\mvn-it-0.tmp\core-it-suite-logs-windows-jdk11.zip
Writing zip file of c:\mvn-it-0.tmp\core-it-suite\target\test-classes to c:\mvn-it-0.tmp\core-it-suite-logs-windows-jdk8.zip
[Pipeline] zip
Writing zip file of /home/jenkins/workspace/Maven_maven-box_maven_master/test/core-it-suite/target/test-classes to /home/jenkins/workspace/Maven_maven-box_maven_master/test/core-it-suite-logs-linux-jdk11.zip
Zipped 8640 entries.
Archiving /home/jenkins/workspace/Maven_maven-box_maven_master/test/core-it-suite-logs-linux-jdk11.zip
Zipped 8650 entries.
Archiving c:\mvn-it-0.tmp\core-it-suite-logs-windows-jdk8.zip
Zipped 8642 entries.
Archiving c:\mvn-it-0.tmp\core-it-suite-logs-windows-jdk11.zip
[Pipeline] fileExists
[Pipeline] zip
Writing zip file of /home/jenkins/workspace/Maven_maven-box_maven_master/test/core-it-suite/target/surefire-reports to /home/jenkins/workspace/Maven_maven-box_maven_master/test/core-it-suite-reports-linux-jdk11.zip
Zipped 4 entries.
Archiving /home/jenkins/workspace/Maven_maven-box_maven_master/test/core-it-suite-reports-linux-jdk11.zip
[Pipeline] fileExists
[Pipeline] fileExists
[Pipeline] zip
[Pipeline] zip
Writing zip file of c:\mvn-it-0.tmp\core-it-suite\target\surefire-reports to c:\mvn-it-0.tmp\core-it-suite-reports-windows-jdk8.zip
Writing zip file of c:\mvn-it-0.tmp\core-it-suite\target\surefire-reports to c:\mvn-it-0.tmp\core-it-suite-reports-windows-jdk11.zip
Zipped 4 entries.
Archiving c:\mvn-it-0.tmp\core-it-suite-reports-windows-jdk8.zip
[Pipeline] deleteDir
Zipped 4 entries.
Archiving c:\mvn-it-0.tmp\core-it-suite-reports-windows-jdk11.zip
[withMaven] openTasksPublisher - Scan Tasks for Maven artifact org.apache.maven.its.plugins:maven-it-plugin-active-collection:maven-plugin:2.1-SNAPSHOT in source directory core-it-support/core-it-plugins/maven-it-plugin-active-collection/src/main/java
[Pipeline] deleteDir
[Pipeline] deleteDir
[withMaven] openTasksPublisher - Scan Tasks for Maven artifact org.apache.maven.its.plugins:maven-it-plugin-artifact:maven-plugin:2.1-SNAPSHOT in source directory core-it-support/core-it-plugins/maven-it-plugin-artifact/src/main/java
[withMaven] openTasksPublisher - Scan Tasks for Maven artifact org.apache.maven.its.plugins.class-loader:dep-a:jar:2.1-SNAPSHOT in source directory core-it-support/core-it-plugins/maven-it-plugin-class-loader/dep-a/src/main/java
[withMaven] openTasksPublisher - Scan Tasks for Maven artifact org.apache.maven.its.plugins.class-loader:dep-b:jar:2.1-SNAPSHOT in source directory core-it-support/core-it-plugins/maven-it-plugin-class-loader/dep-b/src/main/java
[withMaven] openTasksPublisher - Scan Tasks for Maven artifact org.apache.maven.its.plugins:maven-it-plugin-class-loader:maven-plugin:2.1-SNAPSHOT in source directory core-it-support/core-it-plugins/maven-it-plugin-class-loader/maven-it-plugin-class-loader/src/main/java
[withMaven] openTasksPublisher - Scan Tasks for Maven artifact org.apache.maven.its.plugins:maven-it-plugin-configuration:maven-plugin:2.1-SNAPSHOT in source directory core-it-support/core-it-plugins/maven-it-plugin-configuration/src/main/java
[withMaven] openTasksPublisher - Scan Tasks for Maven artifact org.apache.maven.its.plugins:maven-it-plugin-context-passing:maven-plugin:2.1-SNAPSHOT in source directory core-it-support/core-it-plugins/maven-it-plugin-context-passing/src/main/java
[Pipeline] }
[Pipeline] // dir
[Pipeline] }
[withMaven] openTasksPublisher - Scan Tasks for Maven artifact org.apache.maven.plugins:maven-clean-plugin:maven-plugin:0.1-stub-SNAPSHOT in source directory core-it-support/core-it-plugins/maven-it-plugin-core-stubs/maven-clean-plugin/src/main/java
[Pipeline] // stage
[Pipeline] }
[Pipeline] // node
[Pipeline] }
[withMaven] openTasksPublisher - Scan Tasks for Maven artifact org.apache.maven.plugins:maven-compiler-plugin:maven-plugin:0.1-stub-SNAPSHOT in source directory core-it-support/core-it-plugins/maven-it-plugin-core-stubs/maven-compiler-plugin/src/main/java
[withMaven] openTasksPublisher - Scan Tasks for Maven artifact org.apache.maven.plugins:maven-deploy-plugin:maven-plugin:0.1-stub-SNAPSHOT in source directory core-it-support/core-it-plugins/maven-it-plugin-core-stubs/maven-deploy-plugin/src/main/java
[withMaven] openTasksPublisher - Scan Tasks for Maven artifact org.apache.maven.plugins:maven-ear-plugin:maven-plugin:0.1-stub-SNAPSHOT in source directory core-it-support/core-it-plugins/maven-it-plugin-core-stubs/maven-ear-plugin/src/main/java
[withMaven] openTasksPublisher - Scan Tasks for Maven artifact org.apache.maven.plugins:maven-ejb-plugin:maven-plugin:0.1-stub-SNAPSHOT in source directory core-it-support/core-it-plugins/maven-it-plugin-core-stubs/maven-ejb-plugin/src/main/java
[withMaven] openTasksPublisher - Scan Tasks for Maven artifact org.apache.maven.plugins:maven-install-plugin:maven-plugin:0.1-stub-SNAPSHOT in source directory core-it-support/core-it-plugins/maven-it-plugin-core-stubs/maven-install-plugin/src/main/java
[withMaven] openTasksPublisher - Scan Tasks for Maven artifact org.apache.maven.plugins:maven-jar-plugin:maven-plugin:0.1-stub-SNAPSHOT in source directory core-it-support/core-it-plugins/maven-it-plugin-core-stubs/maven-jar-plugin/src/main/java
[withMaven] openTasksPublisher - Scan Tasks for Maven artifact org.apache.maven.plugins:maven-javadoc-plugin:maven-plugin:0.1-stub-SNAPSHOT in source directory core-it-support/core-it-plugins/maven-it-plugin-core-stubs/maven-javadoc-plugin/src/main/java
[withMaven] openTasksPublisher - Scan Tasks for Maven artifact org.apache.maven.plugins:maven-plugin-plugin:maven-plugin:0.1-stub-SNAPSHOT in source directory core-it-support/core-it-plugins/maven-it-plugin-core-stubs/maven-plugin-plugin/src/main/java
[withMaven] openTasksPublisher - Scan Tasks for Maven artifact org.apache.maven.plugins:maven-rar-plugin:maven-plugin:0.1-stub-SNAPSHOT in source directory core-it-support/core-it-plugins/maven-it-plugin-core-stubs/maven-rar-plugin/src/main/java
[withMaven] openTasksPublisher - Scan Tasks for Maven artifact org.apache.maven.plugins:maven-resources-plugin:maven-plugin:0.1-stub-SNAPSHOT in source directory core-it-support/core-it-plugins/maven-it-plugin-core-stubs/maven-resources-plugin/src/main/java
[withMaven] openTasksPublisher - Scan Tasks for Maven artifact org.apache.maven.plugins:maven-site-plugin:maven-plugin:0.1-stub-SNAPSHOT in source directory core-it-support/core-it-plugins/maven-it-plugin-core-stubs/maven-site-plugin/src/main/java
[withMaven] openTasksPublisher - Scan Tasks for Maven artifact org.apache.maven.plugins:maven-source-plugin:maven-plugin:0.1-stub-SNAPSHOT in source directory core-it-support/core-it-plugins/maven-it-plugin-core-stubs/maven-source-plugin/src/main/java
[withMaven] openTasksPublisher - Scan Tasks for Maven artifact org.apache.maven.plugins:maven-surefire-plugin:maven-plugin:0.1-stub-SNAPSHOT in source directory core-it-support/core-it-plugins/maven-it-plugin-core-stubs/maven-surefire-plugin/src/main/java
[withMaven] openTasksPublisher - Scan Tasks for Maven artifact org.apache.maven.plugins:maven-war-plugin:maven-plugin:0.1-stub-SNAPSHOT in source directory core-it-support/core-it-plugins/maven-it-plugin-core-stubs/maven-war-plugin/src/main/java
[withMaven] openTasksPublisher - Scan Tasks for Maven artifact org.apache.maven.its.plugins:maven-it-plugin-dependency-collection:maven-plugin:2.1-SNAPSHOT in source directory core-it-support/core-it-plugins/maven-it-plugin-dependency-collection/src/main/java
[withMaven] openTasksPublisher - Scan Tasks for Maven artifact org.apache.maven.its.plugins:maven-it-plugin-dependency-resolution:maven-plugin:2.1-SNAPSHOT in source directory core-it-support/core-it-plugins/maven-it-plugin-dependency-resolution/src/main/java
[withMaven] openTasksPublisher - Scan Tasks for Maven artifact org.apache.maven.its.plugins:maven-it-plugin-expression:maven-plugin:2.1-SNAPSHOT in source directory core-it-support/core-it-plugins/maven-it-plugin-expression/src/main/java
[withMaven] openTasksPublisher - Scan Tasks for Maven artifact org.apache.maven.its.plugins:maven-it-plugin-error:maven-plugin:2.1-SNAPSHOT in source directory core-it-support/core-it-plugins/maven-it-plugin-error/src/main/java
[withMaven] openTasksPublisher - Scan Tasks for Maven artifact org.apache.maven.its:core-it-component:jar:2.1-SNAPSHOT in source directory core-it-support/core-it-component/src/main/java
[withMaven] openTasksPublisher - Scan Tasks for Maven artifact org.apache.maven.its.plugins:maven-it-plugin-extension-consumer:maven-plugin:2.1-SNAPSHOT in source directory core-it-support/core-it-plugins/maven-it-plugin-extension-consumer/src/main/java
[withMaven] openTasksPublisher - Scan Tasks for Maven artifact org.apache.maven.its.plugins:maven-it-plugin-extension-provider:maven-plugin:2.1-SNAPSHOT in source directory core-it-support/core-it-plugins/maven-it-plugin-extension-provider/src/main/java
[withMaven] openTasksPublisher - Scan Tasks for Maven artifact org.apache.maven.its.plugins:maven-it-plugin-fork:maven-plugin:2.1-SNAPSHOT in source directory core-it-support/core-it-plugins/maven-it-plugin-fork/src/main/java
[withMaven] openTasksPublisher - Scan Tasks for Maven artifact org.apache.maven.its.plugins:maven-it-plugin-invalid-descriptor:maven-plugin:2.1-SNAPSHOT in source directory core-it-support/core-it-plugins/maven-it-plugin-invalid-descriptor/src/main/java
[withMaven] openTasksPublisher - Scan Tasks for Maven artifact org.apache.maven.its.plugins:maven-it-plugin-log-file:maven-plugin:2.1-SNAPSHOT in source directory core-it-support/core-it-plugins/maven-it-plugin-log-file/src/main/java
[withMaven] openTasksPublisher - Scan Tasks for Maven artifact org.apache.maven.its:maven-it-helper:jar:2.1-SNAPSHOT in source directory core-it-support/maven-it-helper/src/main/java
[withMaven] openTasksPublisher - Scan Tasks for Maven artifact org.apache.maven.its.plugins:maven-it-plugin-model-interpolation:maven-plugin:2.1-SNAPSHOT in source directory core-it-support/core-it-plugins/maven-it-plugin-model-interpolation/src/main/java
[withMaven] openTasksPublisher - Scan Tasks for Maven artifact org.apache.maven.its.plugins:maven-it-plugin-no-default-comp:maven-plugin:2.1-SNAPSHOT in source directory core-it-support/core-it-plugins/maven-it-plugin-no-default-comp/src/main/java
[withMaven] openTasksPublisher - Scan Tasks for Maven artifact org.apache.maven.its.plugins:maven-it-plugin-no-project:maven-plugin:2.1-SNAPSHOT in source directory core-it-support/core-it-plugins/maven-it-plugin-no-project/src/main/java
[withMaven] openTasksPublisher - Scan Tasks for Maven artifact org.apache.maven.its.plugins:maven-it-plugin-online:maven-plugin:2.1-SNAPSHOT in source directory core-it-support/core-it-plugins/maven-it-plugin-online/src/main/java
[withMaven] openTasksPublisher - Scan Tasks for Maven artifact org.apache.maven.its.plugins:maven-it-plugin-optional-mojos:maven-plugin:2.1-SNAPSHOT in source directory core-it-support/core-it-plugins/maven-it-plugin-optional-mojos/src/main/java
[withMaven] openTasksPublisher - Scan Tasks for Maven artifact org.apache.maven.its.plugins:maven-it-plugin-packaging:maven-plugin:2.1-SNAPSHOT in source directory core-it-support/core-it-plugins/maven-it-plugin-packaging/src/main/java
[withMaven] openTasksPublisher - Scan Tasks for Maven artifact org.apache.maven.its.plugins:maven-it-plugin-parameter-implementation:maven-plugin:2.1-SNAPSHOT in source directory core-it-support/core-it-plugins/maven-it-plugin-parameter-implementation/src/main/java
[withMaven] openTasksPublisher - Scan Tasks for Maven artifact org.apache.maven.its.plugins:maven-it-plugin-plugin-dependency:maven-plugin:2.1-SNAPSHOT in source directory core-it-support/core-it-plugins/maven-it-plugin-plugin-dependency/src/main/java
[withMaven] openTasksPublisher - Scan Tasks for Maven artifact org.apache.maven.its.plugins:maven-it-plugin-project:maven-plugin:2.1-SNAPSHOT in source directory core-it-support/core-it-plugins/maven-it-plugin-project/src/main/java
[withMaven] openTasksPublisher - Scan Tasks for Maven artifact org.apache.maven.its.plugins:maven-it-plugin-project-interpolation:maven-plugin:2.1-SNAPSHOT in source directory core-it-support/core-it-plugins/maven-it-plugin-project-interpolation/src/main/java
[withMaven] openTasksPublisher - Scan Tasks for Maven artifact org.apache.maven.its.plugins:maven-it-plugin-setter:maven-plugin:2.1-SNAPSHOT in source directory core-it-support/core-it-plugins/maven-it-plugin-setter/src/main/java
[withMaven] openTasksPublisher - Scan Tasks for Maven artifact org.apache.maven.its.plugins:maven-it-plugin-singleton-component:maven-plugin:2.1-SNAPSHOT in source directory core-it-support/core-it-plugins/maven-it-plugin-singleton-component/src/main/java
[withMaven] openTasksPublisher - Scan Tasks for Maven artifact org.apache.maven.its.plugins:maven-it-plugin-site:maven-plugin:2.1-SNAPSHOT in source directory core-it-support/core-it-plugins/maven-it-plugin-site/src/main/java
[withMaven] openTasksPublisher - Scan Tasks for Maven artifact org.apache.maven.its.plugins:maven-it-plugin-toolchain:maven-plugin:2.1-SNAPSHOT in source directory core-it-support/core-it-plugins/maven-it-plugin-toolchain/src/main/java
[withMaven] openTasksPublisher - Scan Tasks for Maven artifact org.apache.maven.its.plugins:maven-it-plugin-touch:maven-plugin:2.1-SNAPSHOT in source directory core-it-support/core-it-plugins/maven-it-plugin-touch/src/main/java
[withMaven] openTasksPublisher - Scan Tasks for Maven artifact org.apache.maven.its.plugins:maven-it-plugin-uses-properties:maven-plugin:2.1-SNAPSHOT in source directory core-it-support/core-it-plugins/maven-it-plugin-uses-properties/src/main/java
[withMaven] openTasksPublisher - Scan Tasks for Maven artifact org.apache.maven.its.plugins:maven-it-plugin-uses-wagon:maven-plugin:2.1-SNAPSHOT in source directory core-it-support/core-it-plugins/maven-it-plugin-uses-wagon/src/main/java
[Pipeline] }
[Pipeline] // dir
[Pipeline] }
[withMaven] openTasksPublisher - Scan Tasks for Maven artifact org.apache.maven.its.plugins:maven-it-plugin-all:maven-plugin:2.1-SNAPSHOT in source directory core-it-support/core-it-plugins/maven-it-plugin-all/src/main/java
[Pipeline] // stage
[Pipeline] }
[Pipeline] // node
[Pipeline] }
[withMaven] openTasksPublisher - Scan Tasks for Maven artifact org.apache.maven.its.plugins:maven-it-plugin-plexus-utils-11:maven-plugin:2.1-SNAPSHOT in source directory core-it-support/core-it-plugins/maven-it-plugin-plexus-utils-11/src/main/java
[withMaven] openTasksPublisher - Scan Tasks for Maven artifact org.apache.maven.its.plugins:maven-it-plugin-plexus-utils-new:maven-plugin:2.1-SNAPSHOT in source directory core-it-support/core-it-plugins/maven-it-plugin-plexus-utils-new/src/main/java
[withMaven] openTasksPublisher - Scan Tasks for Maven artifact org.apache.maven.its.plugins:maven-it-plugin-plexus-component-api:maven-plugin:2.1-SNAPSHOT in source directory core-it-support/core-it-plugins/maven-it-plugin-plexus-component-api/src/main/java
[withMaven] openTasksPublisher - Scan Tasks for Maven artifact org.apache.maven.its.plugins:maven-it-plugin-log4j:maven-plugin:2.1-SNAPSHOT in source directory core-it-support/core-it-plugins/maven-it-plugin-log4j/src/main/java
[withMaven] openTasksPublisher - Scan Tasks for Maven artifact org.apache.maven.its.plugins:maven-it-plugin-extension1:maven-plugin:2.1-SNAPSHOT in source directory core-it-support/core-it-plugins/maven-it-plugin-extension1/src/main/java
[withMaven] openTasksPublisher - Scan Tasks for Maven artifact org.apache.maven.its.plugins:maven-it-plugin-extension2:maven-plugin:2.1-SNAPSHOT in source directory core-it-support/core-it-plugins/maven-it-plugin-extension2/src/main/java
[Pipeline] }
[Pipeline] // dir
[Pipeline] }
[withMaven] openTasksPublisher - Scan Tasks for Maven artifact org.apache.maven.its.plugins:maven-it-plugin-plexus-lifecycle:maven-plugin:2.1-SNAPSHOT in source directory core-it-support/core-it-plugins/maven-it-plugin-plexus-lifecycle/src/main/java
[Pipeline] // stage
[Pipeline] }
[Pipeline] // node
[Pipeline] }
[withMaven] openTasksPublisher - Scan Tasks for Maven artifact org.apache.maven.its.plugins:maven-it-plugin-settings:maven-plugin:2.1-SNAPSHOT in source directory core-it-support/core-it-plugins/maven-it-plugin-settings/src/main/java
[withMaven] openTasksPublisher - Scan Tasks for Maven artifact org.apache.maven.its.plugins:mng-5805-pkg-type-mojo-configuration-plugin:maven-plugin:2.1-SNAPSHOT in source directory core-it-support/core-it-plugins/mng5805-plugin/src/main/java
[withMaven] openTasksPublisher - Scan Tasks for Maven artifact org.apache.maven.its.plugins:mng-5805-pkg-type-mojo-configuration-plugin-dep:jar:2.1-SNAPSHOT in source directory core-it-support/core-it-plugins/mng5805-plugin-dep/src/main/java
[withMaven] openTasksPublisher - Scan Tasks for Maven artifact org.apache.maven.its.plugins:mng-5958-pkg-type-extension:jar:2.1-SNAPSHOT in source directory core-it-support/core-it-plugins/mng5958-extension/src/main/java
[withMaven] openTasksPublisher - Scan Tasks for Maven artifact org.apache.maven.its.plugins:mng-6759-resolves-project-dependencies-plugin:maven-plugin:2.1-SNAPSHOT in source directory core-it-support/core-it-plugins/mng6759-plugin-resolves-project-dependencies/src/main/java
[withMaven] openTasksPublisher - Scan Tasks for Maven artifact org.apache.maven.its:core-it-toolchain:jar:2.1-SNAPSHOT in source directory core-it-support/core-it-toolchain/src/main/java
[withMaven] openTasksPublisher - Scan Tasks for Maven artifact org.apache.maven.its:core-it-wagon:jar:2.1-SNAPSHOT in source directory core-it-support/core-it-wagon/src/main/java
[withMaven] openTasksPublisher - Scan Tasks for Maven artifact mng-coreit:javaagent:jar:1.0-SNAPSHOT in source directory core-it-support/core-it-javaagent/src/main/java
[TASKS] Scanning folder '/home/jenkins/workspace/Maven_maven-box_maven_master/test' for files matching the pattern 'core-it-support/core-it-plugins/maven-it-plugin-active-collection/src/main/java/**/*,core-it-support/core-it-plugins/maven-it-plugin-artifact/src/main/java/**/*,core-it-support/core-it-plugins/maven-it-plugin-class-loader/dep-a/src/main/java/**/*,core-it-support/core-it-plugins/maven-it-plugin-class-loader/dep-b/src/main/java/**/*,core-it-support/core-it-plugins/maven-it-plugin-class-loader/maven-it-plugin-class-loader/src/main/java/**/*,core-it-support/core-it-plugins/maven-it-plugin-configuration/src/main/java/**/*,core-it-support/core-it-plugins/maven-it-plugin-context-passing/src/main/java/**/*,core-it-support/core-it-plugins/maven-it-plugin-core-stubs/maven-clean-plugin/src/main/java/**/*,core-it-support/core-it-plugins/maven-it-plugin-core-stubs/maven-compiler-plugin/src/main/java/**/*,core-it-support/core-it-plugins/maven-it-plugin-core-stubs/maven-deploy-plugin/src/main/java/**/*,core-it-support/core-it-plugins/maven-it-plugin-core-stubs/maven-ear-plugin/src/main/java/**/*,core-it-support/core-it-plugins/maven-it-plugin-core-stubs/maven-ejb-plugin/src/main/java/**/*,core-it-support/core-it-plugins/maven-it-plugin-core-stubs/maven-install-plugin/src/main/java/**/*,core-it-support/core-it-plugins/maven-it-plugin-core-stubs/maven-jar-plugin/src/main/java/**/*,core-it-support/core-it-plugins/maven-it-plugin-core-stubs/maven-javadoc-plugin/src/main/java/**/*,core-it-support/core-it-plugins/maven-it-plugin-core-stubs/maven-plugin-plugin/src/main/java/**/*,core-it-support/core-it-plugins/maven-it-plugin-core-stubs/maven-rar-plugin/src/main/java/**/*,core-it-support/core-it-plugins/maven-it-plugin-core-stubs/maven-resources-plugin/src/main/java/**/*,core-it-support/core-it-plugins/maven-it-plugin-core-stubs/maven-site-plugin/src/main/java/**/*,core-it-support/core-it-plugins/maven-it-plugin-core-stubs/maven-source-plugin/src/main/java/**/*,core-it-support/core-it-plugins/maven-it-plugin-core-stubs/maven-surefire-plugin/src/main/java/**/*,core-it-support/core-it-plugins/maven-it-plugin-core-stubs/maven-war-plugin/src/main/java/**/*,core-it-support/core-it-plugins/maven-it-plugin-dependency-collection/src/main/java/**/*,core-it-support/core-it-plugins/maven-it-plugin-dependency-resolution/src/main/java/**/*,core-it-support/core-it-plugins/maven-it-plugin-expression/src/main/java/**/*,core-it-support/core-it-plugins/maven-it-plugin-error/src/main/java/**/*,core-it-support/core-it-component/src/main/java/**/*,core-it-support/core-it-plugins/maven-it-plugin-extension-consumer/src/main/java/**/*,core-it-support/core-it-plugins/maven-it-plugin-extension-provider/src/main/java/**/*,core-it-support/core-it-plugins/maven-it-plugin-fork/src/main/java/**/*,core-it-support/core-it-plugins/maven-it-plugin-invalid-descriptor/src/main/java/**/*,core-it-support/core-it-plugins/maven-it-plugin-log-file/src/main/java/**/*,core-it-support/maven-it-helper/src/main/java/**/*,core-it-support/core-it-plugins/maven-it-plugin-model-interpolation/src/main/java/**/*,core-it-support/core-it-plugins/maven-it-plugin-no-default-comp/src/main/java/**/*,core-it-support/core-it-plugins/maven-it-plugin-no-project/src/main/java/**/*,core-it-support/core-it-plugins/maven-it-plugin-online/src/main/java/**/*,core-it-support/core-it-plugins/maven-it-plugin-optional-mojos/src/main/java/**/*,core-it-support/core-it-plugins/maven-it-plugin-packaging/src/main/java/**/*,core-it-support/core-it-plugins/maven-it-plugin-parameter-implementation/src/main/java/**/*,core-it-support/core-it-plugins/maven-it-plugin-plugin-dependency/src/main/java/**/*,core-it-support/core-it-plugins/maven-it-plugin-project/src/main/java/**/*,core-it-support/core-it-plugins/maven-it-plugin-project-interpolation/src/main/java/**/*,core-it-support/core-it-plugins/maven-it-plugin-setter/src/main/java/**/*,core-it-support/core-it-plugins/maven-it-plugin-singleton-component/src/main/java/**/*,core-it-support/core-it-plugins/maven-it-plugin-site/src/main/java/**/*,core-it-support/core-it-plugins/maven-it-plugin-toolchain/src/main/java/**/*,core-it-support/core-it-plugins/maven-it-plugin-touch/src/main/java/**/*,core-it-support/core-it-plugins/maven-it-plugin-uses-properties/src/main/java/**/*,core-it-support/core-it-plugins/maven-it-plugin-uses-wagon/src/main/java/**/*,core-it-support/core-it-plugins/maven-it-plugin-all/src/main/java/**/*,core-it-support/core-it-plugins/maven-it-plugin-plexus-utils-11/src/main/java/**/*,core-it-support/core-it-plugins/maven-it-plugin-plexus-utils-new/src/main/java/**/*,core-it-support/core-it-plugins/maven-it-plugin-plexus-component-api/src/main/java/**/*,core-it-support/core-it-plugins/maven-it-plugin-log4j/src/main/java/**/*,core-it-support/core-it-plugins/maven-it-plugin-extension1/src/main/java/**/*,core-it-support/core-it-plugins/maven-it-plugin-extension2/src/main/java/**/*,core-it-support/core-it-plugins/maven-it-plugin-plexus-lifecycle/src/main/java/**/*,core-it-support/core-it-plugins/maven-it-plugin-settings/src/main/java/**/*,core-it-support/core-it-plugins/mng5805-plugin/src/main/java/**/*,core-it-support/core-it-plugins/mng5805-plugin-dep/src/main/java/**/*,core-it-support/core-it-plugins/mng5958-extension/src/main/java/**/*,core-it-support/core-it-plugins/mng6759-plugin-resolves-project-dependencies/src/main/java/**/*,core-it-support/core-it-toolchain/src/main/java/**/*,core-it-support/core-it-wagon/src/main/java/**/*,core-it-support/core-it-javaagent/src/main/java/**/*' - excludes: null
[TASKS] Found 167 files to scan for tasks
[TASKS] Found 0 open tasks.
Skipping warnings blame since pipelines do not have an SCM link.%n
[TASKS] Computing warning deltas based on reference build #85
[DevOpticsMavenPublisher] dependencies consumed: 5, artifacts produced: 156
[withMaven] Publishers: Pipeline Graph Publisher: 15 ms, Generated Artifacts Publisher: 489757 ms, Invoker Publisher: 3 ms, Junit Publisher: 521300 ms, Concordion Publisher: 2 ms, Dependencies Fingerprint Publisher: 4785 ms, Findbugs Publisher: 1 ms, JGiven Publisher: 1 ms, Jacoco Publisher: 1 ms, SpotBugs Publisher: 1 ms, Open Task Scanner Publisher: 22785 ms, CloudBees DevOptics Gate Artifact Publisher: 466401 ms
[Pipeline] // withMaven
[Pipeline] fileExists
[Pipeline] zip
Writing zip file of /home/jenkins/workspace/Maven_maven-box_maven_master/test/core-it-suite/target/test-classes to /home/jenkins/workspace/Maven_maven-box_maven_master/test/core-it-suite-logs-linux-jdk8.zip
Zipped 8648 entries.
Archiving /home/jenkins/workspace/Maven_maven-box_maven_master/test/core-it-suite-logs-linux-jdk8.zip
[Pipeline] fileExists
[Pipeline] zip
Writing zip file of /home/jenkins/workspace/Maven_maven-box_maven_master/test/core-it-suite/target/surefire-reports to /home/jenkins/workspace/Maven_maven-box_maven_master/test/core-it-suite-reports-linux-jdk8.zip
Zipped 4 entries.
Archiving /home/jenkins/workspace/Maven_maven-box_maven_master/test/core-it-suite-reports-linux-jdk8.zip
[Pipeline] deleteDir
[Pipeline] }
[Pipeline] // dir
[Pipeline] }
[Pipeline] // stage
[Pipeline] }
[Pipeline] // node
[Pipeline] }
[Pipeline] // parallel
[Pipeline] stage
[Pipeline] { (Notifications)
[Pipeline] echo
Build result: UNSTABLE
[Pipeline] jiraIssueSelector
[Pipeline] jiraComment
[Pipeline] echo
The authors of changes [michaelo].
[Pipeline] echo
Sending email ...
[Pipeline] emailext