Build unstable in Jenkins: Maven » Maven TLP » maven-javadoc-plugin » master #29

Previous Topic Next Topic
 
classic Classic list List threaded Threaded
2 messages Options
Reply | Threaded
Open this post in threaded view
|

Build unstable in Jenkins: Maven » Maven TLP » maven-javadoc-plugin » master #29

Apache Jenkins Server-2
See https://ci-builds.apache.org/job/Maven/job/maven-box/job/maven-javadoc-plugin/job/master/29/

Changes:

* [MJAVADOC-667] Broken links in Javadoc comments

2 tests failed.
FAILED:  org.apache.maven.plugins.javadoc.JavadocReportTest.linux-jdk16-m3.6.x_build / Build linux-jdk16-m3.6.x_build / testDefaultConfiguration

Error Message:
null

Stack Trace:
junit.framework.AssertionFailedError
        at org.apache.maven.plugins.javadoc.JavadocReportTest.testDefaultConfiguration(JavadocReportTest.java:293)


FAILED:  org.apache.maven.plugins.javadoc.JavadocReportTest.linux-jdk16-m3.6.x_build / Build linux-jdk16-m3.6.x_build / testCustomConfiguration

Error Message:
null

Stack Trace:
junit.framework.AssertionFailedError
        at org.apache.maven.plugins.javadoc.JavadocReportTest.testCustomConfiguration(JavadocReportTest.java:436)




Build log:
[...truncated 8484 lines...]
[INFO] Total time:  19:41 min
[INFO] Finished at: 2020-12-23T15:22:51-08:00
[INFO] ------------------------------------------------------------------------
[INFO] [jenkins-event-spy] Generated F:\jenkins\jenkins-slave\712657a4\workspace\_box_maven-javadoc-plugin_master@2@tmp\withMavenad34fdd7\maven-spy-20201223-150309-42614210460243405066277.log
[Pipeline] }
[Pipeline] // dir
[Pipeline] }
[withMaven] artifactsPublisher - Archive artifact windows-jdk11-m3.6.x_build\pom.xml under org\apache\maven\plugins\maven-javadoc-plugin\3.2.1-SNAPSHOT\maven-javadoc-plugin-3.2.1-SNAPSHOT.pom
[withMaven] artifactsPublisher - Archive artifact windows-jdk11-m3.6.x_build\target\maven-javadoc-plugin-3.2.1-SNAPSHOT.jar under org\apache\maven\plugins\maven-javadoc-plugin\3.2.1-SNAPSHOT\maven-javadoc-plugin-3.2.1-SNAPSHOT.jar
[Fast Archiver] Compressed 505.70 KB of artifacts by 38.0% relative to #28
[withMaven] junitPublisher - Archive test results for Maven artifact org.apache.maven.plugins:maven-javadoc-plugin:maven-plugin:3.2.1-SNAPSHOT generated by maven-surefire-plugin:test (default-test): windows-jdk11-m3.6.x_build\target\surefire-reports\*.xml
Recording test results
[INFO] run post-build script verify.bsh
[INFO]           MJAVADOC-369\pom.xml ............................. SUCCESS (16.0 s)
[INFO] Building: MJAVADOC-384\pom.xml
[withMaven] openTasksPublisher - Scan Tasks for Maven artifact org.apache.maven.plugins:maven-javadoc-plugin:maven-plugin:3.2.1-SNAPSHOT in source directory windows-jdk11-m3.6.x_build\src\main\java
[TASKS] Scanning folder 'f:\jenkins\jenkins-slave\712657a4\workspace\_box_maven-javadoc-plugin_master@2' for files matching the pattern 'windows-jdk11-m3.6.x_build\src\main\java\**\*' - excludes: null
[TASKS] Found 27 files to scan for tasks
[TASKS] Found 7 open tasks.
Skipping warnings blame since pipelines do not have an SCM link.%n
[TASKS] Computing warning deltas based on reference build #28
[withMaven] invokerPublisher - Archive invoker results for Maven artifact MavenArtifact{org.apache.maven.plugins:maven-javadoc-plugin:maven-plugin:3.2.1-SNAPSHOT(version: 3.2.1-SNAPSHOT, snapshot:false) } generated by PluginInvocation{org.apache.maven.plugins:maven-invoker-plugin:3.2.1@integration-test  integration-test}: windows-jdk11-m3.6.x_build\target\invoker-reports\*.xml
[INFO] run post-build script verify.bsh
[INFO]           MJAVADOC-384\pom.xml ............................. SUCCESS (8.1 s)
[INFO] Building: MJAVADOC-407\pom.xml
[INFO] run post-build script verify.bsh
[INFO]           MJAVADOC-407\pom.xml ............................. SUCCESS (9.7 s)
[INFO] Building: MJAVADOC-414\pom.xml
[INFO] run post-build script verify.bsh
[INFO]           MJAVADOC-414\pom.xml ............................. SUCCESS (8.7 s)
[INFO] Building: MJAVADOC-420_fixparam\pom.xml
[withMaven] Publishers: Generated Artifacts Publisher: 1472 ms, Junit Publisher: 5616 ms, Open Task Scanner Publisher: 2068 ms, Invoker Publisher: 174202 ms, Pipeline Graph Publisher: 1 ms
[INFO] run post-build script verify.groovy
[INFO]           MJAVADOC-420_fixparam\pom.xml .................... SUCCESS (10.5 s)
[INFO] Building: MJAVADOC-427\pom.xml
[Pipeline] // withMaven
[Pipeline] cleanWs
[WS-CLEANUP] Deleting project workspace...
[WS-CLEANUP] Deferred wipeout is used...
[WS-CLEANUP] done
[Pipeline] }
[Pipeline] // stage
[Pipeline] }
[Pipeline] // ws
[Pipeline] }
[Pipeline] // node
[Pipeline] }
[INFO] run post-build script verify.groovy
[INFO]           MJAVADOC-427\pom.xml ............................. SUCCESS (9.4 s)
[INFO] Building: MJAVADOC-434_fixcompile\pom.xml
[INFO]           MJAVADOC-434_fixcompile\pom.xml .................. SUCCESS (12.8 s)
[INFO] Building: MJAVADOC-437\pom.xml
[INFO] run post-build script verify.bsh
[INFO]           MJAVADOC-437\pom.xml ............................. SUCCESS (9.4 s)
[INFO] Building: MJAVADOC-444\pom.xml
[withMaven] Publishers: Generated Artifacts Publisher: 1492 ms, Junit Publisher: 2343 ms, Open Task Scanner Publisher: 2099 ms, Invoker Publisher: 75802 ms
[Pipeline] // withMaven
[Pipeline] cleanWs
[WS-CLEANUP] Deleting project workspace...
[WS-CLEANUP] Deferred wipeout is used...
[WS-CLEANUP] done
[Pipeline] }
[Pipeline] // stage
[Pipeline] }
[Pipeline] // ws
[Pipeline] }
[Pipeline] // node
[Pipeline] }
[INFO] run post-build script verify.bsh
[INFO]           MJAVADOC-444\pom.xml ............................. SUCCESS (28.0 s)
[INFO] Building: MJAVADOC-449_aggr_modulepath\pom.xml
[INFO] artifact org.apache.maven:plugins: checking for updates from central
[INFO] artifact org.codehaus:mojo: checking for updates from central
[withMaven] Publishers: Generated Artifacts Publisher: 2077 ms, Junit Publisher: 9116 ms, Open Task Scanner Publisher: 2191 ms, Invoker Publisher: 155671 ms
[Pipeline] // withMaven
[Pipeline] cleanWs
[WS-CLEANUP] Deleting project workspace...
[WS-CLEANUP] Deferred wipeout is used...
[WS-CLEANUP] done
[Pipeline] }
[Pipeline] // stage
[Pipeline] }
[Pipeline] // ws
[Pipeline] }
[Pipeline] // node
[Pipeline] }
[INFO] run post-build script verify.groovy
[INFO]           MJAVADOC-449_aggr_modulepath\pom.xml ............. SUCCESS (11.0 s)
[INFO] Building: MJAVADOC-452_fix-duplicateparams\pom.xml
[INFO] run post-build script verify.groovy
[INFO]           MJAVADOC-452_fix-duplicateparams\pom.xml ......... SUCCESS (8.2 s)
[INFO] Building: MJAVADOC-494_aggregate-repositories\pom.xml
[INFO]           MJAVADOC-494_aggregate-repositories\pom.xml ...... SUCCESS (8.9 s)
[INFO] Building: MJAVADOC-495_offline-filescheme\pom.xml
[INFO] run post-build script verify.groovy
[INFO]           MJAVADOC-495_offline-filescheme\pom.xml .......... SUCCESS (13.7 s)
[INFO] Building: MJAVADOC-497\pom.xml
[INFO] run post-build script verify.bsh
[INFO]           MJAVADOC-497\pom.xml ............................. SUCCESS (8.4 s)
[INFO] Building: MJAVADOC-498_aggr_modulepath\pom.xml
[INFO]           MJAVADOC-498_aggr_modulepath\pom.xml ............. SUCCESS (22.7 s)
[INFO] Building: MJAVADOC-498_mm_modulepath\pom.xml
[INFO]           MJAVADOC-498_mm_modulepath\pom.xml ............... SUCCESS (11.5 s)
[INFO] Building: MJAVADOC-498_modulepath\pom.xml
[INFO] run post-build script verify.groovy
[INFO]           MJAVADOC-498_modulepath\pom.xml .................. SUCCESS (13.5 s)
[INFO] Building: MJAVADOC-506_excl-module-info\pom.xml
[INFO] run post-build script verify.groovy
[INFO]           MJAVADOC-506_excl-module-info\pom.xml ............ SUCCESS (8.7 s)
[INFO] Building: MJAVADOC-508\pom.xml
[INFO]           MJAVADOC-508\pom.xml ............................. SUCCESS (6.7 s)
[INFO] Building: MJAVADOC-514_3rdparty-doclettags\pom.xml
[INFO]           MJAVADOC-514_3rdparty-doclettags\pom.xml ......... SKIPPED due to JRE version
[INFO] Building: MJAVADOC-526_aggr-managedDeps\pom.xml
[INFO]           MJAVADOC-526_aggr-managedDeps\pom.xml ............ SUCCESS (10.0 s)
[INFO] Building: MJAVADOC-528\pom.xml
[INFO] run post-build script verify.groovy
[INFO]           MJAVADOC-528\pom.xml ............................. SUCCESS (8.3 s)
[INFO] Building: MJAVADOC-538\pom.xml
[INFO]           MJAVADOC-538\pom.xml ............................. SUCCESS (6.8 s)
[INFO] Building: MJAVADOC-551 spaces\pom.xml
[INFO]           MJAVADOC-551 spaces\pom.xml ...................... SUCCESS (4.9 s)
[INFO] Building: MJAVADOC-552_fix-author\pom.xml
[INFO] run post-build script verify.groovy
[INFO]           MJAVADOC-552_fix-author\pom.xml .................. SUCCESS (8.4 s)
[INFO] Building: MJAVADOC-555_aggr_mixed\pom.xml
[INFO] run post-build script verify.groovy
[INFO]           MJAVADOC-555_aggr_mixed\pom.xml .................. SUCCESS (10.9 s)
[INFO] Building: MJAVADOC-555_link-automatic-modules\pom.xml
[INFO] run post-build script verify.groovy
[INFO]           MJAVADOC-555_link-automatic-modules\pom.xml ...... SUCCESS (12.2 s)
[INFO] Building: MJAVADOC-556_hide-non-exported-packages\pom.xml
[INFO]           MJAVADOC-556_hide-non-exported-packages\pom.xml .. SUCCESS (7.3 s)
[INFO] Building: MJAVADOC-558_fix-unknownthrows\pom.xml
[INFO] run post-build script verify.groovy
[INFO]           MJAVADOC-558_fix-unknownthrows\pom.xml ........... SUCCESS (8.9 s)
[INFO] Building: MJAVADOC-562_release\pom.xml
[INFO]           MJAVADOC-562_release\pom.xml ..................... SUCCESS (9.1 s)
[INFO] Building: MJAVADOC-567_aggr-mixed\pom.xml
[INFO] run post-build script verify.groovy
[INFO]           MJAVADOC-567_aggr-mixed\pom.xml .................. SUCCESS (6.0 s)
[INFO] Building: MJAVADOC-568_export-to-testcase\pom.xml
[INFO]           MJAVADOC-568_export-to-testcase\pom.xml .......... SUCCESS (19.4 s)
[INFO] Building: MJAVADOC-568_jar-mixed\pom.xml
[INFO]           MJAVADOC-568_jar-mixed\pom.xml ................... SUCCESS (13.5 s)
[INFO] Building: MJAVADOC-568_manifest-splitpackage\pom.xml
[INFO]           MJAVADOC-568_manifest-splitpackage\pom.xml ....... SUCCESS (19.2 s)
[INFO] Building: MJAVADOC-569_aggr-mixed\pom.xml
[INFO]           MJAVADOC-569_aggr-mixed\pom.xml .................. SUCCESS (16.9 s)
[INFO] Building: MJAVADOC-575_source8-module-info\pom.xml
[INFO] run post-build script verify.groovy
[INFO]           MJAVADOC-575_source8-module-info\pom.xml ......... SUCCESS (7.8 s)
[INFO] Building: MJAVADOC-580_detectLinks\pom.xml
[INFO] run post-build script verify.groovy
[INFO]           MJAVADOC-580_detectLinks\pom.xml ................. SUCCESS (7.0 s)
[INFO] Building: MJAVADOC-591_release8\pom.xml
[INFO]           MJAVADOC-591_release8\pom.xml .................... SUCCESS (9.8 s)
[INFO] Building: MJAVADOC-599\pom.xml
[INFO] run post-build script verify.groovy
[INFO]           MJAVADOC-599\pom.xml ............................. SUCCESS (9.4 s)
[INFO] Building: MJAVADOC-610_mrjar\pom.xml
[INFO] run post-build script verify.groovy
[INFO]           MJAVADOC-610_mrjar\pom.xml ....................... SUCCESS (9.8 s)
[INFO] Building: MJAVADOC-613-aggregate-exclude\pom.xml
[INFO] run post-build script verify.groovy
[INFO]           MJAVADOC-613-aggregate-exclude\pom.xml ........... SUCCESS (14.9 s)
[INFO] Building: MJAVADOC-620_no-dot-in-version\pom.xml
[INFO] run post-build script verify.bsh
[INFO]           MJAVADOC-620_no-dot-in-version\pom.xml ........... SUCCESS (13.9 s)
[INFO] Building: MJAVADOC-620_top-level-package\pom.xml
[INFO] run post-build script verify.bsh
[INFO]           MJAVADOC-620_top-level-package\pom.xml ........... SUCCESS (12.7 s)
[INFO] Building: MJAVADOC-636-aggregate_module_skipped\pom.xml
[INFO] run post-build script verify.groovy
[INFO]           MJAVADOC-636-aggregate_module_skipped\pom.xml .... SUCCESS (24.2 s)
[INFO] Building: MJAVADOC-639_aggr_static_modulepath\pom.xml
[INFO]           MJAVADOC-639_aggr_static_modulepath\pom.xml ...... SUCCESS (9.6 s)
[INFO] Building: MJAVADOC-639_requires_ignored\pom.xml
[INFO] run post-build script verify.groovy
[INFO]           MJAVADOC-639_requires_ignored\pom.xml ............ SUCCESS (18.3 s)
[INFO] Building: site-failOnError\pom.xml
[INFO]           site-failOnError\pom.xml ......................... SUCCESS (8.5 s)
[INFO]
[INFO] --- mrm-maven-plugin:1.2.0:stop (repository) @ maven-javadoc-plugin ---
[INFO] Stopping Mock Repository Manager on http://localhost:52054
[INFO] Stopped SocketConnector@0.0.0.0:52054
[INFO] Mock Repository Manager http://localhost:52054 is stopped.
[INFO]
[INFO] --- mrm-maven-plugin:1.2.0:stop (3rdparty) @ maven-javadoc-plugin ---
[INFO] Stopping Mock Repository Manager on http://localhost:52055
[INFO] Stopped SocketConnector@0.0.0.0:52055
[INFO] Mock Repository Manager http://localhost:52055 is stopped.
[INFO]
[INFO] --- maven-checkstyle-plugin:3.0.0:check (checkstyle-check) @ maven-javadoc-plugin ---
[INFO] There are 4 errors reported by Checkstyle 6.18 with config/maven_checks.xml ruleset.
[INFO] Ignored 4 errors, 0 violation remaining.
[INFO]
[INFO] --- maven-invoker-plugin:3.2.1:verify (integration-test) @ maven-javadoc-plugin ---
[INFO] -------------------------------------------------
[INFO] Build Summary:
[INFO]   Passed: 67, Failed: 0, Errors: 0, Skipped: 4
[INFO] -------------------------------------------------
[INFO] ------------------------------------------------------------------------
[INFO] BUILD SUCCESS
[INFO] ------------------------------------------------------------------------
[INFO] Total time:  17:26 min
[INFO] Finished at: 2020-12-23T15:31:49-08:00
[INFO] ------------------------------------------------------------------------
[INFO] [jenkins-event-spy] Generated F:\jenkins\jenkins-slave\712657a4\workspace\_box_maven-javadoc-plugin_master@2@tmp\withMaven0bb7ca44\maven-spy-20201223-151421-92611949450757064564394.log
[Pipeline] }
[Pipeline] // dir
[Pipeline] }
[withMaven] artifactsPublisher - Archive artifact windows-jdk15-m3.6.x_build\pom.xml under org\apache\maven\plugins\maven-javadoc-plugin\3.2.1-SNAPSHOT\maven-javadoc-plugin-3.2.1-SNAPSHOT.pom
[withMaven] artifactsPublisher - Archive artifact windows-jdk15-m3.6.x_build\target\maven-javadoc-plugin-3.2.1-SNAPSHOT.jar under org\apache\maven\plugins\maven-javadoc-plugin\3.2.1-SNAPSHOT\maven-javadoc-plugin-3.2.1-SNAPSHOT.jar
[Fast Archiver] Compressed 507.96 KB of artifacts by 50.4% relative to #28
[withMaven] junitPublisher - Archive test results for Maven artifact org.apache.maven.plugins:maven-javadoc-plugin:maven-plugin:3.2.1-SNAPSHOT generated by maven-surefire-plugin:test (default-test): windows-jdk15-m3.6.x_build\target\surefire-reports\*.xml
Recording test results
[withMaven] openTasksPublisher - Scan Tasks for Maven artifact org.apache.maven.plugins:maven-javadoc-plugin:maven-plugin:3.2.1-SNAPSHOT in source directory windows-jdk15-m3.6.x_build\src\main\java
[TASKS] Scanning folder 'f:\jenkins\jenkins-slave\712657a4\workspace\_box_maven-javadoc-plugin_master@2' for files matching the pattern 'windows-jdk15-m3.6.x_build\src\main\java\**\*' - excludes: null
[TASKS] Found 27 files to scan for tasks
[TASKS] Found 7 open tasks.
Skipping warnings blame since pipelines do not have an SCM link.%n
[TASKS] Computing warning deltas based on reference build #28
[withMaven] invokerPublisher - Archive invoker results for Maven artifact MavenArtifact{org.apache.maven.plugins:maven-javadoc-plugin:maven-plugin:3.2.1-SNAPSHOT(version: 3.2.1-SNAPSHOT, snapshot:false) } generated by PluginInvocation{org.apache.maven.plugins:maven-invoker-plugin:3.2.1@integration-test  integration-test}: windows-jdk15-m3.6.x_build\target\invoker-reports\*.xml
[withMaven] Publishers: Generated Artifacts Publisher: 315 ms, Junit Publisher: 912 ms, Open Task Scanner Publisher: 340 ms, Invoker Publisher: 71934 ms, Pipeline Graph Publisher: 1 ms
[Pipeline] // withMaven
[Pipeline] cleanWs
[WS-CLEANUP] Deleting project workspace...
[WS-CLEANUP] Deferred wipeout is used...
[WS-CLEANUP] done
[Pipeline] }
[Pipeline] // stage
[Pipeline] }
[Pipeline] // ws
[Pipeline] }
[Pipeline] // node
[Pipeline] }
[Pipeline] // parallel
[Pipeline] stage
[Pipeline] { (Notifications)
[Pipeline] echo
Build result: UNSTABLE
[Pipeline] jiraIssueSelector
[Pipeline] jiraComment
[Pipeline] echo
The authors of changes [michaelo].
[Pipeline] echo
Sending email ...
[Pipeline] emailext
Reply | Threaded
Open this post in threaded view
|

Build unstable in Jenkins: Maven » Maven TLP » maven-javadoc-plugin » master #30

Apache Jenkins Server-2
See https://ci-builds.apache.org/job/Maven/job/maven-box/job/maven-javadoc-plugin/job/master/30/

Changes:

* Next Maven version change 3.7.x -> 4.x.x
* Added Java 17

3 tests failed.
FAILED:  org.apache.maven.plugins.javadoc.JavadocReportTest.linux-jdk16-m3.6.x_build / Build linux-jdk16-m3.6.x_build / testDefaultConfiguration

Error Message:
null

Stack Trace:
junit.framework.AssertionFailedError
        at org.apache.maven.plugins.javadoc.JavadocReportTest.testDefaultConfiguration(JavadocReportTest.java:293)


FAILED:  org.apache.maven.plugins.javadoc.JavadocReportTest.linux-jdk16-m3.6.x_build / Build linux-jdk16-m3.6.x_build / testCustomConfiguration

Error Message:
null

Stack Trace:
junit.framework.AssertionFailedError
        at org.apache.maven.plugins.javadoc.JavadocReportTest.testCustomConfiguration(JavadocReportTest.java:436)


FAILED:  org.apache.maven.plugins.javadoc.JavadocUtilTest.linux-jdk16-m3.6.x_build / Build linux-jdk16-m3.6.x_build / testCopyJavadocResources

Error Message:
Unable to make field private static final long java.util.ArrayList.serialVersionUID accessible: module java.base does not "opens java.util" to unnamed module @209c0b14

Stack Trace:
java.lang.reflect.InaccessibleObjectException: Unable to make field private static final long java.util.ArrayList.serialVersionUID accessible: module java.base does not "opens java.util" to unnamed module @209c0b14
        at org.apache.maven.plugins.javadoc.JavadocUtilTest.testCopyJavadocResources(JavadocUtilTest.java:644)




Build log:
[...truncated 8464 lines...]
[INFO] Building: MJAVADOC-514_3rdparty-doclettags\pom.xml
[INFO]           MJAVADOC-514_3rdparty-doclettags\pom.xml ......... SKIPPED due to JRE version
[INFO] Building: MJAVADOC-526_aggr-managedDeps\pom.xml
[INFO] run post-build script verify.groovy
[INFO]           MJAVADOC-555_aggr_mixed\pom.xml .................. SUCCESS (11.2 s)
[INFO] Building: MJAVADOC-555_link-automatic-modules\pom.xml
[INFO]           MJAVADOC-526_aggr-managedDeps\pom.xml ............ SUCCESS (9.9 s)
[INFO] Building: MJAVADOC-528\pom.xml
[INFO] run post-build script verify.groovy
[INFO]           MJAVADOC-555_link-automatic-modules\pom.xml ...... SUCCESS (13.5 s)
[INFO] Building: MJAVADOC-556_hide-non-exported-packages\pom.xml
[INFO] run post-build script verify.groovy
[INFO]           MJAVADOC-528\pom.xml ............................. SUCCESS (9.1 s)
[INFO] Building: MJAVADOC-538\pom.xml
[INFO]           MJAVADOC-538\pom.xml ............................. SUCCESS (7.2 s)
[INFO] Building: MJAVADOC-551 spaces\pom.xml
[INFO]           MJAVADOC-556_hide-non-exported-packages\pom.xml .. SUCCESS (8.2 s)
[INFO] Building: MJAVADOC-558_fix-unknownthrows\pom.xml
[INFO]           MJAVADOC-551 spaces\pom.xml ...................... SUCCESS (5.5 s)
[INFO] Building: MJAVADOC-552_fix-author\pom.xml
[INFO] run post-build script verify.groovy
[INFO]           MJAVADOC-558_fix-unknownthrows\pom.xml ........... SUCCESS (8.4 s)
[INFO] Building: MJAVADOC-562_release\pom.xml
[INFO] run post-build script verify.groovy
[INFO]           MJAVADOC-552_fix-author\pom.xml .................. SUCCESS (8.6 s)
[INFO] Building: MJAVADOC-555_aggr_mixed\pom.xml
[INFO]           MJAVADOC-562_release\pom.xml ..................... SUCCESS (9.4 s)
[INFO] Building: MJAVADOC-567_aggr-mixed\pom.xml
[INFO] run post-build script verify.groovy
[INFO]           MJAVADOC-567_aggr-mixed\pom.xml .................. SUCCESS (5.6 s)
[INFO] Building: MJAVADOC-568_export-to-testcase\pom.xml
[INFO] run post-build script verify.groovy
[INFO]           MJAVADOC-555_aggr_mixed\pom.xml .................. SUCCESS (10.8 s)
[INFO] Building: MJAVADOC-555_link-automatic-modules\pom.xml
[INFO] run post-build script verify.groovy
[INFO]           MJAVADOC-555_link-automatic-modules\pom.xml ...... SUCCESS (13.1 s)
[INFO] Building: MJAVADOC-556_hide-non-exported-packages\pom.xml
[INFO]           MJAVADOC-568_export-to-testcase\pom.xml .......... SUCCESS (20.7 s)
[INFO] Building: MJAVADOC-568_jar-mixed\pom.xml
[INFO]           MJAVADOC-556_hide-non-exported-packages\pom.xml .. SUCCESS (8.6 s)
[INFO] Building: MJAVADOC-558_fix-unknownthrows\pom.xml
[INFO] run post-build script verify.groovy
[INFO]           MJAVADOC-558_fix-unknownthrows\pom.xml ........... SUCCESS (9.2 s)
[INFO] Building: MJAVADOC-562_release\pom.xml
[INFO]           MJAVADOC-568_jar-mixed\pom.xml ................... SUCCESS (14.5 s)
[INFO] Building: MJAVADOC-568_manifest-splitpackage\pom.xml
[INFO]           MJAVADOC-562_release\pom.xml ..................... SUCCESS (9.5 s)
[INFO] Building: MJAVADOC-567_aggr-mixed\pom.xml
[INFO] run post-build script verify.groovy
[INFO]           MJAVADOC-567_aggr-mixed\pom.xml .................. SUCCESS (6.2 s)
[INFO] Building: MJAVADOC-568_export-to-testcase\pom.xml
[INFO]           MJAVADOC-568_manifest-splitpackage\pom.xml ....... SUCCESS (21.5 s)
[INFO] Building: MJAVADOC-569_aggr-mixed\pom.xml
[INFO]           MJAVADOC-568_export-to-testcase\pom.xml .......... SUCCESS (19.9 s)
[INFO] Building: MJAVADOC-568_jar-mixed\pom.xml
[INFO]           MJAVADOC-569_aggr-mixed\pom.xml .................. SUCCESS (17.5 s)
[INFO] Building: MJAVADOC-575_source8-module-info\pom.xml
[INFO] run post-build script verify.groovy
[INFO]           MJAVADOC-575_source8-module-info\pom.xml ......... SUCCESS (8.8 s)
[INFO] Building: MJAVADOC-580_detectLinks\pom.xml
[INFO]           MJAVADOC-568_jar-mixed\pom.xml ................... SUCCESS (14.2 s)
[INFO] Building: MJAVADOC-568_manifest-splitpackage\pom.xml
[INFO] run post-build script verify.groovy
[INFO]           MJAVADOC-580_detectLinks\pom.xml ................. SUCCESS (6.9 s)
[INFO] Building: MJAVADOC-591_release8\pom.xml
[INFO]           MJAVADOC-591_release8\pom.xml .................... SUCCESS (10.0 s)
[INFO] Building: MJAVADOC-599\pom.xml
[INFO]           MJAVADOC-568_manifest-splitpackage\pom.xml ....... SUCCESS (20.7 s)
[INFO] Building: MJAVADOC-569_aggr-mixed\pom.xml
[INFO] run post-build script verify.groovy
[INFO]           MJAVADOC-599\pom.xml ............................. SUCCESS (9.5 s)
[INFO] Building: MJAVADOC-610_mrjar\pom.xml
[INFO]           MJAVADOC-610_mrjar\pom.xml ....................... SKIPPED due to JRE version
[INFO] Building: MJAVADOC-613-aggregate-exclude\pom.xml
[INFO]           MJAVADOC-569_aggr-mixed\pom.xml .................. SUCCESS (16.5 s)
[INFO] Building: MJAVADOC-575_source8-module-info\pom.xml
[INFO] run post-build script verify.groovy
[INFO]           MJAVADOC-613-aggregate-exclude\pom.xml ........... SUCCESS (14.7 s)
[INFO] Building: MJAVADOC-620_no-dot-in-version\pom.xml
[INFO] run post-build script verify.groovy
[INFO]           MJAVADOC-575_source8-module-info\pom.xml ......... SUCCESS (7.8 s)
[INFO] Building: MJAVADOC-580_detectLinks\pom.xml
[INFO] run post-build script verify.groovy
[INFO]           MJAVADOC-580_detectLinks\pom.xml ................. SUCCESS (7.2 s)
[INFO] Building: MJAVADOC-591_release8\pom.xml
[INFO] run post-build script verify.bsh
[INFO]           MJAVADOC-620_no-dot-in-version\pom.xml ........... SUCCESS (12.4 s)
[INFO] Building: MJAVADOC-620_top-level-package\pom.xml
[INFO]           MJAVADOC-591_release8\pom.xml .................... SUCCESS (10.4 s)
[INFO] Building: MJAVADOC-599\pom.xml
[INFO] run post-build script verify.bsh
[INFO]           MJAVADOC-620_top-level-package\pom.xml ........... SUCCESS (12.8 s)
[INFO] Building: MJAVADOC-636-aggregate_module_skipped\pom.xml
[INFO] run post-build script verify.groovy
[INFO]           MJAVADOC-599\pom.xml ............................. SUCCESS (9.6 s)
[INFO] Building: MJAVADOC-610_mrjar\pom.xml
[INFO] run post-build script verify.groovy
[INFO]           MJAVADOC-610_mrjar\pom.xml ....................... SUCCESS (10.0 s)
[INFO] Building: MJAVADOC-613-aggregate-exclude\pom.xml
[INFO] run post-build script verify.groovy
[INFO]           MJAVADOC-636-aggregate_module_skipped\pom.xml .... SUCCESS (24.7 s)
[INFO] Building: MJAVADOC-639_aggr_static_modulepath\pom.xml
[INFO] run post-build script verify.groovy
[INFO]           MJAVADOC-613-aggregate-exclude\pom.xml ........... SUCCESS (15.4 s)
[INFO] Building: MJAVADOC-620_no-dot-in-version\pom.xml
[INFO]           MJAVADOC-639_aggr_static_modulepath\pom.xml ...... SUCCESS (9.8 s)
[INFO] Building: MJAVADOC-639_requires_ignored\pom.xml
[INFO] artifact org.apache.maven.plugins:maven-source-plugin: checking for updates from central
[INFO] run post-build script verify.bsh
[INFO]           MJAVADOC-620_no-dot-in-version\pom.xml ........... SUCCESS (13.5 s)
[INFO] Building: MJAVADOC-620_top-level-package\pom.xml
[INFO] run post-build script verify.groovy
[INFO]           MJAVADOC-639_requires_ignored\pom.xml ............ SUCCESS (19.7 s)
[INFO] Building: site-failOnError\pom.xml
[INFO] run post-build script verify.bsh
[INFO]           MJAVADOC-620_top-level-package\pom.xml ........... SUCCESS (12.8 s)
[INFO] Building: MJAVADOC-636-aggregate_module_skipped\pom.xml
[INFO]           site-failOnError\pom.xml ......................... SUCCESS (8.6 s)
[INFO]
[INFO] --- mrm-maven-plugin:1.2.0:stop (repository) @ maven-javadoc-plugin ---
[INFO] Stopping Mock Repository Manager on http://localhost:64303
[INFO] Stopped SocketConnector@0.0.0.0:64303
[INFO] Mock Repository Manager http://localhost:64303 is stopped.
[INFO]
[INFO] --- mrm-maven-plugin:1.2.0:stop (3rdparty) @ maven-javadoc-plugin ---
[INFO] Stopping Mock Repository Manager on http://localhost:64304
[INFO] Stopped SocketConnector@0.0.0.0:64304
[INFO] Mock Repository Manager http://localhost:64304 is stopped.
[INFO]
[INFO] --- maven-checkstyle-plugin:3.0.0:check (checkstyle-check) @ maven-javadoc-plugin ---
[INFO] There are 4 errors reported by Checkstyle 6.18 with config/maven_checks.xml ruleset.
[INFO] Ignored 4 errors, 0 violation remaining.
[INFO]
[INFO] --- maven-invoker-plugin:3.2.1:verify (integration-test) @ maven-javadoc-plugin ---
[INFO] -------------------------------------------------
[INFO] Build Summary:
[INFO]   Passed: 69, Failed: 0, Errors: 0, Skipped: 2
[INFO] -------------------------------------------------
[INFO] ------------------------------------------------------------------------
[INFO] BUILD SUCCESS
[INFO] ------------------------------------------------------------------------
[INFO] Total time:  18:49 min
[INFO] Finished at: 2021-01-10T07:01:01-08:00
[INFO] ------------------------------------------------------------------------
[INFO] [jenkins-event-spy] Generated F:\jenkins\jenkins-slave\712657a4\workspace\_box_maven-javadoc-plugin_master@2@tmp\withMavenfb2486b6\maven-spy-20210110-064212-530996524530226338390.log
[Pipeline] }
[Pipeline] // dir
[Pipeline] }
[withMaven] artifactsPublisher - Archive artifact windows-jdk11-m3.6.x_build\pom.xml under org\apache\maven\plugins\maven-javadoc-plugin\3.2.1-SNAPSHOT\maven-javadoc-plugin-3.2.1-SNAPSHOT.pom
[withMaven] artifactsPublisher - Archive artifact windows-jdk11-m3.6.x_build\target\maven-javadoc-plugin-3.2.1-SNAPSHOT.jar under org\apache\maven\plugins\maven-javadoc-plugin\3.2.1-SNAPSHOT\maven-javadoc-plugin-3.2.1-SNAPSHOT.jar
[Fast Archiver] Compressed 505.70 KB of artifacts by 69.6% relative to #29
[withMaven] junitPublisher - Archive test results for Maven artifact org.apache.maven.plugins:maven-javadoc-plugin:maven-plugin:3.2.1-SNAPSHOT generated by maven-surefire-plugin:test (default-test): windows-jdk11-m3.6.x_build\target\surefire-reports\*.xml
Recording test results
[withMaven] openTasksPublisher - Scan Tasks for Maven artifact org.apache.maven.plugins:maven-javadoc-plugin:maven-plugin:3.2.1-SNAPSHOT in source directory windows-jdk11-m3.6.x_build\src\main\java
[TASKS] Scanning folder 'f:\jenkins\jenkins-slave\712657a4\workspace\_box_maven-javadoc-plugin_master@2' for files matching the pattern 'windows-jdk11-m3.6.x_build\src\main\java\**\*' - excludes: null
[TASKS] Found 27 files to scan for tasks
[TASKS] Found 7 open tasks.
Skipping warnings blame since pipelines do not have an SCM link.%n
[TASKS] Computing warning deltas based on reference build #29
[withMaven] invokerPublisher - Archive invoker results for Maven artifact MavenArtifact{org.apache.maven.plugins:maven-javadoc-plugin:maven-plugin:3.2.1-SNAPSHOT(version: 3.2.1-SNAPSHOT, snapshot:false) } generated by PluginInvocation{org.apache.maven.plugins:maven-invoker-plugin:3.2.1@integration-test  integration-test}: windows-jdk11-m3.6.x_build\target\invoker-reports\*.xml
[INFO] run post-build script verify.groovy
[INFO]           MJAVADOC-636-aggregate_module_skipped\pom.xml .... SUCCESS (25.5 s)
[INFO] Building: MJAVADOC-639_aggr_static_modulepath\pom.xml
[INFO]           MJAVADOC-639_aggr_static_modulepath\pom.xml ...... SUCCESS (10.1 s)
[INFO] Building: MJAVADOC-639_requires_ignored\pom.xml
[INFO] artifact org.apache.maven.plugins:maven-source-plugin: checking for updates from central
[INFO] run post-build script verify.groovy
[INFO]           MJAVADOC-639_requires_ignored\pom.xml ............ SUCCESS (18.7 s)
[INFO] Building: site-failOnError\pom.xml
[INFO]           site-failOnError\pom.xml ......................... SUCCESS (9.5 s)
[INFO]
[INFO] --- mrm-maven-plugin:1.2.0:stop (repository) @ maven-javadoc-plugin ---
[INFO] Stopping Mock Repository Manager on http://localhost:51914
[INFO] Stopped SocketConnector@0.0.0.0:51914
[INFO] Mock Repository Manager http://localhost:51914 is stopped.
[INFO]
[INFO] --- mrm-maven-plugin:1.2.0:stop (3rdparty) @ maven-javadoc-plugin ---
[INFO] Stopping Mock Repository Manager on http://localhost:51915
[INFO] Stopped SocketConnector@0.0.0.0:51915
[INFO] Mock Repository Manager http://localhost:51915 is stopped.
[INFO]
[INFO] --- maven-checkstyle-plugin:3.0.0:check (checkstyle-check) @ maven-javadoc-plugin ---
[INFO] There are 4 errors reported by Checkstyle 6.18 with config/maven_checks.xml ruleset.
[INFO] Ignored 4 errors, 0 violation remaining.
[INFO]
[INFO] --- maven-invoker-plugin:3.2.1:verify (integration-test) @ maven-javadoc-plugin ---
[INFO] -------------------------------------------------
[INFO] Build Summary:
[INFO]   Passed: 67, Failed: 0, Errors: 0, Skipped: 4
[INFO] -------------------------------------------------
[INFO] ------------------------------------------------------------------------
[INFO] BUILD SUCCESS
[INFO] ------------------------------------------------------------------------
[INFO] Total time:  18:03 min
[INFO] Finished at: 2021-01-10T07:01:51-08:00
[INFO] ------------------------------------------------------------------------
[INFO] [jenkins-event-spy] Generated F:\jenkins\jenkins-slave\712657a4\workspace\_box_maven-javadoc-plugin_master@2@tmp\withMavenecc8b01b\maven-spy-20210110-064347-75615720974072946040626.log
[Pipeline] }
[Pipeline] // dir
[Pipeline] }
[withMaven] artifactsPublisher - Archive artifact windows-jdk15-m3.6.x_build\pom.xml under org\apache\maven\plugins\maven-javadoc-plugin\3.2.1-SNAPSHOT\maven-javadoc-plugin-3.2.1-SNAPSHOT.pom
[withMaven] artifactsPublisher - Archive artifact windows-jdk15-m3.6.x_build\target\maven-javadoc-plugin-3.2.1-SNAPSHOT.jar under org\apache\maven\plugins\maven-javadoc-plugin\3.2.1-SNAPSHOT\maven-javadoc-plugin-3.2.1-SNAPSHOT.jar
[Fast Archiver] Compressed 507.96 KB of artifacts by 94.5% relative to #29
[withMaven] junitPublisher - Archive test results for Maven artifact org.apache.maven.plugins:maven-javadoc-plugin:maven-plugin:3.2.1-SNAPSHOT generated by maven-surefire-plugin:test (default-test): windows-jdk15-m3.6.x_build\target\surefire-reports\*.xml
Recording test results
[withMaven] openTasksPublisher - Scan Tasks for Maven artifact org.apache.maven.plugins:maven-javadoc-plugin:maven-plugin:3.2.1-SNAPSHOT in source directory windows-jdk15-m3.6.x_build\src\main\java
[TASKS] Scanning folder 'f:\jenkins\jenkins-slave\712657a4\workspace\_box_maven-javadoc-plugin_master@2' for files matching the pattern 'windows-jdk15-m3.6.x_build\src\main\java\**\*' - excludes: null
[TASKS] Found 27 files to scan for tasks
[TASKS] Found 7 open tasks.
Skipping warnings blame since pipelines do not have an SCM link.%n
[TASKS] Computing warning deltas based on reference build #29
[withMaven] invokerPublisher - Archive invoker results for Maven artifact MavenArtifact{org.apache.maven.plugins:maven-javadoc-plugin:maven-plugin:3.2.1-SNAPSHOT(version: 3.2.1-SNAPSHOT, snapshot:false) } generated by PluginInvocation{org.apache.maven.plugins:maven-invoker-plugin:3.2.1@integration-test  integration-test}: windows-jdk15-m3.6.x_build\target\invoker-reports\*.xml
[withMaven] Publishers: Generated Artifacts Publisher: 273 ms, Junit Publisher: 881 ms, Open Task Scanner Publisher: 331 ms, Invoker Publisher: 75157 ms
[Pipeline] // withMaven
[Pipeline] cleanWs
[WS-CLEANUP] Deleting project workspace...
[WS-CLEANUP] Deferred wipeout is used...
[WS-CLEANUP] done
[Pipeline] }
[Pipeline] // stage
[Pipeline] }
[Pipeline] // ws
[Pipeline] }
[Pipeline] // node
[Pipeline] }
[withMaven] Publishers: Generated Artifacts Publisher: 227 ms, Junit Publisher: 887 ms, Open Task Scanner Publisher: 370 ms, Invoker Publisher: 74247 ms, Pipeline Graph Publisher: 4 ms
[Pipeline] // withMaven
[Pipeline] cleanWs
[WS-CLEANUP] Deleting project workspace...
[WS-CLEANUP] Deferred wipeout is used...
[WS-CLEANUP] done
[Pipeline] }
[Pipeline] // stage
[Pipeline] }
[Pipeline] // ws
[Pipeline] }
[Pipeline] // node
[Pipeline] }
[Pipeline] // parallel
[Pipeline] stage
[Pipeline] { (Notifications)
[Pipeline] echo
Build result: UNSTABLE
[Pipeline] jiraIssueSelector
[Pipeline] echo
The authors of changes [slachiewicz].
[Pipeline] echo
Sending email ...
[Pipeline] emailext