Build unstable in Jenkins: Maven » Maven TLP » maven-indexer » guava #23

Previous Topic Next Topic
 
classic Classic list List threaded Threaded
1 message Options
Reply | Threaded
Open this post in threaded view
|

Build unstable in Jenkins: Maven » Maven TLP » maven-indexer » guava #23

Apache Jenkins Server-2
See https://ci-builds.apache.org/job/Maven/job/maven-box/job/maven-indexer/job/guava/23/

Changes:

* Reomve Guava from tests

224 tests failed.
FAILED:  org.apache.maven.index.ConcurrentUseTest.linux-jdk16 / Build linux-jdk16 / testConcurrency

Error Message:
java.lang.NoClassDefFoundError: Could not initialize class com.google.inject.internal.cglib.core.$ReflectUtils

Stack Trace:
com.google.common.util.concurrent.ExecutionError: java.lang.NoClassDefFoundError: Could not initialize class com.google.inject.internal.cglib.core.$ReflectUtils
Caused by: java.lang.NoClassDefFoundError: Could not initialize class com.google.inject.internal.cglib.core.$ReflectUtils


FAILED:  org.apache.maven.index.ConcurrentUseTest.linux-jdk16 / Build linux-jdk16 / testDirectory

Error Message:
java.lang.NoClassDefFoundError: Could not initialize class com.google.inject.internal.cglib.core.$ReflectUtils

Stack Trace:
com.google.common.util.concurrent.ExecutionError: java.lang.NoClassDefFoundError: Could not initialize class com.google.inject.internal.cglib.core.$ReflectUtils
Caused by: java.lang.NoClassDefFoundError: Could not initialize class com.google.inject.internal.cglib.core.$ReflectUtils


FAILED:  org.apache.maven.index.ConcurrentUseWithMergedContextPublishingTest.linux-jdk16 / Build linux-jdk16 / testConcurrency

Error Message:
java.lang.NoClassDefFoundError: Could not initialize class com.google.inject.internal.cglib.core.$ReflectUtils

Stack Trace:
com.google.common.util.concurrent.ExecutionError: java.lang.NoClassDefFoundError: Could not initialize class com.google.inject.internal.cglib.core.$ReflectUtils
        at org.apache.maven.index.ConcurrentUseWithMergedContextPublishingTest.setUp(ConcurrentUseWithMergedContextPublishingTest.java:50)
Caused by: java.lang.NoClassDefFoundError: Could not initialize class com.google.inject.internal.cglib.core.$ReflectUtils
        at org.apache.maven.index.ConcurrentUseWithMergedContextPublishingTest.setUp(ConcurrentUseWithMergedContextPublishingTest.java:50)


FAILED:  org.apache.maven.index.ConcurrentUseWithMergedContextPublishingTest.linux-jdk16 / Build linux-jdk16 / testDirectory

Error Message:
java.lang.NoClassDefFoundError: Could not initialize class com.google.inject.internal.cglib.core.$ReflectUtils

Stack Trace:
com.google.common.util.concurrent.ExecutionError: java.lang.NoClassDefFoundError: Could not initialize class com.google.inject.internal.cglib.core.$ReflectUtils
        at org.apache.maven.index.ConcurrentUseWithMergedContextPublishingTest.setUp(ConcurrentUseWithMergedContextPublishingTest.java:50)
Caused by: java.lang.NoClassDefFoundError: Could not initialize class com.google.inject.internal.cglib.core.$ReflectUtils
        at org.apache.maven.index.ConcurrentUseWithMergedContextPublishingTest.setUp(ConcurrentUseWithMergedContextPublishingTest.java:50)


FAILED:  org.apache.maven.index.ConcurrentUseWithMergedContextTest.linux-jdk16 / Build linux-jdk16 / testConcurrency

Error Message:
java.lang.NoClassDefFoundError: Could not initialize class com.google.inject.internal.cglib.core.$ReflectUtils

Stack Trace:
com.google.common.util.concurrent.ExecutionError: java.lang.NoClassDefFoundError: Could not initialize class com.google.inject.internal.cglib.core.$ReflectUtils
Caused by: java.lang.NoClassDefFoundError: Could not initialize class com.google.inject.internal.cglib.core.$ReflectUtils


FAILED:  org.apache.maven.index.ConcurrentUseWithMergedContextTest.linux-jdk16 / Build linux-jdk16 / testDirectory

Error Message:
java.lang.NoClassDefFoundError: Could not initialize class com.google.inject.internal.cglib.core.$ReflectUtils

Stack Trace:
com.google.common.util.concurrent.ExecutionError: java.lang.NoClassDefFoundError: Could not initialize class com.google.inject.internal.cglib.core.$ReflectUtils
Caused by: java.lang.NoClassDefFoundError: Could not initialize class com.google.inject.internal.cglib.core.$ReflectUtils


FAILED:  org.apache.maven.index.DefaultIndexNexusIndexerTest.linux-jdk16 / Build linux-jdk16 / testIndexTimestamp

Error Message:
java.lang.NoClassDefFoundError: Could not initialize class com.google.inject.internal.cglib.core.$ReflectUtils

Stack Trace:
com.google.common.util.concurrent.ExecutionError: java.lang.NoClassDefFoundError: Could not initialize class com.google.inject.internal.cglib.core.$ReflectUtils
Caused by: java.lang.NoClassDefFoundError: Could not initialize class com.google.inject.internal.cglib.core.$ReflectUtils


FAILED:  org.apache.maven.index.DefaultIndexNexusIndexerTest.linux-jdk16 / Build linux-jdk16 / testPluginPackaging

Error Message:
java.lang.NoClassDefFoundError: Could not initialize class com.google.inject.internal.cglib.core.$ReflectUtils

Stack Trace:
com.google.common.util.concurrent.ExecutionError: java.lang.NoClassDefFoundError: Could not initialize class com.google.inject.internal.cglib.core.$ReflectUtils
Caused by: java.lang.NoClassDefFoundError: Could not initialize class com.google.inject.internal.cglib.core.$ReflectUtils


FAILED:  org.apache.maven.index.DefaultIndexNexusIndexerTest.linux-jdk16 / Build linux-jdk16 / testArchetype

Error Message:
java.lang.NoClassDefFoundError: Could not initialize class com.google.inject.internal.cglib.core.$ReflectUtils

Stack Trace:
com.google.common.util.concurrent.ExecutionError: java.lang.NoClassDefFoundError: Could not initialize class com.google.inject.internal.cglib.core.$ReflectUtils
Caused by: java.lang.NoClassDefFoundError: Could not initialize class com.google.inject.internal.cglib.core.$ReflectUtils


FAILED:  org.apache.maven.index.DefaultIndexNexusIndexerTest.linux-jdk16 / Build linux-jdk16 / testMissingPom

Error Message:
java.lang.NoClassDefFoundError: Could not initialize class com.google.inject.internal.cglib.core.$ReflectUtils

Stack Trace:
com.google.common.util.concurrent.ExecutionError: java.lang.NoClassDefFoundError: Could not initialize class com.google.inject.internal.cglib.core.$ReflectUtils
Caused by: java.lang.NoClassDefFoundError: Could not initialize class com.google.inject.internal.cglib.core.$ReflectUtils


FAILED:  org.apache.maven.index.DefaultIndexNexusIndexerTest.linux-jdk16 / Build linux-jdk16 / testBrokenJar

Error Message:
java.lang.NoClassDefFoundError: Could not initialize class com.google.inject.internal.cglib.core.$ReflectUtils

Stack Trace:
com.google.common.util.concurrent.ExecutionError: java.lang.NoClassDefFoundError: Could not initialize class com.google.inject.internal.cglib.core.$ReflectUtils
Caused by: java.lang.NoClassDefFoundError: Could not initialize class com.google.inject.internal.cglib.core.$ReflectUtils


FAILED:  org.apache.maven.index.DefaultIndexNexusIndexerTest.linux-jdk16 / Build linux-jdk16 / testArchetypePackaging

Error Message:
java.lang.NoClassDefFoundError: Could not initialize class com.google.inject.internal.cglib.core.$ReflectUtils

Stack Trace:
com.google.common.util.concurrent.ExecutionError: java.lang.NoClassDefFoundError: Could not initialize class com.google.inject.internal.cglib.core.$ReflectUtils
Caused by: java.lang.NoClassDefFoundError: Could not initialize class com.google.inject.internal.cglib.core.$ReflectUtils


FAILED:  org.apache.maven.index.DefaultIndexNexusIndexerTest.linux-jdk16 / Build linux-jdk16 / testSearchArchetypes

Error Message:
java.lang.NoClassDefFoundError: Could not initialize class com.google.inject.internal.cglib.core.$ReflectUtils

Stack Trace:
com.google.common.util.concurrent.ExecutionError: java.lang.NoClassDefFoundError: Could not initialize class com.google.inject.internal.cglib.core.$ReflectUtils
Caused by: java.lang.NoClassDefFoundError: Could not initialize class com.google.inject.internal.cglib.core.$ReflectUtils


FAILED:  org.apache.maven.index.DefaultIndexNexusIndexerTest.linux-jdk16 / Build linux-jdk16 / testPlugin

Error Message:
java.lang.NoClassDefFoundError: Could not initialize class com.google.inject.internal.cglib.core.$ReflectUtils

Stack Trace:
com.google.common.util.concurrent.ExecutionError: java.lang.NoClassDefFoundError: Could not initialize class com.google.inject.internal.cglib.core.$ReflectUtils
Caused by: java.lang.NoClassDefFoundError: Could not initialize class com.google.inject.internal.cglib.core.$ReflectUtils


FAILED:  org.apache.maven.index.DefaultIndexNexusIndexerTest.linux-jdk16 / Build linux-jdk16 / testNEXUS2712

Error Message:
java.lang.NoClassDefFoundError: Could not initialize class com.google.inject.internal.cglib.core.$ReflectUtils

Stack Trace:
com.google.common.util.concurrent.ExecutionError: java.lang.NoClassDefFoundError: Could not initialize class com.google.inject.internal.cglib.core.$ReflectUtils
Caused by: java.lang.NoClassDefFoundError: Could not initialize class com.google.inject.internal.cglib.core.$ReflectUtils


FAILED:  org.apache.maven.index.DefaultIndexNexusIndexerTest.linux-jdk16 / Build linux-jdk16 / testPrefixWildcard

Error Message:
java.lang.NoClassDefFoundError: Could not initialize class com.google.inject.internal.cglib.core.$ReflectUtils

Stack Trace:
com.google.common.util.concurrent.ExecutionError: java.lang.NoClassDefFoundError: Could not initialize class com.google.inject.internal.cglib.core.$ReflectUtils
Caused by: java.lang.NoClassDefFoundError: Could not initialize class com.google.inject.internal.cglib.core.$ReflectUtils


FAILED:  org.apache.maven.index.DefaultIndexNexusIndexerTest.linux-jdk16 / Build linux-jdk16 / testPackaging

Error Message:
java.lang.NoClassDefFoundError: Could not initialize class com.google.inject.internal.cglib.core.$ReflectUtils

Stack Trace:
com.google.common.util.concurrent.ExecutionError: java.lang.NoClassDefFoundError: Could not initialize class com.google.inject.internal.cglib.core.$ReflectUtils
Caused by: java.lang.NoClassDefFoundError: Could not initialize class com.google.inject.internal.cglib.core.$ReflectUtils


FAILED:  org.apache.maven.index.DefaultIndexNexusIndexerTest.linux-jdk16 / Build linux-jdk16 / testSearchFlat

Error Message:
java.lang.NoClassDefFoundError: Could not initialize class com.google.inject.internal.cglib.core.$ReflectUtils

Stack Trace:
com.google.common.util.concurrent.ExecutionError: java.lang.NoClassDefFoundError: Could not initialize class com.google.inject.internal.cglib.core.$ReflectUtils
Caused by: java.lang.NoClassDefFoundError: Could not initialize class com.google.inject.internal.cglib.core.$ReflectUtils


FAILED:  org.apache.maven.index.DefaultIndexNexusIndexerTest.linux-jdk16 / Build linux-jdk16 / testPurge

Error Message:
java.lang.NoClassDefFoundError: Could not initialize class com.google.inject.internal.cglib.core.$ReflectUtils

Stack Trace:
com.google.common.util.concurrent.ExecutionError: java.lang.NoClassDefFoundError: Could not initialize class com.google.inject.internal.cglib.core.$ReflectUtils
Caused by: java.lang.NoClassDefFoundError: Could not initialize class com.google.inject.internal.cglib.core.$ReflectUtils


FAILED:  org.apache.maven.index.DefaultIndexNexusIndexerTest.linux-jdk16 / Build linux-jdk16 / testSearchGrouped

Error Message:
java.lang.NoClassDefFoundError: Could not initialize class com.google.inject.internal.cglib.core.$ReflectUtils

Stack Trace:
com.google.common.util.concurrent.ExecutionError: java.lang.NoClassDefFoundError: Could not initialize class com.google.inject.internal.cglib.core.$ReflectUtils
Caused by: java.lang.NoClassDefFoundError: Could not initialize class com.google.inject.internal.cglib.core.$ReflectUtils


FAILED:  org.apache.maven.index.DefaultIndexNexusIndexerTest.linux-jdk16 / Build linux-jdk16 / testSearchGroupedProblematicNames

Error Message:
java.lang.NoClassDefFoundError: Could not initialize class com.google.inject.internal.cglib.core.$ReflectUtils

Stack Trace:
com.google.common.util.concurrent.ExecutionError: java.lang.NoClassDefFoundError: Could not initialize class com.google.inject.internal.cglib.core.$ReflectUtils
Caused by: java.lang.NoClassDefFoundError: Could not initialize class com.google.inject.internal.cglib.core.$ReflectUtils


FAILED:  org.apache.maven.index.DefaultIndexNexusIndexerTest.linux-jdk16 / Build linux-jdk16 / testIdentify

Error Message:
java.lang.NoClassDefFoundError: Could not initialize class com.google.inject.internal.cglib.core.$ReflectUtils

Stack Trace:
com.google.common.util.concurrent.ExecutionError: java.lang.NoClassDefFoundError: Could not initialize class com.google.inject.internal.cglib.core.$ReflectUtils
Caused by: java.lang.NoClassDefFoundError: Could not initialize class com.google.inject.internal.cglib.core.$ReflectUtils


FAILED:  org.apache.maven.index.DefaultIndexNexusIndexerTest.linux-jdk16 / Build linux-jdk16 / testSearchFlatPaged

Error Message:
java.lang.NoClassDefFoundError: Could not initialize class com.google.inject.internal.cglib.core.$ReflectUtils

Stack Trace:
com.google.common.util.concurrent.ExecutionError: java.lang.NoClassDefFoundError: Could not initialize class com.google.inject.internal.cglib.core.$ReflectUtils
Caused by: java.lang.NoClassDefFoundError: Could not initialize class com.google.inject.internal.cglib.core.$ReflectUtils


FAILED:  org.apache.maven.index.DefaultIndexNexusIndexerTest.linux-jdk16 / Build linux-jdk16 / testRootGroups

Error Message:
java.lang.NoClassDefFoundError: Could not initialize class com.google.inject.internal.cglib.core.$ReflectUtils

Stack Trace:
com.google.common.util.concurrent.ExecutionError: java.lang.NoClassDefFoundError: Could not initialize class com.google.inject.internal.cglib.core.$ReflectUtils
Caused by: java.lang.NoClassDefFoundError: Could not initialize class com.google.inject.internal.cglib.core.$ReflectUtils


FAILED:  org.apache.maven.index.DefaultIndexNexusIndexerTest.linux-jdk16 / Build linux-jdk16 / testDirectory

Error Message:
java.lang.NoClassDefFoundError: Could not initialize class com.google.inject.internal.cglib.core.$ReflectUtils

Stack Trace:
com.google.common.util.concurrent.ExecutionError: java.lang.NoClassDefFoundError: Could not initialize class com.google.inject.internal.cglib.core.$ReflectUtils
Caused by: java.lang.NoClassDefFoundError: Could not initialize class com.google.inject.internal.cglib.core.$ReflectUtils


FAILED:  org.apache.maven.index.DefaultSearchEngineTest.linux-jdk16 / Build linux-jdk16 / testExceptionInArtifactFilter

Error Message:
java.lang.NoClassDefFoundError: Could not initialize class com.google.inject.internal.cglib.core.$ReflectUtils

Stack Trace:
com.google.common.util.concurrent.ExecutionError: java.lang.NoClassDefFoundError: Could not initialize class com.google.inject.internal.cglib.core.$ReflectUtils
        at org.apache.maven.index.DefaultSearchEngineTest.setUp(DefaultSearchEngineTest.java:100)
Caused by: java.lang.NoClassDefFoundError: Could not initialize class com.google.inject.internal.cglib.core.$ReflectUtils
        at org.apache.maven.index.DefaultSearchEngineTest.setUp(DefaultSearchEngineTest.java:100)


FAILED:  org.apache.maven.index.DefaultSearchEngineTest.linux-jdk16 / Build linux-jdk16 / testDirectory

Error Message:
java.lang.NoClassDefFoundError: Could not initialize class com.google.inject.internal.cglib.core.$ReflectUtils

Stack Trace:
com.google.common.util.concurrent.ExecutionError: java.lang.NoClassDefFoundError: Could not initialize class com.google.inject.internal.cglib.core.$ReflectUtils
        at org.apache.maven.index.DefaultSearchEngineTest.setUp(DefaultSearchEngineTest.java:100)
Caused by: java.lang.NoClassDefFoundError: Could not initialize class com.google.inject.internal.cglib.core.$ReflectUtils
        at org.apache.maven.index.DefaultSearchEngineTest.setUp(DefaultSearchEngineTest.java:100)


FAILED:  org.apache.maven.index.DuplicateSearchTest.linux-jdk16 / Build linux-jdk16 / testProveSvnRev1158917IsWrong

Error Message:
java.lang.NoClassDefFoundError: Could not initialize class com.google.inject.internal.cglib.core.$ReflectUtils

Stack Trace:
com.google.common.util.concurrent.ExecutionError: java.lang.NoClassDefFoundError: Could not initialize class com.google.inject.internal.cglib.core.$ReflectUtils
Caused by: java.lang.NoClassDefFoundError: Could not initialize class com.google.inject.internal.cglib.core.$ReflectUtils


FAILED:  org.apache.maven.index.DuplicateSearchTest.linux-jdk16 / Build linux-jdk16 / testHowUniqueSearchShouldBeDone

Error Message:
java.lang.NoClassDefFoundError: Could not initialize class com.google.inject.internal.cglib.core.$ReflectUtils

Stack Trace:
com.google.common.util.concurrent.ExecutionError: java.lang.NoClassDefFoundError: Could not initialize class com.google.inject.internal.cglib.core.$ReflectUtils
Caused by: java.lang.NoClassDefFoundError: Could not initialize class com.google.inject.internal.cglib.core.$ReflectUtils


FAILED:  org.apache.maven.index.DuplicateSearchTest.linux-jdk16 / Build linux-jdk16 / testHowtoPerformAggregatedSearch

Error Message:
java.lang.NoClassDefFoundError: Could not initialize class com.google.inject.internal.cglib.core.$ReflectUtils

Stack Trace:
com.google.common.util.concurrent.ExecutionError: java.lang.NoClassDefFoundError: Could not initialize class com.google.inject.internal.cglib.core.$ReflectUtils
Caused by: java.lang.NoClassDefFoundError: Could not initialize class com.google.inject.internal.cglib.core.$ReflectUtils


FAILED:  org.apache.maven.index.DuplicateSearchTest.linux-jdk16 / Build linux-jdk16 / testDirectory

Error Message:
java.lang.NoClassDefFoundError: Could not initialize class com.google.inject.internal.cglib.core.$ReflectUtils

Stack Trace:
com.google.common.util.concurrent.ExecutionError: java.lang.NoClassDefFoundError: Could not initialize class com.google.inject.internal.cglib.core.$ReflectUtils
Caused by: java.lang.NoClassDefFoundError: Could not initialize class com.google.inject.internal.cglib.core.$ReflectUtils


FAILED:  org.apache.maven.index.FSDirectoryDeleteTest.linux-jdk16 / Build linux-jdk16 / testIndexAndDelete

Error Message:
java.lang.NoClassDefFoundError: Could not initialize class com.google.inject.internal.cglib.core.$ReflectUtils

Stack Trace:
com.google.common.util.concurrent.ExecutionError: java.lang.NoClassDefFoundError: Could not initialize class com.google.inject.internal.cglib.core.$ReflectUtils
        at org.apache.maven.index.FSDirectoryDeleteTest.setUp(FSDirectoryDeleteTest.java:52)
Caused by: java.lang.NoClassDefFoundError: Could not initialize class com.google.inject.internal.cglib.core.$ReflectUtils
        at org.apache.maven.index.FSDirectoryDeleteTest.setUp(FSDirectoryDeleteTest.java:52)


FAILED:  org.apache.maven.index.FSDirectoryDeleteTest.linux-jdk16 / Build linux-jdk16 / testDirectory

Error Message:
java.lang.NoClassDefFoundError: Could not initialize class com.google.inject.internal.cglib.core.$ReflectUtils

Stack Trace:
com.google.common.util.concurrent.ExecutionError: java.lang.NoClassDefFoundError: Could not initialize class com.google.inject.internal.cglib.core.$ReflectUtils
        at org.apache.maven.index.FSDirectoryDeleteTest.setUp(FSDirectoryDeleteTest.java:52)
Caused by: java.lang.NoClassDefFoundError: Could not initialize class com.google.inject.internal.cglib.core.$ReflectUtils
        at org.apache.maven.index.FSDirectoryDeleteTest.setUp(FSDirectoryDeleteTest.java:52)


FAILED:  org.apache.maven.index.FullIndexNexusIndexerTest.linux-jdk16 / Build linux-jdk16 / testIndexTimestamp

Error Message:
java.lang.NoClassDefFoundError: Could not initialize class com.google.inject.internal.cglib.core.$ReflectUtils

Stack Trace:
com.google.common.util.concurrent.ExecutionError: java.lang.NoClassDefFoundError: Could not initialize class com.google.inject.internal.cglib.core.$ReflectUtils
Caused by: java.lang.NoClassDefFoundError: Could not initialize class com.google.inject.internal.cglib.core.$ReflectUtils


FAILED:  org.apache.maven.index.FullIndexNexusIndexerTest.linux-jdk16 / Build linux-jdk16 / testClassnameSearchNgWithHighlighting

Error Message:
java.lang.NoClassDefFoundError: Could not initialize class com.google.inject.internal.cglib.core.$ReflectUtils

Stack Trace:
com.google.common.util.concurrent.ExecutionError: java.lang.NoClassDefFoundError: Could not initialize class com.google.inject.internal.cglib.core.$ReflectUtils
Caused by: java.lang.NoClassDefFoundError: Could not initialize class com.google.inject.internal.cglib.core.$ReflectUtils


FAILED:  org.apache.maven.index.FullIndexNexusIndexerTest.linux-jdk16 / Build linux-jdk16 / testSearchGroupedClasses

Error Message:
java.lang.NoClassDefFoundError: Could not initialize class com.google.inject.internal.cglib.core.$ReflectUtils

Stack Trace:
com.google.common.util.concurrent.ExecutionError: java.lang.NoClassDefFoundError: Could not initialize class com.google.inject.internal.cglib.core.$ReflectUtils
Caused by: java.lang.NoClassDefFoundError: Could not initialize class com.google.inject.internal.cglib.core.$ReflectUtils


FAILED:  org.apache.maven.index.FullIndexNexusIndexerTest.linux-jdk16 / Build linux-jdk16 / testArchetype

Error Message:
java.lang.NoClassDefFoundError: Could not initialize class com.google.inject.internal.cglib.core.$ReflectUtils

Stack Trace:
com.google.common.util.concurrent.ExecutionError: java.lang.NoClassDefFoundError: Could not initialize class com.google.inject.internal.cglib.core.$ReflectUtils
Caused by: java.lang.NoClassDefFoundError: Could not initialize class com.google.inject.internal.cglib.core.$ReflectUtils


FAILED:  org.apache.maven.index.FullIndexNexusIndexerTest.linux-jdk16 / Build linux-jdk16 / testMissingPom

Error Message:
java.lang.NoClassDefFoundError: Could not initialize class com.google.inject.internal.cglib.core.$ReflectUtils

Stack Trace:
com.google.common.util.concurrent.ExecutionError: java.lang.NoClassDefFoundError: Could not initialize class com.google.inject.internal.cglib.core.$ReflectUtils
Caused by: java.lang.NoClassDefFoundError: Could not initialize class com.google.inject.internal.cglib.core.$ReflectUtils


FAILED:  org.apache.maven.index.FullIndexNexusIndexerTest.linux-jdk16 / Build linux-jdk16 / testBrokenJar

Error Message:
java.lang.NoClassDefFoundError: Could not initialize class com.google.inject.internal.cglib.core.$ReflectUtils

Stack Trace:
com.google.common.util.concurrent.ExecutionError: java.lang.NoClassDefFoundError: Could not initialize class com.google.inject.internal.cglib.core.$ReflectUtils
Caused by: java.lang.NoClassDefFoundError: Could not initialize class com.google.inject.internal.cglib.core.$ReflectUtils


FAILED:  org.apache.maven.index.FullIndexNexusIndexerTest.linux-jdk16 / Build linux-jdk16 / testGAVSearchNgWithHighlighting

Error Message:
java.lang.NoClassDefFoundError: Could not initialize class com.google.inject.internal.cglib.core.$ReflectUtils

Stack Trace:
com.google.common.util.concurrent.ExecutionError: java.lang.NoClassDefFoundError: Could not initialize class com.google.inject.internal.cglib.core.$ReflectUtils
Caused by: java.lang.NoClassDefFoundError: Could not initialize class com.google.inject.internal.cglib.core.$ReflectUtils


FAILED:  org.apache.maven.index.FullIndexNexusIndexerTest.linux-jdk16 / Build linux-jdk16 / testArchetypePackaging

Error Message:
java.lang.NoClassDefFoundError: Could not initialize class com.google.inject.internal.cglib.core.$ReflectUtils

Stack Trace:
com.google.common.util.concurrent.ExecutionError: java.lang.NoClassDefFoundError: Could not initialize class com.google.inject.internal.cglib.core.$ReflectUtils
Caused by: java.lang.NoClassDefFoundError: Could not initialize class com.google.inject.internal.cglib.core.$ReflectUtils


FAILED:  org.apache.maven.index.FullIndexNexusIndexerTest.linux-jdk16 / Build linux-jdk16 / testSearchArchetypes

Error Message:
java.lang.NoClassDefFoundError: Could not initialize class com.google.inject.internal.cglib.core.$ReflectUtils

Stack Trace:
com.google.common.util.concurrent.ExecutionError: java.lang.NoClassDefFoundError: Could not initialize class com.google.inject.internal.cglib.core.$ReflectUtils
Caused by: java.lang.NoClassDefFoundError: Could not initialize class com.google.inject.internal.cglib.core.$ReflectUtils


FAILED:  org.apache.maven.index.FullIndexNexusIndexerTest.linux-jdk16 / Build linux-jdk16 / testPluginPackaging

Error Message:
java.lang.NoClassDefFoundError: Could not initialize class com.google.inject.internal.cglib.core.$ReflectUtils

Stack Trace:
com.google.common.util.concurrent.ExecutionError: java.lang.NoClassDefFoundError: Could not initialize class com.google.inject.internal.cglib.core.$ReflectUtils
Caused by: java.lang.NoClassDefFoundError: Could not initialize class com.google.inject.internal.cglib.core.$ReflectUtils


FAILED:  org.apache.maven.index.FullIndexNexusIndexerTest.linux-jdk16 / Build linux-jdk16 / testPlugin

Error Message:
java.lang.NoClassDefFoundError: Could not initialize class com.google.inject.internal.cglib.core.$ReflectUtils

Stack Trace:
com.google.common.util.concurrent.ExecutionError: java.lang.NoClassDefFoundError: Could not initialize class com.google.inject.internal.cglib.core.$ReflectUtils
Caused by: java.lang.NoClassDefFoundError: Could not initialize class com.google.inject.internal.cglib.core.$ReflectUtils


FAILED:  org.apache.maven.index.FullIndexNexusIndexerTest.linux-jdk16 / Build linux-jdk16 / testNEXUS2712

Error Message:
java.lang.NoClassDefFoundError: Could not initialize class com.google.inject.internal.cglib.core.$ReflectUtils

Stack Trace:
com.google.common.util.concurrent.ExecutionError: java.lang.NoClassDefFoundError: Could not initialize class com.google.inject.internal.cglib.core.$ReflectUtils
Caused by: java.lang.NoClassDefFoundError: Could not initialize class com.google.inject.internal.cglib.core.$ReflectUtils


FAILED:  org.apache.maven.index.FullIndexNexusIndexerTest.linux-jdk16 / Build linux-jdk16 / testPrefixWildcard

Error Message:
java.lang.NoClassDefFoundError: Could not initialize class com.google.inject.internal.cglib.core.$ReflectUtils

Stack Trace:
com.google.common.util.concurrent.ExecutionError: java.lang.NoClassDefFoundError: Could not initialize class com.google.inject.internal.cglib.core.$ReflectUtils
Caused by: java.lang.NoClassDefFoundError: Could not initialize class com.google.inject.internal.cglib.core.$ReflectUtils


FAILED:  org.apache.maven.index.FullIndexNexusIndexerTest.linux-jdk16 / Build linux-jdk16 / testPackaging

Error Message:
java.lang.NoClassDefFoundError: Could not initialize class com.google.inject.internal.cglib.core.$ReflectUtils

Stack Trace:
com.google.common.util.concurrent.ExecutionError: java.lang.NoClassDefFoundError: Could not initialize class com.google.inject.internal.cglib.core.$ReflectUtils
Caused by: java.lang.NoClassDefFoundError: Could not initialize class com.google.inject.internal.cglib.core.$ReflectUtils


FAILED:  org.apache.maven.index.FullIndexNexusIndexerTest.linux-jdk16 / Build linux-jdk16 / testSearchFlat

Error Message:
java.lang.NoClassDefFoundError: Could not initialize class com.google.inject.internal.cglib.core.$ReflectUtils

Stack Trace:
com.google.common.util.concurrent.ExecutionError: java.lang.NoClassDefFoundError: Could not initialize class com.google.inject.internal.cglib.core.$ReflectUtils
Caused by: java.lang.NoClassDefFoundError: Could not initialize class com.google.inject.internal.cglib.core.$ReflectUtils


FAILED:  org.apache.maven.index.FullIndexNexusIndexerTest.linux-jdk16 / Build linux-jdk16 / testPurge

Error Message:
java.lang.NoClassDefFoundError: Could not initialize class com.google.inject.internal.cglib.core.$ReflectUtils

Stack Trace:
com.google.common.util.concurrent.ExecutionError: java.lang.NoClassDefFoundError: Could not initialize class com.google.inject.internal.cglib.core.$ReflectUtils
Caused by: java.lang.NoClassDefFoundError: Could not initialize class com.google.inject.internal.cglib.core.$ReflectUtils


FAILED:  org.apache.maven.index.FullIndexNexusIndexerTest.linux-jdk16 / Build linux-jdk16 / testSearchGrouped

Error Message:
java.lang.NoClassDefFoundError: Could not initialize class com.google.inject.internal.cglib.core.$ReflectUtils

Stack Trace:
com.google.common.util.concurrent.ExecutionError: java.lang.NoClassDefFoundError: Could not initialize class com.google.inject.internal.cglib.core.$ReflectUtils
Caused by: java.lang.NoClassDefFoundError: Could not initialize class com.google.inject.internal.cglib.core.$ReflectUtils


FAILED:  org.apache.maven.index.FullIndexNexusIndexerTest.linux-jdk16 / Build linux-jdk16 / testSearchGroupedProblematicNames

Error Message:
java.lang.NoClassDefFoundError: Could not initialize class com.google.inject.internal.cglib.core.$ReflectUtils

Stack Trace:
com.google.common.util.concurrent.ExecutionError: java.lang.NoClassDefFoundError: Could not initialize class com.google.inject.internal.cglib.core.$ReflectUtils
Caused by: java.lang.NoClassDefFoundError: Could not initialize class com.google.inject.internal.cglib.core.$ReflectUtils


FAILED:  org.apache.maven.index.FullIndexNexusIndexerTest.linux-jdk16 / Build linux-jdk16 / testIdentify

Error Message:
java.lang.NoClassDefFoundError: Could not initialize class com.google.inject.internal.cglib.core.$ReflectUtils

Stack Trace:
com.google.common.util.concurrent.ExecutionError: java.lang.NoClassDefFoundError: Could not initialize class com.google.inject.internal.cglib.core.$ReflectUtils
Caused by: java.lang.NoClassDefFoundError: Could not initialize class com.google.inject.internal.cglib.core.$ReflectUtils


FAILED:  org.apache.maven.index.FullIndexNexusIndexerTest.linux-jdk16 / Build linux-jdk16 / testSearchFlatPaged

Error Message:
java.lang.NoClassDefFoundError: Could not initialize class com.google.inject.internal.cglib.core.$ReflectUtils

Stack Trace:
com.google.common.util.concurrent.ExecutionError: java.lang.NoClassDefFoundError: Could not initialize class com.google.inject.internal.cglib.core.$ReflectUtils
Caused by: java.lang.NoClassDefFoundError: Could not initialize class com.google.inject.internal.cglib.core.$ReflectUtils


FAILED:  org.apache.maven.index.FullIndexNexusIndexerTest.linux-jdk16 / Build linux-jdk16 / testRootGroups

Error Message:
java.lang.NoClassDefFoundError: Could not initialize class com.google.inject.internal.cglib.core.$ReflectUtils

Stack Trace:
com.google.common.util.concurrent.ExecutionError: java.lang.NoClassDefFoundError: Could not initialize class com.google.inject.internal.cglib.core.$ReflectUtils
Caused by: java.lang.NoClassDefFoundError: Could not initialize class com.google.inject.internal.cglib.core.$ReflectUtils


FAILED:  org.apache.maven.index.FullIndexNexusIndexerTest.linux-jdk16 / Build linux-jdk16 / testDirectory

Error Message:
java.lang.NoClassDefFoundError: Could not initialize class com.google.inject.internal.cglib.core.$ReflectUtils

Stack Trace:
com.google.common.util.concurrent.ExecutionError: java.lang.NoClassDefFoundError: Could not initialize class com.google.inject.internal.cglib.core.$ReflectUtils
Caused by: java.lang.NoClassDefFoundError: Could not initialize class com.google.inject.internal.cglib.core.$ReflectUtils


FAILED:  org.apache.maven.index.Mindexer14HitLimitTest.linux-jdk16 / Build linux-jdk16 / testFlatSearchLimited

Error Message:
java.lang.NoClassDefFoundError: Could not initialize class com.google.inject.internal.cglib.core.$ReflectUtils

Stack Trace:
com.google.common.util.concurrent.ExecutionError: java.lang.NoClassDefFoundError: Could not initialize class com.google.inject.internal.cglib.core.$ReflectUtils
Caused by: java.lang.NoClassDefFoundError: Could not initialize class com.google.inject.internal.cglib.core.$ReflectUtils


FAILED:  org.apache.maven.index.Mindexer14HitLimitTest.linux-jdk16 / Build linux-jdk16 / testGroupedSearchTotalHitsLie1k

Error Message:
java.lang.NoClassDefFoundError: Could not initialize class com.google.inject.internal.cglib.core.$ReflectUtils

Stack Trace:
com.google.common.util.concurrent.ExecutionError: java.lang.NoClassDefFoundError: Could not initialize class com.google.inject.internal.cglib.core.$ReflectUtils
Caused by: java.lang.NoClassDefFoundError: Could not initialize class com.google.inject.internal.cglib.core.$ReflectUtils


FAILED:  org.apache.maven.index.Mindexer14HitLimitTest.linux-jdk16 / Build linux-jdk16 / testFlatSearchUnlimited

Error Message:
java.lang.NoClassDefFoundError: Could not initialize class com.google.inject.internal.cglib.core.$ReflectUtils

Stack Trace:
com.google.common.util.concurrent.ExecutionError: java.lang.NoClassDefFoundError: Could not initialize class com.google.inject.internal.cglib.core.$ReflectUtils
Caused by: java.lang.NoClassDefFoundError: Could not initialize class com.google.inject.internal.cglib.core.$ReflectUtils


FAILED:  org.apache.maven.index.Mindexer14HitLimitTest.linux-jdk16 / Build linux-jdk16 / testIteratorSearchTotalHitsLie1k

Error Message:
java.lang.NoClassDefFoundError: Could not initialize class com.google.inject.internal.cglib.core.$ReflectUtils

Stack Trace:
com.google.common.util.concurrent.ExecutionError: java.lang.NoClassDefFoundError: Could not initialize class com.google.inject.internal.cglib.core.$ReflectUtils
Caused by: java.lang.NoClassDefFoundError: Could not initialize class com.google.inject.internal.cglib.core.$ReflectUtils


FAILED:  org.apache.maven.index.Mindexer14HitLimitTest.linux-jdk16 / Build linux-jdk16 / testFlatSearchTotalHitsLie1k

Error Message:
java.lang.NoClassDefFoundError: Could not initialize class com.google.inject.internal.cglib.core.$ReflectUtils

Stack Trace:
com.google.common.util.concurrent.ExecutionError: java.lang.NoClassDefFoundError: Could not initialize class com.google.inject.internal.cglib.core.$ReflectUtils
Caused by: java.lang.NoClassDefFoundError: Could not initialize class com.google.inject.internal.cglib.core.$ReflectUtils


FAILED:  org.apache.maven.index.Mindexer14HitLimitTest.linux-jdk16 / Build linux-jdk16 / testDirectory

Error Message:
java.lang.NoClassDefFoundError: Could not initialize class com.google.inject.internal.cglib.core.$ReflectUtils

Stack Trace:
com.google.common.util.concurrent.ExecutionError: java.lang.NoClassDefFoundError: Could not initialize class com.google.inject.internal.cglib.core.$ReflectUtils
Caused by: java.lang.NoClassDefFoundError: Could not initialize class com.google.inject.internal.cglib.core.$ReflectUtils


FAILED:  org.apache.maven.index.Mindexer35NexusIndexerTest.linux-jdk16 / Build linux-jdk16 / testSearchWar

Error Message:
java.lang.NoClassDefFoundError: Could not initialize class com.google.inject.internal.cglib.core.$ReflectUtils

Stack Trace:
com.google.common.util.concurrent.ExecutionError: java.lang.NoClassDefFoundError: Could not initialize class com.google.inject.internal.cglib.core.$ReflectUtils
Caused by: java.lang.NoClassDefFoundError: Could not initialize class com.google.inject.internal.cglib.core.$ReflectUtils


FAILED:  org.apache.maven.index.Mindexer35NexusIndexerTest.linux-jdk16 / Build linux-jdk16 / testDirectory

Error Message:
java.lang.NoClassDefFoundError: Could not initialize class com.google.inject.internal.cglib.core.$ReflectUtils

Stack Trace:
com.google.common.util.concurrent.ExecutionError: java.lang.NoClassDefFoundError: Could not initialize class com.google.inject.internal.cglib.core.$ReflectUtils
Caused by: java.lang.NoClassDefFoundError: Could not initialize class com.google.inject.internal.cglib.core.$ReflectUtils


FAILED:  org.apache.maven.index.MinimalIndexNexusIndexerTest.linux-jdk16 / Build linux-jdk16 / testNEXUS2712

Error Message:
java.lang.NoClassDefFoundError: Could not initialize class com.google.inject.internal.cglib.core.$ReflectUtils

Stack Trace:
com.google.common.util.concurrent.ExecutionError: java.lang.NoClassDefFoundError: Could not initialize class com.google.inject.internal.cglib.core.$ReflectUtils
Caused by: java.lang.NoClassDefFoundError: Could not initialize class com.google.inject.internal.cglib.core.$ReflectUtils


FAILED:  org.apache.maven.index.MinimalIndexNexusIndexerTest.linux-jdk16 / Build linux-jdk16 / testPrefixWildcard

Error Message:
java.lang.NoClassDefFoundError: Could not initialize class com.google.inject.internal.cglib.core.$ReflectUtils

Stack Trace:
com.google.common.util.concurrent.ExecutionError: java.lang.NoClassDefFoundError: Could not initialize class com.google.inject.internal.cglib.core.$ReflectUtils
Caused by: java.lang.NoClassDefFoundError: Could not initialize class com.google.inject.internal.cglib.core.$ReflectUtils


FAILED:  org.apache.maven.index.MinimalIndexNexusIndexerTest.linux-jdk16 / Build linux-jdk16 / testPackaging

Error Message:
java.lang.NoClassDefFoundError: Could not initialize class com.google.inject.internal.cglib.core.$ReflectUtils

Stack Trace:
com.google.common.util.concurrent.ExecutionError: java.lang.NoClassDefFoundError: Could not initialize class com.google.inject.internal.cglib.core.$ReflectUtils
Caused by: java.lang.NoClassDefFoundError: Could not initialize class com.google.inject.internal.cglib.core.$ReflectUtils


FAILED:  org.apache.maven.index.MinimalIndexNexusIndexerTest.linux-jdk16 / Build linux-jdk16 / testSearchFlat

Error Message:
java.lang.NoClassDefFoundError: Could not initialize class com.google.inject.internal.cglib.core.$ReflectUtils

Stack Trace:
com.google.common.util.concurrent.ExecutionError: java.lang.NoClassDefFoundError: Could not initialize class com.google.inject.internal.cglib.core.$ReflectUtils
Caused by: java.lang.NoClassDefFoundError: Could not initialize class com.google.inject.internal.cglib.core.$ReflectUtils


FAILED:  org.apache.maven.index.MinimalIndexNexusIndexerTest.linux-jdk16 / Build linux-jdk16 / testPurge

Error Message:
java.lang.NoClassDefFoundError: Could not initialize class com.google.inject.internal.cglib.core.$ReflectUtils

Stack Trace:
com.google.common.util.concurrent.ExecutionError: java.lang.NoClassDefFoundError: Could not initialize class com.google.inject.internal.cglib.core.$ReflectUtils
Caused by: java.lang.NoClassDefFoundError: Could not initialize class com.google.inject.internal.cglib.core.$ReflectUtils


FAILED:  org.apache.maven.index.MinimalIndexNexusIndexerTest.linux-jdk16 / Build linux-jdk16 / testSearchGrouped

Error Message:
java.lang.NoClassDefFoundError: Could not initialize class com.google.inject.internal.cglib.core.$ReflectUtils

Stack Trace:
com.google.common.util.concurrent.ExecutionError: java.lang.NoClassDefFoundError: Could not initialize class com.google.inject.internal.cglib.core.$ReflectUtils
Caused by: java.lang.NoClassDefFoundError: Could not initialize class com.google.inject.internal.cglib.core.$ReflectUtils


FAILED:  org.apache.maven.index.MinimalIndexNexusIndexerTest.linux-jdk16 / Build linux-jdk16 / testSearchGroupedProblematicNames

Error Message:
java.lang.NoClassDefFoundError: Could not initialize class com.google.inject.internal.cglib.core.$ReflectUtils

Stack Trace:
com.google.common.util.concurrent.ExecutionError: java.lang.NoClassDefFoundError: Could not initialize class com.google.inject.internal.cglib.core.$ReflectUtils
Caused by: java.lang.NoClassDefFoundError: Could not initialize class com.google.inject.internal.cglib.core.$ReflectUtils


FAILED:  org.apache.maven.index.MinimalIndexNexusIndexerTest.linux-jdk16 / Build linux-jdk16 / testIdentify

Error Message:
java.lang.NoClassDefFoundError: Could not initialize class com.google.inject.internal.cglib.core.$ReflectUtils

Stack Trace:
com.google.common.util.concurrent.ExecutionError: java.lang.NoClassDefFoundError: Could not initialize class com.google.inject.internal.cglib.core.$ReflectUtils
Caused by: java.lang.NoClassDefFoundError: Could not initialize class com.google.inject.internal.cglib.core.$ReflectUtils


FAILED:  org.apache.maven.index.MinimalIndexNexusIndexerTest.linux-jdk16 / Build linux-jdk16 / testSearchFlatPaged

Error Message:
java.lang.NoClassDefFoundError: Could not initialize class com.google.inject.internal.cglib.core.$ReflectUtils

Stack Trace:
com.google.common.util.concurrent.ExecutionError: java.lang.NoClassDefFoundError: Could not initialize class com.google.inject.internal.cglib.core.$ReflectUtils
Caused by: java.lang.NoClassDefFoundError: Could not initialize class com.google.inject.internal.cglib.core.$ReflectUtils


FAILED:  org.apache.maven.index.MinimalIndexNexusIndexerTest.linux-jdk16 / Build linux-jdk16 / testRootGroups

Error Message:
java.lang.NoClassDefFoundError: Could not initialize class com.google.inject.internal.cglib.core.$ReflectUtils

Stack Trace:
com.google.common.util.concurrent.ExecutionError: java.lang.NoClassDefFoundError: Could not initialize class com.google.inject.internal.cglib.core.$ReflectUtils
Caused by: java.lang.NoClassDefFoundError: Could not initialize class com.google.inject.internal.cglib.core.$ReflectUtils


FAILED:  org.apache.maven.index.MinimalIndexNexusIndexerTest.linux-jdk16 / Build linux-jdk16 / testDirectory

Error Message:
java.lang.NoClassDefFoundError: Could not initialize class com.google.inject.internal.cglib.core.$ReflectUtils

Stack Trace:
com.google.common.util.concurrent.ExecutionError: java.lang.NoClassDefFoundError: Could not initialize class com.google.inject.internal.cglib.core.$ReflectUtils
Caused by: java.lang.NoClassDefFoundError: Could not initialize class com.google.inject.internal.cglib.core.$ReflectUtils


FAILED:  org.apache.maven.index.Nexus1179NexusIndexerTest.linux-jdk16 / Build linux-jdk16 / testSearchFlat

Error Message:
java.lang.NoClassDefFoundError: Could not initialize class com.google.inject.internal.cglib.core.$ReflectUtils

Stack Trace:
com.google.common.util.concurrent.ExecutionError: java.lang.NoClassDefFoundError: Could not initialize class com.google.inject.internal.cglib.core.$ReflectUtils
Caused by: java.lang.NoClassDefFoundError: Could not initialize class com.google.inject.internal.cglib.core.$ReflectUtils


FAILED:  org.apache.maven.index.Nexus1179NexusIndexerTest.linux-jdk16 / Build linux-jdk16 / testDirectory

Error Message:
java.lang.NoClassDefFoundError: Could not initialize class com.google.inject.internal.cglib.core.$ReflectUtils

Stack Trace:
com.google.common.util.concurrent.ExecutionError: java.lang.NoClassDefFoundError: Could not initialize class com.google.inject.internal.cglib.core.$ReflectUtils
Caused by: java.lang.NoClassDefFoundError: Could not initialize class com.google.inject.internal.cglib.core.$ReflectUtils


FAILED:  org.apache.maven.index.Nexus13NexusIndexerTest.linux-jdk16 / Build linux-jdk16 / testIndexTimestamp

Error Message:
java.lang.ExceptionInInitializerError

Stack Trace:
com.google.common.util.concurrent.ExecutionError: java.lang.ExceptionInInitializerError
Caused by: java.lang.ExceptionInInitializerError
Caused by: java.lang.reflect.InaccessibleObjectException: Unable to make protected final java.lang.Class java.lang.ClassLoader.defineClass(java.lang.String,byte[],int,int,java.security.ProtectionDomain) throws java.lang.ClassFormatError accessible: module java.base does not "opens java.lang" to unnamed module @209c0b14


FAILED:  org.apache.maven.index.Nexus13NexusIndexerTest.linux-jdk16 / Build linux-jdk16 / testSearchFlat

Error Message:
java.lang.NoClassDefFoundError: Could not initialize class com.google.inject.internal.cglib.core.$ReflectUtils

Stack Trace:
com.google.common.util.concurrent.ExecutionError: java.lang.NoClassDefFoundError: Could not initialize class com.google.inject.internal.cglib.core.$ReflectUtils
Caused by: java.lang.NoClassDefFoundError: Could not initialize class com.google.inject.internal.cglib.core.$ReflectUtils


FAILED:  org.apache.maven.index.Nexus13NexusIndexerTest.linux-jdk16 / Build linux-jdk16 / testSearchGroupedClasses

Error Message:
java.lang.NoClassDefFoundError: Could not initialize class com.google.inject.internal.cglib.core.$ReflectUtils

Stack Trace:
com.google.common.util.concurrent.ExecutionError: java.lang.NoClassDefFoundError: Could not initialize class com.google.inject.internal.cglib.core.$ReflectUtils
Caused by: java.lang.NoClassDefFoundError: Could not initialize class com.google.inject.internal.cglib.core.$ReflectUtils


FAILED:  org.apache.maven.index.Nexus13NexusIndexerTest.linux-jdk16 / Build linux-jdk16 / testSearchGrouped

Error Message:
java.lang.NoClassDefFoundError: Could not initialize class com.google.inject.internal.cglib.core.$ReflectUtils

Stack Trace:
com.google.common.util.concurrent.ExecutionError: java.lang.NoClassDefFoundError: Could not initialize class com.google.inject.internal.cglib.core.$ReflectUtils
Caused by: java.lang.NoClassDefFoundError: Could not initialize class com.google.inject.internal.cglib.core.$ReflectUtils


FAILED:  org.apache.maven.index.Nexus13NexusIndexerTest.linux-jdk16 / Build linux-jdk16 / testSearchGroupedProblematicNames

Error Message:
java.lang.NoClassDefFoundError: Could not initialize class com.google.inject.internal.cglib.core.$ReflectUtils

Stack Trace:
com.google.common.util.concurrent.ExecutionError: java.lang.NoClassDefFoundError: Could not initialize class com.google.inject.internal.cglib.core.$ReflectUtils
Caused by: java.lang.NoClassDefFoundError: Could not initialize class com.google.inject.internal.cglib.core.$ReflectUtils


FAILED:  org.apache.maven.index.Nexus13NexusIndexerTest.linux-jdk16 / Build linux-jdk16 / testIdentify

Error Message:
java.lang.NoClassDefFoundError: Could not initialize class com.google.inject.internal.cglib.core.$ReflectUtils

Stack Trace:
com.google.common.util.concurrent.ExecutionError: java.lang.NoClassDefFoundError: Could not initialize class com.google.inject.internal.cglib.core.$ReflectUtils
Caused by: java.lang.NoClassDefFoundError: Could not initialize class com.google.inject.internal.cglib.core.$ReflectUtils


FAILED:  org.apache.maven.index.Nexus13NexusIndexerTest.linux-jdk16 / Build linux-jdk16 / testSearchArchetypes

Error Message:
java.lang.NoClassDefFoundError: Could not initialize class com.google.inject.internal.cglib.core.$ReflectUtils

Stack Trace:
com.google.common.util.concurrent.ExecutionError: java.lang.NoClassDefFoundError: Could not initialize class com.google.inject.internal.cglib.core.$ReflectUtils
Caused by: java.lang.NoClassDefFoundError: Could not initialize class com.google.inject.internal.cglib.core.$ReflectUtils


FAILED:  org.apache.maven.index.Nexus13NexusIndexerTest.linux-jdk16 / Build linux-jdk16 / testRootGroups

Error Message:
java.lang.NoClassDefFoundError: Could not initialize class com.google.inject.internal.cglib.core.$ReflectUtils

Stack Trace:
com.google.common.util.concurrent.ExecutionError: java.lang.NoClassDefFoundError: Could not initialize class com.google.inject.internal.cglib.core.$ReflectUtils
Caused by: java.lang.NoClassDefFoundError: Could not initialize class com.google.inject.internal.cglib.core.$ReflectUtils


FAILED:  org.apache.maven.index.Nexus13NexusIndexerTest.linux-jdk16 / Build linux-jdk16 / testDirectory

Error Message:
java.lang.NoClassDefFoundError: Could not initialize class com.google.inject.internal.cglib.core.$ReflectUtils

Stack Trace:
com.google.common.util.concurrent.ExecutionError: java.lang.NoClassDefFoundError: Could not initialize class com.google.inject.internal.cglib.core.$ReflectUtils
Caused by: java.lang.NoClassDefFoundError: Could not initialize class com.google.inject.internal.cglib.core.$ReflectUtils


FAILED:  org.apache.maven.index.Nexus1911IncrementalMergedCtxTest.linux-jdk16 / Build linux-jdk16 / testNoIncremental

Error Message:
java.lang.NoClassDefFoundError: Could not initialize class com.google.inject.internal.cglib.core.$ReflectUtils

Stack Trace:
com.google.common.util.concurrent.ExecutionError: java.lang.NoClassDefFoundError: Could not initialize class com.google.inject.internal.cglib.core.$ReflectUtils
        at org.apache.maven.index.Nexus1911IncrementalMergedCtxTest.setUp(Nexus1911IncrementalMergedCtxTest.java:38)
Caused by: java.lang.NoClassDefFoundError: Could not initialize class com.google.inject.internal.cglib.core.$ReflectUtils
        at org.apache.maven.index.Nexus1911IncrementalMergedCtxTest.setUp(Nexus1911IncrementalMergedCtxTest.java:38)


FAILED:  org.apache.maven.index.Nexus1911IncrementalMergedCtxTest.linux-jdk16 / Build linux-jdk16 / testMaxChunks

Error Message:
java.lang.NoClassDefFoundError: Could not initialize class com.google.inject.internal.cglib.core.$ReflectUtils

Stack Trace:
com.google.common.util.concurrent.ExecutionError: java.lang.NoClassDefFoundError: Could not initialize class com.google.inject.internal.cglib.core.$ReflectUtils
        at org.apache.maven.index.Nexus1911IncrementalMergedCtxTest.setUp(Nexus1911IncrementalMergedCtxTest.java:38)
Caused by: java.lang.NoClassDefFoundError: Could not initialize class com.google.inject.internal.cglib.core.$ReflectUtils
        at org.apache.maven.index.Nexus1911IncrementalMergedCtxTest.setUp(Nexus1911IncrementalMergedCtxTest.java:38)


FAILED:  org.apache.maven.index.Nexus1911IncrementalMergedCtxTest.linux-jdk16 / Build linux-jdk16 / test1Incremental

Error Message:
java.lang.NoClassDefFoundError: Could not initialize class com.google.inject.internal.cglib.core.$ReflectUtils

Stack Trace:
com.google.common.util.concurrent.ExecutionError: java.lang.NoClassDefFoundError: Could not initialize class com.google.inject.internal.cglib.core.$ReflectUtils
        at org.apache.maven.index.Nexus1911IncrementalMergedCtxTest.setUp(Nexus1911IncrementalMergedCtxTest.java:38)
Caused by: java.lang.NoClassDefFoundError: Could not initialize class com.google.inject.internal.cglib.core.$ReflectUtils
        at org.apache.maven.index.Nexus1911IncrementalMergedCtxTest.setUp(Nexus1911IncrementalMergedCtxTest.java:38)


FAILED:  org.apache.maven.index.Nexus1911IncrementalMergedCtxTest.linux-jdk16 / Build linux-jdk16 / test2Incremental

Error Message:
java.lang.NoClassDefFoundError: Could not initialize class com.google.inject.internal.cglib.core.$ReflectUtils

Stack Trace:
com.google.common.util.concurrent.ExecutionError: java.lang.NoClassDefFoundError: Could not initialize class com.google.inject.internal.cglib.core.$ReflectUtils
        at org.apache.maven.index.Nexus1911IncrementalMergedCtxTest.setUp(Nexus1911IncrementalMergedCtxTest.java:38)
Caused by: java.lang.NoClassDefFoundError: Could not initialize class com.google.inject.internal.cglib.core.$ReflectUtils
        at org.apache.maven.index.Nexus1911IncrementalMergedCtxTest.setUp(Nexus1911IncrementalMergedCtxTest.java:38)


FAILED:  org.apache.maven.index.Nexus1911IncrementalMergedCtxTest.linux-jdk16 / Build linux-jdk16 / test3Incremental

Error Message:
java.lang.NoClassDefFoundError: Could not initialize class com.google.inject.internal.cglib.core.$ReflectUtils

Stack Trace:
com.google.common.util.concurrent.ExecutionError: java.lang.NoClassDefFoundError: Could not initialize class com.google.inject.internal.cglib.core.$ReflectUtils
        at org.apache.maven.index.Nexus1911IncrementalMergedCtxTest.setUp(Nexus1911IncrementalMergedCtxTest.java:38)
Caused by: java.lang.NoClassDefFoundError: Could not initialize class com.google.inject.internal.cglib.core.$ReflectUtils
        at org.apache.maven.index.Nexus1911IncrementalMergedCtxTest.setUp(Nexus1911IncrementalMergedCtxTest.java:38)


FAILED:  org.apache.maven.index.Nexus1911IncrementalMergedCtxTest.linux-jdk16 / Build linux-jdk16 / testDirectory

Error Message:
java.lang.NoClassDefFoundError: Could not initialize class com.google.inject.internal.cglib.core.$ReflectUtils

Stack Trace:
com.google.common.util.concurrent.ExecutionError: java.lang.NoClassDefFoundError: Could not initialize class com.google.inject.internal.cglib.core.$ReflectUtils
        at org.apache.maven.index.Nexus1911IncrementalMergedCtxTest.setUp(Nexus1911IncrementalMergedCtxTest.java:38)
Caused by: java.lang.NoClassDefFoundError: Could not initialize class com.google.inject.internal.cglib.core.$ReflectUtils
        at org.apache.maven.index.Nexus1911IncrementalMergedCtxTest.setUp(Nexus1911IncrementalMergedCtxTest.java:38)


FAILED:  org.apache.maven.index.Nexus1911IncrementalTest.linux-jdk16 / Build linux-jdk16 / testNoIncremental

Error Message:
java.lang.NoClassDefFoundError: Could not initialize class com.google.inject.internal.cglib.core.$ReflectUtils

Stack Trace:
com.google.common.util.concurrent.ExecutionError: java.lang.NoClassDefFoundError: Could not initialize class com.google.inject.internal.cglib.core.$ReflectUtils
        at org.apache.maven.index.Nexus1911IncrementalTest.setUp(Nexus1911IncrementalTest.java:58)
Caused by: java.lang.NoClassDefFoundError: Could not initialize class com.google.inject.internal.cglib.core.$ReflectUtils
        at org.apache.maven.index.Nexus1911IncrementalTest.setUp(Nexus1911IncrementalTest.java:58)


FAILED:  org.apache.maven.index.Nexus1911IncrementalTest.linux-jdk16 / Build linux-jdk16 / testMaxChunks

Error Message:
java.lang.NoClassDefFoundError: Could not initialize class com.google.inject.internal.cglib.core.$ReflectUtils

Stack Trace:
com.google.common.util.concurrent.ExecutionError: java.lang.NoClassDefFoundError: Could not initialize class com.google.inject.internal.cglib.core.$ReflectUtils
        at org.apache.maven.index.Nexus1911IncrementalTest.setUp(Nexus1911IncrementalTest.java:58)
Caused by: java.lang.NoClassDefFoundError: Could not initialize class com.google.inject.internal.cglib.core.$ReflectUtils
        at org.apache.maven.index.Nexus1911IncrementalTest.setUp(Nexus1911IncrementalTest.java:58)


FAILED:  org.apache.maven.index.Nexus1911IncrementalTest.linux-jdk16 / Build linux-jdk16 / test1Incremental

Error Message:
java.lang.NoClassDefFoundError: Could not initialize class com.google.inject.internal.cglib.core.$ReflectUtils

Stack Trace:
com.google.common.util.concurrent.ExecutionError: java.lang.NoClassDefFoundError: Could not initialize class com.google.inject.internal.cglib.core.$ReflectUtils
        at org.apache.maven.index.Nexus1911IncrementalTest.setUp(Nexus1911IncrementalTest.java:58)
Caused by: java.lang.NoClassDefFoundError: Could not initialize class com.google.inject.internal.cglib.core.$ReflectUtils
        at org.apache.maven.index.Nexus1911IncrementalTest.setUp(Nexus1911IncrementalTest.java:58)


FAILED:  org.apache.maven.index.Nexus1911IncrementalTest.linux-jdk16 / Build linux-jdk16 / test2Incremental

Error Message:
java.lang.NoClassDefFoundError: Could not initialize class com.google.inject.internal.cglib.core.$ReflectUtils

Stack Trace:
com.google.common.util.concurrent.ExecutionError: java.lang.NoClassDefFoundError: Could not initialize class com.google.inject.internal.cglib.core.$ReflectUtils
        at org.apache.maven.index.Nexus1911IncrementalTest.setUp(Nexus1911IncrementalTest.java:58)
Caused by: java.lang.NoClassDefFoundError: Could not initialize class com.google.inject.internal.cglib.core.$ReflectUtils
        at org.apache.maven.index.Nexus1911IncrementalTest.setUp(Nexus1911IncrementalTest.java:58)


FAILED:  org.apache.maven.index.Nexus1911IncrementalTest.linux-jdk16 / Build linux-jdk16 / test3Incremental

Error Message:
java.lang.NoClassDefFoundError: Could not initialize class com.google.inject.internal.cglib.core.$ReflectUtils

Stack Trace:
com.google.common.util.concurrent.ExecutionError: java.lang.NoClassDefFoundError: Could not initialize class com.google.inject.internal.cglib.core.$ReflectUtils
        at org.apache.maven.index.Nexus1911IncrementalTest.setUp(Nexus1911IncrementalTest.java:58)
Caused by: java.lang.NoClassDefFoundError: Could not initialize class com.google.inject.internal.cglib.core.$ReflectUtils
        at org.apache.maven.index.Nexus1911IncrementalTest.setUp(Nexus1911IncrementalTest.java:58)


FAILED:  org.apache.maven.index.Nexus1911IncrementalTest.linux-jdk16 / Build linux-jdk16 / testDirectory

Error Message:
java.lang.NoClassDefFoundError: Could not initialize class com.google.inject.internal.cglib.core.$ReflectUtils

Stack Trace:
com.google.common.util.concurrent.ExecutionError: java.lang.NoClassDefFoundError: Could not initialize class com.google.inject.internal.cglib.core.$ReflectUtils
        at org.apache.maven.index.Nexus1911IncrementalTest.setUp(Nexus1911IncrementalTest.java:58)
Caused by: java.lang.NoClassDefFoundError: Could not initialize class com.google.inject.internal.cglib.core.$ReflectUtils
        at org.apache.maven.index.Nexus1911IncrementalTest.setUp(Nexus1911IncrementalTest.java:58)


FAILED:  org.apache.maven.index.Nexus2046NexusIndexerTest.linux-jdk16 / Build linux-jdk16 / testSearchFlat

Error Message:
java.lang.NoClassDefFoundError: Could not initialize class com.google.inject.internal.cglib.core.$ReflectUtils

Stack Trace:
com.google.common.util.concurrent.ExecutionError: java.lang.NoClassDefFoundError: Could not initialize class com.google.inject.internal.cglib.core.$ReflectUtils
Caused by: java.lang.NoClassDefFoundError: Could not initialize class com.google.inject.internal.cglib.core.$ReflectUtils


FAILED:  org.apache.maven.index.Nexus2046NexusIndexerTest.linux-jdk16 / Build linux-jdk16 / testDirectory

Error Message:
java.lang.NoClassDefFoundError: Could not initialize class com.google.inject.internal.cglib.core.$ReflectUtils

Stack Trace:
com.google.common.util.concurrent.ExecutionError: java.lang.NoClassDefFoundError: Could not initialize class com.google.inject.internal.cglib.core.$ReflectUtils
Caused by: java.lang.NoClassDefFoundError: Could not initialize class com.google.inject.internal.cglib.core.$ReflectUtils


FAILED:  org.apache.maven.index.Nexus3233NexusIndexerTest.linux-jdk16 / Build linux-jdk16 / testIdentifyPomPackagingArtifacts

Error Message:
java.lang.NoClassDefFoundError: Could not initialize class com.google.inject.internal.cglib.core.$ReflectUtils

Stack Trace:
com.google.common.util.concurrent.ExecutionError: java.lang.NoClassDefFoundError: Could not initialize class com.google.inject.internal.cglib.core.$ReflectUtils
Caused by: java.lang.NoClassDefFoundError: Could not initialize class com.google.inject.internal.cglib.core.$ReflectUtils


FAILED:  org.apache.maven.index.Nexus3233NexusIndexerTest.linux-jdk16 / Build linux-jdk16 / testDirectory

Error Message:
java.lang.NoClassDefFoundError: Could not initialize class com.google.inject.internal.cglib.core.$ReflectUtils

Stack Trace:
com.google.common.util.concurrent.ExecutionError: java.lang.NoClassDefFoundError: Could not initialize class com.google.inject.internal.cglib.core.$ReflectUtils
Caused by: java.lang.NoClassDefFoundError: Could not initialize class com.google.inject.internal.cglib.core.$ReflectUtils


FAILED:  org.apache.maven.index.Nexus3293TimestampSnapshotTest.linux-jdk16 / Build linux-jdk16 / test_nexus_3293_releaseJar

Error Message:
java.lang.NoClassDefFoundError: Could not initialize class com.google.inject.internal.cglib.core.$ReflectUtils

Stack Trace:
com.google.common.util.concurrent.ExecutionError: java.lang.NoClassDefFoundError: Could not initialize class com.google.inject.internal.cglib.core.$ReflectUtils
Caused by: java.lang.NoClassDefFoundError: Could not initialize class com.google.inject.internal.cglib.core.$ReflectUtils


FAILED:  org.apache.maven.index.Nexus3293TimestampSnapshotTest.linux-jdk16 / Build linux-jdk16 / test_nexus_3293_indexTimestampedSnapshotJar

Error Message:
java.lang.NoClassDefFoundError: Could not initialize class com.google.inject.internal.cglib.core.$ReflectUtils

Stack Trace:
com.google.common.util.concurrent.ExecutionError: java.lang.NoClassDefFoundError: Could not initialize class com.google.inject.internal.cglib.core.$ReflectUtils
Caused by: java.lang.NoClassDefFoundError: Could not initialize class com.google.inject.internal.cglib.core.$ReflectUtils


FAILED:  org.apache.maven.index.Nexus3293TimestampSnapshotTest.linux-jdk16 / Build linux-jdk16 / testDirectory

Error Message:
java.lang.NoClassDefFoundError: Could not initialize class com.google.inject.internal.cglib.core.$ReflectUtils

Stack Trace:
com.google.common.util.concurrent.ExecutionError: java.lang.NoClassDefFoundError: Could not initialize class com.google.inject.internal.cglib.core.$ReflectUtils
Caused by: java.lang.NoClassDefFoundError: Could not initialize class com.google.inject.internal.cglib.core.$ReflectUtils


FAILED:  org.apache.maven.index.Nexus3881NexusIndexerTest.linux-jdk16 / Build linux-jdk16 / testRelevances

Error Message:
java.lang.NoClassDefFoundError: Could not initialize class com.google.inject.internal.cglib.core.$ReflectUtils

Stack Trace:
com.google.common.util.concurrent.ExecutionError: java.lang.NoClassDefFoundError: Could not initialize class com.google.inject.internal.cglib.core.$ReflectUtils
Caused by: java.lang.NoClassDefFoundError: Could not initialize class com.google.inject.internal.cglib.core.$ReflectUtils


FAILED:  org.apache.maven.index.Nexus3881NexusIndexerTest.linux-jdk16 / Build linux-jdk16 / testDirectory

Error Message:
java.lang.NoClassDefFoundError: Could not initialize class com.google.inject.internal.cglib.core.$ReflectUtils

Stack Trace:
com.google.common.util.concurrent.ExecutionError: java.lang.NoClassDefFoundError: Could not initialize class com.google.inject.internal.cglib.core.$ReflectUtils
Caused by: java.lang.NoClassDefFoundError: Could not initialize class com.google.inject.internal.cglib.core.$ReflectUtils


FAILED:  org.apache.maven.index.Nexus4674GavPathReindexTest.linux-jdk16 / Build linux-jdk16 / testIdentify

Error Message:
java.lang.NoClassDefFoundError: Could not initialize class com.google.inject.internal.cglib.core.$ReflectUtils

Stack Trace:
com.google.common.util.concurrent.ExecutionError: java.lang.NoClassDefFoundError: Could not initialize class com.google.inject.internal.cglib.core.$ReflectUtils
Caused by: java.lang.NoClassDefFoundError: Could not initialize class com.google.inject.internal.cglib.core.$ReflectUtils


FAILED:  org.apache.maven.index.Nexus4674GavPathReindexTest.linux-jdk16 / Build linux-jdk16 / testRootGroups

Error Message:
java.lang.NoClassDefFoundError: Could not initialize class com.google.inject.internal.cglib.core.$ReflectUtils

Stack Trace:
com.google.common.util.concurrent.ExecutionError: java.lang.NoClassDefFoundError: Could not initialize class com.google.inject.internal.cglib.core.$ReflectUtils
Caused by: java.lang.NoClassDefFoundError: Could not initialize class com.google.inject.internal.cglib.core.$ReflectUtils


FAILED:  org.apache.maven.index.Nexus4674GavPathReindexTest.linux-jdk16 / Build linux-jdk16 / testDirectory

Error Message:
java.lang.NoClassDefFoundError: Could not initialize class com.google.inject.internal.cglib.core.$ReflectUtils

Stack Trace:
com.google.common.util.concurrent.ExecutionError: java.lang.NoClassDefFoundError: Could not initialize class com.google.inject.internal.cglib.core.$ReflectUtils
Caused by: java.lang.NoClassDefFoundError: Could not initialize class com.google.inject.internal.cglib.core.$ReflectUtils


FAILED:  org.apache.maven.index.Nexus645NexusIndexerTest.linux-jdk16 / Build linux-jdk16 / testSearchFlat

Error Message:
java.lang.NoClassDefFoundError: Could not initialize class com.google.inject.internal.cglib.core.$ReflectUtils

Stack Trace:
com.google.common.util.concurrent.ExecutionError: java.lang.NoClassDefFoundError: Could not initialize class com.google.inject.internal.cglib.core.$ReflectUtils
Caused by: java.lang.NoClassDefFoundError: Could not initialize class com.google.inject.internal.cglib.core.$ReflectUtils


FAILED:  org.apache.maven.index.Nexus645NexusIndexerTest.linux-jdk16 / Build linux-jdk16 / testDirectory

Error Message:
java.lang.NoClassDefFoundError: Could not initialize class com.google.inject.internal.cglib.core.$ReflectUtils

Stack Trace:
com.google.common.util.concurrent.ExecutionError: java.lang.NoClassDefFoundError: Could not initialize class com.google.inject.internal.cglib.core.$ReflectUtils
Caused by: java.lang.NoClassDefFoundError: Could not initialize class com.google.inject.internal.cglib.core.$ReflectUtils


FAILED:  org.apache.maven.index.Nexus658NexusIndexerTest.linux-jdk16 / Build linux-jdk16 / testSearchFlat

Error Message:
java.lang.NoClassDefFoundError: Could not initialize class com.google.inject.internal.cglib.core.$ReflectUtils

Stack Trace:
com.google.common.util.concurrent.ExecutionError: java.lang.NoClassDefFoundError: Could not initialize class com.google.inject.internal.cglib.core.$ReflectUtils
Caused by: java.lang.NoClassDefFoundError: Could not initialize class com.google.inject.internal.cglib.core.$ReflectUtils


FAILED:  org.apache.maven.index.Nexus658NexusIndexerTest.linux-jdk16 / Build linux-jdk16 / testDirectory

Error Message:
java.lang.NoClassDefFoundError: Could not initialize class com.google.inject.internal.cglib.core.$ReflectUtils

Stack Trace:
com.google.common.util.concurrent.ExecutionError: java.lang.NoClassDefFoundError: Could not initialize class com.google.inject.internal.cglib.core.$ReflectUtils
Caused by: java.lang.NoClassDefFoundError: Could not initialize class com.google.inject.internal.cglib.core.$ReflectUtils


FAILED:  org.apache.maven.index.Nexus687NexusIndexerTest.linux-jdk16 / Build linux-jdk16 / testSearchFlat

Error Message:
java.lang.NoClassDefFoundError: Could not initialize class com.google.inject.internal.cglib.core.$ReflectUtils

Stack Trace:
com.google.common.util.concurrent.ExecutionError: java.lang.NoClassDefFoundError: Could not initialize class com.google.inject.internal.cglib.core.$ReflectUtils
Caused by: java.lang.NoClassDefFoundError: Could not initialize class com.google.inject.internal.cglib.core.$ReflectUtils


FAILED:  org.apache.maven.index.Nexus687NexusIndexerTest.linux-jdk16 / Build linux-jdk16 / testDirectory

Error Message:
java.lang.NoClassDefFoundError: Could not initialize class com.google.inject.internal.cglib.core.$ReflectUtils

Stack Trace:
com.google.common.util.concurrent.ExecutionError: java.lang.NoClassDefFoundError: Could not initialize class com.google.inject.internal.cglib.core.$ReflectUtils
Caused by: java.lang.NoClassDefFoundError: Could not initialize class com.google.inject.internal.cglib.core.$ReflectUtils


FAILED:  org.apache.maven.index.Nexus737NexusIndexerTest.linux-jdk16 / Build linux-jdk16 / testValidateUINFOs

Error Message:
java.lang.NoClassDefFoundError: Could not initialize class com.google.inject.internal.cglib.core.$ReflectUtils

Stack Trace:
com.google.common.util.concurrent.ExecutionError: java.lang.NoClassDefFoundError: Could not initialize class com.google.inject.internal.cglib.core.$ReflectUtils
Caused by: java.lang.NoClassDefFoundError: Could not initialize class com.google.inject.internal.cglib.core.$ReflectUtils


FAILED:  org.apache.maven.index.Nexus737NexusIndexerTest.linux-jdk16 / Build linux-jdk16 / testDirectory

Error Message:
java.lang.NoClassDefFoundError: Could not initialize class com.google.inject.internal.cglib.core.$ReflectUtils

Stack Trace:
com.google.common.util.concurrent.ExecutionError: java.lang.NoClassDefFoundError: Could not initialize class com.google.inject.internal.cglib.core.$ReflectUtils
Caused by: java.lang.NoClassDefFoundError: Could not initialize class com.google.inject.internal.cglib.core.$ReflectUtils


FAILED:  org.apache.maven.index.NexusIndexerTest.linux-jdk16 / Build linux-jdk16 / testUpdateArtifact

Error Message:
java.lang.NoClassDefFoundError: Could not initialize class com.google.inject.internal.cglib.core.$ReflectUtils

Stack Trace:
com.google.common.util.concurrent.ExecutionError: java.lang.NoClassDefFoundError: Could not initialize class com.google.inject.internal.cglib.core.$ReflectUtils
Caused by: java.lang.NoClassDefFoundError: Could not initialize class com.google.inject.internal.cglib.core.$ReflectUtils


FAILED:  org.apache.maven.index.NexusIndexerTest.linux-jdk16 / Build linux-jdk16 / testSearchFlat

Error Message:
java.lang.NoClassDefFoundError: Could not initialize class com.google.inject.internal.cglib.core.$ReflectUtils

Stack Trace:
com.google.common.util.concurrent.ExecutionError: java.lang.NoClassDefFoundError: Could not initialize class com.google.inject.internal.cglib.core.$ReflectUtils
Caused by: java.lang.NoClassDefFoundError: Could not initialize class com.google.inject.internal.cglib.core.$ReflectUtils


FAILED:  org.apache.maven.index.NexusIndexerTest.linux-jdk16 / Build linux-jdk16 / testSearchGrouped

Error Message:
java.lang.NoClassDefFoundError: Could not initialize class com.google.inject.internal.cglib.core.$ReflectUtils

Stack Trace:
com.google.common.util.concurrent.ExecutionError: java.lang.NoClassDefFoundError: Could not initialize class com.google.inject.internal.cglib.core.$ReflectUtils
Caused by: java.lang.NoClassDefFoundError: Could not initialize class com.google.inject.internal.cglib.core.$ReflectUtils


FAILED:  org.apache.maven.index.NexusIndexerTest.linux-jdk16 / Build linux-jdk16 / testQueryCreatorNGSearchOnMergedContext

Error Message:
java.lang.NoClassDefFoundError: Could not initialize class com.google.inject.internal.cglib.core.$ReflectUtils

Stack Trace:
com.google.common.util.concurrent.ExecutionError: java.lang.NoClassDefFoundError: Could not initialize class com.google.inject.internal.cglib.core.$ReflectUtils
Caused by: java.lang.NoClassDefFoundError: Could not initialize class com.google.inject.internal.cglib.core.$ReflectUtils


FAILED:  org.apache.maven.index.NexusIndexerTest.linux-jdk16 / Build linux-jdk16 / testQueryCreatorNG

Error Message:
java.lang.NoClassDefFoundError: Could not initialize class com.google.inject.internal.cglib.core.$ReflectUtils

Stack Trace:
com.google.common.util.concurrent.ExecutionError: java.lang.NoClassDefFoundError: Could not initialize class com.google.inject.internal.cglib.core.$ReflectUtils
Caused by: java.lang.NoClassDefFoundError: Could not initialize class com.google.inject.internal.cglib.core.$ReflectUtils


FAILED:  org.apache.maven.index.NexusIndexerTest.linux-jdk16 / Build linux-jdk16 / testSearchIteratorWithFilter

Error Message:
java.lang.NoClassDefFoundError: Could not initialize class com.google.inject.internal.cglib.core.$ReflectUtils

Stack Trace:
com.google.common.util.concurrent.ExecutionError: java.lang.NoClassDefFoundError: Could not initialize class com.google.inject.internal.cglib.core.$ReflectUtils
Caused by: java.lang.NoClassDefFoundError: Could not initialize class com.google.inject.internal.cglib.core.$ReflectUtils


FAILED:  org.apache.maven.index.NexusIndexerTest.linux-jdk16 / Build linux-jdk16 / testSearchPackaging

Error Message:
java.lang.NoClassDefFoundError: Could not initialize class com.google.inject.internal.cglib.core.$ReflectUtils

Stack Trace:
com.google.common.util.concurrent.ExecutionError: java.lang.NoClassDefFoundError: Could not initialize class com.google.inject.internal.cglib.core.$ReflectUtils
Caused by: java.lang.NoClassDefFoundError: Could not initialize class com.google.inject.internal.cglib.core.$ReflectUtils


FAILED:  org.apache.maven.index.NexusIndexerTest.linux-jdk16 / Build linux-jdk16 / testIdentity

Error Message:
java.lang.NoClassDefFoundError: Could not initialize class com.google.inject.internal.cglib.core.$ReflectUtils

Stack Trace:
com.google.common.util.concurrent.ExecutionError: java.lang.NoClassDefFoundError: Could not initialize class com.google.inject.internal.cglib.core.$ReflectUtils
Caused by: java.lang.NoClassDefFoundError: Could not initialize class com.google.inject.internal.cglib.core.$ReflectUtils


FAILED:  org.apache.maven.index.NexusIndexerTest.linux-jdk16 / Build linux-jdk16 / testQueryCreatorNGSearch

Error Message:
java.lang.NoClassDefFoundError: Could not initialize class com.google.inject.internal.cglib.core.$ReflectUtils

Stack Trace:
com.google.common.util.concurrent.ExecutionError: java.lang.NoClassDefFoundError: Could not initialize class com.google.inject.internal.cglib.core.$ReflectUtils
Caused by: java.lang.NoClassDefFoundError: Could not initialize class com.google.inject.internal.cglib.core.$ReflectUtils


FAILED:  org.apache.maven.index.NexusIndexerTest.linux-jdk16 / Build linux-jdk16 / testUnpack

Error Message:
java.lang.NoClassDefFoundError: Could not initialize class com.google.inject.internal.cglib.core.$ReflectUtils

Stack Trace:
com.google.common.util.concurrent.ExecutionError: java.lang.NoClassDefFoundError: Could not initialize class com.google.inject.internal.cglib.core.$ReflectUtils
Caused by: java.lang.NoClassDefFoundError: Could not initialize class com.google.inject.internal.cglib.core.$ReflectUtils


FAILED:  org.apache.maven.index.NexusIndexerTest.linux-jdk16 / Build linux-jdk16 / testSingleQuery

Error Message:
java.lang.NoClassDefFoundError: Could not initialize class com.google.inject.internal.cglib.core.$ReflectUtils

Stack Trace:
com.google.common.util.concurrent.ExecutionError: java.lang.NoClassDefFoundError: Could not initialize class com.google.inject.internal.cglib.core.$ReflectUtils
Caused by: java.lang.NoClassDefFoundError: Could not initialize class com.google.inject.internal.cglib.core.$ReflectUtils


FAILED:  org.apache.maven.index.NexusIndexerTest.linux-jdk16 / Build linux-jdk16 / testSearchIterator

Error Message:
java.lang.NoClassDefFoundError: Could not initialize class com.google.inject.internal.cglib.core.$ReflectUtils

Stack Trace:
com.google.common.util.concurrent.ExecutionError: java.lang.NoClassDefFoundError: Could not initialize class com.google.inject.internal.cglib.core.$ReflectUtils
Caused by: java.lang.NoClassDefFoundError: Could not initialize class com.google.inject.internal.cglib.core.$ReflectUtils


FAILED:  org.apache.maven.index.NexusIndexerTest.linux-jdk16 / Build linux-jdk16 / testDirectory

Error Message:
java.lang.NoClassDefFoundError: Could not initialize class com.google.inject.internal.cglib.core.$ReflectUtils

Stack Trace:
com.google.common.util.concurrent.ExecutionError: java.lang.NoClassDefFoundError: Could not initialize class com.google.inject.internal.cglib.core.$ReflectUtils
Caused by: java.lang.NoClassDefFoundError: Could not initialize class com.google.inject.internal.cglib.core.$ReflectUtils


FAILED:  org.apache.maven.index.SearchWithAnEmptyIndexTest.linux-jdk16 / Build linux-jdk16 / testSearchNoDuplicateArtifactInfo

Error Message:
java.lang.NoClassDefFoundError: Could not initialize class com.google.inject.internal.cglib.core.$ReflectUtils

Stack Trace:
com.google.common.util.concurrent.ExecutionError: java.lang.NoClassDefFoundError: Could not initialize class com.google.inject.internal.cglib.core.$ReflectUtils
        at org.apache.maven.index.SearchWithAnEmptyIndexTest.setUp(SearchWithAnEmptyIndexTest.java:56)
Caused by: java.lang.NoClassDefFoundError: Could not initialize class com.google.inject.internal.cglib.core.$ReflectUtils
        at org.apache.maven.index.SearchWithAnEmptyIndexTest.setUp(SearchWithAnEmptyIndexTest.java:56)


FAILED:  org.apache.maven.index.SearchWithAnEmptyIndexTest.linux-jdk16 / Build linux-jdk16 / testWithTwoContextWithOneEmptyFirstInContextsListSearchFlat

Error Message:
java.lang.NoClassDefFoundError: Could not initialize class com.google.inject.internal.cglib.core.$ReflectUtils

Stack Trace:
com.google.common.util.concurrent.ExecutionError: java.lang.NoClassDefFoundError: Could not initialize class com.google.inject.internal.cglib.core.$ReflectUtils
        at org.apache.maven.index.SearchWithAnEmptyIndexTest.setUp(SearchWithAnEmptyIndexTest.java:56)
Caused by: java.lang.NoClassDefFoundError: Could not initialize class com.google.inject.internal.cglib.core.$ReflectUtils
        at org.apache.maven.index.SearchWithAnEmptyIndexTest.setUp(SearchWithAnEmptyIndexTest.java:56)


FAILED:  org.apache.maven.index.SubPathReindexTest.linux-jdk16 / Build linux-jdk16 / testIdentify

Error Message:
java.lang.NoClassDefFoundError: Could not initialize class com.google.inject.internal.cglib.core.$ReflectUtils

Stack Trace:
com.google.common.util.concurrent.ExecutionError: java.lang.NoClassDefFoundError: Could not initialize class com.google.inject.internal.cglib.core.$ReflectUtils
Caused by: java.lang.NoClassDefFoundError: Could not initialize class com.google.inject.internal.cglib.core.$ReflectUtils


FAILED:  org.apache.maven.index.SubPathReindexTest.linux-jdk16 / Build linux-jdk16 / testRootGroups

Error Message:
java.lang.NoClassDefFoundError: Could not initialize class com.google.inject.internal.cglib.core.$ReflectUtils

Stack Trace:
com.google.common.util.concurrent.ExecutionError: java.lang.NoClassDefFoundError: Could not initialize class com.google.inject.internal.cglib.core.$ReflectUtils
Caused by: java.lang.NoClassDefFoundError: Could not initialize class com.google.inject.internal.cglib.core.$ReflectUtils


FAILED:  org.apache.maven.index.SubPathReindexTest.linux-jdk16 / Build linux-jdk16 / testDirectory

Error Message:
java.lang.NoClassDefFoundError: Could not initialize class com.google.inject.internal.cglib.core.$ReflectUtils

Stack Trace:
com.google.common.util.concurrent.ExecutionError: java.lang.NoClassDefFoundError: Could not initialize class com.google.inject.internal.cglib.core.$ReflectUtils
Caused by: java.lang.NoClassDefFoundError: Could not initialize class com.google.inject.internal.cglib.core.$ReflectUtils


FAILED:  org.apache.maven.index.UniqueArtifactFilterTest.linux-jdk16 / Build linux-jdk16 / testSearchIteratorWithFilter

Error Message:
java.lang.NoClassDefFoundError: Could not initialize class com.google.inject.internal.cglib.core.$ReflectUtils

Stack Trace:
com.google.common.util.concurrent.ExecutionError: java.lang.NoClassDefFoundError: Could not initialize class com.google.inject.internal.cglib.core.$ReflectUtils
Caused by: java.lang.NoClassDefFoundError: Could not initialize class com.google.inject.internal.cglib.core.$ReflectUtils


FAILED:  org.apache.maven.index.UniqueArtifactFilterTest.linux-jdk16 / Build linux-jdk16 / testSearchIterator

Error Message:
java.lang.NoClassDefFoundError: Could not initialize class com.google.inject.internal.cglib.core.$ReflectUtils

Stack Trace:
com.google.common.util.concurrent.ExecutionError: java.lang.NoClassDefFoundError: Could not initialize class com.google.inject.internal.cglib.core.$ReflectUtils
Caused by: java.lang.NoClassDefFoundError: Could not initialize class com.google.inject.internal.cglib.core.$ReflectUtils


FAILED:  org.apache.maven.index.UniqueArtifactFilterTest.linux-jdk16 / Build linux-jdk16 / testDirectory

Error Message:
java.lang.NoClassDefFoundError: Could not initialize class com.google.inject.internal.cglib.core.$ReflectUtils

Stack Trace:
com.google.common.util.concurrent.ExecutionError: java.lang.NoClassDefFoundError: Could not initialize class com.google.inject.internal.cglib.core.$ReflectUtils
Caused by: java.lang.NoClassDefFoundError: Could not initialize class com.google.inject.internal.cglib.core.$ReflectUtils


FAILED:  org.apache.maven.index.cli.NexusIndexerCliIT.linux-jdk16 / Build linux-jdk16 / testRequiredArgs

Error Message:
Picked up JAVA_TOOL_OPTIONS: -Dmaven.ext.class.path="/home/jenkins/workspace/en_maven-box_maven-indexer_guava@2@tmp/withMavene7c14b83/pipeline-maven-spy.jar" -Dorg.jenkinsci.plugins.pipeline.maven.reportsFolder="/home/jenkins/workspace/en_maven-box_maven-indexer_guava@2@tmp/withMavene7c14b83"
Exception in thread "main" com.google.common.util.concurrent.ExecutionError: java.lang.ExceptionInInitializerError
 at com.google.common.cache.LocalCache$Segment.get(LocalCache.java:2205)
 at com.google.common.cache.LocalCache.get(LocalCache.java:3953)
 at com.google.common.cache.LocalCache.getOrLoad(LocalCache.java:3957)
 at com.google.common.cache.LocalCache$LocalLoadingCache.get(LocalCache.java:4875)
 at com.google.common.cache.LocalCache$LocalLoadingCache.getUnchecked(LocalCache.java:4881)
 at com.google.inject.internal.FailableCache.get(FailableCache.java:48)
 at com.google.inject.internal.ConstructorInjectorStore.get(ConstructorInjectorStore.java:50)
 at com.google.inject.internal.ConstructorBindingImpl.initialize(ConstructorBindingImpl.java:138)
 at com.google.inject.internal.InjectorImpl.initializeJitBinding(InjectorImpl.java:550)
 at com.google.inject.internal.InjectorImpl.createJustInTimeBinding(InjectorImpl.java:887)
 at com.google.inject.internal.InjectorImpl.createJustInTimeBindingRecursive(InjectorImpl.java:808)
 at com.google.inject.internal.InjectorImpl.getJustInTimeBinding(InjectorImpl.java:285)
 at com.google.inject.internal.InjectorImpl.getBindingOrThrow(InjectorImpl.java:217)
 at com.google.inject.internal.InjectorImpl.getInternalFactory(InjectorImpl.java:893)
 at com.google.inject.internal.FactoryProxy.notify(FactoryProxy.java:46)
 at com.google.inject.internal.ProcessedBindingData.runCreationListeners(ProcessedBindingData.java:50)
 at com.google.inject.internal.InternalInjectorCreator.initializeStatically(InternalInjectorCreator.java:134)
 at com.google.inject.internal.InternalInjectorCreator.build(InternalInjectorCreator.java:107)
 at com.google.inject.Guice.createInjector(Guice.java:99)
 at com.google.inject.Guice.createInjector(Guice.java:73)
 at com.google.inject.Guice.createInjector(Guice.java:62)
 at org.codehaus.plexus.DefaultPlexusContainer.addPlexusInjector(DefaultPlexusContainer.java:481)
 at org.codehaus.plexus.DefaultPlexusContainer.<init>(DefaultPlexusContainer.java:206)
 at org.codehaus.plexus.DefaultPlexusContainer.<init>(DefaultPlexusContainer.java:168)
 at org.codehaus.plexus.tools.cli.AbstractCli.execute(AbstractCli.java:177)
 at org.apache.maven.index.cli.NexusIndexerCli.execute(NexusIndexerCli.java:124)
 at org.codehaus.plexus.tools.cli.AbstractCli.execute(AbstractCli.java:83)
 at org.apache.maven.index.cli.NexusIndexerCli.execute(NexusIndexerCli.java:137)
 at org.apache.maven.index.cli.NexusIndexerCli.main(NexusIndexerCli.java:116)
Caused by: java.lang.ExceptionInInitializerError
 at com.google.inject.internal.cglib.reflect.$FastClass$Generator.getProtectionDomain(FastClass.java:73)
 at com.google.inject.internal.cglib.core.$AbstractClassGenerator.create(AbstractClassGenerator.java:206)
 at com.google.inject.internal.cglib.reflect.$FastClass$Generator.create(FastClass.java:65)
 at com.google.inject.internal.BytecodeGen.newFastClassForMember(BytecodeGen.java:252)
 at com.google.inject.internal.BytecodeGen.newFastClassForMember(BytecodeGen.java:203)
 at com.google.inject.internal.DefaultConstructionProxyFactory.create(DefaultConstructionProxyFactory.java:53)
 at com.google.inject.internal.ProxyFactory.create(ProxyFactory.java:158)
 at com.google.inject.internal.ConstructorInjectorStore.createConstructor(ConstructorInjectorStore.java:90)
 at com.google.inject.internal.ConstructorInjectorStore.access$000(ConstructorInjectorStore.java:29)
 at com.google.inject.internal.ConstructorInjectorStore$1.create(ConstructorInjectorStore.java:37)
 at com.google.inject.internal.ConstructorInjectorStore$1.create(ConstructorInjectorStore.java:33)
 at com.google.inject.internal.FailableCache$1.load(FailableCache.java:37)
 at com.google.common.cache.LocalCache$LoadingValueReference.loadFuture(LocalCache.java:3542)
 at com.google.common.cache.LocalCache$Segment.loadSync(LocalCache.java:2323)
 at com.google.common.cache.LocalCache$Segment.lockedGetOrLoad(LocalCache.java:2286)
 at com.google.common.cache.LocalCache$Segment.get(LocalCache.java:2201)
 ... 28 more
Caused by: java.lang.reflect.InaccessibleObjectException: Unable to make protected final java.lang.Class java.lang.ClassLoader.defineClass(java.lang.String,byte[],int,int,java.security.ProtectionDomain) throws java.lang.ClassFormatError accessible: module java.base does not "opens java.lang" to unnamed module @209c0b14
 at java.base/java.lang.reflect.AccessibleObject.checkCanSetAccessible(AccessibleObject.java:357)
 at java.base/java.lang.reflect.AccessibleObject.checkCanSetAccessible(AccessibleObject.java:297)
 at java.base/java.lang.reflect.Method.checkCanSetAccessible(Method.java:199)
 at java.base/java.lang.reflect.Method.setAccessible(Method.java:193)
 at com.google.inject.internal.cglib.core.$ReflectUtils$1.run(ReflectUtils.java:52)
 at java.base/java.security.AccessController.doPrivileged(AccessController.java:312)
 at com.google.inject.internal.cglib.core.$ReflectUtils.<clinit>(ReflectUtils.java:42)
 ... 44 more
 expected:<0> but was:<1>

Stack Trace:
junit.framework.AssertionFailedError:
Picked up JAVA_TOOL_OPTIONS: -Dmaven.ext.class.path="/home/jenkins/workspace/en_maven-box_maven-indexer_guava@2@tmp/withMavene7c14b83/pipeline-maven-spy.jar" -Dorg.jenkinsci.plugins.pipeline.maven.reportsFolder="/home/jenkins/workspace/en_maven-box_maven-indexer_guava@2@tmp/withMavene7c14b83"
Exception in thread "main" com.google.common.util.concurrent.ExecutionError: java.lang.ExceptionInInitializerError
        at com.google.common.cache.LocalCache$Segment.get(LocalCache.java:2205)
        at com.google.common.cache.LocalCache.get(LocalCache.java:3953)
        at com.google.common.cache.LocalCache.getOrLoad(LocalCache.java:3957)
        at com.google.common.cache.LocalCache$LocalLoadingCache.get(LocalCache.java:4875)
        at com.google.common.cache.LocalCache$LocalLoadingCache.getUnchecked(LocalCache.java:4881)
        at com.google.inject.internal.FailableCache.get(FailableCache.java:48)
        at com.google.inject.internal.ConstructorInjectorStore.get(ConstructorInjectorStore.java:50)
        at com.google.inject.internal.ConstructorBindingImpl.initialize(ConstructorBindingImpl.java:138)
        at com.google.inject.internal.InjectorImpl.initializeJitBinding(InjectorImpl.java:550)
        at com.google.inject.internal.InjectorImpl.createJustInTimeBinding(InjectorImpl.java:887)
        at com.google.inject.internal.InjectorImpl.createJustInTimeBindingRecursive(InjectorImpl.java:808)
        at com.google.inject.internal.InjectorImpl.getJustInTimeBinding(InjectorImpl.java:285)
        at com.google.inject.internal.InjectorImpl.getBindingOrThrow(InjectorImpl.java:217)
        at com.google.inject.internal.InjectorImpl.getInternalFactory(InjectorImpl.java:893)
        at com.google.inject.internal.FactoryProxy.notify(FactoryProxy.java:46)
        at com.google.inject.internal.ProcessedBindingData.runCreationListeners(ProcessedBindingData.java:50)
        at com.google.inject.internal.InternalInjectorCreator.initializeStatically(InternalInjectorCreator.java:134)
        at com.google.inject.internal.InternalInjectorCreator.build(InternalInjectorCreator.java:107)
        at com.google.inject.Guice.createInjector(Guice.java:99)
        at com.google.inject.Guice.createInjector(Guice.java:73)
        at com.google.inject.Guice.createInjector(Guice.java:62)
        at org.codehaus.plexus.DefaultPlexusContainer.addPlexusInjector(DefaultPlexusContainer.java:481)
        at org.codehaus.plexus.DefaultPlexusContainer.<init>(DefaultPlexusContainer.java:206)
        at org.codehaus.plexus.DefaultPlexusContainer.<init>(DefaultPlexusContainer.java:168)
        at org.codehaus.plexus.tools.cli.AbstractCli.execute(AbstractCli.java:177)
        at org.apache.maven.index.cli.NexusIndexerCli.execute(NexusIndexerCli.java:124)
        at org.codehaus.plexus.tools.cli.AbstractCli.execute(AbstractCli.java:83)
        at org.apache.maven.index.cli.NexusIndexerCli.execute(NexusIndexerCli.java:137)
        at org.apache.maven.index.cli.NexusIndexerCli.main(NexusIndexerCli.java:116)
Caused by: java.lang.ExceptionInInitializerError
        at com.google.inject.internal.cglib.reflect.$FastClass$Generator.getProtectionDomain(FastClass.java:73)
        at com.google.inject.internal.cglib.core.$AbstractClassGenerator.create(AbstractClassGenerator.java:206)
        at com.google.inject.internal.cglib.reflect.$FastClass$Generator.create(FastClass.java:65)
        at com.google.inject.internal.BytecodeGen.newFastClassForMember(BytecodeGen.java:252)
        at com.google.inject.internal.BytecodeGen.newFastClassForMember(BytecodeGen.java:203)
        at com.google.inject.internal.DefaultConstructionProxyFactory.create(DefaultConstructionProxyFactory.java:53)
        at com.google.inject.internal.ProxyFactory.create(ProxyFactory.java:158)
        at com.google.inject.internal.ConstructorInjectorStore.createConstructor(ConstructorInjectorStore.java:90)
        at com.google.inject.internal.ConstructorInjectorStore.access$000(ConstructorInjectorStore.java:29)
        at com.google.inject.internal.ConstructorInjectorStore$1.create(ConstructorInjectorStore.java:37)
        at com.google.inject.internal.ConstructorInjectorStore$1.create(ConstructorInjectorStore.java:33)
        at com.google.inject.internal.FailableCache$1.load(FailableCache.java:37)
        at com.google.common.cache.LocalCache$LoadingValueReference.loadFuture(LocalCache.java:3542)
        at com.google.common.cache.LocalCache$Segment.loadSync(LocalCache.java:2323)
        at com.google.common.cache.LocalCache$Segment.lockedGetOrLoad(LocalCache.java:2286)
        at com.google.common.cache.LocalCache$Segment.get(LocalCache.java:2201)
        ... 28 more
Caused by: java.lang.reflect.InaccessibleObjectException: Unable to make protected final java.lang.Class java.lang.ClassLoader.defineClass(java.lang.String,byte[],int,int,java.security.ProtectionDomain) throws java.lang.ClassFormatError accessible: module java.base does not "opens java.lang" to unnamed module @209c0b14
        at java.base/java.lang.reflect.AccessibleObject.checkCanSetAccessible(AccessibleObject.java:357)
        at java.base/java.lang.reflect.AccessibleObject.checkCanSetAccessible(AccessibleObject.java:297)
        at java.base/java.lang.reflect.Method.checkCanSetAccessible(Method.java:199)
        at java.base/java.lang.reflect.Method.setAccessible(Method.java:193)
        at com.google.inject.internal.cglib.core.$ReflectUtils$1.run(ReflectUtils.java:52)
        at java.base/java.security.AccessController.doPrivileged(AccessController.java:312)
        at com.google.inject.internal.cglib.core.$ReflectUtils.<clinit>(ReflectUtils.java:42)
        ... 44 more
 expected:<0> but was:<1>


FAILED:  org.apache.maven.index.cli.NexusIndexerCliIT.linux-jdk16 / Build linux-jdk16 / testLoggingLevel

Error Message:
Picked up JAVA_TOOL_OPTIONS: -Dmaven.ext.class.path="/home/jenkins/workspace/en_maven-box_maven-indexer_guava@2@tmp/withMavene7c14b83/pipeline-maven-spy.jar" -Dorg.jenkinsci.plugins.pipeline.maven.reportsFolder="/home/jenkins/workspace/en_maven-box_maven-indexer_guava@2@tmp/withMavene7c14b83"
Exception in thread "main" com.google.common.util.concurrent.ExecutionError: java.lang.ExceptionInInitializerError
 at com.google.common.cache.LocalCache$Segment.get(LocalCache.java:2205)
 at com.google.common.cache.LocalCache.get(LocalCache.java:3953)
 at com.google.common.cache.LocalCache.getOrLoad(LocalCache.java:3957)
 at com.google.common.cache.LocalCache$LocalLoadingCache.get(LocalCache.java:4875)
 at com.google.common.cache.LocalCache$LocalLoadingCache.getUnchecked(LocalCache.java:4881)
 at com.google.inject.internal.FailableCache.get(FailableCache.java:48)
 at com.google.inject.internal.ConstructorInjectorStore.get(ConstructorInjectorStore.java:50)
 at com.google.inject.internal.ConstructorBindingImpl.initialize(ConstructorBindingImpl.java:138)
 at com.google.inject.internal.InjectorImpl.initializeJitBinding(InjectorImpl.java:550)
 at com.google.inject.internal.InjectorImpl.createJustInTimeBinding(InjectorImpl.java:887)
 at com.google.inject.internal.InjectorImpl.createJustInTimeBindingRecursive(InjectorImpl.java:808)
 at com.google.inject.internal.InjectorImpl.getJustInTimeBinding(InjectorImpl.java:285)
 at com.google.inject.internal.InjectorImpl.getBindingOrThrow(InjectorImpl.java:217)
 at com.google.inject.internal.InjectorImpl.getInternalFactory(InjectorImpl.java:893)
 at com.google.inject.internal.FactoryProxy.notify(FactoryProxy.java:46)
 at com.google.inject.internal.ProcessedBindingData.runCreationListeners(ProcessedBindingData.java:50)
 at com.google.inject.internal.InternalInjectorCreator.initializeStatically(InternalInjectorCreator.java:134)
 at com.google.inject.internal.InternalInjectorCreator.build(InternalInjectorCreator.java:107)
 at com.google.inject.Guice.createInjector(Guice.java:99)
 at com.google.inject.Guice.createInjector(Guice.java:73)
 at com.google.inject.Guice.createInjector(Guice.java:62)
 at org.codehaus.plexus.DefaultPlexusContainer.addPlexusInjector(DefaultPlexusContainer.java:481)
 at org.codehaus.plexus.DefaultPlexusContainer.<init>(DefaultPlexusContainer.java:206)
 at org.codehaus.plexus.DefaultPlexusContainer.<init>(DefaultPlexusContainer.java:168)
 at org.codehaus.plexus.tools.cli.AbstractCli.execute(AbstractCli.java:177)
 at org.apache.maven.index.cli.NexusIndexerCli.execute(NexusIndexerCli.java:124)
 at org.codehaus.plexus.tools.cli.AbstractCli.execute(AbstractCli.java:83)
 at org.apache.maven.index.cli.NexusIndexerCli.execute(NexusIndexerCli.java:137)
 at org.apache.maven.index.cli.NexusIndexerCli.main(NexusIndexerCli.java:116)
Caused by: java.lang.ExceptionInInitializerError
 at com.google.inject.internal.cglib.reflect.$FastClass$Generator.getProtectionDomain(FastClass.java:73)
 at com.google.inject.internal.cglib.core.$AbstractClassGenerator.create(AbstractClassGenerator.java:206)
 at com.google.inject.internal.cglib.reflect.$FastClass$Generator.create(FastClass.java:65)
 at com.google.inject.internal.BytecodeGen.newFastClassForMember(BytecodeGen.java:252)
 at com.google.inject.internal.BytecodeGen.newFastClassForMember(BytecodeGen.java:203)
 at com.google.inject.internal.DefaultConstructionProxyFactory.create(DefaultConstructionProxyFactory.java:53)
 at com.google.inject.internal.ProxyFactory.create(ProxyFactory.java:158)
 at com.google.inject.internal.ConstructorInjectorStore.createConstructor(ConstructorInjectorStore.java:90)
 at com.google.inject.internal.ConstructorInjectorStore.access$000(ConstructorInjectorStore.java:29)
 at com.google.inject.internal.ConstructorInjectorStore$1.create(ConstructorInjectorStore.java:37)
 at com.google.inject.internal.ConstructorInjectorStore$1.create(ConstructorInjectorStore.java:33)
 at com.google.inject.internal.FailableCache$1.load(FailableCache.java:37)
 at com.google.common.cache.LocalCache$LoadingValueReference.loadFuture(LocalCache.java:3542)
 at com.google.common.cache.LocalCache$Segment.loadSync(LocalCache.java:2323)
 at com.google.common.cache.LocalCache$Segment.lockedGetOrLoad(LocalCache.java:2286)
 at com.google.common.cache.LocalCache$Segment.get(LocalCache.java:2201)
 ... 28 more
Caused by: java.lang.reflect.InaccessibleObjectException: Unable to make protected final java.lang.Class java.lang.ClassLoader.defineClass(java.lang.String,byte[],int,int,java.security.ProtectionDomain) throws java.lang.ClassFormatError accessible: module java.base does not "opens java.lang" to unnamed module @209c0b14
 at java.base/java.lang.reflect.AccessibleObject.checkCanSetAccessible(AccessibleObject.java:357)
 at java.base/java.lang.reflect.AccessibleObject.checkCanSetAccessible(AccessibleObject.java:297)
 at java.base/java.lang.reflect.Method.checkCanSetAccessible(Method.java:199)
 at java.base/java.lang.reflect.Method.setAccessible(Method.java:193)
 at com.google.inject.internal.cglib.core.$ReflectUtils$1.run(ReflectUtils.java:52)
 at java.base/java.security.AccessController.doPrivileged(AccessController.java:312)
 at com.google.inject.internal.cglib.core.$ReflectUtils.<clinit>(ReflectUtils.java:42)
 ... 44 more
 expected:<0> but was:<1>

Stack Trace:
junit.framework.AssertionFailedError:
Picked up JAVA_TOOL_OPTIONS: -Dmaven.ext.class.path="/home/jenkins/workspace/en_maven-box_maven-indexer_guava@2@tmp/withMavene7c14b83/pipeline-maven-spy.jar" -Dorg.jenkinsci.plugins.pipeline.maven.reportsFolder="/home/jenkins/workspace/en_maven-box_maven-indexer_guava@2@tmp/withMavene7c14b83"
Exception in thread "main" com.google.common.util.concurrent.ExecutionError: java.lang.ExceptionInInitializerError
        at com.google.common.cache.LocalCache$Segment.get(LocalCache.java:2205)
        at com.google.common.cache.LocalCache.get(LocalCache.java:3953)
        at com.google.common.cache.LocalCache.getOrLoad(LocalCache.java:3957)
        at com.google.common.cache.LocalCache$LocalLoadingCache.get(LocalCache.java:4875)
        at com.google.common.cache.LocalCache$LocalLoadingCache.getUnchecked(LocalCache.java:4881)
        at com.google.inject.internal.FailableCache.get(FailableCache.java:48)
        at com.google.inject.internal.ConstructorInjectorStore.get(ConstructorInjectorStore.java:50)
        at com.google.inject.internal.ConstructorBindingImpl.initialize(ConstructorBindingImpl.java:138)
        at com.google.inject.internal.InjectorImpl.initializeJitBinding(InjectorImpl.java:550)
        at com.google.inject.internal.InjectorImpl.createJustInTimeBinding(InjectorImpl.java:887)
        at com.google.inject.internal.InjectorImpl.createJustInTimeBindingRecursive(InjectorImpl.java:808)
        at com.google.inject.internal.InjectorImpl.getJustInTimeBinding(InjectorImpl.java:285)
        at com.google.inject.internal.InjectorImpl.getBindingOrThrow(InjectorImpl.java:217)
        at com.google.inject.internal.InjectorImpl.getInternalFactory(InjectorImpl.java:893)
        at com.google.inject.internal.FactoryProxy.notify(FactoryProxy.java:46)
        at com.google.inject.internal.ProcessedBindingData.runCreationListeners(ProcessedBindingData.java:50)
        at com.google.inject.internal.InternalInjectorCreator.initializeStatically(InternalInjectorCreator.java:134)
        at com.google.inject.internal.InternalInjectorCreator.build(InternalInjectorCreator.java:107)
        at com.google.inject.Guice.createInjector(Guice.java:99)
        at com.google.inject.Guice.createInjector(Guice.java:73)
        at com.google.inject.Guice.createInjector(Guice.java:62)
        at org.codehaus.plexus.DefaultPlexusContainer.addPlexusInjector(DefaultPlexusContainer.java:481)
        at org.codehaus.plexus.DefaultPlexusContainer.<init>(DefaultPlexusContainer.java:206)
        at org.codehaus.plexus.DefaultPlexusContainer.<init>(DefaultPlexusContainer.java:168)
        at org.codehaus.plexus.tools.cli.AbstractCli.execute(AbstractCli.java:177)
        at org.apache.maven.index.cli.NexusIndexerCli.execute(NexusIndexerCli.java:124)
        at org.codehaus.plexus.tools.cli.AbstractCli.execute(AbstractCli.java:83)
        at org.apache.maven.index.cli.NexusIndexerCli.execute(NexusIndexerCli.java:137)
        at org.apache.maven.index.cli.NexusIndexerCli.main(NexusIndexerCli.java:116)
Caused by: java.lang.ExceptionInInitializerError
        at com.google.inject.internal.cglib.reflect.$FastClass$Generator.getProtectionDomain(FastClass.java:73)
        at com.google.inject.internal.cglib.core.$AbstractClassGenerator.create(AbstractClassGenerator.java:206)
        at com.google.inject.internal.cglib.reflect.$FastClass$Generator.create(FastClass.java:65)
        at com.google.inject.internal.BytecodeGen.newFastClassForMember(BytecodeGen.java:252)
        at com.google.inject.internal.BytecodeGen.newFastClassForMember(BytecodeGen.java:203)
        at com.google.inject.internal.DefaultConstructionProxyFactory.create(DefaultConstructionProxyFactory.java:53)
        at com.google.inject.internal.ProxyFactory.create(ProxyFactory.java:158)
        at com.google.inject.internal.ConstructorInjectorStore.createConstructor(ConstructorInjectorStore.java:90)
        at com.google.inject.internal.ConstructorInjectorStore.access$000(ConstructorInjectorStore.java:29)
        at com.google.inject.internal.ConstructorInjectorStore$1.create(ConstructorInjectorStore.java:37)
        at com.google.inject.internal.ConstructorInjectorStore$1.create(ConstructorInjectorStore.java:33)
        at com.google.inject.internal.FailableCache$1.load(FailableCache.java:37)
        at com.google.common.cache.LocalCache$LoadingValueReference.loadFuture(LocalCache.java:3542)
        at com.google.common.cache.LocalCache$Segment.loadSync(LocalCache.java:2323)
        at com.google.common.cache.LocalCache$Segment.lockedGetOrLoad(LocalCache.java:2286)
        at com.google.common.cache.LocalCache$Segment.get(LocalCache.java:2201)
        ... 28 more
Caused by: java.lang.reflect.InaccessibleObjectException: Unable to make protected final java.lang.Class java.lang.ClassLoader.defineClass(java.lang.String,byte[],int,int,java.security.ProtectionDomain) throws java.lang.ClassFormatError accessible: module java.base does not "opens java.lang" to unnamed module @209c0b14
        at java.base/java.lang.reflect.AccessibleObject.checkCanSetAccessible(AccessibleObject.java:357)
        at java.base/java.lang.reflect.AccessibleObject.checkCanSetAccessible(AccessibleObject.java:297)
        at java.base/java.lang.reflect.Method.checkCanSetAccessible(Method.java:199)
        at java.base/java.lang.reflect.Method.setAccessible(Method.java:193)
        at com.google.inject.internal.cglib.core.$ReflectUtils$1.run(ReflectUtils.java:52)
        at java.base/java.security.AccessController.doPrivileged(AccessController.java:312)
        at com.google.inject.internal.cglib.core.$ReflectUtils.<clinit>(ReflectUtils.java:42)
        ... 44 more
 expected:<0> but was:<1>


FAILED:  org.apache.maven.index.cli.NexusIndexerCliIT.linux-jdk16 / Build linux-jdk16 / testAbrvsRequiredArgs

Error Message:
Picked up JAVA_TOOL_OPTIONS: -Dmaven.ext.class.path="/home/jenkins/workspace/en_maven-box_maven-indexer_guava@2@tmp/withMavene7c14b83/pipeline-maven-spy.jar" -Dorg.jenkinsci.plugins.pipeline.maven.reportsFolder="/home/jenkins/workspace/en_maven-box_maven-indexer_guava@2@tmp/withMavene7c14b83"
Exception in thread "main" com.google.common.util.concurrent.ExecutionError: java.lang.ExceptionInInitializerError
 at com.google.common.cache.LocalCache$Segment.get(LocalCache.java:2205)
 at com.google.common.cache.LocalCache.get(LocalCache.java:3953)
 at com.google.common.cache.LocalCache.getOrLoad(LocalCache.java:3957)
 at com.google.common.cache.LocalCache$LocalLoadingCache.get(LocalCache.java:4875)
 at com.google.common.cache.LocalCache$LocalLoadingCache.getUnchecked(LocalCache.java:4881)
 at com.google.inject.internal.FailableCache.get(FailableCache.java:48)
 at com.google.inject.internal.ConstructorInjectorStore.get(ConstructorInjectorStore.java:50)
 at com.google.inject.internal.ConstructorBindingImpl.initialize(ConstructorBindingImpl.java:138)
 at com.google.inject.internal.InjectorImpl.initializeJitBinding(InjectorImpl.java:550)
 at com.google.inject.internal.InjectorImpl.createJustInTimeBinding(InjectorImpl.java:887)
 at com.google.inject.internal.InjectorImpl.createJustInTimeBindingRecursive(InjectorImpl.java:808)
 at com.google.inject.internal.InjectorImpl.getJustInTimeBinding(InjectorImpl.java:285)
 at com.google.inject.internal.InjectorImpl.getBindingOrThrow(InjectorImpl.java:217)
 at com.google.inject.internal.InjectorImpl.getInternalFactory(InjectorImpl.java:893)
 at com.google.inject.internal.FactoryProxy.notify(FactoryProxy.java:46)
 at com.google.inject.internal.ProcessedBindingData.runCreationListeners(ProcessedBindingData.java:50)
 at com.google.inject.internal.InternalInjectorCreator.initializeStatically(InternalInjectorCreator.java:134)
 at com.google.inject.internal.InternalInjectorCreator.build(InternalInjectorCreator.java:107)
 at com.google.inject.Guice.createInjector(Guice.java:99)
 at com.google.inject.Guice.createInjector(Guice.java:73)
 at com.google.inject.Guice.createInjector(Guice.java:62)
 at org.codehaus.plexus.DefaultPlexusContainer.addPlexusInjector(DefaultPlexusContainer.java:481)
 at org.codehaus.plexus.DefaultPlexusContainer.<init>(DefaultPlexusContainer.java:206)
 at org.codehaus.plexus.DefaultPlexusContainer.<init>(DefaultPlexusContainer.java:168)
 at org.codehaus.plexus.tools.cli.AbstractCli.execute(AbstractCli.java:177)
 at org.apache.maven.index.cli.NexusIndexerCli.execute(NexusIndexerCli.java:124)
 at org.codehaus.plexus.tools.cli.AbstractCli.execute(AbstractCli.java:83)
 at org.apache.maven.index.cli.NexusIndexerCli.execute(NexusIndexerCli.java:137)
 at org.apache.maven.index.cli.NexusIndexerCli.main(NexusIndexerCli.java:116)
Caused by: java.lang.ExceptionInInitializerError
 at com.google.inject.internal.cglib.reflect.$FastClass$Generator.getProtectionDomain(FastClass.java:73)
 at com.google.inject.internal.cglib.core.$AbstractClassGenerator.create(AbstractClassGenerator.java:206)
 at com.google.inject.internal.cglib.reflect.$FastClass$Generator.create(FastClass.java:65)
 at com.google.inject.internal.BytecodeGen.newFastClassForMember(BytecodeGen.java:252)
 at com.google.inject.internal.BytecodeGen.newFastClassForMember(BytecodeGen.java:203)
 at com.google.inject.internal.DefaultConstructionProxyFactory.create(DefaultConstructionProxyFactory.java:53)
 at com.google.inject.internal.ProxyFactory.create(ProxyFactory.java:158)
 at com.google.inject.internal.ConstructorInjectorStore.createConstructor(ConstructorInjectorStore.java:90)
 at com.google.inject.internal.ConstructorInjectorStore.access$000(ConstructorInjectorStore.java:29)
 at com.google.inject.internal.ConstructorInjectorStore$1.create(ConstructorInjectorStore.java:37)
 at com.google.inject.internal.ConstructorInjectorStore$1.create(ConstructorInjectorStore.java:33)
 at com.google.inject.internal.FailableCache$1.load(FailableCache.java:37)
 at com.google.common.cache.LocalCache$LoadingValueReference.loadFuture(LocalCache.java:3542)
 at com.google.common.cache.LocalCache$Segment.loadSync(LocalCache.java:2323)
 at com.google.common.cache.LocalCache$Segment.lockedGetOrLoad(LocalCache.java:2286)
 at com.google.common.cache.LocalCache$Segment.get(LocalCache.java:2201)
 ... 28 more
Caused by: java.lang.reflect.InaccessibleObjectException: Unable to make protected final java.lang.Class java.lang.ClassLoader.defineClass(java.lang.String,byte[],int,int,java.security.ProtectionDomain) throws java.lang.ClassFormatError accessible: module java.base does not "opens java.lang" to unnamed module @209c0b14
 at java.base/java.lang.reflect.AccessibleObject.checkCanSetAccessible(AccessibleObject.java:357)
 at java.base/java.lang.reflect.AccessibleObject.checkCanSetAccessible(AccessibleObject.java:297)
 at java.base/java.lang.reflect.Method.checkCanSetAccessible(Method.java:199)
 at java.base/java.lang.reflect.Method.setAccessible(Method.java:193)
 at com.google.inject.internal.cglib.core.$ReflectUtils$1.run(ReflectUtils.java:52)
 at java.base/java.security.AccessController.doPrivileged(AccessController.java:312)
 at com.google.inject.internal.cglib.core.$ReflectUtils.<clinit>(ReflectUtils.java:42)
 ... 44 more
 expected:<0> but was:<1>

Stack Trace:
junit.framework.AssertionFailedError:
Picked up JAVA_TOOL_OPTIONS: -Dmaven.ext.class.path="/home/jenkins/workspace/en_maven-box_maven-indexer_guava@2@tmp/withMavene7c14b83/pipeline-maven-spy.jar" -Dorg.jenkinsci.plugins.pipeline.maven.reportsFolder="/home/jenkins/workspace/en_maven-box_maven-indexer_guava@2@tmp/withMavene7c14b83"
Exception in thread "main" com.google.common.util.concurrent.ExecutionError: java.lang.ExceptionInInitializerError
        at com.google.common.cache.LocalCache$Segment.get(LocalCache.java:2205)
        at com.google.common.cache.LocalCache.get(LocalCache.java:3953)
        at com.google.common.cache.LocalCache.getOrLoad(LocalCache.java:3957)
        at com.google.common.cache.LocalCache$LocalLoadingCache.get(LocalCache.java:4875)
        at com.google.common.cache.LocalCache$LocalLoadingCache.getUnchecked(LocalCache.java:4881)
        at com.google.inject.internal.FailableCache.get(FailableCache.java:48)
        at com.google.inject.internal.ConstructorInjectorStore.get(ConstructorInjectorStore.java:50)
        at com.google.inject.internal.ConstructorBindingImpl.initialize(ConstructorBindingImpl.java:138)
        at com.google.inject.internal.InjectorImpl.initializeJitBinding(InjectorImpl.java:550)
        at com.google.inject.internal.InjectorImpl.createJustInTimeBinding(InjectorImpl.java:887)
        at com.google.inject.internal.InjectorImpl.createJustInTimeBindingRecursive(InjectorImpl.java:808)
        at com.google.inject.internal.InjectorImpl.getJustInTimeBinding(InjectorImpl.java:285)
        at com.google.inject.internal.InjectorImpl.getBindingOrThrow(InjectorImpl.java:217)
        at com.google.inject.internal.InjectorImpl.getInternalFactory(InjectorImpl.java:893)
        at com.google.inject.internal.FactoryProxy.notify(FactoryProxy.java:46)
        at com.google.inject.internal.ProcessedBindingData.runCreationListeners(ProcessedBindingData.java:50)
        at com.google.inject.internal.InternalInjectorCreator.initializeStatically(InternalInjectorCreator.java:134)
        at com.google.inject.internal.InternalInjectorCreator.build(InternalInjectorCreator.java:107)
        at com.google.inject.Guice.createInjector(Guice.java:99)
        at com.google.inject.Guice.createInjector(Guice.java:73)
        at com.google.inject.Guice.createInjector(Guice.java:62)
        at org.codehaus.plexus.DefaultPlexusContainer.addPlexusInjector(DefaultPlexusContainer.java:481)
        at org.codehaus.plexus.DefaultPlexusContainer.<init>(DefaultPlexusContainer.java:206)
        at org.codehaus.plexus.DefaultPlexusContainer.<init>(DefaultPlexusContainer.java:168)
        at org.codehaus.plexus.tools.cli.AbstractCli.execute(AbstractCli.java:177)
        at org.apache.maven.index.cli.NexusIndexerCli.execute(NexusIndexerCli.java:124)
        at org.codehaus.plexus.tools.cli.AbstractCli.execute(AbstractCli.java:83)
        at org.apache.maven.index.cli.NexusIndexerCli.execute(NexusIndexerCli.java:137)
        at org.apache.maven.index.cli.NexusIndexerCli.main(NexusIndexerCli.java:116)
Caused by: java.lang.ExceptionInInitializerError
        at com.google.inject.internal.cglib.reflect.$FastClass$Generator.getProtectionDomain(FastClass.java:73)
        at com.google.inject.internal.cglib.core.$AbstractClassGenerator.create(AbstractClassGenerator.java:206)
        at com.google.inject.internal.cglib.reflect.$FastClass$Generator.create(FastClass.java:65)
        at com.google.inject.internal.BytecodeGen.newFastClassForMember(BytecodeGen.java:252)
        at com.google.inject.internal.BytecodeGen.newFastClassForMember(BytecodeGen.java:203)
        at com.google.inject.internal.DefaultConstructionProxyFactory.create(DefaultConstructionProxyFactory.java:53)
        at com.google.inject.internal.ProxyFactory.create(ProxyFactory.java:158)
        at com.google.inject.internal.ConstructorInjectorStore.createConstructor(ConstructorInjectorStore.java:90)
        at com.google.inject.internal.ConstructorInjectorStore.access$000(ConstructorInjectorStore.java:29)
        at com.google.inject.internal.ConstructorInjectorStore$1.create(ConstructorInjectorStore.java:37)
        at com.google.inject.internal.ConstructorInjectorStore$1.create(ConstructorInjectorStore.java:33)
        at com.google.inject.internal.FailableCache$1.load(FailableCache.java:37)
        at com.google.common.cache.LocalCache$LoadingValueReference.loadFuture(LocalCache.java:3542)
        at com.google.common.cache.LocalCache$Segment.loadSync(LocalCache.java:2323)
        at com.google.common.cache.LocalCache$Segment.lockedGetOrLoad(LocalCache.java:2286)
        at com.google.common.cache.LocalCache$Segment.get(LocalCache.java:2201)
        ... 28 more
Caused by: java.lang.reflect.InaccessibleObjectException: Unable to make protected final java.lang.Class java.lang.ClassLoader.defineClass(java.lang.String,byte[],int,int,java.security.ProtectionDomain) throws java.lang.ClassFormatError accessible: module java.base does not "opens java.lang" to unnamed module @209c0b14
        at java.base/java.lang.reflect.AccessibleObject.checkCanSetAccessible(AccessibleObject.java:357)
        at java.base/java.lang.reflect.AccessibleObject.checkCanSetAccessible(AccessibleObject.java:297)
        at java.base/java.lang.reflect.Method.checkCanSetAccessible(Method.java:199)
        at java.base/java.lang.reflect.Method.setAccessible(Method.java:193)
        at com.google.inject.internal.cglib.core.$ReflectUtils$1.run(ReflectUtils.java:52)
        at java.base/java.security.AccessController.doPrivileged(AccessController.java:312)
        at com.google.inject.internal.cglib.core.$ReflectUtils.<clinit>(ReflectUtils.java:42)
        ... 44 more
 expected:<0> but was:<1>


FAILED:  org.apache.maven.index.cli.NexusIndexerCliIT.linux-jdk16 / Build linux-jdk16 / testNoArgs

Error Message:
Should print usage

Stack Trace:
junit.framework.AssertionFailedError: Should print usage


FAILED:  org.apache.maven.index.cli.NexusIndexerCliIT.linux-jdk16 / Build linux-jdk16 / testUnpack

Error Message:
Picked up JAVA_TOOL_OPTIONS: -Dmaven.ext.class.path="/home/jenkins/workspace/en_maven-box_maven-indexer_guava@2@tmp/withMavene7c14b83/pipeline-maven-spy.jar" -Dorg.jenkinsci.plugins.pipeline.maven.reportsFolder="/home/jenkins/workspace/en_maven-box_maven-indexer_guava@2@tmp/withMavene7c14b83"
Exception in thread "main" com.google.common.util.concurrent.ExecutionError: java.lang.ExceptionInInitializerError
 at com.google.common.cache.LocalCache$Segment.get(LocalCache.java:2205)
 at com.google.common.cache.LocalCache.get(LocalCache.java:3953)
 at com.google.common.cache.LocalCache.getOrLoad(LocalCache.java:3957)
 at com.google.common.cache.LocalCache$LocalLoadingCache.get(LocalCache.java:4875)
 at com.google.common.cache.LocalCache$LocalLoadingCache.getUnchecked(LocalCache.java:4881)
 at com.google.inject.internal.FailableCache.get(FailableCache.java:48)
 at com.google.inject.internal.ConstructorInjectorStore.get(ConstructorInjectorStore.java:50)
 at com.google.inject.internal.ConstructorBindingImpl.initialize(ConstructorBindingImpl.java:138)
 at com.google.inject.internal.InjectorImpl.initializeJitBinding(InjectorImpl.java:550)
 at com.google.inject.internal.InjectorImpl.createJustInTimeBinding(InjectorImpl.java:887)
 at com.google.inject.internal.InjectorImpl.createJustInTimeBindingRecursive(InjectorImpl.java:808)
 at com.google.inject.internal.InjectorImpl.getJustInTimeBinding(InjectorImpl.java:285)
 at com.google.inject.internal.InjectorImpl.getBindingOrThrow(InjectorImpl.java:217)
 at com.google.inject.internal.InjectorImpl.getInternalFactory(InjectorImpl.java:893)
 at com.google.inject.internal.FactoryProxy.notify(FactoryProxy.java:46)
 at com.google.inject.internal.ProcessedBindingData.runCreationListeners(ProcessedBindingData.java:50)
 at com.google.inject.internal.InternalInjectorCreator.initializeStatically(InternalInjectorCreator.java:134)
 at com.google.inject.internal.InternalInjectorCreator.build(InternalInjectorCreator.java:107)
 at com.google.inject.Guice.createInjector(Guice.java:99)
 at com.google.inject.Guice.createInjector(Guice.java:73)
 at com.google.inject.Guice.createInjector(Guice.java:62)
 at org.codehaus.plexus.DefaultPlexusContainer.addPlexusInjector(DefaultPlexusContainer.java:481)
 at org.codehaus.plexus.DefaultPlexusContainer.<init>(DefaultPlexusContainer.java:206)
 at org.codehaus.plexus.DefaultPlexusContainer.<init>(DefaultPlexusContainer.java:168)
 at org.codehaus.plexus.tools.cli.AbstractCli.execute(AbstractCli.java:177)
 at org.apache.maven.index.cli.NexusIndexerCli.execute(NexusIndexerCli.java:124)
 at org.codehaus.plexus.tools.cli.AbstractCli.execute(AbstractCli.java:83)
 at org.apache.maven.index.cli.NexusIndexerCli.execute(NexusIndexerCli.java:137)
 at org.apache.maven.index.cli.NexusIndexerCli.main(NexusIndexerCli.java:116)
Caused by: java.lang.ExceptionInInitializerError
 at com.google.inject.internal.cglib.reflect.$FastClass$Generator.getProtectionDomain(FastClass.java:73)
 at com.google.inject.internal.cglib.core.$AbstractClassGenerator.create(AbstractClassGenerator.java:206)
 at com.google.inject.internal.cglib.reflect.$FastClass$Generator.create(FastClass.java:65)
 at com.google.inject.internal.BytecodeGen.newFastClassForMember(BytecodeGen.java:252)
 at com.google.inject.internal.BytecodeGen.newFastClassForMember(BytecodeGen.java:203)
 at com.google.inject.internal.DefaultConstructionProxyFactory.create(DefaultConstructionProxyFactory.java:53)
 at com.google.inject.internal.ProxyFactory.create(ProxyFactory.java:158)
 at com.google.inject.internal.ConstructorInjectorStore.createConstructor(ConstructorInjectorStore.java:90)
 at com.google.inject.internal.ConstructorInjectorStore.access$000(ConstructorInjectorStore.java:29)
 at com.google.inject.internal.ConstructorInjectorStore$1.create(ConstructorInjectorStore.java:37)
 at com.google.inject.internal.ConstructorInjectorStore$1.create(ConstructorInjectorStore.java:33)
 at com.google.inject.internal.FailableCache$1.load(FailableCache.java:37)
 at com.google.common.cache.LocalCache$LoadingValueReference.loadFuture(LocalCache.java:3542)
 at com.google.common.cache.LocalCache$Segment.loadSync(LocalCache.java:2323)
 at com.google.common.cache.LocalCache$Segment.lockedGetOrLoad(LocalCache.java:2286)
 at com.google.common.cache.LocalCache$Segment.get(LocalCache.java:2201)
 ... 28 more
Caused by: java.lang.reflect.InaccessibleObjectException: Unable to make protected final java.lang.Class java.lang.ClassLoader.defineClass(java.lang.String,byte[],int,int,java.security.ProtectionDomain) throws java.lang.ClassFormatError accessible: module java.base does not "opens java.lang" to unnamed module @209c0b14
 at java.base/java.lang.reflect.AccessibleObject.checkCanSetAccessible(AccessibleObject.java:357)
 at java.base/java.lang.reflect.AccessibleObject.checkCanSetAccessible(AccessibleObject.java:297)
 at java.base/java.lang.reflect.Method.checkCanSetAccessible(Method.java:199)
 at java.base/java.lang.reflect.Method.setAccessible(Method.java:193)
 at com.google.inject.internal.cglib.core.$ReflectUtils$1.run(ReflectUtils.java:52)
 at java.base/java.security.AccessController.doPrivileged(AccessController.java:312)
 at com.google.inject.internal.cglib.core.$ReflectUtils.<clinit>(ReflectUtils.java:42)
 ... 44 more
Picked up JAVA_TOOL_OPTIONS: -Dmaven.ext.class.path="/home/jenkins/workspace/en_maven-box_maven-indexer_guava@2@tmp/withMavene7c14b83/pipeline-maven-spy.jar" -Dorg.jenkinsci.plugins.pipeline.maven.reportsFolder="/home/jenkins/workspace/en_maven-box_maven-indexer_guava@2@tmp/withMavene7c14b83"
Exception in thread "main" com.google.common.util.concurrent.ExecutionError: java.lang.ExceptionInInitializerError
 at com.google.common.cache.LocalCache$Segment.get(LocalCache.java:2205)
 at com.google.common.cache.LocalCache.get(LocalCache.java:3953)
 at com.google.common.cache.LocalCache.getOrLoad(LocalCache.java:3957)
 at com.google.common.cache.LocalCache$LocalLoadingCache.get(LocalCache.java:4875)
 at com.google.common.cache.LocalCache$LocalLoadingCache.getUnchecked(LocalCache.java:4881)
 at com.google.inject.internal.FailableCache.get(FailableCache.java:48)
 at com.google.inject.internal.ConstructorInjectorStore.get(ConstructorInjectorStore.java:50)
 at com.google.inject.internal.ConstructorBindingImpl.initialize(ConstructorBindingImpl.java:138)
 at com.google.inject.internal.InjectorImpl.initializeJitBinding(InjectorImpl.java:550)
 at com.google.inject.internal.InjectorImpl.createJustInTimeBinding(InjectorImpl.java:887)
 at com.google.inject.internal.InjectorImpl.createJustInTimeBindingRecursive(InjectorImpl.java:808)
 at com.google.inject.internal.InjectorImpl.getJustInTimeBinding(InjectorImpl.java:285)
 at com.google.inject.internal.InjectorImpl.getBindingOrThrow(InjectorImpl.java:217)
 at com.google.inject.internal.InjectorImpl.getInternalFactory(InjectorImpl.java:893)
 at com.google.inject.internal.FactoryProxy.notify(FactoryProxy.java:46)
 at com.google.inject.internal.ProcessedBindingData.runCreationListeners(ProcessedBindingData.java:50)
 at com.google.inject.internal.InternalInjectorCreator.initializeStatically(InternalInjectorCreator.java:134)
 at com.google.inject.internal.InternalInjectorCreator.build(InternalInjectorCreator.java:107)
 at com.google.inject.Guice.createInjector(Guice.java:99)
 at com.google.inject.Guice.createInjector(Guice.java:73)
 at com.google.inject.Guice.createInjector(Guice.java:62)
 at org.codehaus.plexus.DefaultPlexusContainer.addPlexusInjector(DefaultPlexusContainer.java:481)
 at org.codehaus.plexus.DefaultPlexusContainer.<init>(DefaultPlexusContainer.java:206)
 at org.codehaus.plexus.DefaultPlexusContainer.<init>(DefaultPlexusContainer.java:168)
 at org.codehaus.plexus.tools.cli.AbstractCli.execute(AbstractCli.java:177)
 at org.apache.maven.index.cli.NexusIndexerCli.execute(NexusIndexerCli.java:124)
 at org.codehaus.plexus.tools.cli.AbstractCli.execute(AbstractCli.java:83)
 at org.apache.maven.index.cli.NexusIndexerCli.execute(NexusIndexerCli.java:137)
 at org.apache.maven.index.cli.NexusIndexerCli.main(NexusIndexerCli.java:116)
Caused by: java.lang.ExceptionInInitializerError
 at com.google.inject.internal.cglib.reflect.$FastClass$Generator.getProtectionDomain(FastClass.java:73)
 at com.google.inject.internal.cglib.core.$AbstractClassGenerator.create(AbstractClassGenerator.java:206)
 at com.google.inject.internal.cglib.reflect.$FastClass$Generator.create(FastClass.java:65)
 at com.google.inject.internal.BytecodeGen.newFastClassForMember(BytecodeGen.java:252)
 at com.google.inject.internal.BytecodeGen.newFastClassForMember(BytecodeGen.java:203)
 at com.google.inject.internal.DefaultConstructionProxyFactory.create(DefaultConstructionProxyFactory.java:53)
 at com.google.inject.internal.ProxyFactory.create(ProxyFactory.java:158)
 at com.google.inject.internal.ConstructorInjectorStore.createConstructor(ConstructorInjectorStore.java:90)
 at com.google.inject.internal.ConstructorInjectorStore.access$000(ConstructorInjectorStore.java:29)
 at com.google.inject.internal.ConstructorInjectorStore$1.create(ConstructorInjectorStore.java:37)
 at com.google.inject.internal.ConstructorInjectorStore$1.create(ConstructorInjectorStore.java:33)
 at com.google.inject.internal.FailableCache$1.load(FailableCache.java:37)
 at com.google.common.cache.LocalCache$LoadingValueReference.loadFuture(LocalCache.java:3542)
 at com.google.common.cache.LocalCache$Segment.loadSync(LocalCache.java:2323)
 at com.google.common.cache.LocalCache$Segment.lockedGetOrLoad(LocalCache.java:2286)
 at com.google.common.cache.LocalCache$Segment.get(LocalCache.java:2201)
 ... 28 more
Caused by: java.lang.reflect.InaccessibleObjectException: Unable to make protected final java.lang.Class java.lang.ClassLoader.defineClass(java.lang.String,byte[],int,int,java.security.ProtectionDomain) throws java.lang.ClassFormatError accessible: module java.base does not "opens java.lang" to unnamed module @209c0b14
 at java.base/java.lang.reflect.AccessibleObject.checkCanSetAccessible(AccessibleObject.java:357)
 at java.base/java.lang.reflect.AccessibleObject.checkCanSetAccessible(AccessibleObject.java:297)
 at java.base/java.lang.reflect.Method.checkCanSetAccessible(Method.java:199)
 at java.base/java.lang.reflect.Method.setAccessible(Method.java:193)
 at com.google.inject.internal.cglib.core.$ReflectUtils$1.run(ReflectUtils.java:52)
 at java.base/java.security.AccessController.doPrivileged(AccessController.java:312)
 at com.google.inject.internal.cglib.core.$ReflectUtils.<clinit>(ReflectUtils.java:42)
 ... 44 more
 expected:<0> but was:<1>

Stack Trace:
junit.framework.AssertionFailedError:
Picked up JAVA_TOOL_OPTIONS: -Dmaven.ext.class.path="/home/jenkins/workspace/en_maven-box_maven-indexer_guava@2@tmp/withMavene7c14b83/pipeline-maven-spy.jar" -Dorg.jenkinsci.plugins.pipeline.maven.reportsFolder="/home/jenkins/workspace/en_maven-box_maven-indexer_guava@2@tmp/withMavene7c14b83"
Exception in thread "main" com.google.common.util.concurrent.ExecutionError: java.lang.ExceptionInInitializerError
        at com.google.common.cache.LocalCache$Segment.get(LocalCache.java:2205)
        at com.google.common.cache.LocalCache.get(LocalCache.java:3953)
        at com.google.common.cache.LocalCache.getOrLoad(LocalCache.java:3957)
        at com.google.common.cache.LocalCache$LocalLoadingCache.get(LocalCache.java:4875)
        at com.google.common.cache.LocalCache$LocalLoadingCache.getUnchecked(LocalCache.java:4881)
        at com.google.inject.internal.FailableCache.get(FailableCache.java:48)
        at com.google.inject.internal.ConstructorInjectorStore.get(ConstructorInjectorStore.java:50)
        at com.google.inject.internal.ConstructorBindingImpl.initialize(ConstructorBindingImpl.java:138)
        at com.google.inject.internal.InjectorImpl.initializeJitBinding(InjectorImpl.java:550)
        at com.google.inject.internal.InjectorImpl.createJustInTimeBinding(InjectorImpl.java:887)
        at com.google.inject.internal.InjectorImpl.createJustInTimeBindingRecursive(InjectorImpl.java:808)
        at com.google.inject.internal.InjectorImpl.getJustInTimeBinding(InjectorImpl.java:285)
        at com.google.inject.internal.InjectorImpl.getBindingOrThrow(InjectorImpl.java:217)
        at com.google.inject.internal.InjectorImpl.getInternalFactory(InjectorImpl.java:893)
        at com.google.inject.internal.FactoryProxy.notify(FactoryProxy.java:46)
        at com.google.inject.internal.ProcessedBindingData.runCreationListeners(ProcessedBindingData.java:50)
        at com.google.inject.internal.InternalInjectorCreator.initializeStatically(InternalInjectorCreator.java:134)
        at com.google.inject.internal.InternalInjectorCreator.build(InternalInjectorCreator.java:107)
        at com.google.inject.Guice.createInjector(Guice.java:99)
        at com.google.inject.Guice.createInjector(Guice.java:73)
        at com.google.inject.Guice.createInjector(Guice.java:62)
        at org.codehaus.plexus.DefaultPlexusContainer.addPlexusInjector(DefaultPlexusContainer.java:481)
        at org.codehaus.plexus.DefaultPlexusContainer.<init>(DefaultPlexusContainer.java:206)
        at org.codehaus.plexus.DefaultPlexusContainer.<init>(DefaultPlexusContainer.java:168)
        at org.codehaus.plexus.tools.cli.AbstractCli.execute(AbstractCli.java:177)
        at org.apache.maven.index.cli.NexusIndexerCli.execute(NexusIndexerCli.java:124)
        at org.codehaus.plexus.tools.cli.AbstractCli.execute(AbstractCli.java:83)
        at org.apache.maven.index.cli.NexusIndexerCli.execute(NexusIndexerCli.java:137)
        at org.apache.maven.index.cli.NexusIndexerCli.main(NexusIndexerCli.java:116)
Caused by: java.lang.ExceptionInInitializerError
        at com.google.inject.internal.cglib.reflect.$FastClass$Generator.getProtectionDomain(FastClass.java:73)
        at com.google.inject.internal.cglib.core.$AbstractClassGenerator.create(AbstractClassGenerator.java:206)
        at com.google.inject.internal.cglib.reflect.$FastClass$Generator.create(FastClass.java:65)
        at com.google.inject.internal.BytecodeGen.newFastClassForMember(BytecodeGen.java:252)
        at com.google.inject.internal.BytecodeGen.newFastClassForMember(BytecodeGen.java:203)
        at com.google.inject.internal.DefaultConstructionProxyFactory.create(DefaultConstructionProxyFactory.java:53)
        at com.google.inject.internal.ProxyFactory.create(ProxyFactory.java:158)
        at com.google.inject.internal.ConstructorInjectorStore.createConstructor(ConstructorInjectorStore.java:90)
        at com.google.inject.internal.ConstructorInjectorStore.access$000(ConstructorInjectorStore.java:29)
        at com.google.inject.internal.ConstructorInjectorStore$1.create(ConstructorInjectorStore.java:37)
        at com.google.inject.internal.ConstructorInjectorStore$1.create(ConstructorInjectorStore.java:33)
        at com.google.inject.internal.FailableCache$1.load(FailableCache.java:37)
        at com.google.common.cache.LocalCache$LoadingValueReference.loadFuture(LocalCache.java:3542)
        at com.google.common.cache.LocalCache$Segment.loadSync(LocalCache.java:2323)
        at com.google.common.cache.LocalCache$Segment.lockedGetOrLoad(LocalCache.java:2286)
        at com.google.common.cache.LocalCache$Segment.get(LocalCache.java:2201)
        ... 28 more
Caused by: java.lang.reflect.InaccessibleObjectException: Unable to make protected final java.lang.Class java.lang.ClassLoader.defineClass(java.lang.String,byte[],int,int,java.security.ProtectionDomain) throws java.lang.ClassFormatError accessible: module java.base does not "opens java.lang" to unnamed module @209c0b14
        at java.base/java.lang.reflect.AccessibleObject.checkCanSetAccessible(AccessibleObject.java:357)
        at java.base/java.lang.reflect.AccessibleObject.checkCanSetAccessible(AccessibleObject.java:297)
        at java.base/java.lang.reflect.Method.checkCanSetAccessible(Method.java:199)
        at java.base/java.lang.reflect.Method.setAccessible(Method.java:193)
        at com.google.inject.internal.cglib.core.$ReflectUtils$1.run(ReflectUtils.java:52)
        at java.base/java.security.AccessController.doPrivileged(AccessController.java:312)
        at com.google.inject.internal.cglib.core.$ReflectUtils.<clinit>(ReflectUtils.java:42)
        ... 44 more
Picked up JAVA_TOOL_OPTIONS: -Dmaven.ext.class.path="/home/jenkins/workspace/en_maven-box_maven-indexer_guava@2@tmp/withMavene7c14b83/pipeline-maven-spy.jar" -Dorg.jenkinsci.plugins.pipeline.maven.reportsFolder="/home/jenkins/workspace/en_maven-box_maven-indexer_guava@2@tmp/withMavene7c14b83"
Exception in thread "main" com.google.common.util.concurrent.ExecutionError: java.lang.ExceptionInInitializerError
        at com.google.common.cache.LocalCache$Segment.get(LocalCache.java:2205)
        at com.google.common.cache.LocalCache.get(LocalCache.java:3953)
        at com.google.common.cache.LocalCache.getOrLoad(LocalCache.java:3957)
        at com.google.common.cache.LocalCache$LocalLoadingCache.get(LocalCache.java:4875)
        at com.google.common.cache.LocalCache$LocalLoadingCache.getUnchecked(LocalCache.java:4881)
        at com.google.inject.internal.FailableCache.get(FailableCache.java:48)
        at com.google.inject.internal.ConstructorInjectorStore.get(ConstructorInjectorStore.java:50)
        at com.google.inject.internal.ConstructorBindingImpl.initialize(ConstructorBindingImpl.java:138)
        at com.google.inject.internal.InjectorImpl.initializeJitBinding(InjectorImpl.java:550)
        at com.google.inject.internal.InjectorImpl.createJustInTimeBinding(InjectorImpl.java:887)
        at com.google.inject.internal.InjectorImpl.createJustInTimeBindingRecursive(InjectorImpl.java:808)
        at com.google.inject.internal.InjectorImpl.getJustInTimeBinding(InjectorImpl.java:285)
        at com.google.inject.internal.InjectorImpl.getBindingOrThrow(InjectorImpl.java:217)
        at com.google.inject.internal.InjectorImpl.getInternalFactory(InjectorImpl.java:893)
        at com.google.inject.internal.FactoryProxy.notify(FactoryProxy.java:46)
        at com.google.inject.internal.ProcessedBindingData.runCreationListeners(ProcessedBindingData.java:50)
        at com.google.inject.internal.InternalInjectorCreator.initializeStatically(InternalInjectorCreator.java:134)
        at com.google.inject.internal.InternalInjectorCreator.build(InternalInjectorCreator.java:107)
        at com.google.inject.Guice.createInjector(Guice.java:99)
        at com.google.inject.Guice.createInjector(Guice.java:73)
        at com.google.inject.Guice.createInjector(Guice.java:62)
        at org.codehaus.plexus.DefaultPlexusContainer.addPlexusInjector(DefaultPlexusContainer.java:481)
        at org.codehaus.plexus.DefaultPlexusContainer.<init>(DefaultPlexusContainer.java:206)
        at org.codehaus.plexus.DefaultPlexusContainer.<init>(DefaultPlexusContainer.java:168)
        at org.codehaus.plexus.tools.cli.AbstractCli.execute(AbstractCli.java:177)
        at org.apache.maven.index.cli.NexusIndexerCli.execute(NexusIndexerCli.java:124)
        at org.codehaus.plexus.tools.cli.AbstractCli.execute(AbstractCli.java:83)
        at org.apache.maven.index.cli.NexusIndexerCli.execute(NexusIndexerCli.java:137)
        at org.apache.maven.index.cli.NexusIndexerCli.main(NexusIndexerCli.java:116)
Caused by: java.lang.ExceptionInInitializerError
        at com.google.inject.internal.cglib.reflect.$FastClass$Generator.getProtectionDomain(FastClass.java:73)
        at com.google.inject.internal.cglib.core.$AbstractClassGenerator.create(AbstractClassGenerator.java:206)
        at com.google.inject.internal.cglib.reflect.$FastClass$Generator.create(FastClass.java:65)
        at com.google.inject.internal.BytecodeGen.newFastClassForMember(BytecodeGen.java:252)
        at com.google.inject.internal.BytecodeGen.newFastClassForMember(BytecodeGen.java:203)
        at com.google.inject.internal.DefaultConstructionProxyFactory.create(DefaultConstructionProxyFactory.java:53)
        at com.google.inject.internal.ProxyFactory.create(ProxyFactory.java:158)
        at com.google.inject.internal.ConstructorInjectorStore.createConstructor(ConstructorInjectorStore.java:90)
        at com.google.inject.internal.ConstructorInjectorStore.access$000(ConstructorInjectorStore.java:29)
        at com.google.inject.internal.ConstructorInjectorStore$1.create(ConstructorInjectorStore.java:37)
        at com.google.inject.internal.ConstructorInjectorStore$1.create(ConstructorInjectorStore.java:33)
        at com.google.inject.internal.FailableCache$1.load(FailableCache.java:37)
        at com.google.common.cache.LocalCache$LoadingValueReference.loadFuture(LocalCache.java:3542)
        at com.google.common.cache.LocalCache$Segment.loadSync(LocalCache.java:2323)
        at com.google.common.cache.LocalCache$Segment.lockedGetOrLoad(LocalCache.java:2286)
        at com.google.common.cache.LocalCache$Segment.get(LocalCache.java:2201)
        ... 28 more
Caused by: java.lang.reflect.InaccessibleObjectException: Unable to make protected final java.lang.Class java.lang.ClassLoader.defineClass(java.lang.String,byte[],int,int,java.security.ProtectionDomain) throws java.lang.ClassFormatError accessible: module java.base does not "opens java.lang" to unnamed module @209c0b14
        at java.base/java.lang.reflect.AccessibleObject.checkCanSetAccessible(AccessibleObject.java:357)
        at java.base/java.lang.reflect.AccessibleObject.checkCanSetAccessible(AccessibleObject.java:297)
        at java.base/java.lang.reflect.Method.checkCanSetAccessible(Method.java:199)
        at java.base/java.lang.reflect.Method.setAccessible(Method.java:193)
        at com.google.inject.internal.cglib.core.$ReflectUtils$1.run(ReflectUtils.java:52)
        at java.base/java.security.AccessController.doPrivileged(AccessController.java:312)
        at com.google.inject.internal.cglib.core.$ReflectUtils.<clinit>(ReflectUtils.java:42)
        ... 44 more
 expected:<0> but was:<1>


FAILED:  org.apache.maven.index.cli.NexusIndexerCliTest.linux-jdk16 / Build linux-jdk16 / testInvalidRepo

Error Message:
java.lang.ExceptionInInitializerError

Stack Trace:
com.google.common.util.concurrent.ExecutionError: java.lang.ExceptionInInitializerError
        at org.apache.maven.index.cli.NexusIndexerCliTest.execute(NexusIndexerCliTest.java:54)
Caused by: java.lang.ExceptionInInitializerError
        at org.apache.maven.index.cli.NexusIndexerCliTest.execute(NexusIndexerCliTest.java:54)
Caused by: java.lang.reflect.InaccessibleObjectException: Unable to make protected final java.lang.Class java.lang.ClassLoader.defineClass(java.lang.String,byte[],int,int,java.security.ProtectionDomain) throws java.lang.ClassFormatError accessible: module java.base does not "opens java.lang" to unnamed module @209c0b14
        at org.apache.maven.index.cli.NexusIndexerCliTest.execute(NexusIndexerCliTest.java:54)


FAILED:  org.apache.maven.index.cli.NexusIndexerCliTest.linux-jdk16 / Build linux-jdk16 / testRequiredArgs

Error Message:
java.lang.NoClassDefFoundError: Could not initialize class com.google.inject.internal.cglib.core.$ReflectUtils

Stack Trace:
com.google.common.util.concurrent.ExecutionError: java.lang.NoClassDefFoundError: Could not initialize class com.google.inject.internal.cglib.core.$ReflectUtils
        at org.apache.maven.index.cli.NexusIndexerCliTest.execute(NexusIndexerCliTest.java:54)
Caused by: java.lang.NoClassDefFoundError: Could not initialize class com.google.inject.internal.cglib.core.$ReflectUtils
        at org.apache.maven.index.cli.NexusIndexerCliTest.execute(NexusIndexerCliTest.java:54)


FAILED:  org.apache.maven.index.cli.NexusIndexerCliTest.linux-jdk16 / Build linux-jdk16 / testLoggingLevel

Error Message:
java.lang.NoClassDefFoundError: Could not initialize class com.google.inject.internal.cglib.core.$ReflectUtils

Stack Trace:
com.google.common.util.concurrent.ExecutionError: java.lang.NoClassDefFoundError: Could not initialize class com.google.inject.internal.cglib.core.$ReflectUtils
        at org.apache.maven.index.cli.NexusIndexerCliTest.execute(NexusIndexerCliTest.java:54)
Caused by: java.lang.NoClassDefFoundError: Could not initialize class com.google.inject.internal.cglib.core.$ReflectUtils
        at org.apache.maven.index.cli.NexusIndexerCliTest.execute(NexusIndexerCliTest.java:54)


FAILED:  org.apache.maven.index.cli.NexusIndexerCliTest.linux-jdk16 / Build linux-jdk16 / testAbrvsRequiredArgs

Error Message:
java.lang.NoClassDefFoundError: Could not initialize class com.google.inject.internal.cglib.core.$ReflectUtils

Stack Trace:
com.google.common.util.concurrent.ExecutionError: java.lang.NoClassDefFoundError: Could not initialize class com.google.inject.internal.cglib.core.$ReflectUtils
        at org.apache.maven.index.cli.NexusIndexerCliTest.execute(NexusIndexerCliTest.java:54)
Caused by: java.lang.NoClassDefFoundError: Could not initialize class com.google.inject.internal.cglib.core.$ReflectUtils
        at org.apache.maven.index.cli.NexusIndexerCliTest.execute(NexusIndexerCliTest.java:54)


FAILED:  org.apache.maven.index.cli.NexusIndexerCliTest.linux-jdk16 / Build linux-jdk16 / testNoArgs

Error Message:
java.lang.NoClassDefFoundError: Could not initialize class com.google.inject.internal.cglib.core.$ReflectUtils

Stack Trace:
com.google.common.util.concurrent.ExecutionError: java.lang.NoClassDefFoundError: Could not initialize class com.google.inject.internal.cglib.core.$ReflectUtils
        at org.apache.maven.index.cli.NexusIndexerCliTest.execute(NexusIndexerCliTest.java:54)
Caused by: java.lang.NoClassDefFoundError: Could not initialize class com.google.inject.internal.cglib.core.$ReflectUtils
        at org.apache.maven.index.cli.NexusIndexerCliTest.execute(NexusIndexerCliTest.java:54)


FAILED:  org.apache.maven.index.cli.NexusIndexerCliTest.linux-jdk16 / Build linux-jdk16 / testUnpack

Error Message:
java.lang.NoClassDefFoundError: Could not initialize class com.google.inject.internal.cglib.core.$ReflectUtils

Stack Trace:
com.google.common.util.concurrent.ExecutionError: java.lang.NoClassDefFoundError: Could not initialize class com.google.inject.internal.cglib.core.$ReflectUtils
        at org.apache.maven.index.cli.NexusIndexerCliTest.execute(NexusIndexerCliTest.java:54)
Caused by: java.lang.NoClassDefFoundError: Could not initialize class com.google.inject.internal.cglib.core.$ReflectUtils
        at org.apache.maven.index.cli.NexusIndexerCliTest.execute(NexusIndexerCliTest.java:54)


FAILED:  org.apache.maven.index.creator.JarFileContentsIndexCreatorTest.linux-jdk16 / Build linux-jdk16 / test_nexus_2318_indexZipWithClasses

Error Message:
java.lang.NoClassDefFoundError: Could not initialize class com.google.inject.internal.cglib.core.$ReflectUtils

Stack Trace:
com.google.common.util.concurrent.ExecutionError: java.lang.NoClassDefFoundError: Could not initialize class com.google.inject.internal.cglib.core.$ReflectUtils
        at org.apache.maven.index.creator.JarFileContentsIndexCreatorTest.setUp(JarFileContentsIndexCreatorTest.java:43)
Caused by: java.lang.NoClassDefFoundError: Could not initialize class com.google.inject.internal.cglib.core.$ReflectUtils
        at org.apache.maven.index.creator.JarFileContentsIndexCreatorTest.setUp(JarFileContentsIndexCreatorTest.java:43)


FAILED:  org.apache.maven.index.creator.JarFileContentsIndexCreatorTest.linux-jdk16 / Build linux-jdk16 / test_nexus_2318_indexZipWithSources

Error Message:
java.lang.NoClassDefFoundError: Could not initialize class com.google.inject.internal.cglib.core.$ReflectUtils

Stack Trace:
com.google.common.util.concurrent.ExecutionError: java.lang.NoClassDefFoundError: Could not initialize class com.google.inject.internal.cglib.core.$ReflectUtils
        at org.apache.maven.index.creator.JarFileContentsIndexCreatorTest.setUp(JarFileContentsIndexCreatorTest.java:43)
Caused by: java.lang.NoClassDefFoundError: Could not initialize class com.google.inject.internal.cglib.core.$ReflectUtils
        at org.apache.maven.index.creator.JarFileContentsIndexCreatorTest.setUp(JarFileContentsIndexCreatorTest.java:43)


FAILED:  org.apache.maven.index.creator.JarFileContentsIndexCreatorTest.linux-jdk16 / Build linux-jdk16 / test_nexus_2318_indexJarWithClasses

Error Message:
java.lang.NoClassDefFoundError: Could not initialize class com.google.inject.internal.cglib.core.$ReflectUtils

Stack Trace:
com.google.common.util.concurrent.ExecutionError: java.lang.NoClassDefFoundError: Could not initialize class com.google.inject.internal.cglib.core.$ReflectUtils
        at org.apache.maven.index.creator.JarFileContentsIndexCreatorTest.setUp(JarFileContentsIndexCreatorTest.java:43)
Caused by: java.lang.NoClassDefFoundError: Could not initialize class com.google.inject.internal.cglib.core.$ReflectUtils
        at org.apache.maven.index.creator.JarFileContentsIndexCreatorTest.setUp(JarFileContentsIndexCreatorTest.java:43)


FAILED:  org.apache.maven.index.creator.JarFileContentsIndexCreatorTest.linux-jdk16 / Build linux-jdk16 / testMindexer35ScanWar

Error Message:
java.lang.NoClassDefFoundError: Could not initialize class com.google.inject.internal.cglib.core.$ReflectUtils

Stack Trace:
com.google.common.util.concurrent.ExecutionError: java.lang.NoClassDefFoundError: Could not initialize class com.google.inject.internal.cglib.core.$ReflectUtils
        at org.apache.maven.index.creator.JarFileContentsIndexCreatorTest.setUp(JarFileContentsIndexCreatorTest.java:43)
Caused by: java.lang.NoClassDefFoundError: Could not initialize class com.google.inject.internal.cglib.core.$ReflectUtils
        at org.apache.maven.index.creator.JarFileContentsIndexCreatorTest.setUp(JarFileContentsIndexCreatorTest.java:43)


FAILED:  org.apache.maven.index.creator.JarFileContentsIndexCreatorTest.linux-jdk16 / Build linux-jdk16 / test_nexus_2318_indexJarWithSources

Error Message:
java.lang.NoClassDefFoundError: Could not initialize class com.google.inject.internal.cglib.core.$ReflectUtils

Stack Trace:
com.google.common.util.concurrent.ExecutionError: java.lang.NoClassDefFoundError: Could not initialize class com.google.inject.internal.cglib.core.$ReflectUtils
        at org.apache.maven.index.creator.JarFileContentsIndexCreatorTest.setUp(JarFileContentsIndexCreatorTest.java:43)
Caused by: java.lang.NoClassDefFoundError: Could not initialize class com.google.inject.internal.cglib.core.$ReflectUtils
        at org.apache.maven.index.creator.JarFileContentsIndexCreatorTest.setUp(JarFileContentsIndexCreatorTest.java:43)


FAILED:  org.apache.maven.index.creator.MavenPluginArtifactInfoIndexCreatorTest.linux-jdk16 / Build linux-jdk16 / testMavenPluginInfo

Error Message:
java.lang.NoClassDefFoundError: Could not initialize class com.google.inject.internal.cglib.core.$ReflectUtils

Stack Trace:
com.google.common.util.concurrent.ExecutionError: java.lang.NoClassDefFoundError: Could not initialize class com.google.inject.internal.cglib.core.$ReflectUtils
        at org.apache.maven.index.creator.MavenPluginArtifactInfoIndexCreatorTest.setUp(MavenPluginArtifactInfoIndexCreatorTest.java:45)
Caused by: java.lang.NoClassDefFoundError: Could not initialize class com.google.inject.internal.cglib.core.$ReflectUtils
        at org.apache.maven.index.creator.MavenPluginArtifactInfoIndexCreatorTest.setUp(MavenPluginArtifactInfoIndexCreatorTest.java:45)


FAILED:  org.apache.maven.index.creator.OsgiArtifactIndexCreatorTest.linux-jdk16 / Build linux-jdk16 / testPopulateArtifactInfo

Error Message:
java.lang.NoClassDefFoundError: Could not initialize class com.google.inject.internal.cglib.core.$ReflectUtils

Stack Trace:
com.google.common.util.concurrent.ExecutionError: java.lang.NoClassDefFoundError: Could not initialize class com.google.inject.internal.cglib.core.$ReflectUtils
        at org.apache.maven.index.creator.OsgiArtifactIndexCreatorTest.setUp(OsgiArtifactIndexCreatorTest.java:61)
Caused by: java.lang.NoClassDefFoundError: Could not initialize class com.google.inject.internal.cglib.core.$ReflectUtils
        at org.apache.maven.index.creator.OsgiArtifactIndexCreatorTest.setUp(OsgiArtifactIndexCreatorTest.java:61)


FAILED:  org.apache.maven.index.creator.OsgiArtifactIndexCreatorTest.linux-jdk16 / Build linux-jdk16 / testIndexOSGIRepoThenSearchWithExportService

Error Message:
java.lang.NoClassDefFoundError: Could not initialize class com.google.inject.internal.cglib.core.$ReflectUtils

Stack Trace:
com.google.common.util.concurrent.ExecutionError: java.lang.NoClassDefFoundError: Could not initialize class com.google.inject.internal.cglib.core.$ReflectUtils
        at org.apache.maven.index.creator.OsgiArtifactIndexCreatorTest.setUp(OsgiArtifactIndexCreatorTest.java:61)
Caused by: java.lang.NoClassDefFoundError: Could not initialize class com.google.inject.internal.cglib.core.$ReflectUtils
        at org.apache.maven.index.creator.OsgiArtifactIndexCreatorTest.setUp(OsgiArtifactIndexCreatorTest.java:61)


FAILED:  org.apache.maven.index.creator.OsgiArtifactIndexCreatorTest.linux-jdk16 / Build linux-jdk16 / testPopulateCapabilityAndSha256

Error Message:
java.lang.NoClassDefFoundError: Could not initialize class com.google.inject.internal.cglib.core.$ReflectUtils

Stack Trace:
com.google.common.util.concurrent.ExecutionError: java.lang.NoClassDefFoundError: Could not initialize class com.google.inject.internal.cglib.core.$ReflectUtils
        at org.apache.maven.index.creator.OsgiArtifactIndexCreatorTest.setUp(OsgiArtifactIndexCreatorTest.java:61)
Caused by: java.lang.NoClassDefFoundError: Could not initialize class com.google.inject.internal.cglib.core.$ReflectUtils
        at org.apache.maven.index.creator.OsgiArtifactIndexCreatorTest.setUp(OsgiArtifactIndexCreatorTest.java:61)


FAILED:  org.apache.maven.index.creator.OsgiArtifactIndexCreatorTest.linux-jdk16 / Build linux-jdk16 / testIndexOSGIRepoThenSearchWithSha256

Error Message:
java.lang.NoClassDefFoundError: Could not initialize class com.google.inject.internal.cglib.core.$ReflectUtils

Stack Trace:
com.google.common.util.concurrent.ExecutionError: java.lang.NoClassDefFoundError: Could not initialize class com.google.inject.internal.cglib.core.$ReflectUtils
        at org.apache.maven.index.creator.OsgiArtifactIndexCreatorTest.setUp(OsgiArtifactIndexCreatorTest.java:61)
Caused by: java.lang.NoClassDefFoundError: Could not initialize class com.google.inject.internal.cglib.core.$ReflectUtils
        at org.apache.maven.index.creator.OsgiArtifactIndexCreatorTest.setUp(OsgiArtifactIndexCreatorTest.java:61)


FAILED:  org.apache.maven.index.creator.OsgiArtifactIndexCreatorTest.linux-jdk16 / Build linux-jdk16 / testIndexOSGIRepoThenSearch

Error Message:
java.lang.NoClassDefFoundError: Could not initialize class com.google.inject.internal.cglib.core.$ReflectUtils

Stack Trace:
com.google.common.util.concurrent.ExecutionError: java.lang.NoClassDefFoundError: Could not initialize class com.google.inject.internal.cglib.core.$ReflectUtils
        at org.apache.maven.index.creator.OsgiArtifactIndexCreatorTest.setUp(OsgiArtifactIndexCreatorTest.java:61)
Caused by: java.lang.NoClassDefFoundError: Could not initialize class com.google.inject.internal.cglib.core.$ReflectUtils
        at org.apache.maven.index.creator.OsgiArtifactIndexCreatorTest.setUp(OsgiArtifactIndexCreatorTest.java:61)


FAILED:  org.apache.maven.index.creator.OsgiArtifactIndexCreatorTest.linux-jdk16 / Build linux-jdk16 / testAssertIndexCreatorComponentExists

Error Message:
java.lang.NoClassDefFoundError: Could not initialize class com.google.inject.internal.cglib.core.$ReflectUtils

Stack Trace:
com.google.common.util.concurrent.ExecutionError: java.lang.NoClassDefFoundError: Could not initialize class com.google.inject.internal.cglib.core.$ReflectUtils
        at org.apache.maven.index.creator.OsgiArtifactIndexCreatorTest.setUp(OsgiArtifactIndexCreatorTest.java:61)
Caused by: java.lang.NoClassDefFoundError: Could not initialize class com.google.inject.internal.cglib.core.$ReflectUtils
        at org.apache.maven.index.creator.OsgiArtifactIndexCreatorTest.setUp(OsgiArtifactIndexCreatorTest.java:61)


FAILED:  org.apache.maven.index.creator.OsgiArtifactIndexCreatorTest.linux-jdk16 / Build linux-jdk16 / testIndexOSGIRepoThenSearchWithExportPackage

Error Message:
java.lang.NoClassDefFoundError: Could not initialize class com.google.inject.internal.cglib.core.$ReflectUtils

Stack Trace:
com.google.common.util.concurrent.ExecutionError: java.lang.NoClassDefFoundError: Could not initialize class com.google.inject.internal.cglib.core.$ReflectUtils
        at org.apache.maven.index.creator.OsgiArtifactIndexCreatorTest.setUp(OsgiArtifactIndexCreatorTest.java:61)
Caused by: java.lang.NoClassDefFoundError: Could not initialize class com.google.inject.internal.cglib.core.$ReflectUtils
        at org.apache.maven.index.creator.OsgiArtifactIndexCreatorTest.setUp(OsgiArtifactIndexCreatorTest.java:61)


FAILED:  org.apache.maven.index.creator.OsgiArtifactIndexCreatorTest.linux-jdk16 / Build linux-jdk16 / testPopulateFragmentHost

Error Message:
java.lang.NoClassDefFoundError: Could not initialize class com.google.inject.internal.cglib.core.$ReflectUtils

Stack Trace:
com.google.common.util.concurrent.ExecutionError: java.lang.NoClassDefFoundError: Could not initialize class com.google.inject.internal.cglib.core.$ReflectUtils
        at org.apache.maven.index.creator.OsgiArtifactIndexCreatorTest.setUp(OsgiArtifactIndexCreatorTest.java:61)
Caused by: java.lang.NoClassDefFoundError: Could not initialize class com.google.inject.internal.cglib.core.$ReflectUtils
        at org.apache.maven.index.creator.OsgiArtifactIndexCreatorTest.setUp(OsgiArtifactIndexCreatorTest.java:61)


FAILED:  org.apache.maven.index.creator.OsgiArtifactIndexCreatorTest.linux-jdk16 / Build linux-jdk16 / testIndexOSGIRepoThenSearchWithVersion

Error Message:
java.lang.NoClassDefFoundError: Could not initialize class com.google.inject.internal.cglib.core.$ReflectUtils

Stack Trace:
com.google.common.util.concurrent.ExecutionError: java.lang.NoClassDefFoundError: Could not initialize class com.google.inject.internal.cglib.core.$ReflectUtils
        at org.apache.maven.index.creator.OsgiArtifactIndexCreatorTest.setUp(OsgiArtifactIndexCreatorTest.java:61)
Caused by: java.lang.NoClassDefFoundError: Could not initialize class com.google.inject.internal.cglib.core.$ReflectUtils
        at org.apache.maven.index.creator.OsgiArtifactIndexCreatorTest.setUp(OsgiArtifactIndexCreatorTest.java:61)


FAILED:  org.apache.maven.index.incremental.DefaultIncrementalHandlerTest.linux-jdk16 / Build linux-jdk16 / testUpdateValid

Error Message:
java.lang.NoClassDefFoundError: Could not initialize class com.google.inject.internal.cglib.core.$ReflectUtils

Stack Trace:
com.google.common.util.concurrent.ExecutionError: java.lang.NoClassDefFoundError: Could not initialize class com.google.inject.internal.cglib.core.$ReflectUtils
        at org.apache.maven.index.incremental.DefaultIncrementalHandlerTest.setUp(DefaultIncrementalHandlerTest.java:55)
Caused by: java.lang.NoClassDefFoundError: Could not initialize class com.google.inject.internal.cglib.core.$ReflectUtils
        at org.apache.maven.index.incremental.DefaultIncrementalHandlerTest.setUp(DefaultIncrementalHandlerTest.java:55)


FAILED:  org.apache.maven.index.incremental.DefaultIncrementalHandlerTest.linux-jdk16 / Build linux-jdk16 / testRemoteUpdatesInvalidProperties

Error Message:
java.lang.NoClassDefFoundError: Could not initialize class com.google.inject.internal.cglib.core.$ReflectUtils

Stack Trace:
com.google.common.util.concurrent.ExecutionError: java.lang.NoClassDefFoundError: Could not initialize class com.google.inject.internal.cglib.core.$ReflectUtils
        at org.apache.maven.index.incremental.DefaultIncrementalHandlerTest.setUp(DefaultIncrementalHandlerTest.java:55)
Caused by: java.lang.NoClassDefFoundError: Could not initialize class com.google.inject.internal.cglib.core.$ReflectUtils
        at org.apache.maven.index.incremental.DefaultIncrementalHandlerTest.setUp(DefaultIncrementalHandlerTest.java:55)


FAILED:  org.apache.maven.index.incremental.DefaultIncrementalHandlerTest.linux-jdk16 / Build linux-jdk16 / testUpdateInvalidProperties

Error Message:
java.lang.NoClassDefFoundError: Could not initialize class com.google.inject.internal.cglib.core.$ReflectUtils

Stack Trace:
com.google.common.util.concurrent.ExecutionError: java.lang.NoClassDefFoundError: Could not initialize class com.google.inject.internal.cglib.core.$ReflectUtils
        at org.apache.maven.index.incremental.DefaultIncrementalHandlerTest.setUp(DefaultIncrementalHandlerTest.java:55)
Caused by: java.lang.NoClassDefFoundError: Could not initialize class com.google.inject.internal.cglib.core.$ReflectUtils
        at org.apache.maven.index.incremental.DefaultIncrementalHandlerTest.setUp(DefaultIncrementalHandlerTest.java:55)


FAILED:  org.apache.maven.index.incremental.DefaultIncrementalHandlerTest.linux-jdk16 / Build linux-jdk16 / testDirectory

Error Message:
java.lang.NoClassDefFoundError: Could not initialize class com.google.inject.internal.cglib.core.$ReflectUtils

Stack Trace:
com.google.common.util.concurrent.ExecutionError: java.lang.NoClassDefFoundError: Could not initialize class com.google.inject.internal.cglib.core.$ReflectUtils
        at org.apache.maven.index.incremental.DefaultIncrementalHandlerTest.setUp(DefaultIncrementalHandlerTest.java:55)
Caused by: java.lang.NoClassDefFoundError: Could not initialize class com.google.inject.internal.cglib.core.$ReflectUtils
        at org.apache.maven.index.incremental.DefaultIncrementalHandlerTest.setUp(DefaultIncrementalHandlerTest.java:55)


FAILED:  org.apache.maven.index.locator.ArtifactLocatorTest.linux-jdk16 / Build linux-jdk16 / testArtifactLocator

Error Message:
java.lang.NoClassDefFoundError: Could not initialize class com.google.inject.internal.cglib.core.$ReflectUtils

Stack Trace:
com.google.common.util.concurrent.ExecutionError: java.lang.NoClassDefFoundError: Could not initialize class com.google.inject.internal.cglib.core.$ReflectUtils
Caused by: java.lang.NoClassDefFoundError: Could not initialize class com.google.inject.internal.cglib.core.$ReflectUtils


FAILED:  org.apache.maven.index.locator.ArtifactLocatorTest.linux-jdk16 / Build linux-jdk16 / testContextProducer

Error Message:
java.lang.NoClassDefFoundError: Could not initialize class com.google.inject.internal.cglib.core.$ReflectUtils

Stack Trace:
com.google.common.util.concurrent.ExecutionError: java.lang.NoClassDefFoundError: Could not initialize class com.google.inject.internal.cglib.core.$ReflectUtils
Caused by: java.lang.NoClassDefFoundError: Could not initialize class com.google.inject.internal.cglib.core.$ReflectUtils


FAILED:  org.apache.maven.index.locator.ArtifactLocatorTest.linux-jdk16 / Build linux-jdk16 / testDirectory

Error Message:
java.lang.NoClassDefFoundError: Could not initialize class com.google.inject.internal.cglib.core.$ReflectUtils

Stack Trace:
com.google.common.util.concurrent.ExecutionError: java.lang.NoClassDefFoundError: Could not initialize class com.google.inject.internal.cglib.core.$ReflectUtils
Caused by: java.lang.NoClassDefFoundError: Could not initialize class com.google.inject.internal.cglib.core.$ReflectUtils


FAILED:  org.apache.maven.index.packer.NEXUS4149TransferFormatTest.linux-jdk16 / Build linux-jdk16 / testDirectory

Error Message:
java.lang.NoClassDefFoundError: Could not initialize class com.google.inject.internal.cglib.core.$ReflectUtils

Stack Trace:
com.google.common.util.concurrent.ExecutionError: java.lang.NoClassDefFoundError: Could not initialize class com.google.inject.internal.cglib.core.$ReflectUtils
        at org.apache.maven.index.packer.NEXUS4149TransferFormatTest.setUp(NEXUS4149TransferFormatTest.java:54)
Caused by: java.lang.NoClassDefFoundError: Could not initialize class com.google.inject.internal.cglib.core.$ReflectUtils
        at org.apache.maven.index.packer.NEXUS4149TransferFormatTest.setUp(NEXUS4149TransferFormatTest.java:54)


FAILED:  org.apache.maven.index.packer.NEXUS4149TransferFormatTest.linux-jdk16 / Build linux-jdk16 / testTransportFile

Error Message:
java.lang.NoClassDefFoundError: Could not initialize class com.google.inject.internal.cglib.core.$ReflectUtils

Stack Trace:
com.google.common.util.concurrent.ExecutionError: java.lang.NoClassDefFoundError: Could not initialize class com.google.inject.internal.cglib.core.$ReflectUtils
        at org.apache.maven.index.packer.NEXUS4149TransferFormatTest.setUp(NEXUS4149TransferFormatTest.java:54)
Caused by: java.lang.NoClassDefFoundError: Could not initialize class com.google.inject.internal.cglib.core.$ReflectUtils
        at org.apache.maven.index.packer.NEXUS4149TransferFormatTest.setUp(NEXUS4149TransferFormatTest.java:54)


FAILED:  org.apache.maven.index.packer.NEXUS4149TransferFormatTest.linux-jdk16 / Build linux-jdk16 / testMembersAndMergedRootGroups

Error Message:
java.lang.NoClassDefFoundError: Could not initialize class com.google.inject.internal.cglib.core.$ReflectUtils

Stack Trace:
com.google.common.util.concurrent.ExecutionError: java.lang.NoClassDefFoundError: Could not initialize class com.google.inject.internal.cglib.core.$ReflectUtils
        at org.apache.maven.index.packer.NEXUS4149TransferFormatTest.setUp(NEXUS4149TransferFormatTest.java:54)
Caused by: java.lang.NoClassDefFoundError: Could not initialize class com.google.inject.internal.cglib.core.$ReflectUtils
        at org.apache.maven.index.packer.NEXUS4149TransferFormatTest.setUp(NEXUS4149TransferFormatTest.java:54)


FAILED:  org.apache.maven.index.treeview.IndexTreeViewTest.linux-jdk16 / Build linux-jdk16 / testPathIsRealGroup

Error Message:
java.lang.NoClassDefFoundError: Could not initialize class com.google.inject.internal.cglib.core.$ReflectUtils

Stack Trace:
com.google.common.util.concurrent.ExecutionError: java.lang.NoClassDefFoundError: Could not initialize class com.google.inject.internal.cglib.core.$ReflectUtils
        at org.apache.maven.index.treeview.IndexTreeViewTest.setUp(IndexTreeViewTest.java:43)
Caused by: java.lang.NoClassDefFoundError: Could not initialize class com.google.inject.internal.cglib.core.$ReflectUtils
        at org.apache.maven.index.treeview.IndexTreeViewTest.setUp(IndexTreeViewTest.java:43)


FAILED:  org.apache.maven.index.treeview.IndexTreeViewTest.linux-jdk16 / Build linux-jdk16 / testPathIsAboveRealGroup

Error Message:
java.lang.NoClassDefFoundError: Could not initialize class com.google.inject.internal.cglib.core.$ReflectUtils

Stack Trace:
com.google.common.util.concurrent.ExecutionError: java.lang.NoClassDefFoundError: Could not initialize class com.google.inject.internal.cglib.core.$ReflectUtils
        at org.apache.maven.index.treeview.IndexTreeViewTest.setUp(IndexTreeViewTest.java:43)
Caused by: java.lang.NoClassDefFoundError: Could not initialize class com.google.inject.internal.cglib.core.$ReflectUtils
        at org.apache.maven.index.treeview.IndexTreeViewTest.setUp(IndexTreeViewTest.java:43)


FAILED:  org.apache.maven.index.treeview.IndexTreeViewTest.linux-jdk16 / Build linux-jdk16 / testPathIsRealGroupArtifact

Error Message:
java.lang.NoClassDefFoundError: Could not initialize class com.google.inject.internal.cglib.core.$ReflectUtils

Stack Trace:
com.google.common.util.concurrent.ExecutionError: java.lang.NoClassDefFoundError: Could not initialize class com.google.inject.internal.cglib.core.$ReflectUtils
        at org.apache.maven.index.treeview.IndexTreeViewTest.setUp(IndexTreeViewTest.java:43)
Caused by: java.lang.NoClassDefFoundError: Could not initialize class com.google.inject.internal.cglib.core.$ReflectUtils
        at org.apache.maven.index.treeview.IndexTreeViewTest.setUp(IndexTreeViewTest.java:43)


FAILED:  org.apache.maven.index.treeview.IndexTreeViewTest.linux-jdk16 / Build linux-jdk16 / testRoot

Error Message:
java.lang.NoClassDefFoundError: Could not initialize class com.google.inject.internal.cglib.core.$ReflectUtils

Stack Trace:
com.google.common.util.concurrent.ExecutionError: java.lang.NoClassDefFoundError: Could not initialize class com.google.inject.internal.cglib.core.$ReflectUtils
        at org.apache.maven.index.treeview.IndexTreeViewTest.setUp(IndexTreeViewTest.java:43)
Caused by: java.lang.NoClassDefFoundError: Could not initialize class com.google.inject.internal.cglib.core.$ReflectUtils
        at org.apache.maven.index.treeview.IndexTreeViewTest.setUp(IndexTreeViewTest.java:43)


FAILED:  org.apache.maven.index.treeview.IndexTreeViewTest.linux-jdk16 / Build linux-jdk16 / testPathIsRealGroupArtifactVersion

Error Message:
java.lang.NoClassDefFoundError: Could not initialize class com.google.inject.internal.cglib.core.$ReflectUtils

Stack Trace:
com.google.common.util.concurrent.ExecutionError: java.lang.NoClassDefFoundError: Could not initialize class com.google.inject.internal.cglib.core.$ReflectUtils
        at org.apache.maven.index.treeview.IndexTreeViewTest.setUp(IndexTreeViewTest.java:43)
Caused by: java.lang.NoClassDefFoundError: Could not initialize class com.google.inject.internal.cglib.core.$ReflectUtils
        at org.apache.maven.index.treeview.IndexTreeViewTest.setUp(IndexTreeViewTest.java:43)


FAILED:  org.apache.maven.index.treeview.IndexTreeViewTest.linux-jdk16 / Build linux-jdk16 / testDirectory

Error Message:
java.lang.NoClassDefFoundError: Could not initialize class com.google.inject.internal.cglib.core.$ReflectUtils

Stack Trace:
com.google.common.util.concurrent.ExecutionError: java.lang.NoClassDefFoundError: Could not initialize class com.google.inject.internal.cglib.core.$ReflectUtils
        at org.apache.maven.index.treeview.IndexTreeViewTest.setUp(IndexTreeViewTest.java:43)
Caused by: java.lang.NoClassDefFoundError: Could not initialize class com.google.inject.internal.cglib.core.$ReflectUtils
        at org.apache.maven.index.treeview.IndexTreeViewTest.setUp(IndexTreeViewTest.java:43)


FAILED:  org.apache.maven.index.updater.DefaultIndexUpdaterEmbeddingIT.linux-jdk16 / Build linux-jdk16 / testBasicAuthenticatedIndexRetrieval

Error Message:
java.lang.ExceptionInInitializerError

Stack Trace:
com.google.common.util.concurrent.ExecutionError: java.lang.ExceptionInInitializerError
        at org.apache.maven.index.updater.DefaultIndexUpdaterEmbeddingIT.setUp(DefaultIndexUpdaterEmbeddingIT.java:75)
Caused by: java.lang.ExceptionInInitializerError
        at org.apache.maven.index.updater.DefaultIndexUpdaterEmbeddingIT.setUp(DefaultIndexUpdaterEmbeddingIT.java:75)
Caused by: java.lang.reflect.InaccessibleObjectException: Unable to make protected final java.lang.Class java.lang.ClassLoader.defineClass(java.lang.String,byte[],int,int,java.security.ProtectionDomain) throws java.lang.ClassFormatError accessible: module java.base does not "opens java.lang" to unnamed module @209c0b14
        at org.apache.maven.index.updater.DefaultIndexUpdaterEmbeddingIT.setUp(DefaultIndexUpdaterEmbeddingIT.java:75)


FAILED:  org.apache.maven.index.updater.DefaultIndexUpdaterEmbeddingIT.linux-jdk16 / Build linux-jdk16 / testAuthenticatedIndexRetrieval_LongAuthorizationHeader

Error Message:
java.lang.NoClassDefFoundError: Could not initialize class com.google.inject.internal.cglib.core.$ReflectUtils

Stack Trace:
com.google.common.util.concurrent.ExecutionError: java.lang.NoClassDefFoundError: Could not initialize class com.google.inject.internal.cglib.core.$ReflectUtils
        at org.apache.maven.index.updater.DefaultIndexUpdaterEmbeddingIT.setUp(DefaultIndexUpdaterEmbeddingIT.java:75)
Caused by: java.lang.NoClassDefFoundError: Could not initialize class com.google.inject.internal.cglib.core.$ReflectUtils
        at org.apache.maven.index.updater.DefaultIndexUpdaterEmbeddingIT.setUp(DefaultIndexUpdaterEmbeddingIT.java:75)


FAILED:  org.apache.maven.index.updater.DefaultIndexUpdaterEmbeddingIT.linux-jdk16 / Build linux-jdk16 / testBasicIndexRetrieval

Error Message:
java.lang.NoClassDefFoundError: Could not initialize class com.google.inject.internal.cglib.core.$ReflectUtils

Stack Trace:
com.google.common.util.concurrent.ExecutionError: java.lang.NoClassDefFoundError: Could not initialize class com.google.inject.internal.cglib.core.$ReflectUtils
        at org.apache.maven.index.updater.DefaultIndexUpdaterEmbeddingIT.setUp(DefaultIndexUpdaterEmbeddingIT.java:75)
Caused by: java.lang.NoClassDefFoundError: Could not initialize class com.google.inject.internal.cglib.core.$ReflectUtils
        at org.apache.maven.index.updater.DefaultIndexUpdaterEmbeddingIT.setUp(DefaultIndexUpdaterEmbeddingIT.java:75)


FAILED:  org.apache.maven.index.updater.DefaultIndexUpdaterEmbeddingIT.linux-jdk16 / Build linux-jdk16 / testIndexRetrieval_InfiniteRedirection

Error Message:
java.lang.NoClassDefFoundError: Could not initialize class com.google.inject.internal.cglib.core.$ReflectUtils

Stack Trace:
com.google.common.util.concurrent.ExecutionError: java.lang.NoClassDefFoundError: Could not initialize class com.google.inject.internal.cglib.core.$ReflectUtils
        at org.apache.maven.index.updater.DefaultIndexUpdaterEmbeddingIT.setUp(DefaultIndexUpdaterEmbeddingIT.java:75)
Caused by: java.lang.NoClassDefFoundError: Could not initialize class com.google.inject.internal.cglib.core.$ReflectUtils
        at org.apache.maven.index.updater.DefaultIndexUpdaterEmbeddingIT.setUp(DefaultIndexUpdaterEmbeddingIT.java:75)


FAILED:  org.apache.maven.index.updater.DefaultIndexUpdaterEmbeddingIT.linux-jdk16 / Build linux-jdk16 / testBasicHighLatencyIndexRetrieval

Error Message:
java.lang.NoClassDefFoundError: Could not initialize class com.google.inject.internal.cglib.core.$ReflectUtils

Stack Trace:
com.google.common.util.concurrent.ExecutionError: java.lang.NoClassDefFoundError: Could not initialize class com.google.inject.internal.cglib.core.$ReflectUtils
        at org.apache.maven.index.updater.DefaultIndexUpdaterEmbeddingIT.setUp(DefaultIndexUpdaterEmbeddingIT.java:75)
Caused by: java.lang.NoClassDefFoundError: Could not initialize class com.google.inject.internal.cglib.core.$ReflectUtils
        at org.apache.maven.index.updater.DefaultIndexUpdaterEmbeddingIT.setUp(DefaultIndexUpdaterEmbeddingIT.java:75)


FAILED:  org.apache.maven.index.updater.DefaultIndexUpdaterEmbeddingIT.linux-jdk16 / Build linux-jdk16 / testIndexTempDirB

Error Message:
java.lang.NoClassDefFoundError: Could not initialize class com.google.inject.internal.cglib.core.$ReflectUtils

Stack Trace:
com.google.common.util.concurrent.ExecutionError: java.lang.NoClassDefFoundError: Could not initialize class com.google.inject.internal.cglib.core.$ReflectUtils
        at org.apache.maven.index.updater.DefaultIndexUpdaterEmbeddingIT.setUp(DefaultIndexUpdaterEmbeddingIT.java:75)
Caused by: java.lang.NoClassDefFoundError: Could not initialize class com.google.inject.internal.cglib.core.$ReflectUtils
        at org.apache.maven.index.updater.DefaultIndexUpdaterEmbeddingIT.setUp(DefaultIndexUpdaterEmbeddingIT.java:75)


FAILED:  org.apache.maven.index.updater.DefaultIndexUpdaterEmbeddingIT.linux-jdk16 / Build linux-jdk16 / testIndexRetrieval_BadHostname

Error Message:
java.lang.NoClassDefFoundError: Could not initialize class com.google.inject.internal.cglib.core.$ReflectUtils

Stack Trace:
com.google.common.util.concurrent.ExecutionError: java.lang.NoClassDefFoundError: Could not initialize class com.google.inject.internal.cglib.core.$ReflectUtils
        at org.apache.maven.index.updater.DefaultIndexUpdaterEmbeddingIT.setUp(DefaultIndexUpdaterEmbeddingIT.java:75)
Caused by: java.lang.NoClassDefFoundError: Could not initialize class com.google.inject.internal.cglib.core.$ReflectUtils
        at org.apache.maven.index.updater.DefaultIndexUpdaterEmbeddingIT.setUp(DefaultIndexUpdaterEmbeddingIT.java:75)


FAILED:  org.apache.maven.index.updater.DefaultIndexUpdaterTest.linux-jdk16 / Build linux-jdk16 / testFullIndexUpdate

Error Message:
java.lang.NoClassDefFoundError: Could not initialize class com.google.inject.internal.cglib.core.$ReflectUtils

Stack Trace:
com.google.common.util.concurrent.ExecutionError: java.lang.NoClassDefFoundError: Could not initialize class com.google.inject.internal.cglib.core.$ReflectUtils
Caused by: java.lang.NoClassDefFoundError: Could not initialize class com.google.inject.internal.cglib.core.$ReflectUtils


FAILED:  org.apache.maven.index.updater.DefaultIndexUpdaterTest.linux-jdk16 / Build linux-jdk16 / testMergeIndex

Error Message:
java.lang.NoClassDefFoundError: Could not initialize class com.google.inject.internal.cglib.core.$ReflectUtils

Stack Trace:
com.google.common.util.concurrent.ExecutionError: java.lang.NoClassDefFoundError: Could not initialize class com.google.inject.internal.cglib.core.$ReflectUtils
Caused by: java.lang.NoClassDefFoundError: Could not initialize class com.google.inject.internal.cglib.core.$ReflectUtils


FAILED:  org.apache.maven.index.updater.DefaultIndexUpdaterTest.linux-jdk16 / Build linux-jdk16 / testMergeGroups

Error Message:
java.lang.NoClassDefFoundError: Could not initialize class com.google.inject.internal.cglib.core.$ReflectUtils

Stack Trace:
com.google.common.util.concurrent.ExecutionError: java.lang.NoClassDefFoundError: Could not initialize class com.google.inject.internal.cglib.core.$ReflectUtils
Caused by: java.lang.NoClassDefFoundError: Could not initialize class com.google.inject.internal.cglib.core.$ReflectUtils


FAILED:  org.apache.maven.index.updater.DefaultIndexUpdaterTest.linux-jdk16 / Build linux-jdk16 / testMergeSearch

Error Message:
java.lang.NoClassDefFoundError: Could not initialize class com.google.inject.internal.cglib.core.$ReflectUtils

Stack Trace:
com.google.common.util.concurrent.ExecutionError: java.lang.NoClassDefFoundError: Could not initialize class com.google.inject.internal.cglib.core.$ReflectUtils
Caused by: java.lang.NoClassDefFoundError: Could not initialize class com.google.inject.internal.cglib.core.$ReflectUtils


FAILED:  org.apache.maven.index.updater.DefaultIndexUpdaterTest.linux-jdk16 / Build linux-jdk16 / testIncrementalIndexUpdate

Error Message:
java.lang.NoClassDefFoundError: Could not initialize class com.google.inject.internal.cglib.core.$ReflectUtils

Stack Trace:
com.google.common.util.concurrent.ExecutionError: java.lang.NoClassDefFoundError: Could not initialize class com.google.inject.internal.cglib.core.$ReflectUtils
Caused by: java.lang.NoClassDefFoundError: Could not initialize class com.google.inject.internal.cglib.core.$ReflectUtils


FAILED:  org.apache.maven.index.updater.DefaultIndexUpdaterTest.linux-jdk16 / Build linux-jdk16 / testNoIndexUpdate

Error Message:
java.lang.NoClassDefFoundError: Could not initialize class com.google.inject.internal.cglib.core.$ReflectUtils

Stack Trace:
com.google.common.util.concurrent.ExecutionError: java.lang.NoClassDefFoundError: Could not initialize class com.google.inject.internal.cglib.core.$ReflectUtils
Caused by: java.lang.NoClassDefFoundError: Could not initialize class com.google.inject.internal.cglib.core.$ReflectUtils


FAILED:  org.apache.maven.index.updater.DefaultIndexUpdaterTest.linux-jdk16 / Build linux-jdk16 / testIncrementalOnlyIndexUpdateNoCounter

Error Message:
java.lang.NoClassDefFoundError: Could not initialize class com.google.inject.internal.cglib.core.$ReflectUtils

Stack Trace:
com.google.common.util.concurrent.ExecutionError: java.lang.NoClassDefFoundError: Could not initialize class com.google.inject.internal.cglib.core.$ReflectUtils
Caused by: java.lang.NoClassDefFoundError: Could not initialize class com.google.inject.internal.cglib.core.$ReflectUtils


FAILED:  org.apache.maven.index.updater.DefaultIndexUpdaterTest.linux-jdk16 / Build linux-jdk16 / testUpdateForceFullUpdate

Error Message:
java.lang.NoClassDefFoundError: Could not initialize class com.google.inject.internal.cglib.core.$ReflectUtils

Stack Trace:
com.google.common.util.concurrent.ExecutionError: java.lang.NoClassDefFoundError: Could not initialize class com.google.inject.internal.cglib.core.$ReflectUtils
Caused by: java.lang.NoClassDefFoundError: Could not initialize class com.google.inject.internal.cglib.core.$ReflectUtils


FAILED:  org.apache.maven.index.updater.DefaultIndexUpdaterTest.linux-jdk16 / Build linux-jdk16 / testMergeIndexDeletes

Error Message:
java.lang.NoClassDefFoundError: Could not initialize class com.google.inject.internal.cglib.core.$ReflectUtils

Stack Trace:
com.google.common.util.concurrent.ExecutionError: java.lang.NoClassDefFoundError: Could not initialize class com.google.inject.internal.cglib.core.$ReflectUtils
Caused by: java.lang.NoClassDefFoundError: Could not initialize class com.google.inject.internal.cglib.core.$ReflectUtils


FAILED:  org.apache.maven.index.updater.DefaultIndexUpdaterTest.linux-jdk16 / Build linux-jdk16 / testReplaceIndex

Error Message:
java.lang.NoClassDefFoundError: Could not initialize class com.google.inject.internal.cglib.core.$ReflectUtils

Stack Trace:
com.google.common.util.concurrent.ExecutionError: java.lang.NoClassDefFoundError: Could not initialize class com.google.inject.internal.cglib.core.$ReflectUtils
Caused by: java.lang.NoClassDefFoundError: Could not initialize class com.google.inject.internal.cglib.core.$ReflectUtils


FAILED:  org.apache.maven.index.updater.DefaultIndexUpdaterTest.linux-jdk16 / Build linux-jdk16 / testIncrementalIndexUpdateNoCounter

Error Message:
java.lang.NoClassDefFoundError: Could not initialize class com.google.inject.internal.cglib.core.$ReflectUtils

Stack Trace:
com.google.common.util.concurrent.ExecutionError: java.lang.NoClassDefFoundError: Could not initialize class com.google.inject.internal.cglib.core.$ReflectUtils
Caused by: java.lang.NoClassDefFoundError: Could not initialize class com.google.inject.internal.cglib.core.$ReflectUtils


FAILED:  org.apache.maven.index.updater.DefaultIndexUpdaterTest.linux-jdk16 / Build linux-jdk16 / testIncrementalIndexUpdateNoUpdateNecessary

Error Message:
java.lang.NoClassDefFoundError: Could not initialize class com.google.inject.internal.cglib.core.$ReflectUtils

Stack Trace:
com.google.common.util.concurrent.ExecutionError: java.lang.NoClassDefFoundError: Could not initialize class com.google.inject.internal.cglib.core.$ReflectUtils
Caused by: java.lang.NoClassDefFoundError: Could not initialize class com.google.inject.internal.cglib.core.$ReflectUtils


FAILED:  org.apache.maven.index.updater.DefaultIndexUpdaterTest.linux-jdk16 / Build linux-jdk16 / testDirectory

Error Message:
java.lang.NoClassDefFoundError: Could not initialize class com.google.inject.internal.cglib.core.$ReflectUtils

Stack Trace:
com.google.common.util.concurrent.ExecutionError: java.lang.NoClassDefFoundError: Could not initialize class com.google.inject.internal.cglib.core.$ReflectUtils
Caused by: java.lang.NoClassDefFoundError: Could not initialize class com.google.inject.internal.cglib.core.$ReflectUtils


FAILED:  org.apache.maven.index.updater.DownloadRemoteIndexerManagerTest.linux-jdk16 / Build linux-jdk16 / testRepoReindex

Error Message:
java.lang.NoClassDefFoundError: Could not initialize class com.google.inject.internal.cglib.core.$ReflectUtils

Stack Trace:
com.google.common.util.concurrent.ExecutionError: java.lang.NoClassDefFoundError: Could not initialize class com.google.inject.internal.cglib.core.$ReflectUtils
        at org.apache.maven.index.updater.DownloadRemoteIndexerManagerTest.setUp(DownloadRemoteIndexerManagerTest.java:60)
Caused by: java.lang.NoClassDefFoundError: Could not initialize class com.google.inject.internal.cglib.core.$ReflectUtils
        at org.apache.maven.index.updater.DownloadRemoteIndexerManagerTest.setUp(DownloadRemoteIndexerManagerTest.java:60)


FAILED:  org.apache.maven.index.updater.DownloadRemoteIndexerManagerTest.linux-jdk16 / Build linux-jdk16 / testDirectory

Error Message:
java.lang.NoClassDefFoundError: Could not initialize class com.google.inject.internal.cglib.core.$ReflectUtils

Stack Trace:
com.google.common.util.concurrent.ExecutionError: java.lang.NoClassDefFoundError: Could not initialize class com.google.inject.internal.cglib.core.$ReflectUtils
        at org.apache.maven.index.updater.DownloadRemoteIndexerManagerTest.setUp(DownloadRemoteIndexerManagerTest.java:60)
Caused by: java.lang.NoClassDefFoundError: Could not initialize class com.google.inject.internal.cglib.core.$ReflectUtils
        at org.apache.maven.index.updater.DownloadRemoteIndexerManagerTest.setUp(DownloadRemoteIndexerManagerTest.java:60)


FAILED:  org.apache.maven.index.updater.IndexDataTest.linux-jdk16 / Build linux-jdk16 / testData

Error Message:
java.lang.NoClassDefFoundError: Could not initialize class com.google.inject.internal.cglib.core.$ReflectUtils

Stack Trace:
com.google.common.util.concurrent.ExecutionError: java.lang.NoClassDefFoundError: Could not initialize class com.google.inject.internal.cglib.core.$ReflectUtils
Caused by: java.lang.NoClassDefFoundError: Could not initialize class com.google.inject.internal.cglib.core.$ReflectUtils


FAILED:  org.apache.maven.index.updater.IndexDataTest.linux-jdk16 / Build linux-jdk16 / testEmptyContext

Error Message:
java.lang.NoClassDefFoundError: Could not initialize class com.google.inject.internal.cglib.core.$ReflectUtils

Stack Trace:
com.google.common.util.concurrent.ExecutionError: java.lang.NoClassDefFoundError: Could not initialize class com.google.inject.internal.cglib.core.$ReflectUtils
Caused by: java.lang.NoClassDefFoundError: Could not initialize class com.google.inject.internal.cglib.core.$ReflectUtils


FAILED:  org.apache.maven.index.updater.IndexDataTest.linux-jdk16 / Build linux-jdk16 / testPrefixWildcard

Error Message:
java.lang.NoClassDefFoundError: Could not initialize class com.google.inject.internal.cglib.core.$ReflectUtils

Stack Trace:
com.google.common.util.concurrent.ExecutionError: java.lang.NoClassDefFoundError: Could not initialize class com.google.inject.internal.cglib.core.$ReflectUtils
Caused by: java.lang.NoClassDefFoundError: Could not initialize class com.google.inject.internal.cglib.core.$ReflectUtils


FAILED:  org.apache.maven.index.updater.IndexDataTest.linux-jdk16 / Build linux-jdk16 / testPackaging

Error Message:
java.lang.NoClassDefFoundError: Could not initialize class com.google.inject.internal.cglib.core.$ReflectUtils

Stack Trace:
com.google.common.util.concurrent.ExecutionError: java.lang.NoClassDefFoundError: Could not initialize class com.google.inject.internal.cglib.core.$ReflectUtils
Caused by: java.lang.NoClassDefFoundError: Could not initialize class com.google.inject.internal.cglib.core.$ReflectUtils


FAILED:  org.apache.maven.index.updater.IndexDataTest.linux-jdk16 / Build linux-jdk16 / testSearchFlat

Error Message:
java.lang.NoClassDefFoundError: Could not initialize class com.google.inject.internal.cglib.core.$ReflectUtils

Stack Trace:
com.google.common.util.concurrent.ExecutionError: java.lang.NoClassDefFoundError: Could not initialize class com.google.inject.internal.cglib.core.$ReflectUtils
Caused by: java.lang.NoClassDefFoundError: Could not initialize class com.google.inject.internal.cglib.core.$ReflectUtils


FAILED:  org.apache.maven.index.updater.IndexDataTest.linux-jdk16 / Build linux-jdk16 / testPurge

Error Message:
java.lang.NoClassDefFoundError: Could not initialize class com.google.inject.internal.cglib.core.$ReflectUtils

Stack Trace:
com.google.common.util.concurrent.ExecutionError: java.lang.NoClassDefFoundError: Could not initialize class com.google.inject.internal.cglib.core.$ReflectUtils
Caused by: java.lang.NoClassDefFoundError: Could not initialize class com.google.inject.internal.cglib.core.$ReflectUtils


FAILED:  org.apache.maven.index.updater.IndexDataTest.linux-jdk16 / Build linux-jdk16 / testSearchGrouped

Error Message:
java.lang.NoClassDefFoundError: Could not initialize class com.google.inject.internal.cglib.core.$ReflectUtils

Stack Trace:
com.google.common.util.concurrent.ExecutionError: java.lang.NoClassDefFoundError: Could not initialize class com.google.inject.internal.cglib.core.$ReflectUtils
Caused by: java.lang.NoClassDefFoundError: Could not initialize class com.google.inject.internal.cglib.core.$ReflectUtils


FAILED:  org.apache.maven.index.updater.IndexDataTest.linux-jdk16 / Build linux-jdk16 / testSearchGroupedProblematicNames

Error Message:
java.lang.NoClassDefFoundError: Could not initialize class com.google.inject.internal.cglib.core.$ReflectUtils

Stack Trace:
com.google.common.util.concurrent.ExecutionError: java.lang.NoClassDefFoundError: Could not initialize class com.google.inject.internal.cglib.core.$ReflectUtils
Caused by: java.lang.NoClassDefFoundError: Could not initialize class com.google.inject.internal.cglib.core.$ReflectUtils


FAILED:  org.apache.maven.index.updater.IndexDataTest.linux-jdk16 / Build linux-jdk16 / testIdentify

Error Message:
java.lang.NoClassDefFoundError: Could not initialize class com.google.inject.internal.cglib.core.$ReflectUtils

Stack Trace:
com.google.common.util.concurrent.ExecutionError: java.lang.NoClassDefFoundError: Could not initialize class com.google.inject.internal.cglib.core.$ReflectUtils
Caused by: java.lang.NoClassDefFoundError: Could not initialize class com.google.inject.internal.cglib.core.$ReflectUtils


FAILED:  org.apache.maven.index.updater.IndexDataTest.linux-jdk16 / Build linux-jdk16 / testSearchFlatPaged

Error Message:
java.lang.NoClassDefFoundError: Could not initialize class com.google.inject.internal.cglib.core.$ReflectUtils

Stack Trace:
com.google.common.util.concurrent.ExecutionError: java.lang.NoClassDefFoundError: Could not initialize class com.google.inject.internal.cglib.core.$ReflectUtils
Caused by: java.lang.NoClassDefFoundError: Could not initialize class com.google.inject.internal.cglib.core.$ReflectUtils


FAILED:  org.apache.maven.index.updater.IndexDataTest.linux-jdk16 / Build linux-jdk16 / testRootGroups

Error Message:
java.lang.NoClassDefFoundError: Could not initialize class com.google.inject.internal.cglib.core.$ReflectUtils

Stack Trace:
com.google.common.util.concurrent.ExecutionError: java.lang.NoClassDefFoundError: Could not initialize class com.google.inject.internal.cglib.core.$ReflectUtils
Caused by: java.lang.NoClassDefFoundError: Could not initialize class com.google.inject.internal.cglib.core.$ReflectUtils


FAILED:  org.apache.maven.index.updater.IndexDataTest.linux-jdk16 / Build linux-jdk16 / testDirectory

Error Message:
java.lang.NoClassDefFoundError: Could not initialize class com.google.inject.internal.cglib.core.$ReflectUtils

Stack Trace:
com.google.common.util.concurrent.ExecutionError: java.lang.NoClassDefFoundError: Could not initialize class com.google.inject.internal.cglib.core.$ReflectUtils
Caused by: java.lang.NoClassDefFoundError: Could not initialize class com.google.inject.internal.cglib.core.$ReflectUtils


FAILED:  org.apache.maven.index.updater.LocalIndexCacheTest.linux-jdk16 / Build linux-jdk16 / testCleanCacheDirectory

Error Message:
java.lang.NoClassDefFoundError: Could not initialize class com.google.inject.internal.cglib.core.$ReflectUtils

Stack Trace:
com.google.common.util.concurrent.ExecutionError: java.lang.NoClassDefFoundError: Could not initialize class com.google.inject.internal.cglib.core.$ReflectUtils
        at org.apache.maven.index.updater.LocalIndexCacheTest.setUp(LocalIndexCacheTest.java:53)
Caused by: java.lang.NoClassDefFoundError: Could not initialize class com.google.inject.internal.cglib.core.$ReflectUtils
        at org.apache.maven.index.updater.LocalIndexCacheTest.setUp(LocalIndexCacheTest.java:53)


FAILED:  org.apache.maven.index.updater.LocalIndexCacheTest.linux-jdk16 / Build linux-jdk16 / testOffline

Error Message:
java.lang.NoClassDefFoundError: Could not initialize class com.google.inject.internal.cglib.core.$ReflectUtils

Stack Trace:
com.google.common.util.concurrent.ExecutionError: java.lang.NoClassDefFoundError: Could not initialize class com.google.inject.internal.cglib.core.$ReflectUtils
        at org.apache.maven.index.updater.LocalIndexCacheTest.setUp(LocalIndexCacheTest.java:53)
Caused by: java.lang.NoClassDefFoundError: Could not initialize class com.google.inject.internal.cglib.core.$ReflectUtils
        at org.apache.maven.index.updater.LocalIndexCacheTest.setUp(LocalIndexCacheTest.java:53)


FAILED:  org.apache.maven.index.updater.LocalIndexCacheTest.linux-jdk16 / Build linux-jdk16 / testFailedIndexDownload

Error Message:
java.lang.NoClassDefFoundError: Could not initialize class com.google.inject.internal.cglib.core.$ReflectUtils

Stack Trace:
com.google.common.util.concurrent.ExecutionError: java.lang.NoClassDefFoundError: Could not initialize class com.google.inject.internal.cglib.core.$ReflectUtils
        at org.apache.maven.index.updater.LocalIndexCacheTest.setUp(LocalIndexCacheTest.java:53)
Caused by: java.lang.NoClassDefFoundError: Could not initialize class com.google.inject.internal.cglib.core.$ReflectUtils
        at org.apache.maven.index.updater.LocalIndexCacheTest.setUp(LocalIndexCacheTest.java:53)


FAILED:  org.apache.maven.index.updater.LocalIndexCacheTest.linux-jdk16 / Build linux-jdk16 / testInitialForcedFullDownload

Error Message:
java.lang.NoClassDefFoundError: Could not initialize class com.google.inject.internal.cglib.core.$ReflectUtils

Stack Trace:
com.google.common.util.concurrent.ExecutionError: java.lang.NoClassDefFoundError: Could not initialize class com.google.inject.internal.cglib.core.$ReflectUtils
        at org.apache.maven.index.updater.LocalIndexCacheTest.setUp(LocalIndexCacheTest.java:53)
Caused by: java.lang.NoClassDefFoundError: Could not initialize class com.google.inject.internal.cglib.core.$ReflectUtils
        at org.apache.maven.index.updater.LocalIndexCacheTest.setUp(LocalIndexCacheTest.java:53)


FAILED:  org.apache.maven.index.updater.LocalIndexCacheTest.linux-jdk16 / Build linux-jdk16 / testBasic

Error Message:
java.lang.NoClassDefFoundError: Could not initialize class com.google.inject.internal.cglib.core.$ReflectUtils

Stack Trace:
com.google.common.util.concurrent.ExecutionError: java.lang.NoClassDefFoundError: Could not initialize class com.google.inject.internal.cglib.core.$ReflectUtils
        at org.apache.maven.index.updater.LocalIndexCacheTest.setUp(LocalIndexCacheTest.java:53)
Caused by: java.lang.NoClassDefFoundError: Could not initialize class com.google.inject.internal.cglib.core.$ReflectUtils
        at org.apache.maven.index.updater.LocalIndexCacheTest.setUp(LocalIndexCacheTest.java:53)


FAILED:  org.apache.maven.index.updater.LocalIndexCacheTest.linux-jdk16 / Build linux-jdk16 / testForceIndexDownload

Error Message:
java.lang.NoClassDefFoundError: Could not initialize class com.google.inject.internal.cglib.core.$ReflectUtils

Stack Trace:
com.google.common.util.concurrent.ExecutionError: java.lang.NoClassDefFoundError: Could not initialize class com.google.inject.internal.cglib.core.$ReflectUtils
        at org.apache.maven.index.updater.LocalIndexCacheTest.setUp(LocalIndexCacheTest.java:53)
Caused by: java.lang.NoClassDefFoundError: Could not initialize class com.google.inject.internal.cglib.core.$ReflectUtils
        at org.apache.maven.index.updater.LocalIndexCacheTest.setUp(LocalIndexCacheTest.java:53)


FAILED:  org.apache.maven.index.updater.LocalIndexCacheTest.linux-jdk16 / Build linux-jdk16 / testDirectory

Error Message:
java.lang.NoClassDefFoundError: Could not initialize class com.google.inject.internal.cglib.core.$ReflectUtils

Stack Trace:
com.google.common.util.concurrent.ExecutionError: java.lang.NoClassDefFoundError: Could not initialize class com.google.inject.internal.cglib.core.$ReflectUtils
        at org.apache.maven.index.updater.LocalIndexCacheTest.setUp(LocalIndexCacheTest.java:53)
Caused by: java.lang.NoClassDefFoundError: Could not initialize class com.google.inject.internal.cglib.core.$ReflectUtils
        at org.apache.maven.index.updater.LocalIndexCacheTest.setUp(LocalIndexCacheTest.java:53)


FAILED:  org.apache.maven.index.util.IndexCreatorSorterTest.linux-jdk16 / Build linux-jdk16 / testLookupListWithNonExistentCreatorDependency

Error Message:
java.lang.NoClassDefFoundError: Could not initialize class com.google.inject.internal.cglib.core.$ReflectUtils

Stack Trace:
com.google.common.util.concurrent.ExecutionError: java.lang.NoClassDefFoundError: Could not initialize class com.google.inject.internal.cglib.core.$ReflectUtils
        at org.apache.maven.index.util.IndexCreatorSorterTest.testLookupListWithNonExistentCreatorDependency(IndexCreatorSorterTest.java:101)
Caused by: java.lang.NoClassDefFoundError: Could not initialize class com.google.inject.internal.cglib.core.$ReflectUtils
        at org.apache.maven.index.util.IndexCreatorSorterTest.testLookupListWithNonExistentCreatorDependency(IndexCreatorSorterTest.java:101)


FAILED:  org.apache.maven.index.util.IndexCreatorSorterTest.linux-jdk16 / Build linux-jdk16 / testLookupList

Error Message:
java.lang.NoClassDefFoundError: Could not initialize class com.google.inject.internal.cglib.core.$ReflectUtils

Stack Trace:
com.google.common.util.concurrent.ExecutionError: java.lang.NoClassDefFoundError: Could not initialize class com.google.inject.internal.cglib.core.$ReflectUtils
        at org.apache.maven.index.util.IndexCreatorSorterTest.testLookupList(IndexCreatorSorterTest.java:36)
Caused by: java.lang.NoClassDefFoundError: Could not initialize class com.google.inject.internal.cglib.core.$ReflectUtils
        at org.apache.maven.index.util.IndexCreatorSorterTest.testLookupList(IndexCreatorSorterTest.java:36)


FAILED:  org.apache.maven.index.util.IndexCreatorSorterTest.linux-jdk16 / Build linux-jdk16 / testLookupListWithSpoofedCreator

Error Message:
java.lang.NoClassDefFoundError: Could not initialize class com.google.inject.internal.cglib.core.$ReflectUtils

Stack Trace:
com.google.common.util.concurrent.ExecutionError: java.lang.NoClassDefFoundError: Could not initialize class com.google.inject.internal.cglib.core.$ReflectUtils
        at org.apache.maven.index.util.IndexCreatorSorterTest.testLookupListWithSpoofedCreator(IndexCreatorSorterTest.java:63)
Caused by: java.lang.NoClassDefFoundError: Could not initialize class com.google.inject.internal.cglib.core.$ReflectUtils
        at org.apache.maven.index.util.IndexCreatorSorterTest.testLookupListWithSpoofedCreator(IndexCreatorSorterTest.java:63)




Build log:
[...truncated 19408 lines...]
[INFO] Preparing remote bundle org.apache:apache-jar-resource-bundle:1.4
[INFO] Copying 3 resources from 1 bundle.
[INFO]
[INFO] --- animal-sniffer-maven-plugin:1.20:check (check-java-compat) @ maven-indexer-examples ---
[INFO] Checking unresolved references to org.codehaus.mojo.signature:java18:1.0
[INFO]
[INFO] --- maven-site-plugin:3.7.1:attach-descriptor (attach-descriptor) @ maven-indexer-examples ---
[INFO] No site descriptor found: nothing to attach.
[INFO]
[INFO] --- maven-checkstyle-plugin:3.1.2:check (checkstyle-check) @ maven-indexer-examples ---
[WARNING] Old version of checkstyle detected. Consider updating to >= v8.30
[WARNING] For more information see: https://maven.apache.org/plugins/maven-checkstyle-plugin/examples/upgrading-checkstyle.html
[INFO] You have 0 Checkstyle violations.
[INFO]
[INFO] ----------< org.apache.maven.indexer:indexer-examples-basic >-----------
[INFO] Building Maven :: Indexer Examples [Basic] 6.1.0-SNAPSHOT          [6/7]
[INFO] --------------------------------[ jar ]---------------------------------
[INFO] Downloading from central: https://repo.maven.apache.org/maven2/org/apache/maven/wagon/wagon-http-lightweight/3.4.3/wagon-http-lightweight-3.4.3.pom
[INFO] Downloaded from central: https://repo.maven.apache.org/maven2/org/apache/maven/wagon/wagon-http-lightweight/3.4.3/wagon-http-lightweight-3.4.3.pom (2.6 kB at 110 kB/s)
[INFO] Downloading from central: https://repo.maven.apache.org/maven2/org/apache/maven/wagon/wagon-http-lightweight/3.4.3/wagon-http-lightweight-3.4.3.jar
[INFO] Downloaded from central: https://repo.maven.apache.org/maven2/org/apache/maven/wagon/wagon-http-lightweight/3.4.3/wagon-http-lightweight-3.4.3.jar (18 kB at 636 kB/s)
[INFO]
[INFO] --- maven-clean-plugin:3.1.0:clean (default-clean) @ indexer-examples-basic ---
[INFO]
[INFO] --- maven-enforcer-plugin:1.4.1:enforce (enforce-maven-version) @ indexer-examples-basic ---
[INFO]
[INFO] --- maven-enforcer-plugin:1.4.1:enforce (enforce-bytecode-version) @ indexer-examples-basic ---
[INFO] Adding ignore: module-info
[INFO]
[INFO] --- apache-rat-plugin:0.13:check (rat-check) @ indexer-examples-basic ---
[INFO] Enabled default license matchers.
[INFO] Will parse SCM ignores for exclusions...
[INFO] Finished adding exclusions from SCM ignore files.
[INFO] 62 implicit excludes (use -debug for more details).
[INFO] 22 explicit excludes (use -debug for more details).
[INFO] 4 resources included (use -debug for more details)
[INFO] Rat check: Summary over all files. Unapproved: 0, unknown: 0, generated: 0, approved: 4 licenses.
[INFO]
[INFO] --- maven-remote-resources-plugin:1.7.0:process (process-resource-bundles) @ indexer-examples-basic ---
[INFO] Preparing remote bundle org.apache:apache-jar-resource-bundle:1.4
[INFO] Copying 3 resources from 1 bundle.
[INFO]
[INFO] --- maven-resources-plugin:3.1.0:resources (default-resources) @ indexer-examples-basic ---
[INFO] Using 'UTF-8' encoding to copy filtered resources.
[INFO] skip non existing resourceDirectory F:\jenkins\jenkins-slave\712657a4\workspace\en_maven-box_maven-indexer_guava@2\m\indexer-examples\indexer-examples-basic\src\main\resources
[INFO] Copying 3 resources
[INFO]
[INFO] --- maven-compiler-plugin:3.8.1:compile (default-compile) @ indexer-examples-basic ---
[INFO] Changes detected - recompiling the module!
[INFO] Compiling 1 source file to F:\jenkins\jenkins-slave\712657a4\workspace\en_maven-box_maven-indexer_guava@2\m\indexer-examples\indexer-examples-basic\target\classes
[INFO]
[INFO] --- animal-sniffer-maven-plugin:1.20:check (check-java-compat) @ indexer-examples-basic ---
[INFO] Checking unresolved references to org.codehaus.mojo.signature:java18:1.0
[INFO]
[INFO] --- maven-resources-plugin:3.1.0:testResources (default-testResources) @ indexer-examples-basic ---
[INFO] Using 'UTF-8' encoding to copy filtered resources.
[INFO] skip non existing resourceDirectory F:\jenkins\jenkins-slave\712657a4\workspace\en_maven-box_maven-indexer_guava@2\m\indexer-examples\indexer-examples-basic\src\test\resources
[INFO] Copying 3 resources
[INFO]
[INFO] --- maven-compiler-plugin:3.8.1:testCompile (default-testCompile) @ indexer-examples-basic ---
[INFO] Changes detected - recompiling the module!
[INFO] Compiling 1 source file to F:\jenkins\jenkins-slave\712657a4\workspace\en_maven-box_maven-indexer_guava@2\m\indexer-examples\indexer-examples-basic\target\test-classes
[INFO]
[INFO] --- maven-surefire-plugin:2.22.2:test (default-test) @ indexer-examples-basic ---
[INFO] Tests are skipped.
[INFO]
[INFO] --- maven-jar-plugin:3.2.0:jar (default-jar) @ indexer-examples-basic ---
[INFO] Building jar: F:\jenkins\jenkins-slave\712657a4\workspace\en_maven-box_maven-indexer_guava@2\m\indexer-examples\indexer-examples-basic\target\indexer-examples-basic-6.1.0-SNAPSHOT.jar
[INFO]
[INFO] --- maven-site-plugin:3.7.1:attach-descriptor (attach-descriptor) @ indexer-examples-basic ---
[INFO] Skipping because packaging 'jar' is not pom.
[INFO]
[INFO] --- maven-checkstyle-plugin:3.1.2:check (checkstyle-check) @ indexer-examples-basic ---
[WARNING] Old version of checkstyle detected. Consider updating to >= v8.30
[WARNING] For more information see: https://maven.apache.org/plugins/maven-checkstyle-plugin/examples/upgrading-checkstyle.html
[INFO] There is 1 error reported by Checkstyle 8.29 with config/maven_checks.xml ruleset.
[INFO] Ignored 1 error, 0 violation remaining.
[INFO] You have 0 Checkstyle violations.
[INFO]
[INFO] ----------< org.apache.maven.indexer:indexer-examples-spring >----------
[INFO] Building Maven :: Indexer Examples [Spring] 6.1.0-SNAPSHOT         [7/7]
[INFO] --------------------------------[ jar ]---------------------------------
[INFO] Downloading from central: https://repo.maven.apache.org/maven2/ch/qos/logback/logback-classic/1.2.3/logback-classic-1.2.3.pom
[INFO] Downloaded from central: https://repo.maven.apache.org/maven2/ch/qos/logback/logback-classic/1.2.3/logback-classic-1.2.3.pom (13 kB at 422 kB/s)
[INFO] Downloading from central: https://repo.maven.apache.org/maven2/ch/qos/logback/logback-parent/1.2.3/logback-parent-1.2.3.pom
[INFO] Downloaded from central: https://repo.maven.apache.org/maven2/ch/qos/logback/logback-parent/1.2.3/logback-parent-1.2.3.pom (18 kB at 712 kB/s)
[INFO] Downloading from central: https://repo.maven.apache.org/maven2/ch/qos/logback/logback-core/1.2.3/logback-core-1.2.3.pom
[INFO] Downloaded from central: https://repo.maven.apache.org/maven2/ch/qos/logback/logback-core/1.2.3/logback-core-1.2.3.pom (4.2 kB at 161 kB/s)
[INFO] Downloading from central: https://repo.maven.apache.org/maven2/org/apache/maven/maven-model-builder/3.8.1/maven-model-builder-3.8.1.pom
[INFO] Downloaded from central: https://repo.maven.apache.org/maven2/org/apache/maven/maven-model-builder/3.8.1/maven-model-builder-3.8.1.pom (3.4 kB at 113 kB/s)
[INFO] Downloading from central: https://repo.maven.apache.org/maven2/org/apache/maven/maven-artifact/3.8.1/maven-artifact-3.8.1.pom
[INFO] Downloaded from central: https://repo.maven.apache.org/maven2/org/apache/maven/maven-artifact/3.8.1/maven-artifact-3.8.1.pom (2.4 kB at 96 kB/s)
[INFO] Downloading from central: https://repo.maven.apache.org/maven2/org/apache/commons/commons-lang3/3.8.1/commons-lang3-3.8.1.pom
[INFO] Downloaded from central: https://repo.maven.apache.org/maven2/org/apache/commons/commons-lang3/3.8.1/commons-lang3-3.8.1.pom (28 kB at 1.1 MB/s)
[INFO] Downloading from central: https://repo.maven.apache.org/maven2/org/apache/maven/maven-builder-support/3.8.1/maven-builder-support-3.8.1.pom
[INFO] Downloaded from central: https://repo.maven.apache.org/maven2/org/apache/maven/maven-builder-support/3.8.1/maven-builder-support-3.8.1.pom (1.4 kB at 9.0 kB/s)
[INFO] Downloading from central: https://repo.maven.apache.org/maven2/org/springframework/spring-beans/5.3.5/spring-beans-5.3.5.pom
[INFO] Downloaded from central: https://repo.maven.apache.org/maven2/org/springframework/spring-beans/5.3.5/spring-beans-5.3.5.pom (2.0 kB at 75 kB/s)
[INFO] Downloading from central: https://repo.maven.apache.org/maven2/org/springframework/spring-core/5.3.5/spring-core-5.3.5.pom
[INFO] Downloaded from central: https://repo.maven.apache.org/maven2/org/springframework/spring-core/5.3.5/spring-core-5.3.5.pom (2.0 kB at 59 kB/s)
[INFO] Downloading from central: https://repo.maven.apache.org/maven2/org/springframework/spring-jcl/5.3.5/spring-jcl-5.3.5.pom
[INFO] Downloaded from central: https://repo.maven.apache.org/maven2/org/springframework/spring-jcl/5.3.5/spring-jcl-5.3.5.pom (1.8 kB at 63 kB/s)
[INFO] Downloading from central: https://repo.maven.apache.org/maven2/org/springframework/spring-context/5.3.5/spring-context-5.3.5.pom
[INFO] Downloaded from central: https://repo.maven.apache.org/maven2/org/springframework/spring-context/5.3.5/spring-context-5.3.5.pom (2.6 kB at 81 kB/s)
[INFO] Downloading from central: https://repo.maven.apache.org/maven2/org/springframework/spring-aop/5.3.5/spring-aop-5.3.5.pom
[INFO] Downloaded from central: https://repo.maven.apache.org/maven2/org/springframework/spring-aop/5.3.5/spring-aop-5.3.5.pom (2.2 kB at 78 kB/s)
[INFO] Downloading from central: https://repo.maven.apache.org/maven2/org/springframework/spring-expression/5.3.5/spring-expression-5.3.5.pom
[INFO] Downloaded from central: https://repo.maven.apache.org/maven2/org/springframework/spring-expression/5.3.5/spring-expression-5.3.5.pom (2.1 kB at 71 kB/s)
[INFO] Downloading from central: https://repo.maven.apache.org/maven2/org/springframework/spring-test/5.3.5/spring-test-5.3.5.pom
[INFO] Downloaded from central: https://repo.maven.apache.org/maven2/org/springframework/spring-test/5.3.5/spring-test-5.3.5.pom (2.0 kB at 71 kB/s)
[INFO] Downloading from central: https://repo.maven.apache.org/maven2/ch/qos/logback/logback-classic/1.2.3/logback-classic-1.2.3.jar
[INFO] Downloading from central: https://repo.maven.apache.org/maven2/org/apache/maven/maven-artifact/3.8.1/maven-artifact-3.8.1.jar
[INFO] Downloading from central: https://repo.maven.apache.org/maven2/org/codehaus/plexus/plexus-utils/3.2.1/plexus-utils-3.2.1.jar
[INFO] Downloading from central: https://repo.maven.apache.org/maven2/org/apache/maven/maven-model-builder/3.8.1/maven-model-builder-3.8.1.jar
[INFO] Downloading from central: https://repo.maven.apache.org/maven2/ch/qos/logback/logback-core/1.2.3/logback-core-1.2.3.jar
[INFO] Downloaded from central: https://repo.maven.apache.org/maven2/ch/qos/logback/logback-classic/1.2.3/logback-classic-1.2.3.jar (290 kB at 5.7 MB/s)
[INFO] Downloaded from central: https://repo.maven.apache.org/maven2/org/apache/maven/maven-model-builder/3.8.1/maven-model-builder-3.8.1.jar (192 kB at 3.8 MB/s)
[INFO] Downloading from central: https://repo.maven.apache.org/maven2/org/apache/commons/commons-lang3/3.8.1/commons-lang3-3.8.1.jar
[INFO] Downloading from central: https://repo.maven.apache.org/maven2/org/apache/maven/maven-builder-support/3.8.1/maven-builder-support-3.8.1.jar
[INFO] Downloaded from central: https://repo.maven.apache.org/maven2/org/codehaus/plexus/plexus-utils/3.2.1/plexus-utils-3.2.1.jar (262 kB at 4.9 MB/s)
[INFO] Downloading from central: https://repo.maven.apache.org/maven2/org/springframework/spring-beans/5.3.5/spring-beans-5.3.5.jar
[INFO] Downloaded from central: https://repo.maven.apache.org/maven2/ch/qos/logback/logback-core/1.2.3/logback-core-1.2.3.jar (472 kB at 5.6 MB/s)
[INFO] Downloading from central: https://repo.maven.apache.org/maven2/org/springframework/spring-context/5.3.5/spring-context-5.3.5.jar
[INFO] Downloaded from central: https://repo.maven.apache.org/maven2/org/apache/commons/commons-lang3/3.8.1/commons-lang3-3.8.1.jar (502 kB at 4.4 MB/s)
[INFO] Downloading from central: https://repo.maven.apache.org/maven2/org/springframework/spring-aop/5.3.5/spring-aop-5.3.5.jar
[INFO] Downloaded from central: https://repo.maven.apache.org/maven2/org/apache/maven/maven-artifact/3.8.1/maven-artifact-3.8.1.jar (58 kB at 448 kB/s)
[INFO] Downloading from central: https://repo.maven.apache.org/maven2/org/springframework/spring-expression/5.3.5/spring-expression-5.3.5.jar
[INFO] Downloaded from central: https://repo.maven.apache.org/maven2/org/springframework/spring-beans/5.3.5/spring-beans-5.3.5.jar (696 kB at 5.4 MB/s)
[INFO] Downloading from central: https://repo.maven.apache.org/maven2/org/springframework/spring-core/5.3.5/spring-core-5.3.5.jar
[INFO] Downloaded from central: https://repo.maven.apache.org/maven2/org/springframework/spring-aop/5.3.5/spring-aop-5.3.5.jar (375 kB at 2.2 MB/s)
[INFO] Downloading from central: https://repo.maven.apache.org/maven2/org/springframework/spring-jcl/5.3.5/spring-jcl-5.3.5.jar
[INFO] Downloaded from central: https://repo.maven.apache.org/maven2/org/springframework/spring-expression/5.3.5/spring-expression-5.3.5.jar (283 kB at 1.6 MB/s)
[INFO] Downloading from central: https://repo.maven.apache.org/maven2/org/springframework/spring-test/5.3.5/spring-test-5.3.5.jar
[INFO] Downloaded from central: https://repo.maven.apache.org/maven2/org/apache/maven/maven-builder-support/3.8.1/maven-builder-support-3.8.1.jar (14 kB at 78 kB/s)
[INFO] Downloaded from central: https://repo.maven.apache.org/maven2/org/springframework/spring-context/5.3.5/spring-context-5.3.5.jar (1.2 MB at 6.9 MB/s)
[INFO] Downloaded from central: https://repo.maven.apache.org/maven2/org/springframework/spring-jcl/5.3.5/spring-jcl-5.3.5.jar (24 kB at 119 kB/s)
[INFO] Downloaded from central: https://repo.maven.apache.org/maven2/org/springframework/spring-core/5.3.5/spring-core-5.3.5.jar (1.5 MB at 6.6 MB/s)
[INFO] Downloaded from central: https://repo.maven.apache.org/maven2/org/springframework/spring-test/5.3.5/spring-test-5.3.5.jar (766 kB at 3.3 MB/s)
[INFO]
[INFO] --- maven-clean-plugin:3.1.0:clean (default-clean) @ indexer-examples-spring ---
[INFO]
[INFO] --- maven-enforcer-plugin:1.4.1:enforce (enforce-maven-version) @ indexer-examples-spring ---
[INFO]
[INFO] --- maven-enforcer-plugin:1.4.1:enforce (enforce-bytecode-version) @ indexer-examples-spring ---
[INFO] Adding ignore: module-info
[INFO]
[INFO] --- apache-rat-plugin:0.13:check (rat-check) @ indexer-examples-spring ---
[INFO] Enabled default license matchers.
[INFO] Will parse SCM ignores for exclusions...
[INFO] Finished adding exclusions from SCM ignore files.
[INFO] 62 implicit excludes (use -debug for more details).
[INFO] 22 explicit excludes (use -debug for more details).
[INFO] 14 resources included (use -debug for more details)
[INFO] Rat check: Summary over all files. Unapproved: 0, unknown: 0, generated: 0, approved: 14 licenses.
[INFO]
[INFO] --- maven-remote-resources-plugin:1.7.0:process (process-resource-bundles) @ indexer-examples-spring ---
[INFO] Preparing remote bundle org.apache:apache-jar-resource-bundle:1.4
[INFO] Copying 3 resources from 1 bundle.
[INFO]
[INFO] --- maven-resources-plugin:3.1.0:resources (default-resources) @ indexer-examples-spring ---
[INFO] Using 'UTF-8' encoding to copy filtered resources.
[INFO] Copying 1 resource
[INFO] Copying 3 resources
[INFO]
[INFO] --- maven-compiler-plugin:3.8.1:compile (default-compile) @ indexer-examples-spring ---
[INFO] Changes detected - recompiling the module!
[INFO] Compiling 8 source files to F:\jenkins\jenkins-slave\712657a4\workspace\en_maven-box_maven-indexer_guava@2\m\indexer-examples\indexer-examples-spring\target\classes
[INFO]
[INFO] --- animal-sniffer-maven-plugin:1.20:check (check-java-compat) @ indexer-examples-spring ---
[INFO] Checking unresolved references to org.codehaus.mojo.signature:java18:1.0
[INFO]
[INFO] --- maven-resources-plugin:3.1.0:testResources (default-testResources) @ indexer-examples-spring ---
[INFO] Using 'UTF-8' encoding to copy filtered resources.
[INFO] Copying 2 resources
[INFO] Copying 3 resources
[INFO]
[INFO] --- maven-compiler-plugin:3.8.1:testCompile (default-testCompile) @ indexer-examples-spring ---
[INFO] Changes detected - recompiling the module!
[INFO] Compiling 3 source files to F:\jenkins\jenkins-slave\712657a4\workspace\en_maven-box_maven-indexer_guava@2\m\indexer-examples\indexer-examples-spring\target\test-classes
[INFO]
[INFO] --- maven-surefire-plugin:2.22.2:test (default-test) @ indexer-examples-spring ---
[INFO] Tests are skipped.
[INFO]
[INFO] --- maven-jar-plugin:3.2.0:jar (default-jar) @ indexer-examples-spring ---
[INFO] Building jar: F:\jenkins\jenkins-slave\712657a4\workspace\en_maven-box_maven-indexer_guava@2\m\indexer-examples\indexer-examples-spring\target\indexer-examples-spring-6.1.0-SNAPSHOT.jar
[INFO]
[INFO] --- maven-site-plugin:3.7.1:attach-descriptor (attach-descriptor) @ indexer-examples-spring ---
[INFO] Skipping because packaging 'jar' is not pom.
[INFO]
[INFO] --- maven-checkstyle-plugin:3.1.2:check (checkstyle-check) @ indexer-examples-spring ---
[WARNING] Old version of checkstyle detected. Consider updating to >= v8.30
[WARNING] For more information see: https://maven.apache.org/plugins/maven-checkstyle-plugin/examples/upgrading-checkstyle.html
[INFO] You have 0 Checkstyle violations.
[INFO] ------------------------------------------------------------------------
[INFO] Reactor Summary for Maven-Indexer 6.1.0-SNAPSHOT:
[INFO]
[INFO] Maven-Indexer ...................................... SUCCESS [ 39.591 s]
[INFO] Maven :: Indexer Core .............................. SUCCESS [07:10 min]
[INFO] Maven :: Indexer CLI ............................... SUCCESS [ 57.375 s]
[INFO] Maven :: Indexer Reader ............................ SUCCESS [  7.555 s]
[INFO] Maven :: Indexer Examples .......................... SUCCESS [  0.641 s]
[INFO] Maven :: Indexer Examples [Basic] .................. SUCCESS [  2.655 s]
[INFO] Maven :: Indexer Examples [Spring] ................. SUCCESS [  5.197 s]
[INFO] ------------------------------------------------------------------------
[INFO] BUILD SUCCESS
[INFO] ------------------------------------------------------------------------
[INFO] Total time:  09:18 min
[INFO] Finished at: 2021-04-05T05:09:26-07:00
[INFO] ------------------------------------------------------------------------
[WARNING] The requested profile "run-its" could not be activated because it does not exist.
[INFO] [jenkins-event-spy] Generated F:\jenkins\jenkins-slave\712657a4\workspace\en_maven-box_maven-indexer_guava@2@tmp\withMaven51c57fbf\maven-spy-20210405-050007-77512874050834917727928.log
[Pipeline] }
[Pipeline] // dir
[Pipeline] }
[withMaven] junitPublisher - Archive test results for Maven artifact org.apache.maven.indexer:indexer-core:jar:6.1.0-SNAPSHOT generated by maven-surefire-plugin:test (default-test): m\indexer-core\target\surefire-reports\*.xml
[withMaven] junitPublisher - Archive test results for Maven artifact org.apache.maven.indexer:indexer-cli:jar:6.1.0-SNAPSHOT generated by maven-surefire-plugin:test (default-test): m\indexer-cli\target\surefire-reports\*.xml
[withMaven] junitPublisher - Archive test results for Maven artifact org.apache.maven.indexer:indexer-reader:bundle:6.1.0-SNAPSHOT generated by maven-surefire-plugin:test (default-test): m\indexer-reader\target\surefire-reports\*.xml
[withMaven] junitPublisher - Archive test results for Maven artifact org.apache.maven.indexer:indexer-examples-basic:jar:6.1.0-SNAPSHOT generated by maven-surefire-plugin:test (default-test): m\indexer-examples\indexer-examples-basic\target\surefire-reports\*.xml
[withMaven] junitPublisher - Archive test results for Maven artifact org.apache.maven.indexer:indexer-examples-spring:jar:6.1.0-SNAPSHOT generated by maven-surefire-plugin:test (default-test): m\indexer-examples\indexer-examples-spring\target\surefire-reports\*.xml
Recording test results
[withMaven] junitPublisher - Archive test results for Maven artifact org.apache.maven.indexer:indexer-core:jar:6.1.0-SNAPSHOT generated by maven-failsafe-plugin:integration-test (default): m\indexer-core\target\failsafe-reports\*.xml
[withMaven] junitPublisher - Archive test results for Maven artifact org.apache.maven.indexer:indexer-cli:jar:6.1.0-SNAPSHOT generated by maven-failsafe-plugin:integration-test (default): m\indexer-cli\target\failsafe-reports\*.xml
Recording test results
[withMaven] Publishers: Junit Publisher: 6919 ms
[Pipeline] // withMaven
[Pipeline] cleanWs
[WS-CLEANUP] Deleting project workspace...
[WS-CLEANUP] Deferred wipeout is used...
[WS-CLEANUP] done
[Pipeline] }
[Pipeline] // stage
[Pipeline] }
[Pipeline] // ws
[Pipeline] }
[Pipeline] // withEnv
[Pipeline] }
[Pipeline] // node
[Pipeline] }
[Pipeline] // parallel
[Pipeline] stage
[Pipeline] { (Notifications)
[Pipeline] echo
Build result: UNSTABLE
[Pipeline] jiraIssueSelector
[Pipeline] echo
The authors of changes [slachiewicz].
[Pipeline] echo
Sending email ...
[Pipeline] emailext