Build unstable in Jenkins: Maven » Maven TLP » maven » MNG-6957 #3

Previous Topic Next Topic
 
classic Classic list List threaded Threaded
2 messages Options
Reply | Threaded
Open this post in threaded view
|

Build unstable in Jenkins: Maven » Maven TLP » maven » MNG-6957 #3

Apache Jenkins Server-2
See https://ci-builds.apache.org/job/Maven/job/maven-box/job/maven/job/MNG-6957/3/

Changes:

* Remove redundant parameter of readFileModel
* remove redundant parameter from readRawModel
* Introduce DefaultTransformerContext, initialized during build, immutable during consume.
* Pass ModelBuildingRequest
* Refactor code
* Update documentation
* Add javadoc

4 tests failed.
FAILED:  org.apache.maven.it.MavenITmng4464PlatformIndependentFileSeparatorTest.linux-jdk15 / Run ITs Linux Java 15 / testit

Error Message:
Exit code was non-zero: 1; command line and log =
/home/jenkins/workspace/Maven_maven-box_maven_MNG-6957/test/core-it-suite/target/apache-maven/bin/mvn --global-settings /home/jenkins/workspace/Maven_maven-box_maven_MNG-6957/test/core-it-suite/target/test-classes/settings.xml -e --batch-mode -Dmaven.repo.local=/home/jenkins/workspace/Maven_maven-box_maven_MNG-6957/test/it-local-repo validate
[INFO] [jenkins-event-spy] Jenkins Maven Event Spy is disabled
[INFO] Error stacktraces are turned on.
[INFO] Scanning for projects...
[ERROR] [ERROR] Some problems were encountered while processing the POMs:
[FATAL] Non-readable POM /home/jenkins/workspace/Maven_maven-box_maven_MNG-6957/test/core-it-suite/target/test-classes/mng-4464/aggregator/..\parent: /home/jenkins/workspace/Maven_maven-box_maven_MNG-6957/test/core-it-suite/target/test-classes/mng-4464/aggregator/..\parent (No such file or directory) @
 @
[ERROR] The build could not read 1 project -> [Help 1]
org.apache.maven.project.ProjectBuildingException: Some problems were encountered while processing the POMs:
[FATAL] Non-readable POM /home/jenkins/workspace/Maven_maven-box_maven_MNG-6957/test/core-it-suite/target/test-classes/mng-4464/aggregator/..\parent: /home/jenkins/workspace/Maven_maven-box_maven_MNG-6957/test/core-it-suite/target/test-classes/mng-4464/aggregator/..\parent (No such file or directory) @

    at org.apache.maven.project.DefaultProjectBuilder.build (DefaultProjectBuilder.java:415)
    at org.apache.maven.graph.DefaultGraphBuilder.collectProjects (DefaultGraphBuilder.java:391)
    at org.apache.maven.graph.DefaultGraphBuilder.getProjectsForMavenReactor (DefaultGraphBuilder.java:379)
    at org.apache.maven.graph.DefaultGraphBuilder.build (DefaultGraphBuilder.java:93)
    at org.apache.maven.DefaultMaven.buildGraph (DefaultMaven.java:557)
    at org.apache.maven.DefaultMaven.doExecute (DefaultMaven.java:233)
    at org.apache.maven.DefaultMaven.doExecute (DefaultMaven.java:206)
    at org.apache.maven.DefaultMaven.execute (DefaultMaven.java:119)
    at org.apache.maven.cli.MavenCli.execute (MavenCli.java:978)
    at org.apache.maven.cli.MavenCli.doMain (MavenCli.java:292)
    at org.apache.maven.cli.MavenCli.doMain (MavenCli.java:247)
    at jdk.internal.reflect.GeneratedMethodAccessor63.invoke (Unknown Source)
    at jdk.internal.reflect.DelegatingMethodAccessorImpl.invoke (DelegatingMethodAccessorImpl.java:43)
    at java.lang.reflect.Method.invoke (Method.java:564)
    at org.apache.maven.it.Embedded3xLauncher.run (Embedded3xLauncher.java:215)
    at org.apache.maven.it.Verifier.executeGoals (Verifier.java:1339)
    at org.apache.maven.it.Verifier.executeGoal (Verifier.java:1239)
    at org.apache.maven.it.Verifier.executeGoal (Verifier.java:1233)
    at org.apache.maven.it.MavenITmng4464PlatformIndependentFileSeparatorTest.testit (MavenITmng4464PlatformIndependentFileSeparatorTest.java:55)
    at jdk.internal.reflect.NativeMethodAccessorImpl.invoke0 (Native Method)
    at jdk.internal.reflect.NativeMethodAccessorImpl.invoke (NativeMethodAccessorImpl.java:64)
    at jdk.internal.reflect.DelegatingMethodAccessorImpl.invoke (DelegatingMethodAccessorImpl.java:43)
    at java.lang.reflect.Method.invoke (Method.java:564)
    at junit.framework.TestCase.runTest (TestCase.java:176)
    at org.apache.maven.it.AbstractMavenIntegrationTestCase.runTest (AbstractMavenIntegrationTestCase.java:250)
    at junit.framework.TestCase.runBare (TestCase.java:141)
    at junit.framework.TestResult$1.protect (TestResult.java:122)
    at junit.framework.TestResult.runProtected (TestResult.java:142)
    at junit.framework.TestResult.run (TestResult.java:125)
    at junit.framework.TestCase.run (TestCase.java:129)
    at junit.framework.TestSuite.runTest (TestSuite.java:252)
    at junit.framework.TestSuite.run (TestSuite.java:247)
    at junit.framework.TestSuite.runTest (TestSuite.java:252)
    at junit.framework.TestSuite.run (TestSuite.java:247)
    at org.junit.internal.runners.JUnit38ClassRunner.run (JUnit38ClassRunner.java:86)
    at org.apache.maven.surefire.junit4.JUnit4Provider.execute (JUnit4Provider.java:365)
    at org.apache.maven.surefire.junit4.JUnit4Provider.executeWithRerun (JUnit4Provider.java:273)
    at org.apache.maven.surefire.junit4.JUnit4Provider.executeTestSet (JUnit4Provider.java:238)
    at org.apache.maven.surefire.junit4.JUnit4Provider.invoke (JUnit4Provider.java:159)
    at org.apache.maven.surefire.booter.ForkedBooter.invokeProviderInSameClassLoader (ForkedBooter.java:383)
    at org.apache.maven.surefire.booter.ForkedBooter.runSuitesInProcess (ForkedBooter.java:344)
    at org.apache.maven.surefire.booter.ForkedBooter.execute (ForkedBooter.java:125)
    at org.apache.maven.surefire.booter.ForkedBooter.main (ForkedBooter.java:417)
[ERROR]  
[ERROR]   The project  (/home/jenkins/workspace/Maven_maven-box_maven_MNG-6957/test/core-it-suite/target/test-classes/mng-4464/aggregator/pom.xml) has 1 error
[ERROR]     Non-readable POM /home/jenkins/workspace/Maven_maven-box_maven_MNG-6957/test/core-it-suite/target/test-classes/mng-4464/aggregator/..\parent: /home/jenkins/workspace/Maven_maven-box_maven_MNG-6957/test/core-it-suite/target/test-classes/mng-4464/aggregator/..\parent (No such file or directory)
java.io.FileNotFoundException: /home/jenkins/workspace/Maven_maven-box_maven_MNG-6957/test/core-it-suite/target/test-classes/mng-4464/aggregator/..\parent (No such file or directory)
    at java.io.FileInputStream.open0 (Native Method)
    at java.io.FileInputStream.open (FileInputStream.java:211)
    at java.io.FileInputStream.<init> (FileInputStream.java:153)
    at org.apache.maven.building.FileSource.getInputStream (FileSource.java:55)
    at org.apache.maven.model.building.DefaultModelBuilder.readFileModel (DefaultModelBuilder.java:619)
    at org.apache.maven.model.building.DefaultModelBuilder.readRawModel (DefaultModelBuilder.java:723)
    at org.apache.maven.model.building.DefaultModelBuilder.access$200 (DefaultModelBuilder.java:104)
    at org.apache.maven.model.building.DefaultModelBuilder$TransformerContextBuilder$1.findRawModel (DefaultModelBuilder.java:1892)
    at org.apache.maven.model.building.DefaultModelBuilder$TransformerContextBuilder$1.lambda$getRawModel$2 (DefaultModelBuilder.java:1845)
    at java.util.HashMap.computeIfAbsent (HashMap.java:1224)
    at org.apache.maven.model.building.DefaultModelBuilder$TransformerContextBuilder$1.getRawModel (DefaultModelBuilder.java:1845)
    at org.apache.maven.model.building.DefaultBuildPomXMLFilterFactory.lambda$getRelativePathMapper$1 (DefaultBuildPomXMLFilterFactory.java:56)
    at org.apache.maven.xml.sax.filter.ParentXMLFilter.resolveRelativePath (ParentXMLFilter.java:198)
    at org.apache.maven.xml.sax.filter.ParentXMLFilter.endElement (ParentXMLFilter.java:159)
    at org.apache.maven.xml.sax.SAXEventFactory.lambda$endElement$2 (SAXEventFactory.java:59)
    at org.apache.maven.xml.sax.filter.AbstractEventXMLFilter.processEvent (AbstractEventXMLFilter.java:113)
    at org.apache.maven.xml.sax.filter.AbstractEventXMLFilter.endElement (AbstractEventXMLFilter.java:198)
    at org.apache.maven.xml.sax.filter.ReactorDependencyXMLFilter.endElement (ReactorDependencyXMLFilter.java:149)
    at org.xml.sax.helpers.XMLFilterImpl.endElement (XMLFilterImpl.java:557)
    at com.sun.org.apache.xerces.internal.parsers.AbstractSAXParser.endElement (AbstractSAXParser.java:618)
    at com.sun.org.apache.xerces.internal.impl.XMLDocumentFragmentScannerImpl.scanEndElement (XMLDocumentFragmentScannerImpl.java:1727)
    at com.sun.org.apache.xerces.internal.impl.XMLDocumentFragmentScannerImpl$FragmentContentDriver.next (XMLDocumentFragmentScannerImpl.java:2898)
    at com.sun.org.apache.xerces.internal.impl.XMLDocumentScannerImpl.next (XMLDocumentScannerImpl.java:605)
    at com.sun.org.apache.xerces.internal.impl.XMLNSDocumentScannerImpl.next (XMLNSDocumentScannerImpl.java:112)
    at com.sun.org.apache.xerces.internal.impl.XMLDocumentFragmentScannerImpl.scanDocument (XMLDocumentFragmentScannerImpl.java:541)
    at com.sun.org.apache.xerces.internal.parsers.XML11Configuration.parse (XML11Configuration.java:888)
    at com.sun.org.apache.xerces.internal.parsers.XML11Configuration.parse (XML11Configuration.java:824)
    at com.sun.org.apache.xerces.internal.parsers.XMLParser.parse (XMLParser.java:141)
    at com.sun.org.apache.xerces.internal.parsers.AbstractSAXParser.parse (AbstractSAXParser.java:1224)
    at org.xml.sax.helpers.XMLFilterImpl.parse (XMLFilterImpl.java:344)
    at org.xml.sax.helpers.XMLFilterImpl.parse (XMLFilterImpl.java:344)
    at org.xml.sax.helpers.XMLFilterImpl.parse (XMLFilterImpl.java:344)
    at org.xml.sax.helpers.XMLFilterImpl.parse (XMLFilterImpl.java:344)
    at com.sun.org.apache.xalan.internal.xsltc.trax.TransformerImpl.transformIdentity (TransformerImpl.java:701)
    at com.sun.org.apache.xalan.internal.xsltc.trax.TransformerImpl.transform (TransformerImpl.java:788)
    at com.sun.org.apache.xalan.internal.xsltc.trax.TransformerImpl.transform (TransformerImpl.java:383)
    at org.apache.maven.model.building.AbstractModelSourceTransformer.lambda$transform$0 (AbstractModelSourceTransformer.java:145)
    at java.lang.Thread.run (Thread.java:832)
[ERROR]
[ERROR] Re-run Maven using the -X switch to enable full debug logging.
[ERROR]
[ERROR] For more information about the errors and possible solutions, please read the following articles:
[ERROR] [Help 1] http://cwiki.apache.org/confluence/display/MAVEN/ProjectBuildingException


Stack Trace:
org.apache.maven.it.VerificationException:
Exit code was non-zero: 1; command line and log =
/home/jenkins/workspace/Maven_maven-box_maven_MNG-6957/test/core-it-suite/target/apache-maven/bin/mvn --global-settings /home/jenkins/workspace/Maven_maven-box_maven_MNG-6957/test/core-it-suite/target/test-classes/settings.xml -e --batch-mode -Dmaven.repo.local=/home/jenkins/workspace/Maven_maven-box_maven_MNG-6957/test/it-local-repo validate
[INFO] [jenkins-event-spy] Jenkins Maven Event Spy is disabled
[INFO] Error stacktraces are turned on.
[INFO] Scanning for projects...
[ERROR] [ERROR] Some problems were encountered while processing the POMs:
[FATAL] Non-readable POM /home/jenkins/workspace/Maven_maven-box_maven_MNG-6957/test/core-it-suite/target/test-classes/mng-4464/aggregator/..\parent: /home/jenkins/workspace/Maven_maven-box_maven_MNG-6957/test/core-it-suite/target/test-classes/mng-4464/aggregator/..\parent (No such file or directory) @
 @
[ERROR] The build could not read 1 project -> [Help 1]
org.apache.maven.project.ProjectBuildingException: Some problems were encountered while processing the POMs:
[FATAL] Non-readable POM /home/jenkins/workspace/Maven_maven-box_maven_MNG-6957/test/core-it-suite/target/test-classes/mng-4464/aggregator/..\parent: /home/jenkins/workspace/Maven_maven-box_maven_MNG-6957/test/core-it-suite/target/test-classes/mng-4464/aggregator/..\parent (No such file or directory) @

    at org.apache.maven.project.DefaultProjectBuilder.build (DefaultProjectBuilder.java:415)
    at org.apache.maven.graph.DefaultGraphBuilder.collectProjects (DefaultGraphBuilder.java:391)
    at org.apache.maven.graph.DefaultGraphBuilder.getProjectsForMavenReactor (DefaultGraphBuilder.java:379)
    at org.apache.maven.graph.DefaultGraphBuilder.build (DefaultGraphBuilder.java:93)
    at org.apache.maven.DefaultMaven.buildGraph (DefaultMaven.java:557)
    at org.apache.maven.DefaultMaven.doExecute (DefaultMaven.java:233)
    at org.apache.maven.DefaultMaven.doExecute (DefaultMaven.java:206)
    at org.apache.maven.DefaultMaven.execute (DefaultMaven.java:119)
    at org.apache.maven.cli.MavenCli.execute (MavenCli.java:978)
    at org.apache.maven.cli.MavenCli.doMain (MavenCli.java:292)
    at org.apache.maven.cli.MavenCli.doMain (MavenCli.java:247)
    at jdk.internal.reflect.GeneratedMethodAccessor63.invoke (Unknown Source)
    at jdk.internal.reflect.DelegatingMethodAccessorImpl.invoke (DelegatingMethodAccessorImpl.java:43)
    at java.lang.reflect.Method.invoke (Method.java:564)
    at org.apache.maven.it.Embedded3xLauncher.run (Embedded3xLauncher.java:215)
    at org.apache.maven.it.Verifier.executeGoals (Verifier.java:1339)
    at org.apache.maven.it.Verifier.executeGoal (Verifier.java:1239)
    at org.apache.maven.it.Verifier.executeGoal (Verifier.java:1233)
    at org.apache.maven.it.MavenITmng4464PlatformIndependentFileSeparatorTest.testit (MavenITmng4464PlatformIndependentFileSeparatorTest.java:55)
    at jdk.internal.reflect.NativeMethodAccessorImpl.invoke0 (Native Method)
    at jdk.internal.reflect.NativeMethodAccessorImpl.invoke (NativeMethodAccessorImpl.java:64)
    at jdk.internal.reflect.DelegatingMethodAccessorImpl.invoke (DelegatingMethodAccessorImpl.java:43)
    at java.lang.reflect.Method.invoke (Method.java:564)
    at junit.framework.TestCase.runTest (TestCase.java:176)
    at org.apache.maven.it.AbstractMavenIntegrationTestCase.runTest (AbstractMavenIntegrationTestCase.java:250)
    at junit.framework.TestCase.runBare (TestCase.java:141)
    at junit.framework.TestResult$1.protect (TestResult.java:122)
    at junit.framework.TestResult.runProtected (TestResult.java:142)
    at junit.framework.TestResult.run (TestResult.java:125)
    at junit.framework.TestCase.run (TestCase.java:129)
    at junit.framework.TestSuite.runTest (TestSuite.java:252)
    at junit.framework.TestSuite.run (TestSuite.java:247)
    at junit.framework.TestSuite.runTest (TestSuite.java:252)
    at junit.framework.TestSuite.run (TestSuite.java:247)
    at org.junit.internal.runners.JUnit38ClassRunner.run (JUnit38ClassRunner.java:86)
    at org.apache.maven.surefire.junit4.JUnit4Provider.execute (JUnit4Provider.java:365)
    at org.apache.maven.surefire.junit4.JUnit4Provider.executeWithRerun (JUnit4Provider.java:273)
    at org.apache.maven.surefire.junit4.JUnit4Provider.executeTestSet (JUnit4Provider.java:238)
    at org.apache.maven.surefire.junit4.JUnit4Provider.invoke (JUnit4Provider.java:159)
    at org.apache.maven.surefire.booter.ForkedBooter.invokeProviderInSameClassLoader (ForkedBooter.java:383)
    at org.apache.maven.surefire.booter.ForkedBooter.runSuitesInProcess (ForkedBooter.java:344)
    at org.apache.maven.surefire.booter.ForkedBooter.execute (ForkedBooter.java:125)
    at org.apache.maven.surefire.booter.ForkedBooter.main (ForkedBooter.java:417)
[ERROR]  
[ERROR]   The project  (/home/jenkins/workspace/Maven_maven-box_maven_MNG-6957/test/core-it-suite/target/test-classes/mng-4464/aggregator/pom.xml) has 1 error
[ERROR]     Non-readable POM /home/jenkins/workspace/Maven_maven-box_maven_MNG-6957/test/core-it-suite/target/test-classes/mng-4464/aggregator/..\parent: /home/jenkins/workspace/Maven_maven-box_maven_MNG-6957/test/core-it-suite/target/test-classes/mng-4464/aggregator/..\parent (No such file or directory)
java.io.FileNotFoundException: /home/jenkins/workspace/Maven_maven-box_maven_MNG-6957/test/core-it-suite/target/test-classes/mng-4464/aggregator/..\parent (No such file or directory)
    at java.io.FileInputStream.open0 (Native Method)
    at java.io.FileInputStream.open (FileInputStream.java:211)
    at java.io.FileInputStream.<init> (FileInputStream.java:153)
    at org.apache.maven.building.FileSource.getInputStream (FileSource.java:55)
    at org.apache.maven.model.building.DefaultModelBuilder.readFileModel (DefaultModelBuilder.java:619)
    at org.apache.maven.model.building.DefaultModelBuilder.readRawModel (DefaultModelBuilder.java:723)
    at org.apache.maven.model.building.DefaultModelBuilder.access$200 (DefaultModelBuilder.java:104)
    at org.apache.maven.model.building.DefaultModelBuilder$TransformerContextBuilder$1.findRawModel (DefaultModelBuilder.java:1892)
    at org.apache.maven.model.building.DefaultModelBuilder$TransformerContextBuilder$1.lambda$getRawModel$2 (DefaultModelBuilder.java:1845)
    at java.util.HashMap.computeIfAbsent (HashMap.java:1224)
    at org.apache.maven.model.building.DefaultModelBuilder$TransformerContextBuilder$1.getRawModel (DefaultModelBuilder.java:1845)
    at org.apache.maven.model.building.DefaultBuildPomXMLFilterFactory.lambda$getRelativePathMapper$1 (DefaultBuildPomXMLFilterFactory.java:56)
    at org.apache.maven.xml.sax.filter.ParentXMLFilter.resolveRelativePath (ParentXMLFilter.java:198)
    at org.apache.maven.xml.sax.filter.ParentXMLFilter.endElement (ParentXMLFilter.java:159)
    at org.apache.maven.xml.sax.SAXEventFactory.lambda$endElement$2 (SAXEventFactory.java:59)
    at org.apache.maven.xml.sax.filter.AbstractEventXMLFilter.processEvent (AbstractEventXMLFilter.java:113)
    at org.apache.maven.xml.sax.filter.AbstractEventXMLFilter.endElement (AbstractEventXMLFilter.java:198)
    at org.apache.maven.xml.sax.filter.ReactorDependencyXMLFilter.endElement (ReactorDependencyXMLFilter.java:149)
    at org.xml.sax.helpers.XMLFilterImpl.endElement (XMLFilterImpl.java:557)
    at com.sun.org.apache.xerces.internal.parsers.AbstractSAXParser.endElement (AbstractSAXParser.java:618)
    at com.sun.org.apache.xerces.internal.impl.XMLDocumentFragmentScannerImpl.scanEndElement (XMLDocumentFragmentScannerImpl.java:1727)
    at com.sun.org.apache.xerces.internal.impl.XMLDocumentFragmentScannerImpl$FragmentContentDriver.next (XMLDocumentFragmentScannerImpl.java:2898)
    at com.sun.org.apache.xerces.internal.impl.XMLDocumentScannerImpl.next (XMLDocumentScannerImpl.java:605)
    at com.sun.org.apache.xerces.internal.impl.XMLNSDocumentScannerImpl.next (XMLNSDocumentScannerImpl.java:112)
    at com.sun.org.apache.xerces.internal.impl.XMLDocumentFragmentScannerImpl.scanDocument (XMLDocumentFragmentScannerImpl.java:541)
    at com.sun.org.apache.xerces.internal.parsers.XML11Configuration.parse (XML11Configuration.java:888)
    at com.sun.org.apache.xerces.internal.parsers.XML11Configuration.parse (XML11Configuration.java:824)
    at com.sun.org.apache.xerces.internal.parsers.XMLParser.parse (XMLParser.java:141)
    at com.sun.org.apache.xerces.internal.parsers.AbstractSAXParser.parse (AbstractSAXParser.java:1224)
    at org.xml.sax.helpers.XMLFilterImpl.parse (XMLFilterImpl.java:344)
    at org.xml.sax.helpers.XMLFilterImpl.parse (XMLFilterImpl.java:344)
    at org.xml.sax.helpers.XMLFilterImpl.parse (XMLFilterImpl.java:344)
    at org.xml.sax.helpers.XMLFilterImpl.parse (XMLFilterImpl.java:344)
    at com.sun.org.apache.xalan.internal.xsltc.trax.TransformerImpl.transformIdentity (TransformerImpl.java:701)
    at com.sun.org.apache.xalan.internal.xsltc.trax.TransformerImpl.transform (TransformerImpl.java:788)
    at com.sun.org.apache.xalan.internal.xsltc.trax.TransformerImpl.transform (TransformerImpl.java:383)
    at org.apache.maven.model.building.AbstractModelSourceTransformer.lambda$transform$0 (AbstractModelSourceTransformer.java:145)
    at java.lang.Thread.run (Thread.java:832)
[ERROR]
[ERROR] Re-run Maven using the -X switch to enable full debug logging.
[ERROR]
[ERROR] For more information about the errors and possible solutions, please read the following articles:
[ERROR] [Help 1] http://cwiki.apache.org/confluence/display/MAVEN/ProjectBuildingException

        at org.apache.maven.it.MavenITmng4464PlatformIndependentFileSeparatorTest.testit(MavenITmng4464PlatformIndependentFileSeparatorTest.java:55)


FAILED:  org.apache.maven.it.MavenITmng4464PlatformIndependentFileSeparatorTest.linux-jdk11 / Run ITs Linux Java 11 / testit

Error Message:
Exit code was non-zero: 1; command line and log =
/home/jenkins/workspace/Maven_maven-box_maven_MNG-6957/test/core-it-suite/target/apache-maven/bin/mvn --global-settings /home/jenkins/workspace/Maven_maven-box_maven_MNG-6957/test/core-it-suite/target/test-classes/settings.xml -e --batch-mode -Dmaven.repo.local=/home/jenkins/workspace/Maven_maven-box_maven_MNG-6957/test/it-local-repo validate
[INFO] [jenkins-event-spy] Jenkins Maven Event Spy is disabled
[INFO] Error stacktraces are turned on.
[INFO] Scanning for projects...
[ERROR] [ERROR] Some problems were encountered while processing the POMs:
[FATAL] Non-readable POM /home/jenkins/workspace/Maven_maven-box_maven_MNG-6957/test/core-it-suite/target/test-classes/mng-4464/aggregator/..\parent: /home/jenkins/workspace/Maven_maven-box_maven_MNG-6957/test/core-it-suite/target/test-classes/mng-4464/aggregator/..\parent (No such file or directory) @
 @
[ERROR] The build could not read 1 project -> [Help 1]
org.apache.maven.project.ProjectBuildingException: Some problems were encountered while processing the POMs:
[FATAL] Non-readable POM /home/jenkins/workspace/Maven_maven-box_maven_MNG-6957/test/core-it-suite/target/test-classes/mng-4464/aggregator/..\parent: /home/jenkins/workspace/Maven_maven-box_maven_MNG-6957/test/core-it-suite/target/test-classes/mng-4464/aggregator/..\parent (No such file or directory) @

    at org.apache.maven.project.DefaultProjectBuilder.build (DefaultProjectBuilder.java:415)
    at org.apache.maven.graph.DefaultGraphBuilder.collectProjects (DefaultGraphBuilder.java:391)
    at org.apache.maven.graph.DefaultGraphBuilder.getProjectsForMavenReactor (DefaultGraphBuilder.java:379)
    at org.apache.maven.graph.DefaultGraphBuilder.build (DefaultGraphBuilder.java:93)
    at org.apache.maven.DefaultMaven.buildGraph (DefaultMaven.java:557)
    at org.apache.maven.DefaultMaven.doExecute (DefaultMaven.java:233)
    at org.apache.maven.DefaultMaven.doExecute (DefaultMaven.java:206)
    at org.apache.maven.DefaultMaven.execute (DefaultMaven.java:119)
    at org.apache.maven.cli.MavenCli.execute (MavenCli.java:978)
    at org.apache.maven.cli.MavenCli.doMain (MavenCli.java:292)
    at org.apache.maven.cli.MavenCli.doMain (MavenCli.java:247)
    at jdk.internal.reflect.GeneratedMethodAccessor63.invoke (Unknown Source)
    at jdk.internal.reflect.DelegatingMethodAccessorImpl.invoke (DelegatingMethodAccessorImpl.java:43)
    at java.lang.reflect.Method.invoke (Method.java:566)
    at org.apache.maven.it.Embedded3xLauncher.run (Embedded3xLauncher.java:215)
    at org.apache.maven.it.Verifier.executeGoals (Verifier.java:1339)
    at org.apache.maven.it.Verifier.executeGoal (Verifier.java:1239)
    at org.apache.maven.it.Verifier.executeGoal (Verifier.java:1233)
    at org.apache.maven.it.MavenITmng4464PlatformIndependentFileSeparatorTest.testit (MavenITmng4464PlatformIndependentFileSeparatorTest.java:55)
    at jdk.internal.reflect.NativeMethodAccessorImpl.invoke0 (Native Method)
    at jdk.internal.reflect.NativeMethodAccessorImpl.invoke (NativeMethodAccessorImpl.java:62)
    at jdk.internal.reflect.DelegatingMethodAccessorImpl.invoke (DelegatingMethodAccessorImpl.java:43)
    at java.lang.reflect.Method.invoke (Method.java:566)
    at junit.framework.TestCase.runTest (TestCase.java:176)
    at org.apache.maven.it.AbstractMavenIntegrationTestCase.runTest (AbstractMavenIntegrationTestCase.java:250)
    at junit.framework.TestCase.runBare (TestCase.java:141)
    at junit.framework.TestResult$1.protect (TestResult.java:122)
    at junit.framework.TestResult.runProtected (TestResult.java:142)
    at junit.framework.TestResult.run (TestResult.java:125)
    at junit.framework.TestCase.run (TestCase.java:129)
    at junit.framework.TestSuite.runTest (TestSuite.java:252)
    at junit.framework.TestSuite.run (TestSuite.java:247)
    at junit.framework.TestSuite.runTest (TestSuite.java:252)
    at junit.framework.TestSuite.run (TestSuite.java:247)
    at org.junit.internal.runners.JUnit38ClassRunner.run (JUnit38ClassRunner.java:86)
    at org.apache.maven.surefire.junit4.JUnit4Provider.execute (JUnit4Provider.java:365)
    at org.apache.maven.surefire.junit4.JUnit4Provider.executeWithRerun (JUnit4Provider.java:273)
    at org.apache.maven.surefire.junit4.JUnit4Provider.executeTestSet (JUnit4Provider.java:238)
    at org.apache.maven.surefire.junit4.JUnit4Provider.invoke (JUnit4Provider.java:159)
    at org.apache.maven.surefire.booter.ForkedBooter.invokeProviderInSameClassLoader (ForkedBooter.java:383)
    at org.apache.maven.surefire.booter.ForkedBooter.runSuitesInProcess (ForkedBooter.java:344)
    at org.apache.maven.surefire.booter.ForkedBooter.execute (ForkedBooter.java:125)
    at org.apache.maven.surefire.booter.ForkedBooter.main (ForkedBooter.java:417)
[ERROR]  
[ERROR]   The project  (/home/jenkins/workspace/Maven_maven-box_maven_MNG-6957/test/core-it-suite/target/test-classes/mng-4464/aggregator/pom.xml) has 1 error
[ERROR]     Non-readable POM /home/jenkins/workspace/Maven_maven-box_maven_MNG-6957/test/core-it-suite/target/test-classes/mng-4464/aggregator/..\parent: /home/jenkins/workspace/Maven_maven-box_maven_MNG-6957/test/core-it-suite/target/test-classes/mng-4464/aggregator/..\parent (No such file or directory)
java.io.FileNotFoundException: /home/jenkins/workspace/Maven_maven-box_maven_MNG-6957/test/core-it-suite/target/test-classes/mng-4464/aggregator/..\parent (No such file or directory)
    at java.io.FileInputStream.open0 (Native Method)
    at java.io.FileInputStream.open (FileInputStream.java:219)
    at java.io.FileInputStream.<init> (FileInputStream.java:157)
    at org.apache.maven.building.FileSource.getInputStream (FileSource.java:55)
    at org.apache.maven.model.building.DefaultModelBuilder.readFileModel (DefaultModelBuilder.java:619)
    at org.apache.maven.model.building.DefaultModelBuilder.readRawModel (DefaultModelBuilder.java:723)
    at org.apache.maven.model.building.DefaultModelBuilder.access$200 (DefaultModelBuilder.java:104)
    at org.apache.maven.model.building.DefaultModelBuilder$TransformerContextBuilder$1.findRawModel (DefaultModelBuilder.java:1892)
    at org.apache.maven.model.building.DefaultModelBuilder$TransformerContextBuilder$1.lambda$getRawModel$2 (DefaultModelBuilder.java:1845)
    at java.util.HashMap.computeIfAbsent (HashMap.java:1133)
    at org.apache.maven.model.building.DefaultModelBuilder$TransformerContextBuilder$1.getRawModel (DefaultModelBuilder.java:1845)
    at org.apache.maven.model.building.DefaultBuildPomXMLFilterFactory.lambda$getRelativePathMapper$1 (DefaultBuildPomXMLFilterFactory.java:56)
    at org.apache.maven.xml.sax.filter.ParentXMLFilter.resolveRelativePath (ParentXMLFilter.java:198)
    at org.apache.maven.xml.sax.filter.ParentXMLFilter.endElement (ParentXMLFilter.java:159)
    at org.apache.maven.xml.sax.SAXEventFactory.lambda$endElement$2 (SAXEventFactory.java:59)
    at org.apache.maven.xml.sax.filter.AbstractEventXMLFilter.processEvent (AbstractEventXMLFilter.java:113)
    at org.apache.maven.xml.sax.filter.AbstractEventXMLFilter.endElement (AbstractEventXMLFilter.java:198)
    at org.apache.maven.xml.sax.filter.ReactorDependencyXMLFilter.endElement (ReactorDependencyXMLFilter.java:149)
    at org.xml.sax.helpers.XMLFilterImpl.endElement (XMLFilterImpl.java:570)
    at com.sun.org.apache.xerces.internal.parsers.AbstractSAXParser.endElement (AbstractSAXParser.java:610)
    at com.sun.org.apache.xerces.internal.impl.XMLDocumentFragmentScannerImpl.scanEndElement (XMLDocumentFragmentScannerImpl.java:1718)
    at com.sun.org.apache.xerces.internal.impl.XMLDocumentFragmentScannerImpl$FragmentContentDriver.next (XMLDocumentFragmentScannerImpl.java:2883)
    at com.sun.org.apache.xerces.internal.impl.XMLDocumentScannerImpl.next (XMLDocumentScannerImpl.java:605)
    at com.sun.org.apache.xerces.internal.impl.XMLNSDocumentScannerImpl.next (XMLNSDocumentScannerImpl.java:112)
    at com.sun.org.apache.xerces.internal.impl.XMLDocumentFragmentScannerImpl.scanDocument (XMLDocumentFragmentScannerImpl.java:534)
    at com.sun.org.apache.xerces.internal.parsers.XML11Configuration.parse (XML11Configuration.java:888)
    at com.sun.org.apache.xerces.internal.parsers.XML11Configuration.parse (XML11Configuration.java:824)
    at com.sun.org.apache.xerces.internal.parsers.XMLParser.parse (XMLParser.java:141)
    at com.sun.org.apache.xerces.internal.parsers.AbstractSAXParser.parse (AbstractSAXParser.java:1216)
    at org.xml.sax.helpers.XMLFilterImpl.parse (XMLFilterImpl.java:357)
    at org.xml.sax.helpers.XMLFilterImpl.parse (XMLFilterImpl.java:357)
    at org.xml.sax.helpers.XMLFilterImpl.parse (XMLFilterImpl.java:357)
    at org.xml.sax.helpers.XMLFilterImpl.parse (XMLFilterImpl.java:357)
    at com.sun.org.apache.xalan.internal.xsltc.trax.TransformerImpl.transformIdentity (TransformerImpl.java:687)
    at com.sun.org.apache.xalan.internal.xsltc.trax.TransformerImpl.transform (TransformerImpl.java:774)
    at com.sun.org.apache.xalan.internal.xsltc.trax.TransformerImpl.transform (TransformerImpl.java:370)
    at org.apache.maven.model.building.AbstractModelSourceTransformer.lambda$transform$0 (AbstractModelSourceTransformer.java:145)
    at java.lang.Thread.run (Thread.java:834)
[ERROR]
[ERROR] Re-run Maven using the -X switch to enable full debug logging.
[ERROR]
[ERROR] For more information about the errors and possible solutions, please read the following articles:
[ERROR] [Help 1] http://cwiki.apache.org/confluence/display/MAVEN/ProjectBuildingException


Stack Trace:
org.apache.maven.it.VerificationException:
Exit code was non-zero: 1; command line and log =
/home/jenkins/workspace/Maven_maven-box_maven_MNG-6957/test/core-it-suite/target/apache-maven/bin/mvn --global-settings /home/jenkins/workspace/Maven_maven-box_maven_MNG-6957/test/core-it-suite/target/test-classes/settings.xml -e --batch-mode -Dmaven.repo.local=/home/jenkins/workspace/Maven_maven-box_maven_MNG-6957/test/it-local-repo validate
[INFO] [jenkins-event-spy] Jenkins Maven Event Spy is disabled
[INFO] Error stacktraces are turned on.
[INFO] Scanning for projects...
[ERROR] [ERROR] Some problems were encountered while processing the POMs:
[FATAL] Non-readable POM /home/jenkins/workspace/Maven_maven-box_maven_MNG-6957/test/core-it-suite/target/test-classes/mng-4464/aggregator/..\parent: /home/jenkins/workspace/Maven_maven-box_maven_MNG-6957/test/core-it-suite/target/test-classes/mng-4464/aggregator/..\parent (No such file or directory) @
 @
[ERROR] The build could not read 1 project -> [Help 1]
org.apache.maven.project.ProjectBuildingException: Some problems were encountered while processing the POMs:
[FATAL] Non-readable POM /home/jenkins/workspace/Maven_maven-box_maven_MNG-6957/test/core-it-suite/target/test-classes/mng-4464/aggregator/..\parent: /home/jenkins/workspace/Maven_maven-box_maven_MNG-6957/test/core-it-suite/target/test-classes/mng-4464/aggregator/..\parent (No such file or directory) @

    at org.apache.maven.project.DefaultProjectBuilder.build (DefaultProjectBuilder.java:415)
    at org.apache.maven.graph.DefaultGraphBuilder.collectProjects (DefaultGraphBuilder.java:391)
    at org.apache.maven.graph.DefaultGraphBuilder.getProjectsForMavenReactor (DefaultGraphBuilder.java:379)
    at org.apache.maven.graph.DefaultGraphBuilder.build (DefaultGraphBuilder.java:93)
    at org.apache.maven.DefaultMaven.buildGraph (DefaultMaven.java:557)
    at org.apache.maven.DefaultMaven.doExecute (DefaultMaven.java:233)
    at org.apache.maven.DefaultMaven.doExecute (DefaultMaven.java:206)
    at org.apache.maven.DefaultMaven.execute (DefaultMaven.java:119)
    at org.apache.maven.cli.MavenCli.execute (MavenCli.java:978)
    at org.apache.maven.cli.MavenCli.doMain (MavenCli.java:292)
    at org.apache.maven.cli.MavenCli.doMain (MavenCli.java:247)
    at jdk.internal.reflect.GeneratedMethodAccessor63.invoke (Unknown Source)
    at jdk.internal.reflect.DelegatingMethodAccessorImpl.invoke (DelegatingMethodAccessorImpl.java:43)
    at java.lang.reflect.Method.invoke (Method.java:566)
    at org.apache.maven.it.Embedded3xLauncher.run (Embedded3xLauncher.java:215)
    at org.apache.maven.it.Verifier.executeGoals (Verifier.java:1339)
    at org.apache.maven.it.Verifier.executeGoal (Verifier.java:1239)
    at org.apache.maven.it.Verifier.executeGoal (Verifier.java:1233)
    at org.apache.maven.it.MavenITmng4464PlatformIndependentFileSeparatorTest.testit (MavenITmng4464PlatformIndependentFileSeparatorTest.java:55)
    at jdk.internal.reflect.NativeMethodAccessorImpl.invoke0 (Native Method)
    at jdk.internal.reflect.NativeMethodAccessorImpl.invoke (NativeMethodAccessorImpl.java:62)
    at jdk.internal.reflect.DelegatingMethodAccessorImpl.invoke (DelegatingMethodAccessorImpl.java:43)
    at java.lang.reflect.Method.invoke (Method.java:566)
    at junit.framework.TestCase.runTest (TestCase.java:176)
    at org.apache.maven.it.AbstractMavenIntegrationTestCase.runTest (AbstractMavenIntegrationTestCase.java:250)
    at junit.framework.TestCase.runBare (TestCase.java:141)
    at junit.framework.TestResult$1.protect (TestResult.java:122)
    at junit.framework.TestResult.runProtected (TestResult.java:142)
    at junit.framework.TestResult.run (TestResult.java:125)
    at junit.framework.TestCase.run (TestCase.java:129)
    at junit.framework.TestSuite.runTest (TestSuite.java:252)
    at junit.framework.TestSuite.run (TestSuite.java:247)
    at junit.framework.TestSuite.runTest (TestSuite.java:252)
    at junit.framework.TestSuite.run (TestSuite.java:247)
    at org.junit.internal.runners.JUnit38ClassRunner.run (JUnit38ClassRunner.java:86)
    at org.apache.maven.surefire.junit4.JUnit4Provider.execute (JUnit4Provider.java:365)
    at org.apache.maven.surefire.junit4.JUnit4Provider.executeWithRerun (JUnit4Provider.java:273)
    at org.apache.maven.surefire.junit4.JUnit4Provider.executeTestSet (JUnit4Provider.java:238)
    at org.apache.maven.surefire.junit4.JUnit4Provider.invoke (JUnit4Provider.java:159)
    at org.apache.maven.surefire.booter.ForkedBooter.invokeProviderInSameClassLoader (ForkedBooter.java:383)
    at org.apache.maven.surefire.booter.ForkedBooter.runSuitesInProcess (ForkedBooter.java:344)
    at org.apache.maven.surefire.booter.ForkedBooter.execute (ForkedBooter.java:125)
    at org.apache.maven.surefire.booter.ForkedBooter.main (ForkedBooter.java:417)
[ERROR]  
[ERROR]   The project  (/home/jenkins/workspace/Maven_maven-box_maven_MNG-6957/test/core-it-suite/target/test-classes/mng-4464/aggregator/pom.xml) has 1 error
[ERROR]     Non-readable POM /home/jenkins/workspace/Maven_maven-box_maven_MNG-6957/test/core-it-suite/target/test-classes/mng-4464/aggregator/..\parent: /home/jenkins/workspace/Maven_maven-box_maven_MNG-6957/test/core-it-suite/target/test-classes/mng-4464/aggregator/..\parent (No such file or directory)
java.io.FileNotFoundException: /home/jenkins/workspace/Maven_maven-box_maven_MNG-6957/test/core-it-suite/target/test-classes/mng-4464/aggregator/..\parent (No such file or directory)
    at java.io.FileInputStream.open0 (Native Method)
    at java.io.FileInputStream.open (FileInputStream.java:219)
    at java.io.FileInputStream.<init> (FileInputStream.java:157)
    at org.apache.maven.building.FileSource.getInputStream (FileSource.java:55)
    at org.apache.maven.model.building.DefaultModelBuilder.readFileModel (DefaultModelBuilder.java:619)
    at org.apache.maven.model.building.DefaultModelBuilder.readRawModel (DefaultModelBuilder.java:723)
    at org.apache.maven.model.building.DefaultModelBuilder.access$200 (DefaultModelBuilder.java:104)
    at org.apache.maven.model.building.DefaultModelBuilder$TransformerContextBuilder$1.findRawModel (DefaultModelBuilder.java:1892)
    at org.apache.maven.model.building.DefaultModelBuilder$TransformerContextBuilder$1.lambda$getRawModel$2 (DefaultModelBuilder.java:1845)
    at java.util.HashMap.computeIfAbsent (HashMap.java:1133)
    at org.apache.maven.model.building.DefaultModelBuilder$TransformerContextBuilder$1.getRawModel (DefaultModelBuilder.java:1845)
    at org.apache.maven.model.building.DefaultBuildPomXMLFilterFactory.lambda$getRelativePathMapper$1 (DefaultBuildPomXMLFilterFactory.java:56)
    at org.apache.maven.xml.sax.filter.ParentXMLFilter.resolveRelativePath (ParentXMLFilter.java:198)
    at org.apache.maven.xml.sax.filter.ParentXMLFilter.endElement (ParentXMLFilter.java:159)
    at org.apache.maven.xml.sax.SAXEventFactory.lambda$endElement$2 (SAXEventFactory.java:59)
    at org.apache.maven.xml.sax.filter.AbstractEventXMLFilter.processEvent (AbstractEventXMLFilter.java:113)
    at org.apache.maven.xml.sax.filter.AbstractEventXMLFilter.endElement (AbstractEventXMLFilter.java:198)
    at org.apache.maven.xml.sax.filter.ReactorDependencyXMLFilter.endElement (ReactorDependencyXMLFilter.java:149)
    at org.xml.sax.helpers.XMLFilterImpl.endElement (XMLFilterImpl.java:570)
    at com.sun.org.apache.xerces.internal.parsers.AbstractSAXParser.endElement (AbstractSAXParser.java:610)
    at com.sun.org.apache.xerces.internal.impl.XMLDocumentFragmentScannerImpl.scanEndElement (XMLDocumentFragmentScannerImpl.java:1718)
    at com.sun.org.apache.xerces.internal.impl.XMLDocumentFragmentScannerImpl$FragmentContentDriver.next (XMLDocumentFragmentScannerImpl.java:2883)
    at com.sun.org.apache.xerces.internal.impl.XMLDocumentScannerImpl.next (XMLDocumentScannerImpl.java:605)
    at com.sun.org.apache.xerces.internal.impl.XMLNSDocumentScannerImpl.next (XMLNSDocumentScannerImpl.java:112)
    at com.sun.org.apache.xerces.internal.impl.XMLDocumentFragmentScannerImpl.scanDocument (XMLDocumentFragmentScannerImpl.java:534)
    at com.sun.org.apache.xerces.internal.parsers.XML11Configuration.parse (XML11Configuration.java:888)
    at com.sun.org.apache.xerces.internal.parsers.XML11Configuration.parse (XML11Configuration.java:824)
    at com.sun.org.apache.xerces.internal.parsers.XMLParser.parse (XMLParser.java:141)
    at com.sun.org.apache.xerces.internal.parsers.AbstractSAXParser.parse (AbstractSAXParser.java:1216)
    at org.xml.sax.helpers.XMLFilterImpl.parse (XMLFilterImpl.java:357)
    at org.xml.sax.helpers.XMLFilterImpl.parse (XMLFilterImpl.java:357)
    at org.xml.sax.helpers.XMLFilterImpl.parse (XMLFilterImpl.java:357)
    at org.xml.sax.helpers.XMLFilterImpl.parse (XMLFilterImpl.java:357)
    at com.sun.org.apache.xalan.internal.xsltc.trax.TransformerImpl.transformIdentity (TransformerImpl.java:687)
    at com.sun.org.apache.xalan.internal.xsltc.trax.TransformerImpl.transform (TransformerImpl.java:774)
    at com.sun.org.apache.xalan.internal.xsltc.trax.TransformerImpl.transform (TransformerImpl.java:370)
    at org.apache.maven.model.building.AbstractModelSourceTransformer.lambda$transform$0 (AbstractModelSourceTransformer.java:145)
    at java.lang.Thread.run (Thread.java:834)
[ERROR]
[ERROR] Re-run Maven using the -X switch to enable full debug logging.
[ERROR]
[ERROR] For more information about the errors and possible solutions, please read the following articles:
[ERROR] [Help 1] http://cwiki.apache.org/confluence/display/MAVEN/ProjectBuildingException

        at org.apache.maven.it.MavenITmng4464PlatformIndependentFileSeparatorTest.testit(MavenITmng4464PlatformIndependentFileSeparatorTest.java:55)


FAILED:  org.apache.maven.it.MavenITmng4464PlatformIndependentFileSeparatorTest.linux-jdk8 / Run ITs Linux Java 8 / testit

Error Message:
Exit code was non-zero: 1; command line and log =
/home/jenkins/workspace/Maven_maven-box_maven_MNG-6957/test/core-it-suite/target/apache-maven/bin/mvn --global-settings /home/jenkins/workspace/Maven_maven-box_maven_MNG-6957/test/core-it-suite/target/test-classes/settings.xml -e --batch-mode -Dmaven.repo.local=/home/jenkins/workspace/Maven_maven-box_maven_MNG-6957/test/it-local-repo validate
[INFO] [jenkins-event-spy] Jenkins Maven Event Spy is disabled
[INFO] Error stacktraces are turned on.
[INFO] Scanning for projects...
[ERROR] [ERROR] Some problems were encountered while processing the POMs:
[FATAL] Non-readable POM /home/jenkins/workspace/Maven_maven-box_maven_MNG-6957/test/core-it-suite/target/test-classes/mng-4464/aggregator/..\parent: /home/jenkins/workspace/Maven_maven-box_maven_MNG-6957/test/core-it-suite/target/test-classes/mng-4464/aggregator/..\parent (No such file or directory) @
 @
[ERROR] The build could not read 1 project -> [Help 1]
org.apache.maven.project.ProjectBuildingException: Some problems were encountered while processing the POMs:
[FATAL] Non-readable POM /home/jenkins/workspace/Maven_maven-box_maven_MNG-6957/test/core-it-suite/target/test-classes/mng-4464/aggregator/..\parent: /home/jenkins/workspace/Maven_maven-box_maven_MNG-6957/test/core-it-suite/target/test-classes/mng-4464/aggregator/..\parent (No such file or directory) @

    at org.apache.maven.project.DefaultProjectBuilder.build (DefaultProjectBuilder.java:415)
    at org.apache.maven.graph.DefaultGraphBuilder.collectProjects (DefaultGraphBuilder.java:391)
    at org.apache.maven.graph.DefaultGraphBuilder.getProjectsForMavenReactor (DefaultGraphBuilder.java:379)
    at org.apache.maven.graph.DefaultGraphBuilder.build (DefaultGraphBuilder.java:93)
    at org.apache.maven.DefaultMaven.buildGraph (DefaultMaven.java:557)
    at org.apache.maven.DefaultMaven.doExecute (DefaultMaven.java:233)
    at org.apache.maven.DefaultMaven.doExecute (DefaultMaven.java:206)
    at org.apache.maven.DefaultMaven.execute (DefaultMaven.java:119)
    at org.apache.maven.cli.MavenCli.execute (MavenCli.java:978)
    at org.apache.maven.cli.MavenCli.doMain (MavenCli.java:292)
    at org.apache.maven.cli.MavenCli.doMain (MavenCli.java:247)
    at sun.reflect.GeneratedMethodAccessor58.invoke (Unknown Source)
    at sun.reflect.DelegatingMethodAccessorImpl.invoke (DelegatingMethodAccessorImpl.java:43)
    at java.lang.reflect.Method.invoke (Method.java:498)
    at org.apache.maven.it.Embedded3xLauncher.run (Embedded3xLauncher.java:215)
    at org.apache.maven.it.Verifier.executeGoals (Verifier.java:1339)
    at org.apache.maven.it.Verifier.executeGoal (Verifier.java:1239)
    at org.apache.maven.it.Verifier.executeGoal (Verifier.java:1233)
    at org.apache.maven.it.MavenITmng4464PlatformIndependentFileSeparatorTest.testit (MavenITmng4464PlatformIndependentFileSeparatorTest.java:55)
    at sun.reflect.NativeMethodAccessorImpl.invoke0 (Native Method)
    at sun.reflect.NativeMethodAccessorImpl.invoke (NativeMethodAccessorImpl.java:62)
    at sun.reflect.DelegatingMethodAccessorImpl.invoke (DelegatingMethodAccessorImpl.java:43)
    at java.lang.reflect.Method.invoke (Method.java:498)
    at junit.framework.TestCase.runTest (TestCase.java:176)
    at org.apache.maven.it.AbstractMavenIntegrationTestCase.runTest (AbstractMavenIntegrationTestCase.java:250)
    at junit.framework.TestCase.runBare (TestCase.java:141)
    at junit.framework.TestResult$1.protect (TestResult.java:122)
    at junit.framework.TestResult.runProtected (TestResult.java:142)
    at junit.framework.TestResult.run (TestResult.java:125)
    at junit.framework.TestCase.run (TestCase.java:129)
    at junit.framework.TestSuite.runTest (TestSuite.java:252)
    at junit.framework.TestSuite.run (TestSuite.java:247)
    at junit.framework.TestSuite.runTest (TestSuite.java:252)
    at junit.framework.TestSuite.run (TestSuite.java:247)
    at org.junit.internal.runners.JUnit38ClassRunner.run (JUnit38ClassRunner.java:86)
    at org.apache.maven.surefire.junit4.JUnit4Provider.execute (JUnit4Provider.java:365)
    at org.apache.maven.surefire.junit4.JUnit4Provider.executeWithRerun (JUnit4Provider.java:273)
    at org.apache.maven.surefire.junit4.JUnit4Provider.executeTestSet (JUnit4Provider.java:238)
    at org.apache.maven.surefire.junit4.JUnit4Provider.invoke (JUnit4Provider.java:159)
    at org.apache.maven.surefire.booter.ForkedBooter.invokeProviderInSameClassLoader (ForkedBooter.java:383)
    at org.apache.maven.surefire.booter.ForkedBooter.runSuitesInProcess (ForkedBooter.java:344)
    at org.apache.maven.surefire.booter.ForkedBooter.execute (ForkedBooter.java:125)
    at org.apache.maven.surefire.booter.ForkedBooter.main (ForkedBooter.java:417)
[ERROR]  
[ERROR]   The project  (/home/jenkins/workspace/Maven_maven-box_maven_MNG-6957/test/core-it-suite/target/test-classes/mng-4464/aggregator/pom.xml) has 1 error
[ERROR]     Non-readable POM /home/jenkins/workspace/Maven_maven-box_maven_MNG-6957/test/core-it-suite/target/test-classes/mng-4464/aggregator/..\parent: /home/jenkins/workspace/Maven_maven-box_maven_MNG-6957/test/core-it-suite/target/test-classes/mng-4464/aggregator/..\parent (No such file or directory)
java.io.FileNotFoundException: /home/jenkins/workspace/Maven_maven-box_maven_MNG-6957/test/core-it-suite/target/test-classes/mng-4464/aggregator/..\parent (No such file or directory)
    at java.io.FileInputStream.open0 (Native Method)
    at java.io.FileInputStream.open (FileInputStream.java:195)
    at java.io.FileInputStream.<init> (FileInputStream.java:138)
    at org.apache.maven.building.FileSource.getInputStream (FileSource.java:55)
    at org.apache.maven.model.building.DefaultModelBuilder.readFileModel (DefaultModelBuilder.java:619)
    at org.apache.maven.model.building.DefaultModelBuilder.readRawModel (DefaultModelBuilder.java:723)
    at org.apache.maven.model.building.DefaultModelBuilder.access$200 (DefaultModelBuilder.java:104)
    at org.apache.maven.model.building.DefaultModelBuilder$TransformerContextBuilder$1.findRawModel (DefaultModelBuilder.java:1892)
    at org.apache.maven.model.building.DefaultModelBuilder$TransformerContextBuilder$1.lambda$getRawModel$2 (DefaultModelBuilder.java:1845)
    at java.util.HashMap.computeIfAbsent (HashMap.java:1127)
    at org.apache.maven.model.building.DefaultModelBuilder$TransformerContextBuilder$1.getRawModel (DefaultModelBuilder.java:1845)
    at org.apache.maven.model.building.DefaultBuildPomXMLFilterFactory.lambda$getRelativePathMapper$1 (DefaultBuildPomXMLFilterFactory.java:56)
    at org.apache.maven.xml.sax.filter.ParentXMLFilter.resolveRelativePath (ParentXMLFilter.java:198)
    at org.apache.maven.xml.sax.filter.ParentXMLFilter.endElement (ParentXMLFilter.java:159)
    at org.apache.maven.xml.sax.SAXEventFactory.lambda$endElement$2 (SAXEventFactory.java:59)
    at org.apache.maven.xml.sax.filter.AbstractEventXMLFilter.processEvent (AbstractEventXMLFilter.java:113)
    at org.apache.maven.xml.sax.filter.AbstractEventXMLFilter.endElement (AbstractEventXMLFilter.java:198)
    at org.apache.maven.xml.sax.filter.ReactorDependencyXMLFilter.endElement (ReactorDependencyXMLFilter.java:149)
    at org.xml.sax.helpers.XMLFilterImpl.endElement (XMLFilterImpl.java:570)
    at com.sun.org.apache.xerces.internal.parsers.AbstractSAXParser.endElement (AbstractSAXParser.java:609)
    at com.sun.org.apache.xerces.internal.impl.XMLDocumentFragmentScannerImpl.scanEndElement (XMLDocumentFragmentScannerImpl.java:1782)
    at com.sun.org.apache.xerces.internal.impl.XMLDocumentFragmentScannerImpl$FragmentContentDriver.next (XMLDocumentFragmentScannerImpl.java:2967)
    at com.sun.org.apache.xerces.internal.impl.XMLDocumentScannerImpl.next (XMLDocumentScannerImpl.java:602)
    at com.sun.org.apache.xerces.internal.impl.XMLNSDocumentScannerImpl.next (XMLNSDocumentScannerImpl.java:112)
    at com.sun.org.apache.xerces.internal.impl.XMLDocumentFragmentScannerImpl.scanDocument (XMLDocumentFragmentScannerImpl.java:505)
    at com.sun.org.apache.xerces.internal.parsers.XML11Configuration.parse (XML11Configuration.java:842)
    at com.sun.org.apache.xerces.internal.parsers.XML11Configuration.parse (XML11Configuration.java:771)
    at com.sun.org.apache.xerces.internal.parsers.XMLParser.parse (XMLParser.java:141)
    at com.sun.org.apache.xerces.internal.parsers.AbstractSAXParser.parse (AbstractSAXParser.java:1213)
    at org.xml.sax.helpers.XMLFilterImpl.parse (XMLFilterImpl.java:357)
    at org.xml.sax.helpers.XMLFilterImpl.parse (XMLFilterImpl.java:357)
    at org.xml.sax.helpers.XMLFilterImpl.parse (XMLFilterImpl.java:357)
    at org.xml.sax.helpers.XMLFilterImpl.parse (XMLFilterImpl.java:357)
    at com.sun.org.apache.xalan.internal.xsltc.trax.TransformerImpl.transformIdentity (TransformerImpl.java:659)
    at com.sun.org.apache.xalan.internal.xsltc.trax.TransformerImpl.transform (TransformerImpl.java:728)
    at com.sun.org.apache.xalan.internal.xsltc.trax.TransformerImpl.transform (TransformerImpl.java:343)
    at org.apache.maven.model.building.AbstractModelSourceTransformer.lambda$transform$0 (AbstractModelSourceTransformer.java:145)
    at java.lang.Thread.run (Thread.java:748)
[ERROR]
[ERROR] Re-run Maven using the -X switch to enable full debug logging.
[ERROR]
[ERROR] For more information about the errors and possible solutions, please read the following articles:
[ERROR] [Help 1] http://cwiki.apache.org/confluence/display/MAVEN/ProjectBuildingException


Stack Trace:
org.apache.maven.it.VerificationException:
Exit code was non-zero: 1; command line and log =
/home/jenkins/workspace/Maven_maven-box_maven_MNG-6957/test/core-it-suite/target/apache-maven/bin/mvn --global-settings /home/jenkins/workspace/Maven_maven-box_maven_MNG-6957/test/core-it-suite/target/test-classes/settings.xml -e --batch-mode -Dmaven.repo.local=/home/jenkins/workspace/Maven_maven-box_maven_MNG-6957/test/it-local-repo validate
[INFO] [jenkins-event-spy] Jenkins Maven Event Spy is disabled
[INFO] Error stacktraces are turned on.
[INFO] Scanning for projects...
[ERROR] [ERROR] Some problems were encountered while processing the POMs:
[FATAL] Non-readable POM /home/jenkins/workspace/Maven_maven-box_maven_MNG-6957/test/core-it-suite/target/test-classes/mng-4464/aggregator/..\parent: /home/jenkins/workspace/Maven_maven-box_maven_MNG-6957/test/core-it-suite/target/test-classes/mng-4464/aggregator/..\parent (No such file or directory) @
 @
[ERROR] The build could not read 1 project -> [Help 1]
org.apache.maven.project.ProjectBuildingException: Some problems were encountered while processing the POMs:
[FATAL] Non-readable POM /home/jenkins/workspace/Maven_maven-box_maven_MNG-6957/test/core-it-suite/target/test-classes/mng-4464/aggregator/..\parent: /home/jenkins/workspace/Maven_maven-box_maven_MNG-6957/test/core-it-suite/target/test-classes/mng-4464/aggregator/..\parent (No such file or directory) @

    at org.apache.maven.project.DefaultProjectBuilder.build (DefaultProjectBuilder.java:415)
    at org.apache.maven.graph.DefaultGraphBuilder.collectProjects (DefaultGraphBuilder.java:391)
    at org.apache.maven.graph.DefaultGraphBuilder.getProjectsForMavenReactor (DefaultGraphBuilder.java:379)
    at org.apache.maven.graph.DefaultGraphBuilder.build (DefaultGraphBuilder.java:93)
    at org.apache.maven.DefaultMaven.buildGraph (DefaultMaven.java:557)
    at org.apache.maven.DefaultMaven.doExecute (DefaultMaven.java:233)
    at org.apache.maven.DefaultMaven.doExecute (DefaultMaven.java:206)
    at org.apache.maven.DefaultMaven.execute (DefaultMaven.java:119)
    at org.apache.maven.cli.MavenCli.execute (MavenCli.java:978)
    at org.apache.maven.cli.MavenCli.doMain (MavenCli.java:292)
    at org.apache.maven.cli.MavenCli.doMain (MavenCli.java:247)
    at sun.reflect.GeneratedMethodAccessor58.invoke (Unknown Source)
    at sun.reflect.DelegatingMethodAccessorImpl.invoke (DelegatingMethodAccessorImpl.java:43)
    at java.lang.reflect.Method.invoke (Method.java:498)
    at org.apache.maven.it.Embedded3xLauncher.run (Embedded3xLauncher.java:215)
    at org.apache.maven.it.Verifier.executeGoals (Verifier.java:1339)
    at org.apache.maven.it.Verifier.executeGoal (Verifier.java:1239)
    at org.apache.maven.it.Verifier.executeGoal (Verifier.java:1233)
    at org.apache.maven.it.MavenITmng4464PlatformIndependentFileSeparatorTest.testit (MavenITmng4464PlatformIndependentFileSeparatorTest.java:55)
    at sun.reflect.NativeMethodAccessorImpl.invoke0 (Native Method)
    at sun.reflect.NativeMethodAccessorImpl.invoke (NativeMethodAccessorImpl.java:62)
    at sun.reflect.DelegatingMethodAccessorImpl.invoke (DelegatingMethodAccessorImpl.java:43)
    at java.lang.reflect.Method.invoke (Method.java:498)
    at junit.framework.TestCase.runTest (TestCase.java:176)
    at org.apache.maven.it.AbstractMavenIntegrationTestCase.runTest (AbstractMavenIntegrationTestCase.java:250)
    at junit.framework.TestCase.runBare (TestCase.java:141)
    at junit.framework.TestResult$1.protect (TestResult.java:122)
    at junit.framework.TestResult.runProtected (TestResult.java:142)
    at junit.framework.TestResult.run (TestResult.java:125)
    at junit.framework.TestCase.run (TestCase.java:129)
    at junit.framework.TestSuite.runTest (TestSuite.java:252)
    at junit.framework.TestSuite.run (TestSuite.java:247)
    at junit.framework.TestSuite.runTest (TestSuite.java:252)
    at junit.framework.TestSuite.run (TestSuite.java:247)
    at org.junit.internal.runners.JUnit38ClassRunner.run (JUnit38ClassRunner.java:86)
    at org.apache.maven.surefire.junit4.JUnit4Provider.execute (JUnit4Provider.java:365)
    at org.apache.maven.surefire.junit4.JUnit4Provider.executeWithRerun (JUnit4Provider.java:273)
    at org.apache.maven.surefire.junit4.JUnit4Provider.executeTestSet (JUnit4Provider.java:238)
    at org.apache.maven.surefire.junit4.JUnit4Provider.invoke (JUnit4Provider.java:159)
    at org.apache.maven.surefire.booter.ForkedBooter.invokeProviderInSameClassLoader (ForkedBooter.java:383)
    at org.apache.maven.surefire.booter.ForkedBooter.runSuitesInProcess (ForkedBooter.java:344)
    at org.apache.maven.surefire.booter.ForkedBooter.execute (ForkedBooter.java:125)
    at org.apache.maven.surefire.booter.ForkedBooter.main (ForkedBooter.java:417)
[ERROR]  
[ERROR]   The project  (/home/jenkins/workspace/Maven_maven-box_maven_MNG-6957/test/core-it-suite/target/test-classes/mng-4464/aggregator/pom.xml) has 1 error
[ERROR]     Non-readable POM /home/jenkins/workspace/Maven_maven-box_maven_MNG-6957/test/core-it-suite/target/test-classes/mng-4464/aggregator/..\parent: /home/jenkins/workspace/Maven_maven-box_maven_MNG-6957/test/core-it-suite/target/test-classes/mng-4464/aggregator/..\parent (No such file or directory)
java.io.FileNotFoundException: /home/jenkins/workspace/Maven_maven-box_maven_MNG-6957/test/core-it-suite/target/test-classes/mng-4464/aggregator/..\parent (No such file or directory)
    at java.io.FileInputStream.open0 (Native Method)
    at java.io.FileInputStream.open (FileInputStream.java:195)
    at java.io.FileInputStream.<init> (FileInputStream.java:138)
    at org.apache.maven.building.FileSource.getInputStream (FileSource.java:55)
    at org.apache.maven.model.building.DefaultModelBuilder.readFileModel (DefaultModelBuilder.java:619)
    at org.apache.maven.model.building.DefaultModelBuilder.readRawModel (DefaultModelBuilder.java:723)
    at org.apache.maven.model.building.DefaultModelBuilder.access$200 (DefaultModelBuilder.java:104)
    at org.apache.maven.model.building.DefaultModelBuilder$TransformerContextBuilder$1.findRawModel (DefaultModelBuilder.java:1892)
    at org.apache.maven.model.building.DefaultModelBuilder$TransformerContextBuilder$1.lambda$getRawModel$2 (DefaultModelBuilder.java:1845)
    at java.util.HashMap.computeIfAbsent (HashMap.java:1127)
    at org.apache.maven.model.building.DefaultModelBuilder$TransformerContextBuilder$1.getRawModel (DefaultModelBuilder.java:1845)
    at org.apache.maven.model.building.DefaultBuildPomXMLFilterFactory.lambda$getRelativePathMapper$1 (DefaultBuildPomXMLFilterFactory.java:56)
    at org.apache.maven.xml.sax.filter.ParentXMLFilter.resolveRelativePath (ParentXMLFilter.java:198)
    at org.apache.maven.xml.sax.filter.ParentXMLFilter.endElement (ParentXMLFilter.java:159)
    at org.apache.maven.xml.sax.SAXEventFactory.lambda$endElement$2 (SAXEventFactory.java:59)
    at org.apache.maven.xml.sax.filter.AbstractEventXMLFilter.processEvent (AbstractEventXMLFilter.java:113)
    at org.apache.maven.xml.sax.filter.AbstractEventXMLFilter.endElement (AbstractEventXMLFilter.java:198)
    at org.apache.maven.xml.sax.filter.ReactorDependencyXMLFilter.endElement (ReactorDependencyXMLFilter.java:149)
    at org.xml.sax.helpers.XMLFilterImpl.endElement (XMLFilterImpl.java:570)
    at com.sun.org.apache.xerces.internal.parsers.AbstractSAXParser.endElement (AbstractSAXParser.java:609)
    at com.sun.org.apache.xerces.internal.impl.XMLDocumentFragmentScannerImpl.scanEndElement (XMLDocumentFragmentScannerImpl.java:1782)
    at com.sun.org.apache.xerces.internal.impl.XMLDocumentFragmentScannerImpl$FragmentContentDriver.next (XMLDocumentFragmentScannerImpl.java:2967)
    at com.sun.org.apache.xerces.internal.impl.XMLDocumentScannerImpl.next (XMLDocumentScannerImpl.java:602)
    at com.sun.org.apache.xerces.internal.impl.XMLNSDocumentScannerImpl.next (XMLNSDocumentScannerImpl.java:112)
    at com.sun.org.apache.xerces.internal.impl.XMLDocumentFragmentScannerImpl.scanDocument (XMLDocumentFragmentScannerImpl.java:505)
    at com.sun.org.apache.xerces.internal.parsers.XML11Configuration.parse (XML11Configuration.java:842)
    at com.sun.org.apache.xerces.internal.parsers.XML11Configuration.parse (XML11Configuration.java:771)
    at com.sun.org.apache.xerces.internal.parsers.XMLParser.parse (XMLParser.java:141)
    at com.sun.org.apache.xerces.internal.parsers.AbstractSAXParser.parse (AbstractSAXParser.java:1213)
    at org.xml.sax.helpers.XMLFilterImpl.parse (XMLFilterImpl.java:357)
    at org.xml.sax.helpers.XMLFilterImpl.parse (XMLFilterImpl.java:357)
    at org.xml.sax.helpers.XMLFilterImpl.parse (XMLFilterImpl.java:357)
    at org.xml.sax.helpers.XMLFilterImpl.parse (XMLFilterImpl.java:357)
    at com.sun.org.apache.xalan.internal.xsltc.trax.TransformerImpl.transformIdentity (TransformerImpl.java:659)
    at com.sun.org.apache.xalan.internal.xsltc.trax.TransformerImpl.transform (TransformerImpl.java:728)
    at com.sun.org.apache.xalan.internal.xsltc.trax.TransformerImpl.transform (TransformerImpl.java:343)
    at org.apache.maven.model.building.AbstractModelSourceTransformer.lambda$transform$0 (AbstractModelSourceTransformer.java:145)
    at java.lang.Thread.run (Thread.java:748)
[ERROR]
[ERROR] Re-run Maven using the -X switch to enable full debug logging.
[ERROR]
[ERROR] For more information about the errors and possible solutions, please read the following articles:
[ERROR] [Help 1] http://cwiki.apache.org/confluence/display/MAVEN/ProjectBuildingException

        at org.apache.maven.it.MavenITmng4464PlatformIndependentFileSeparatorTest.testit(MavenITmng4464PlatformIndependentFileSeparatorTest.java:55)


FAILED:  org.apache.maven.it.MavenITmng4464PlatformIndependentFileSeparatorTest.linux-jdk14 / Run ITs Linux Java 14 / testit

Error Message:
Exit code was non-zero: 1; command line and log =
/home/jenkins/workspace/Maven_maven-box_maven_MNG-6957/test/core-it-suite/target/apache-maven/bin/mvn --global-settings /home/jenkins/workspace/Maven_maven-box_maven_MNG-6957/test/core-it-suite/target/test-classes/settings.xml -e --batch-mode -Dmaven.repo.local=/home/jenkins/workspace/Maven_maven-box_maven_MNG-6957/test/it-local-repo validate
[INFO] [jenkins-event-spy] Jenkins Maven Event Spy is disabled
[INFO] Error stacktraces are turned on.
[INFO] Scanning for projects...
[ERROR] [ERROR] Some problems were encountered while processing the POMs:
[FATAL] Non-readable POM /home/jenkins/workspace/Maven_maven-box_maven_MNG-6957/test/core-it-suite/target/test-classes/mng-4464/aggregator/..\parent: /home/jenkins/workspace/Maven_maven-box_maven_MNG-6957/test/core-it-suite/target/test-classes/mng-4464/aggregator/..\parent (No such file or directory) @
 @
[ERROR] The build could not read 1 project -> [Help 1]
org.apache.maven.project.ProjectBuildingException: Some problems were encountered while processing the POMs:
[FATAL] Non-readable POM /home/jenkins/workspace/Maven_maven-box_maven_MNG-6957/test/core-it-suite/target/test-classes/mng-4464/aggregator/..\parent: /home/jenkins/workspace/Maven_maven-box_maven_MNG-6957/test/core-it-suite/target/test-classes/mng-4464/aggregator/..\parent (No such file or directory) @

    at org.apache.maven.project.DefaultProjectBuilder.build (DefaultProjectBuilder.java:415)
    at org.apache.maven.graph.DefaultGraphBuilder.collectProjects (DefaultGraphBuilder.java:391)
    at org.apache.maven.graph.DefaultGraphBuilder.getProjectsForMavenReactor (DefaultGraphBuilder.java:379)
    at org.apache.maven.graph.DefaultGraphBuilder.build (DefaultGraphBuilder.java:93)
    at org.apache.maven.DefaultMaven.buildGraph (DefaultMaven.java:557)
    at org.apache.maven.DefaultMaven.doExecute (DefaultMaven.java:233)
    at org.apache.maven.DefaultMaven.doExecute (DefaultMaven.java:206)
    at org.apache.maven.DefaultMaven.execute (DefaultMaven.java:119)
    at org.apache.maven.cli.MavenCli.execute (MavenCli.java:978)
    at org.apache.maven.cli.MavenCli.doMain (MavenCli.java:292)
    at org.apache.maven.cli.MavenCli.doMain (MavenCli.java:247)
    at jdk.internal.reflect.GeneratedMethodAccessor63.invoke (Unknown Source)
    at jdk.internal.reflect.DelegatingMethodAccessorImpl.invoke (DelegatingMethodAccessorImpl.java:43)
    at java.lang.reflect.Method.invoke (Method.java:564)
    at org.apache.maven.it.Embedded3xLauncher.run (Embedded3xLauncher.java:215)
    at org.apache.maven.it.Verifier.executeGoals (Verifier.java:1339)
    at org.apache.maven.it.Verifier.executeGoal (Verifier.java:1239)
    at org.apache.maven.it.Verifier.executeGoal (Verifier.java:1233)
    at org.apache.maven.it.MavenITmng4464PlatformIndependentFileSeparatorTest.testit (MavenITmng4464PlatformIndependentFileSeparatorTest.java:55)
    at jdk.internal.reflect.NativeMethodAccessorImpl.invoke0 (Native Method)
    at jdk.internal.reflect.NativeMethodAccessorImpl.invoke (NativeMethodAccessorImpl.java:62)
    at jdk.internal.reflect.DelegatingMethodAccessorImpl.invoke (DelegatingMethodAccessorImpl.java:43)
    at java.lang.reflect.Method.invoke (Method.java:564)
    at junit.framework.TestCase.runTest (TestCase.java:176)
    at org.apache.maven.it.AbstractMavenIntegrationTestCase.runTest (AbstractMavenIntegrationTestCase.java:250)
    at junit.framework.TestCase.runBare (TestCase.java:141)
    at junit.framework.TestResult$1.protect (TestResult.java:122)
    at junit.framework.TestResult.runProtected (TestResult.java:142)
    at junit.framework.TestResult.run (TestResult.java:125)
    at junit.framework.TestCase.run (TestCase.java:129)
    at junit.framework.TestSuite.runTest (TestSuite.java:252)
    at junit.framework.TestSuite.run (TestSuite.java:247)
    at junit.framework.TestSuite.runTest (TestSuite.java:252)
    at junit.framework.TestSuite.run (TestSuite.java:247)
    at org.junit.internal.runners.JUnit38ClassRunner.run (JUnit38ClassRunner.java:86)
    at org.apache.maven.surefire.junit4.JUnit4Provider.execute (JUnit4Provider.java:365)
    at org.apache.maven.surefire.junit4.JUnit4Provider.executeWithRerun (JUnit4Provider.java:273)
    at org.apache.maven.surefire.junit4.JUnit4Provider.executeTestSet (JUnit4Provider.java:238)
    at org.apache.maven.surefire.junit4.JUnit4Provider.invoke (JUnit4Provider.java:159)
    at org.apache.maven.surefire.booter.ForkedBooter.invokeProviderInSameClassLoader (ForkedBooter.java:383)
    at org.apache.maven.surefire.booter.ForkedBooter.runSuitesInProcess (ForkedBooter.java:344)
    at org.apache.maven.surefire.booter.ForkedBooter.execute (ForkedBooter.java:125)
    at org.apache.maven.surefire.booter.ForkedBooter.main (ForkedBooter.java:417)
[ERROR]  
[ERROR]   The project  (/home/jenkins/workspace/Maven_maven-box_maven_MNG-6957/test/core-it-suite/target/test-classes/mng-4464/aggregator/pom.xml) has 1 error
[ERROR]     Non-readable POM /home/jenkins/workspace/Maven_maven-box_maven_MNG-6957/test/core-it-suite/target/test-classes/mng-4464/aggregator/..\parent: /home/jenkins/workspace/Maven_maven-box_maven_MNG-6957/test/core-it-suite/target/test-classes/mng-4464/aggregator/..\parent (No such file or directory)
java.io.FileNotFoundException: /home/jenkins/workspace/Maven_maven-box_maven_MNG-6957/test/core-it-suite/target/test-classes/mng-4464/aggregator/..\parent (No such file or directory)
    at java.io.FileInputStream.open0 (Native Method)
    at java.io.FileInputStream.open (FileInputStream.java:212)
    at java.io.FileInputStream.<init> (FileInputStream.java:154)
    at org.apache.maven.building.FileSource.getInputStream (FileSource.java:55)
    at org.apache.maven.model.building.DefaultModelBuilder.readFileModel (DefaultModelBuilder.java:619)
    at org.apache.maven.model.building.DefaultModelBuilder.readRawModel (DefaultModelBuilder.java:723)
    at org.apache.maven.model.building.DefaultModelBuilder.access$200 (DefaultModelBuilder.java:104)
    at org.apache.maven.model.building.DefaultModelBuilder$TransformerContextBuilder$1.findRawModel (DefaultModelBuilder.java:1892)
    at org.apache.maven.model.building.DefaultModelBuilder$TransformerContextBuilder$1.lambda$getRawModel$2 (DefaultModelBuilder.java:1845)
    at java.util.HashMap.computeIfAbsent (HashMap.java:1225)
    at org.apache.maven.model.building.DefaultModelBuilder$TransformerContextBuilder$1.getRawModel (DefaultModelBuilder.java:1845)
    at org.apache.maven.model.building.DefaultBuildPomXMLFilterFactory.lambda$getRelativePathMapper$1 (DefaultBuildPomXMLFilterFactory.java:56)
    at org.apache.maven.xml.sax.filter.ParentXMLFilter.resolveRelativePath (ParentXMLFilter.java:198)
    at org.apache.maven.xml.sax.filter.ParentXMLFilter.endElement (ParentXMLFilter.java:159)
    at org.apache.maven.xml.sax.SAXEventFactory.lambda$endElement$2 (SAXEventFactory.java:59)
    at org.apache.maven.xml.sax.filter.AbstractEventXMLFilter.processEvent (AbstractEventXMLFilter.java:113)
    at org.apache.maven.xml.sax.filter.AbstractEventXMLFilter.endElement (AbstractEventXMLFilter.java:198)
    at org.apache.maven.xml.sax.filter.ReactorDependencyXMLFilter.endElement (ReactorDependencyXMLFilter.java:149)
    at org.xml.sax.helpers.XMLFilterImpl.endElement (XMLFilterImpl.java:557)
    at com.sun.org.apache.xerces.internal.parsers.AbstractSAXParser.endElement (AbstractSAXParser.java:618)
    at com.sun.org.apache.xerces.internal.impl.XMLDocumentFragmentScannerImpl.scanEndElement (XMLDocumentFragmentScannerImpl.java:1727)
    at com.sun.org.apache.xerces.internal.impl.XMLDocumentFragmentScannerImpl$FragmentContentDriver.next (XMLDocumentFragmentScannerImpl.java:2898)
    at com.sun.org.apache.xerces.internal.impl.XMLDocumentScannerImpl.next (XMLDocumentScannerImpl.java:605)
    at com.sun.org.apache.xerces.internal.impl.XMLNSDocumentScannerImpl.next (XMLNSDocumentScannerImpl.java:112)
    at com.sun.org.apache.xerces.internal.impl.XMLDocumentFragmentScannerImpl.scanDocument (XMLDocumentFragmentScannerImpl.java:541)
    at com.sun.org.apache.xerces.internal.parsers.XML11Configuration.parse (XML11Configuration.java:888)
    at com.sun.org.apache.xerces.internal.parsers.XML11Configuration.parse (XML11Configuration.java:824)
    at com.sun.org.apache.xerces.internal.parsers.XMLParser.parse (XMLParser.java:141)
    at com.sun.org.apache.xerces.internal.parsers.AbstractSAXParser.parse (AbstractSAXParser.java:1224)
    at org.xml.sax.helpers.XMLFilterImpl.parse (XMLFilterImpl.java:344)
    at org.xml.sax.helpers.XMLFilterImpl.parse (XMLFilterImpl.java:344)
    at org.xml.sax.helpers.XMLFilterImpl.parse (XMLFilterImpl.java:344)
    at org.xml.sax.helpers.XMLFilterImpl.parse (XMLFilterImpl.java:344)
    at com.sun.org.apache.xalan.internal.xsltc.trax.TransformerImpl.transformIdentity (TransformerImpl.java:701)
    at com.sun.org.apache.xalan.internal.xsltc.trax.TransformerImpl.transform (TransformerImpl.java:788)
    at com.sun.org.apache.xalan.internal.xsltc.trax.TransformerImpl.transform (TransformerImpl.java:383)
    at org.apache.maven.model.building.AbstractModelSourceTransformer.lambda$transform$0 (AbstractModelSourceTransformer.java:145)
    at java.lang.Thread.run (Thread.java:832)
[ERROR]
[ERROR] Re-run Maven using the -X switch to enable full debug logging.
[ERROR]
[ERROR] For more information about the errors and possible solutions, please read the following articles:
[ERROR] [Help 1] http://cwiki.apache.org/confluence/display/MAVEN/ProjectBuildingException


Stack Trace:
org.apache.maven.it.VerificationException:
Exit code was non-zero: 1; command line and log =
/home/jenkins/workspace/Maven_maven-box_maven_MNG-6957/test/core-it-suite/target/apache-maven/bin/mvn --global-settings /home/jenkins/workspace/Maven_maven-box_maven_MNG-6957/test/core-it-suite/target/test-classes/settings.xml -e --batch-mode -Dmaven.repo.local=/home/jenkins/workspace/Maven_maven-box_maven_MNG-6957/test/it-local-repo validate
[INFO] [jenkins-event-spy] Jenkins Maven Event Spy is disabled
[INFO] Error stacktraces are turned on.
[INFO] Scanning for projects...
[ERROR] [ERROR] Some problems were encountered while processing the POMs:
[FATAL] Non-readable POM /home/jenkins/workspace/Maven_maven-box_maven_MNG-6957/test/core-it-suite/target/test-classes/mng-4464/aggregator/..\parent: /home/jenkins/workspace/Maven_maven-box_maven_MNG-6957/test/core-it-suite/target/test-classes/mng-4464/aggregator/..\parent (No such file or directory) @
 @
[ERROR] The build could not read 1 project -> [Help 1]
org.apache.maven.project.ProjectBuildingException: Some problems were encountered while processing the POMs:
[FATAL] Non-readable POM /home/jenkins/workspace/Maven_maven-box_maven_MNG-6957/test/core-it-suite/target/test-classes/mng-4464/aggregator/..\parent: /home/jenkins/workspace/Maven_maven-box_maven_MNG-6957/test/core-it-suite/target/test-classes/mng-4464/aggregator/..\parent (No such file or directory) @

    at org.apache.maven.project.DefaultProjectBuilder.build (DefaultProjectBuilder.java:415)
    at org.apache.maven.graph.DefaultGraphBuilder.collectProjects (DefaultGraphBuilder.java:391)
    at org.apache.maven.graph.DefaultGraphBuilder.getProjectsForMavenReactor (DefaultGraphBuilder.java:379)
    at org.apache.maven.graph.DefaultGraphBuilder.build (DefaultGraphBuilder.java:93)
    at org.apache.maven.DefaultMaven.buildGraph (DefaultMaven.java:557)
    at org.apache.maven.DefaultMaven.doExecute (DefaultMaven.java:233)
    at org.apache.maven.DefaultMaven.doExecute (DefaultMaven.java:206)
    at org.apache.maven.DefaultMaven.execute (DefaultMaven.java:119)
    at org.apache.maven.cli.MavenCli.execute (MavenCli.java:978)
    at org.apache.maven.cli.MavenCli.doMain (MavenCli.java:292)
    at org.apache.maven.cli.MavenCli.doMain (MavenCli.java:247)
    at jdk.internal.reflect.GeneratedMethodAccessor63.invoke (Unknown Source)
    at jdk.internal.reflect.DelegatingMethodAccessorImpl.invoke (DelegatingMethodAccessorImpl.java:43)
    at java.lang.reflect.Method.invoke (Method.java:564)
    at org.apache.maven.it.Embedded3xLauncher.run (Embedded3xLauncher.java:215)
    at org.apache.maven.it.Verifier.executeGoals (Verifier.java:1339)
    at org.apache.maven.it.Verifier.executeGoal (Verifier.java:1239)
    at org.apache.maven.it.Verifier.executeGoal (Verifier.java:1233)
    at org.apache.maven.it.MavenITmng4464PlatformIndependentFileSeparatorTest.testit (MavenITmng4464PlatformIndependentFileSeparatorTest.java:55)
    at jdk.internal.reflect.NativeMethodAccessorImpl.invoke0 (Native Method)
    at jdk.internal.reflect.NativeMethodAccessorImpl.invoke (NativeMethodAccessorImpl.java:62)
    at jdk.internal.reflect.DelegatingMethodAccessorImpl.invoke (DelegatingMethodAccessorImpl.java:43)
    at java.lang.reflect.Method.invoke (Method.java:564)
    at junit.framework.TestCase.runTest (TestCase.java:176)
    at org.apache.maven.it.AbstractMavenIntegrationTestCase.runTest (AbstractMavenIntegrationTestCase.java:250)
    at junit.framework.TestCase.runBare (TestCase.java:141)
    at junit.framework.TestResult$1.protect (TestResult.java:122)
    at junit.framework.TestResult.runProtected (TestResult.java:142)
    at junit.framework.TestResult.run (TestResult.java:125)
    at junit.framework.TestCase.run (TestCase.java:129)
    at junit.framework.TestSuite.runTest (TestSuite.java:252)
    at junit.framework.TestSuite.run (TestSuite.java:247)
    at junit.framework.TestSuite.runTest (TestSuite.java:252)
    at junit.framework.TestSuite.run (TestSuite.java:247)
    at org.junit.internal.runners.JUnit38ClassRunner.run (JUnit38ClassRunner.java:86)
    at org.apache.maven.surefire.junit4.JUnit4Provider.execute (JUnit4Provider.java:365)
    at org.apache.maven.surefire.junit4.JUnit4Provider.executeWithRerun (JUnit4Provider.java:273)
    at org.apache.maven.surefire.junit4.JUnit4Provider.executeTestSet (JUnit4Provider.java:238)
    at org.apache.maven.surefire.junit4.JUnit4Provider.invoke (JUnit4Provider.java:159)
    at org.apache.maven.surefire.booter.ForkedBooter.invokeProviderInSameClassLoader (ForkedBooter.java:383)
    at org.apache.maven.surefire.booter.ForkedBooter.runSuitesInProcess (ForkedBooter.java:344)
    at org.apache.maven.surefire.booter.ForkedBooter.execute (ForkedBooter.java:125)
    at org.apache.maven.surefire.booter.ForkedBooter.main (ForkedBooter.java:417)
[ERROR]  
[ERROR]   The project  (/home/jenkins/workspace/Maven_maven-box_maven_MNG-6957/test/core-it-suite/target/test-classes/mng-4464/aggregator/pom.xml) has 1 error
[ERROR]     Non-readable POM /home/jenkins/workspace/Maven_maven-box_maven_MNG-6957/test/core-it-suite/target/test-classes/mng-4464/aggregator/..\parent: /home/jenkins/workspace/Maven_maven-box_maven_MNG-6957/test/core-it-suite/target/test-classes/mng-4464/aggregator/..\parent (No such file or directory)
java.io.FileNotFoundException: /home/jenkins/workspace/Maven_maven-box_maven_MNG-6957/test/core-it-suite/target/test-classes/mng-4464/aggregator/..\parent (No such file or directory)
    at java.io.FileInputStream.open0 (Native Method)
    at java.io.FileInputStream.open (FileInputStream.java:212)
    at java.io.FileInputStream.<init> (FileInputStream.java:154)
    at org.apache.maven.building.FileSource.getInputStream (FileSource.java:55)
    at org.apache.maven.model.building.DefaultModelBuilder.readFileModel (DefaultModelBuilder.java:619)
    at org.apache.maven.model.building.DefaultModelBuilder.readRawModel (DefaultModelBuilder.java:723)
    at org.apache.maven.model.building.DefaultModelBuilder.access$200 (DefaultModelBuilder.java:104)
    at org.apache.maven.model.building.DefaultModelBuilder$TransformerContextBuilder$1.findRawModel (DefaultModelBuilder.java:1892)
    at org.apache.maven.model.building.DefaultModelBuilder$TransformerContextBuilder$1.lambda$getRawModel$2 (DefaultModelBuilder.java:1845)
    at java.util.HashMap.computeIfAbsent (HashMap.java:1225)
    at org.apache.maven.model.building.DefaultModelBuilder$TransformerContextBuilder$1.getRawModel (DefaultModelBuilder.java:1845)
    at org.apache.maven.model.building.DefaultBuildPomXMLFilterFactory.lambda$getRelativePathMapper$1 (DefaultBuildPomXMLFilterFactory.java:56)
    at org.apache.maven.xml.sax.filter.ParentXMLFilter.resolveRelativePath (ParentXMLFilter.java:198)
    at org.apache.maven.xml.sax.filter.ParentXMLFilter.endElement (ParentXMLFilter.java:159)
    at org.apache.maven.xml.sax.SAXEventFactory.lambda$endElement$2 (SAXEventFactory.java:59)
    at org.apache.maven.xml.sax.filter.AbstractEventXMLFilter.processEvent (AbstractEventXMLFilter.java:113)
    at org.apache.maven.xml.sax.filter.AbstractEventXMLFilter.endElement (AbstractEventXMLFilter.java:198)
    at org.apache.maven.xml.sax.filter.ReactorDependencyXMLFilter.endElement (ReactorDependencyXMLFilter.java:149)
    at org.xml.sax.helpers.XMLFilterImpl.endElement (XMLFilterImpl.java:557)
    at com.sun.org.apache.xerces.internal.parsers.AbstractSAXParser.endElement (AbstractSAXParser.java:618)
    at com.sun.org.apache.xerces.internal.impl.XMLDocumentFragmentScannerImpl.scanEndElement (XMLDocumentFragmentScannerImpl.java:1727)
    at com.sun.org.apache.xerces.internal.impl.XMLDocumentFragmentScannerImpl$FragmentContentDriver.next (XMLDocumentFragmentScannerImpl.java:2898)
    at com.sun.org.apache.xerces.internal.impl.XMLDocumentScannerImpl.next (XMLDocumentScannerImpl.java:605)
    at com.sun.org.apache.xerces.internal.impl.XMLNSDocumentScannerImpl.next (XMLNSDocumentScannerImpl.java:112)
    at com.sun.org.apache.xerces.internal.impl.XMLDocumentFragmentScannerImpl.scanDocument (XMLDocumentFragmentScannerImpl.java:541)
    at com.sun.org.apache.xerces.internal.parsers.XML11Configuration.parse (XML11Configuration.java:888)
    at com.sun.org.apache.xerces.internal.parsers.XML11Configuration.parse (XML11Configuration.java:824)
    at com.sun.org.apache.xerces.internal.parsers.XMLParser.parse (XMLParser.java:141)
    at com.sun.org.apache.xerces.internal.parsers.AbstractSAXParser.parse (AbstractSAXParser.java:1224)
    at org.xml.sax.helpers.XMLFilterImpl.parse (XMLFilterImpl.java:344)
    at org.xml.sax.helpers.XMLFilterImpl.parse (XMLFilterImpl.java:344)
    at org.xml.sax.helpers.XMLFilterImpl.parse (XMLFilterImpl.java:344)
    at org.xml.sax.helpers.XMLFilterImpl.parse (XMLFilterImpl.java:344)
    at com.sun.org.apache.xalan.internal.xsltc.trax.TransformerImpl.transformIdentity (TransformerImpl.java:701)
    at com.sun.org.apache.xalan.internal.xsltc.trax.TransformerImpl.transform (TransformerImpl.java:788)
    at com.sun.org.apache.xalan.internal.xsltc.trax.TransformerImpl.transform (TransformerImpl.java:383)
    at org.apache.maven.model.building.AbstractModelSourceTransformer.lambda$transform$0 (AbstractModelSourceTransformer.java:145)
    at java.lang.Thread.run (Thread.java:832)
[ERROR]
[ERROR] Re-run Maven using the -X switch to enable full debug logging.
[ERROR]
[ERROR] For more information about the errors and possible solutions, please read the following articles:
[ERROR] [Help 1] http://cwiki.apache.org/confluence/display/MAVEN/ProjectBuildingException

        at org.apache.maven.it.MavenITmng4464PlatformIndependentFileSeparatorTest.testit(MavenITmng4464PlatformIndependentFileSeparatorTest.java:55)




Build log:
[...truncated 80811 lines...]
[withMaven] artifactsPublisher - Archive artifact core-it-support\core-it-plugins\mng5805-extension\target\mng-5805-pkg-type-mojo-configuration-extension-2.1-SNAPSHOT.jar under org\apache\maven\its\plugins\mng-5805-pkg-type-mojo-configuration-extension\2.1-SNAPSHOT\mng-5805-pkg-type-mojo-configuration-extension-2.1-SNAPSHOT.jar
[withMaven] artifactsPublisher - Archive artifact core-it-support\core-it-plugins\mng5805-extension2\pom.xml under org\apache\maven\its\plugins\mng-5805-pkg-type-mojo-configuration-extension2\2.1-SNAPSHOT\mng-5805-pkg-type-mojo-configuration-extension2-2.1-SNAPSHOT.pom
[withMaven] artifactsPublisher - Archive artifact core-it-support\core-it-plugins\mng5805-extension2\target\mng-5805-pkg-type-mojo-configuration-extension2-2.1-SNAPSHOT.jar under org\apache\maven\its\plugins\mng-5805-pkg-type-mojo-configuration-extension2\2.1-SNAPSHOT\mng-5805-pkg-type-mojo-configuration-extension2-2.1-SNAPSHOT.jar
[withMaven] artifactsPublisher - Archive artifact core-it-support\core-it-plugins\mng5805-plugin\pom.xml under org\apache\maven\its\plugins\mng-5805-pkg-type-mojo-configuration-plugin\2.1-SNAPSHOT\mng-5805-pkg-type-mojo-configuration-plugin-2.1-SNAPSHOT.pom
[withMaven] artifactsPublisher - Archive artifact core-it-support\core-it-plugins\mng5805-plugin\target\mng-5805-pkg-type-mojo-configuration-plugin-2.1-SNAPSHOT.jar under org\apache\maven\its\plugins\mng-5805-pkg-type-mojo-configuration-plugin\2.1-SNAPSHOT\mng-5805-pkg-type-mojo-configuration-plugin-2.1-SNAPSHOT.jar
[withMaven] artifactsPublisher - Archive artifact core-it-support\core-it-plugins\mng5805-plugin-dep\pom.xml under org\apache\maven\its\plugins\mng-5805-pkg-type-mojo-configuration-plugin-dep\2.1-SNAPSHOT\mng-5805-pkg-type-mojo-configuration-plugin-dep-2.1-SNAPSHOT.pom
[withMaven] artifactsPublisher - Archive artifact core-it-support\core-it-plugins\mng5805-plugin-dep\target\mng-5805-pkg-type-mojo-configuration-plugin-dep-2.1-SNAPSHOT.jar under org\apache\maven\its\plugins\mng-5805-pkg-type-mojo-configuration-plugin-dep\2.1-SNAPSHOT\mng-5805-pkg-type-mojo-configuration-plugin-dep-2.1-SNAPSHOT.jar
[withMaven] artifactsPublisher - Archive artifact core-it-support\core-it-plugins\mng5958-extension\pom.xml under org\apache\maven\its\plugins\mng-5958-pkg-type-extension\2.1-SNAPSHOT\mng-5958-pkg-type-extension-2.1-SNAPSHOT.pom
[withMaven] artifactsPublisher - Archive artifact core-it-support\core-it-plugins\mng5958-extension\target\mng-5958-pkg-type-extension-2.1-SNAPSHOT.jar under org\apache\maven\its\plugins\mng-5958-pkg-type-extension\2.1-SNAPSHOT\mng-5958-pkg-type-extension-2.1-SNAPSHOT.jar
[withMaven] artifactsPublisher - Archive artifact core-it-support\core-it-plugins\mng6759-plugin-resolves-project-dependencies\pom.xml under org\apache\maven\its\plugins\mng-6759-resolves-project-dependencies-plugin\2.1-SNAPSHOT\mng-6759-resolves-project-dependencies-plugin-2.1-SNAPSHOT.pom
[withMaven] artifactsPublisher - Archive artifact core-it-support\core-it-plugins\mng6759-plugin-resolves-project-dependencies\target\mng-6759-resolves-project-dependencies-plugin-2.1-SNAPSHOT.jar under org\apache\maven\its\plugins\mng-6759-resolves-project-dependencies-plugin\2.1-SNAPSHOT\mng-6759-resolves-project-dependencies-plugin-2.1-SNAPSHOT.jar
[withMaven] artifactsPublisher - Archive artifact core-it-support\core-it-toolchain\pom.xml under org\apache\maven\its\core-it-toolchain\2.1-SNAPSHOT\core-it-toolchain-2.1-SNAPSHOT.pom
[withMaven] artifactsPublisher - Archive artifact core-it-support\core-it-toolchain\target\core-it-toolchain-2.1-SNAPSHOT.jar under org\apache\maven\its\core-it-toolchain\2.1-SNAPSHOT\core-it-toolchain-2.1-SNAPSHOT.jar
[withMaven] artifactsPublisher - Archive artifact core-it-support\core-it-wagon\pom.xml under org\apache\maven\its\core-it-wagon\2.1-SNAPSHOT\core-it-wagon-2.1-SNAPSHOT.pom
[withMaven] artifactsPublisher - Archive artifact core-it-support\core-it-wagon\target\core-it-wagon-2.1-SNAPSHOT.jar under org\apache\maven\its\core-it-wagon\2.1-SNAPSHOT\core-it-wagon-2.1-SNAPSHOT.jar
[withMaven] artifactsPublisher - Archive artifact core-it-support\core-it-support-artifacts\pom.xml under org\apache\maven\its\core-it-support-artifacts\2.1-SNAPSHOT\core-it-support-artifacts-2.1-SNAPSHOT.pom
[withMaven] artifactsPublisher - Archive artifact core-it-support\core-it-support-artifacts\target\core-it-support-artifacts-2.1-SNAPSHOT-repo.zip under org\apache\maven\its\core-it-support-artifacts\2.1-SNAPSHOT\core-it-support-artifacts-2.1-SNAPSHOT-repo.zip
[withMaven] artifactsPublisher - Archive artifact core-it-support\core-it-extension\pom.xml under org\apache\maven\its\core-it-extension\2.1-SNAPSHOT\core-it-extension-2.1-SNAPSHOT.pom
[withMaven] artifactsPublisher - Archive artifact core-it-support\core-it-extension\target\core-it-extension-2.1-SNAPSHOT.jar under org\apache\maven\its\core-it-extension\2.1-SNAPSHOT\core-it-extension-2.1-SNAPSHOT.jar
[withMaven] artifactsPublisher - Archive artifact core-it-support\core-it-javaagent\pom.xml under mng-coreit\javaagent\1.0-SNAPSHOT\javaagent-1.0-SNAPSHOT.pom
[withMaven] artifactsPublisher - Archive artifact core-it-support\core-it-javaagent\target\javaagent-1.0-SNAPSHOT.jar under mng-coreit\javaagent\1.0-SNAPSHOT\javaagent-1.0-SNAPSHOT.jar
[withMaven] artifactsPublisher - Archive artifact core-it-suite\pom.xml under org\apache\maven\its\core-it-suite\2.1-SNAPSHOT\core-it-suite-2.1-SNAPSHOT.pom
[withMaven] artifactsPublisher - Archive artifact core-it-suite\target\core-it-suite-2.1-SNAPSHOT.jar under org\apache\maven\its\core-it-suite\2.1-SNAPSHOT\core-it-suite-2.1-SNAPSHOT.jar
[withMaven] artifactsPublisher - Archive artifact core-it-suite\target\core-it-suite-2.1-SNAPSHOT-tests.jar under org\apache\maven\its\core-it-suite\2.1-SNAPSHOT\core-it-suite-2.1-SNAPSHOT-tests.jar
[Pipeline] }
[Pipeline] // dir
[Pipeline] }
[Pipeline] // stage
[Pipeline] }
[Pipeline] // node
[Pipeline] }
[DevOpticsMavenPublisher] dependencies consumed: 5, artifacts produced: 156
[withMaven] Publishers: Pipeline Graph Publisher: 14 ms, Generated Artifacts Publisher: 44919 ms, Invoker Publisher: 2 ms, Junit Publisher: 106414 ms, Concordion Publisher: 2 ms, Dependencies Fingerprint Publisher: 1847 ms, Findbugs Publisher: 1 ms, JGiven Publisher: 1 ms, Jacoco Publisher: 1 ms, Open Task Scanner Publisher: 2431 ms, CloudBees DevOptics Gate Artifact Publisher: 91551 ms
[Pipeline] // withMaven
[Pipeline] fileExists
[Pipeline] zip
Writing zip file of c:\mvn-it-0.tmp\core-it-suite\target\test-classes to c:\mvn-it-0.tmp\core-it-suite-logs-windows-jdk8.zip
[withMaven] junitPublisher - Archive test results for Maven artifact org.apache.maven.its.plugins:maven-it-plugin-active-collection:maven-plugin:2.1-SNAPSHOT generated by maven-surefire-plugin:test (default-test): core-it-support\core-it-plugins\maven-it-plugin-active-collection\target\surefire-reports\*.xml
[withMaven] junitPublisher - Archive test results for Maven artifact org.apache.maven.its.plugins:maven-it-plugin-ant-based:maven-plugin:2.1-SNAPSHOT generated by maven-surefire-plugin:test (default-test): core-it-support\core-it-plugins\maven-it-plugin-ant-based\target\surefire-reports\*.xml
[withMaven] junitPublisher - Archive test results for Maven artifact org.apache.maven.its.plugins:maven-it-plugin-artifact:maven-plugin:2.1-SNAPSHOT generated by maven-surefire-plugin:test (default-test): core-it-support\core-it-plugins\maven-it-plugin-artifact\target\surefire-reports\*.xml
[withMaven] junitPublisher - Archive test results for Maven artifact org.apache.maven.its.plugins.class-loader:dep-a:jar:2.1-SNAPSHOT generated by maven-surefire-plugin:test (default-test): core-it-support\core-it-plugins\maven-it-plugin-class-loader\dep-a\target\surefire-reports\*.xml
[withMaven] junitPublisher - Archive test results for Maven artifact org.apache.maven.its.plugins.class-loader:dep-b:jar:2.1-SNAPSHOT generated by maven-surefire-plugin:test (default-test): core-it-support\core-it-plugins\maven-it-plugin-class-loader\dep-b\target\surefire-reports\*.xml
[withMaven] junitPublisher - Archive test results for Maven artifact org.apache.maven.its.plugins.class-loader:dep-c:jar:2.1-SNAPSHOT generated by maven-surefire-plugin:test (default-test): core-it-support\core-it-plugins\maven-it-plugin-class-loader\dep-c\target\surefire-reports\*.xml
[withMaven] junitPublisher - Archive test results for Maven artifact org.apache.maven.its.plugins:maven-it-plugin-class-loader:maven-plugin:2.1-SNAPSHOT generated by maven-surefire-plugin:test (default-test): core-it-support\core-it-plugins\maven-it-plugin-class-loader\maven-it-plugin-class-loader\target\surefire-reports\*.xml
[withMaven] junitPublisher - Archive test results for Maven artifact org.apache.maven.its.plugins:maven-it-plugin-configuration:maven-plugin:2.1-SNAPSHOT generated by maven-surefire-plugin:test (default-test): core-it-support\core-it-plugins\maven-it-plugin-configuration\target\surefire-reports\*.xml
[withMaven] junitPublisher - Archive test results for Maven artifact org.apache.maven.its.plugins:maven-it-plugin-context-passing:maven-plugin:2.1-SNAPSHOT generated by maven-surefire-plugin:test (default-test): core-it-support\core-it-plugins\maven-it-plugin-context-passing\target\surefire-reports\*.xml
[withMaven] junitPublisher - Archive test results for Maven artifact org.apache.maven.plugins:maven-clean-plugin:maven-plugin:0.1-stub-SNAPSHOT generated by maven-surefire-plugin:test (default-test): core-it-support\core-it-plugins\maven-it-plugin-core-stubs\maven-clean-plugin\target\surefire-reports\*.xml
[withMaven] junitPublisher - Archive test results for Maven artifact org.apache.maven.plugins:maven-compiler-plugin:maven-plugin:0.1-stub-SNAPSHOT generated by maven-surefire-plugin:test (default-test): core-it-support\core-it-plugins\maven-it-plugin-core-stubs\maven-compiler-plugin\target\surefire-reports\*.xml
[withMaven] junitPublisher - Archive test results for Maven artifact org.apache.maven.plugins:maven-deploy-plugin:maven-plugin:0.1-stub-SNAPSHOT generated by maven-surefire-plugin:test (default-test): core-it-support\core-it-plugins\maven-it-plugin-core-stubs\maven-deploy-plugin\target\surefire-reports\*.xml
[withMaven] junitPublisher - Archive test results for Maven artifact org.apache.maven.plugins:maven-ear-plugin:maven-plugin:0.1-stub-SNAPSHOT generated by maven-surefire-plugin:test (default-test): core-it-support\core-it-plugins\maven-it-plugin-core-stubs\maven-ear-plugin\target\surefire-reports\*.xml
[withMaven] junitPublisher - Archive test results for Maven artifact org.apache.maven.plugins:maven-ejb-plugin:maven-plugin:0.1-stub-SNAPSHOT generated by maven-surefire-plugin:test (default-test): core-it-support\core-it-plugins\maven-it-plugin-core-stubs\maven-ejb-plugin\target\surefire-reports\*.xml
[withMaven] junitPublisher - Archive test results for Maven artifact org.apache.maven.plugins:maven-install-plugin:maven-plugin:0.1-stub-SNAPSHOT generated by maven-surefire-plugin:test (default-test): core-it-support\core-it-plugins\maven-it-plugin-core-stubs\maven-install-plugin\target\surefire-reports\*.xml
[withMaven] junitPublisher - Archive test results for Maven artifact org.apache.maven.plugins:maven-jar-plugin:maven-plugin:0.1-stub-SNAPSHOT generated by maven-surefire-plugin:test (default-test): core-it-support\core-it-plugins\maven-it-plugin-core-stubs\maven-jar-plugin\target\surefire-reports\*.xml
[withMaven] junitPublisher - Archive test results for Maven artifact org.apache.maven.plugins:maven-javadoc-plugin:maven-plugin:0.1-stub-SNAPSHOT generated by maven-surefire-plugin:test (default-test): core-it-support\core-it-plugins\maven-it-plugin-core-stubs\maven-javadoc-plugin\target\surefire-reports\*.xml
[withMaven] junitPublisher - Archive test results for Maven artifact org.apache.maven.plugins:maven-plugin-plugin:maven-plugin:0.1-stub-SNAPSHOT generated by maven-surefire-plugin:test (default-test): core-it-support\core-it-plugins\maven-it-plugin-core-stubs\maven-plugin-plugin\target\surefire-reports\*.xml
[withMaven] junitPublisher - Archive test results for Maven artifact org.apache.maven.plugins:maven-rar-plugin:maven-plugin:0.1-stub-SNAPSHOT generated by maven-surefire-plugin:test (default-test): core-it-support\core-it-plugins\maven-it-plugin-core-stubs\maven-rar-plugin\target\surefire-reports\*.xml
[withMaven] junitPublisher - Archive test results for Maven artifact org.apache.maven.plugins:maven-resources-plugin:maven-plugin:0.1-stub-SNAPSHOT generated by maven-surefire-plugin:test (default-test): core-it-support\core-it-plugins\maven-it-plugin-core-stubs\maven-resources-plugin\target\surefire-reports\*.xml
[withMaven] junitPublisher - Archive test results for Maven artifact org.apache.maven.plugins:maven-site-plugin:maven-plugin:0.1-stub-SNAPSHOT generated by maven-surefire-plugin:test (default-test): core-it-support\core-it-plugins\maven-it-plugin-core-stubs\maven-site-plugin\target\surefire-reports\*.xml
[withMaven] junitPublisher - Archive test results for Maven artifact org.apache.maven.plugins:maven-source-plugin:maven-plugin:0.1-stub-SNAPSHOT generated by maven-surefire-plugin:test (default-test): core-it-support\core-it-plugins\maven-it-plugin-core-stubs\maven-source-plugin\target\surefire-reports\*.xml
[withMaven] junitPublisher - Archive test results for Maven artifact org.apache.maven.plugins:maven-surefire-plugin:maven-plugin:0.1-stub-SNAPSHOT generated by maven-surefire-plugin:test (default-test): core-it-support\core-it-plugins\maven-it-plugin-core-stubs\maven-surefire-plugin\target\surefire-reports\*.xml
[withMaven] junitPublisher - Archive test results for Maven artifact org.apache.maven.plugins:maven-war-plugin:maven-plugin:0.1-stub-SNAPSHOT generated by maven-surefire-plugin:test (default-test): core-it-support\core-it-plugins\maven-it-plugin-core-stubs\maven-war-plugin\target\surefire-reports\*.xml
[withMaven] junitPublisher - Archive test results for Maven artifact org.apache.maven.its.plugins:maven-it-plugin-dependency-collection:maven-plugin:2.1-SNAPSHOT generated by maven-surefire-plugin:test (default-test): core-it-support\core-it-plugins\maven-it-plugin-dependency-collection\target\surefire-reports\*.xml
[withMaven] junitPublisher - Archive test results for Maven artifact org.apache.maven.its.plugins:maven-it-plugin-dependency-resolution:maven-plugin:2.1-SNAPSHOT generated by maven-surefire-plugin:test (default-test): core-it-support\core-it-plugins\maven-it-plugin-dependency-resolution\target\surefire-reports\*.xml
[withMaven] junitPublisher - Archive test results for Maven artifact org.apache.maven.its.plugins:maven-it-plugin-expression:maven-plugin:2.1-SNAPSHOT generated by maven-surefire-plugin:test (default-test): core-it-support\core-it-plugins\maven-it-plugin-expression\target\surefire-reports\*.xml
[withMaven] junitPublisher - Archive test results for Maven artifact org.apache.maven.its.plugins:maven-it-plugin-error:maven-plugin:2.1-SNAPSHOT generated by maven-surefire-plugin:test (default-test): core-it-support\core-it-plugins\maven-it-plugin-error\target\surefire-reports\*.xml
[withMaven] junitPublisher - Archive test results for Maven artifact org.apache.maven.its:core-it-component:jar:2.1-SNAPSHOT generated by maven-surefire-plugin:test (default-test): core-it-support\core-it-component\target\surefire-reports\*.xml
[withMaven] junitPublisher - Archive test results for Maven artifact org.apache.maven.its.plugins:maven-it-plugin-extension-consumer:maven-plugin:2.1-SNAPSHOT generated by maven-surefire-plugin:test (default-test): core-it-support\core-it-plugins\maven-it-plugin-extension-consumer\target\surefire-reports\*.xml
[withMaven] junitPublisher - Archive test results for Maven artifact org.apache.maven.its.plugins:maven-it-plugin-extension-provider:maven-plugin:2.1-SNAPSHOT generated by maven-surefire-plugin:test (default-test): core-it-support\core-it-plugins\maven-it-plugin-extension-provider\target\surefire-reports\*.xml
[withMaven] junitPublisher - Archive test results for Maven artifact org.apache.maven.its.plugins:maven-it-plugin-fork:maven-plugin:2.1-SNAPSHOT generated by maven-surefire-plugin:test (default-test): core-it-support\core-it-plugins\maven-it-plugin-fork\target\surefire-reports\*.xml
[withMaven] junitPublisher - Archive test results for Maven artifact org.apache.maven.its.plugins:maven-it-plugin-invalid-descriptor:maven-plugin:2.1-SNAPSHOT generated by maven-surefire-plugin:test (default-test): core-it-support\core-it-plugins\maven-it-plugin-invalid-descriptor\target\surefire-reports\*.xml
[withMaven] junitPublisher - Archive test results for Maven artifact org.apache.maven.its.plugins:maven-it-plugin-log-file:maven-plugin:2.1-SNAPSHOT generated by maven-surefire-plugin:test (default-test): core-it-support\core-it-plugins\maven-it-plugin-log-file\target\surefire-reports\*.xml
[withMaven] junitPublisher - Archive test results for Maven artifact org.apache.maven.its:maven-it-helper:jar:2.1-SNAPSHOT generated by maven-surefire-plugin:test (default-test): core-it-support\maven-it-helper\target\surefire-reports\*.xml
[withMaven] junitPublisher - Archive test results for Maven artifact org.apache.maven.its.plugins:maven-it-plugin-model-interpolation:maven-plugin:2.1-SNAPSHOT generated by maven-surefire-plugin:test (default-test): core-it-support\core-it-plugins\maven-it-plugin-model-interpolation\target\surefire-reports\*.xml
[withMaven] junitPublisher - Archive test results for Maven artifact org.apache.maven.its.plugins:maven-it-plugin-no-default-comp:maven-plugin:2.1-SNAPSHOT generated by maven-surefire-plugin:test (default-test): core-it-support\core-it-plugins\maven-it-plugin-no-default-comp\target\surefire-reports\*.xml
[withMaven] junitPublisher - Archive test results for Maven artifact org.apache.maven.its.plugins:maven-it-plugin-no-project:maven-plugin:2.1-SNAPSHOT generated by maven-surefire-plugin:test (default-test): core-it-support\core-it-plugins\maven-it-plugin-no-project\target\surefire-reports\*.xml
[withMaven] junitPublisher - Archive test results for Maven artifact org.apache.maven.its.plugins:maven-it-plugin-online:maven-plugin:2.1-SNAPSHOT generated by maven-surefire-plugin:test (default-test): core-it-support\core-it-plugins\maven-it-plugin-online\target\surefire-reports\*.xml
[withMaven] junitPublisher - Archive test results for Maven artifact org.apache.maven.its.plugins:maven-it-plugin-optional-mojos:maven-plugin:2.1-SNAPSHOT generated by maven-surefire-plugin:test (default-test): core-it-support\core-it-plugins\maven-it-plugin-optional-mojos\target\surefire-reports\*.xml
[withMaven] junitPublisher - Archive test results for Maven artifact org.apache.maven.its.plugins:maven-it-plugin-packaging:maven-plugin:2.1-SNAPSHOT generated by maven-surefire-plugin:test (default-test): core-it-support\core-it-plugins\maven-it-plugin-packaging\target\surefire-reports\*.xml
[withMaven] junitPublisher - Archive test results for Maven artifact org.apache.maven.its.plugins:maven-it-plugin-parameter-implementation:maven-plugin:2.1-SNAPSHOT generated by maven-surefire-plugin:test (default-test): core-it-support\core-it-plugins\maven-it-plugin-parameter-implementation\target\surefire-reports\*.xml
[withMaven] junitPublisher - Archive test results for Maven artifact org.apache.maven.its.plugins:maven-it-plugin-plugin-dependency:maven-plugin:2.1-SNAPSHOT generated by maven-surefire-plugin:test (default-test): core-it-support\core-it-plugins\maven-it-plugin-plugin-dependency\target\surefire-reports\*.xml
[withMaven] junitPublisher - Archive test results for Maven artifact org.apache.maven.its.plugins:maven-it-plugin-project:maven-plugin:2.1-SNAPSHOT generated by maven-surefire-plugin:test (default-test): core-it-support\core-it-plugins\maven-it-plugin-project\target\surefire-reports\*.xml
[withMaven] junitPublisher - Archive test results for Maven artifact org.apache.maven.its.plugins:maven-it-plugin-project-interpolation:maven-plugin:2.1-SNAPSHOT generated by maven-surefire-plugin:test (default-test): core-it-support\core-it-plugins\maven-it-plugin-project-interpolation\target\surefire-reports\*.xml
[withMaven] junitPublisher - Archive test results for Maven artifact org.apache.maven.its.plugins:maven-it-plugin-setter:maven-plugin:2.1-SNAPSHOT generated by maven-surefire-plugin:test (default-test): core-it-support\core-it-plugins\maven-it-plugin-setter\target\surefire-reports\*.xml
[withMaven] junitPublisher - Archive test results for Maven artifact org.apache.maven.its.plugins:maven-it-plugin-singleton-component:maven-plugin:2.1-SNAPSHOT generated by maven-surefire-plugin:test (default-test): core-it-support\core-it-plugins\maven-it-plugin-singleton-component\target\surefire-reports\*.xml
[withMaven] junitPublisher - Archive test results for Maven artifact org.apache.maven.its.plugins:maven-it-plugin-site:maven-plugin:2.1-SNAPSHOT generated by maven-surefire-plugin:test (default-test): core-it-support\core-it-plugins\maven-it-plugin-site\target\surefire-reports\*.xml
[withMaven] junitPublisher - Archive test results for Maven artifact org.apache.maven.its.plugins:maven-it-plugin-toolchain:maven-plugin:2.1-SNAPSHOT generated by maven-surefire-plugin:test (default-test): core-it-support\core-it-plugins\maven-it-plugin-toolchain\target\surefire-reports\*.xml
[withMaven] junitPublisher - Archive test results for Maven artifact org.apache.maven.its.plugins:maven-it-plugin-touch:maven-plugin:2.1-SNAPSHOT generated by maven-surefire-plugin:test (default-test): core-it-support\core-it-plugins\maven-it-plugin-touch\target\surefire-reports\*.xml
[withMaven] junitPublisher - Archive test results for Maven artifact org.apache.maven.its.plugins:maven-it-plugin-uses-properties:maven-plugin:2.1-SNAPSHOT generated by maven-surefire-plugin:test (default-test): core-it-support\core-it-plugins\maven-it-plugin-uses-properties\target\surefire-reports\*.xml
[withMaven] junitPublisher - Archive test results for Maven artifact org.apache.maven.its.plugins:maven-it-plugin-uses-wagon:maven-plugin:2.1-SNAPSHOT generated by maven-surefire-plugin:test (default-test): core-it-support\core-it-plugins\maven-it-plugin-uses-wagon\target\surefire-reports\*.xml
[withMaven] junitPublisher - Archive test results for Maven artifact org.apache.maven.its.plugins:maven-it-plugin-all:maven-plugin:2.1-SNAPSHOT generated by maven-surefire-plugin:test (default-test): core-it-support\core-it-plugins\maven-it-plugin-all\target\surefire-reports\*.xml
[withMaven] junitPublisher - Archive test results for Maven artifact org.apache.maven.its.plugins:maven-it-plugin-plexus-utils-11:maven-plugin:2.1-SNAPSHOT generated by maven-surefire-plugin:test (default-test): core-it-support\core-it-plugins\maven-it-plugin-plexus-utils-11\target\surefire-reports\*.xml
[withMaven] junitPublisher - Archive test results for Maven artifact org.apache.maven.its.plugins:maven-it-plugin-plexus-utils-new:maven-plugin:2.1-SNAPSHOT generated by maven-surefire-plugin:test (default-test): core-it-support\core-it-plugins\maven-it-plugin-plexus-utils-new\target\surefire-reports\*.xml
[withMaven] junitPublisher - Archive test results for Maven artifact org.apache.maven.its.plugins:maven-it-plugin-plexus-component-api:maven-plugin:2.1-SNAPSHOT generated by maven-surefire-plugin:test (default-test): core-it-support\core-it-plugins\maven-it-plugin-plexus-component-api\target\surefire-reports\*.xml
[withMaven] junitPublisher - Archive test results for Maven artifact org.apache.maven.its.plugins:maven-it-plugin-log4j:maven-plugin:2.1-SNAPSHOT generated by maven-surefire-plugin:test (default-test): core-it-support\core-it-plugins\maven-it-plugin-log4j\target\surefire-reports\*.xml
[withMaven] junitPublisher - Archive test results for Maven artifact org.apache.maven.its.plugins:maven-it-plugin-extension1:maven-plugin:2.1-SNAPSHOT generated by maven-surefire-plugin:test (default-test): core-it-support\core-it-plugins\maven-it-plugin-extension1\target\surefire-reports\*.xml
[withMaven] junitPublisher - Archive test results for Maven artifact org.apache.maven.its.plugins:maven-it-plugin-extension2:maven-plugin:2.1-SNAPSHOT generated by maven-surefire-plugin:test (default-test): core-it-support\core-it-plugins\maven-it-plugin-extension2\target\surefire-reports\*.xml
[withMaven] junitPublisher - Archive test results for Maven artifact org.apache.maven.its.plugins:maven-it-plugin-plexus-lifecycle:maven-plugin:2.1-SNAPSHOT generated by maven-surefire-plugin:test (default-test): core-it-support\core-it-plugins\maven-it-plugin-plexus-lifecycle\target\surefire-reports\*.xml
[withMaven] junitPublisher - Archive test results for Maven artifact org.apache.maven.its.plugins:maven-it-plugin-settings:maven-plugin:2.1-SNAPSHOT generated by maven-surefire-plugin:test (default-test): core-it-support\core-it-plugins\maven-it-plugin-settings\target\surefire-reports\*.xml
[withMaven] junitPublisher - Archive test results for Maven artifact org.apache.maven.its.plugins:mng-5805-pkg-type-mojo-configuration-extension:jar:2.1-SNAPSHOT generated by maven-surefire-plugin:test (default-test): core-it-support\core-it-plugins\mng5805-extension\target\surefire-reports\*.xml
[withMaven] junitPublisher - Archive test results for Maven artifact org.apache.maven.its.plugins:mng-5805-pkg-type-mojo-configuration-extension2:jar:2.1-SNAPSHOT generated by maven-surefire-plugin:test (default-test): core-it-support\core-it-plugins\mng5805-extension2\target\surefire-reports\*.xml
[withMaven] junitPublisher - Archive test results for Maven artifact org.apache.maven.its.plugins:mng-5805-pkg-type-mojo-configuration-plugin:maven-plugin:2.1-SNAPSHOT generated by maven-surefire-plugin:test (default-test): core-it-support\core-it-plugins\mng5805-plugin\target\surefire-reports\*.xml
[withMaven] junitPublisher - Archive test results for Maven artifact org.apache.maven.its.plugins:mng-5805-pkg-type-mojo-configuration-plugin-dep:jar:2.1-SNAPSHOT generated by maven-surefire-plugin:test (default-test): core-it-support\core-it-plugins\mng5805-plugin-dep\target\surefire-reports\*.xml
[withMaven] junitPublisher - Archive test results for Maven artifact org.apache.maven.its.plugins:mng-5958-pkg-type-extension:jar:2.1-SNAPSHOT generated by maven-surefire-plugin:test (default-test): core-it-support\core-it-plugins\mng5958-extension\target\surefire-reports\*.xml
[withMaven] junitPublisher - Archive test results for Maven artifact org.apache.maven.its.plugins:mng-6759-resolves-project-dependencies-plugin:maven-plugin:2.1-SNAPSHOT generated by maven-surefire-plugin:test (default-test): core-it-support\core-it-plugins\mng6759-plugin-resolves-project-dependencies\target\surefire-reports\*.xml
[withMaven] junitPublisher - Archive test results for Maven artifact org.apache.maven.its:core-it-toolchain:jar:2.1-SNAPSHOT generated by maven-surefire-plugin:test (default-test): core-it-support\core-it-toolchain\target\surefire-reports\*.xml
[withMaven] junitPublisher - Archive test results for Maven artifact org.apache.maven.its:core-it-wagon:jar:2.1-SNAPSHOT generated by maven-surefire-plugin:test (default-test): core-it-support\core-it-wagon\target\surefire-reports\*.xml
[withMaven] junitPublisher - Archive test results for Maven artifact org.apache.maven.its:core-it-extension:jar:2.1-SNAPSHOT generated by maven-surefire-plugin:test (default-test): core-it-support\core-it-extension\target\surefire-reports\*.xml
[withMaven] junitPublisher - Archive test results for Maven artifact mng-coreit:javaagent:jar:1.0-SNAPSHOT generated by maven-surefire-plugin:test (default-test): core-it-support\core-it-javaagent\target\surefire-reports\*.xml
[withMaven] junitPublisher - Archive test results for Maven artifact org.apache.maven.its:core-it-suite:jar:2.1-SNAPSHOT generated by maven-surefire-plugin:test (default-test): core-it-suite\target\surefire-reports\*.xml
Recording test results
Zipped 6735 entries.
Archiving c:\mvn-it-0.tmp\core-it-suite-logs-windows-jdk8.zip
[withMaven] openTasksPublisher - Scan Tasks for Maven artifact org.apache.maven.its.plugins:maven-it-plugin-active-collection:maven-plugin:2.1-SNAPSHOT in source directory core-it-support\core-it-plugins\maven-it-plugin-active-collection\src\main\java
[withMaven] openTasksPublisher - Scan Tasks for Maven artifact org.apache.maven.its.plugins:maven-it-plugin-artifact:maven-plugin:2.1-SNAPSHOT in source directory core-it-support\core-it-plugins\maven-it-plugin-artifact\src\main\java
[withMaven] openTasksPublisher - Scan Tasks for Maven artifact org.apache.maven.its.plugins.class-loader:dep-a:jar:2.1-SNAPSHOT in source directory core-it-support\core-it-plugins\maven-it-plugin-class-loader\dep-a\src\main\java
[withMaven] openTasksPublisher - Scan Tasks for Maven artifact org.apache.maven.its.plugins.class-loader:dep-b:jar:2.1-SNAPSHOT in source directory core-it-support\core-it-plugins\maven-it-plugin-class-loader\dep-b\src\main\java
[withMaven] openTasksPublisher - Scan Tasks for Maven artifact org.apache.maven.its.plugins:maven-it-plugin-class-loader:maven-plugin:2.1-SNAPSHOT in source directory core-it-support\core-it-plugins\maven-it-plugin-class-loader\maven-it-plugin-class-loader\src\main\java
[withMaven] openTasksPublisher - Scan Tasks for Maven artifact org.apache.maven.its.plugins:maven-it-plugin-configuration:maven-plugin:2.1-SNAPSHOT in source directory core-it-support\core-it-plugins\maven-it-plugin-configuration\src\main\java
[withMaven] openTasksPublisher - Scan Tasks for Maven artifact org.apache.maven.its.plugins:maven-it-plugin-context-passing:maven-plugin:2.1-SNAPSHOT in source directory core-it-support\core-it-plugins\maven-it-plugin-context-passing\src\main\java
[withMaven] openTasksPublisher - Scan Tasks for Maven artifact org.apache.maven.plugins:maven-clean-plugin:maven-plugin:0.1-stub-SNAPSHOT in source directory core-it-support\core-it-plugins\maven-it-plugin-core-stubs\maven-clean-plugin\src\main\java
[withMaven] openTasksPublisher - Scan Tasks for Maven artifact org.apache.maven.plugins:maven-compiler-plugin:maven-plugin:0.1-stub-SNAPSHOT in source directory core-it-support\core-it-plugins\maven-it-plugin-core-stubs\maven-compiler-plugin\src\main\java
[withMaven] openTasksPublisher - Scan Tasks for Maven artifact org.apache.maven.plugins:maven-deploy-plugin:maven-plugin:0.1-stub-SNAPSHOT in source directory core-it-support\core-it-plugins\maven-it-plugin-core-stubs\maven-deploy-plugin\src\main\java
[withMaven] openTasksPublisher - Scan Tasks for Maven artifact org.apache.maven.plugins:maven-ear-plugin:maven-plugin:0.1-stub-SNAPSHOT in source directory core-it-support\core-it-plugins\maven-it-plugin-core-stubs\maven-ear-plugin\src\main\java
[withMaven] openTasksPublisher - Scan Tasks for Maven artifact org.apache.maven.plugins:maven-ejb-plugin:maven-plugin:0.1-stub-SNAPSHOT in source directory core-it-support\core-it-plugins\maven-it-plugin-core-stubs\maven-ejb-plugin\src\main\java
[withMaven] openTasksPublisher - Scan Tasks for Maven artifact org.apache.maven.plugins:maven-install-plugin:maven-plugin:0.1-stub-SNAPSHOT in source directory core-it-support\core-it-plugins\maven-it-plugin-core-stubs\maven-install-plugin\src\main\java
[withMaven] openTasksPublisher - Scan Tasks for Maven artifact org.apache.maven.plugins:maven-jar-plugin:maven-plugin:0.1-stub-SNAPSHOT in source directory core-it-support\core-it-plugins\maven-it-plugin-core-stubs\maven-jar-plugin\src\main\java
[withMaven] openTasksPublisher - Scan Tasks for Maven artifact org.apache.maven.plugins:maven-javadoc-plugin:maven-plugin:0.1-stub-SNAPSHOT in source directory core-it-support\core-it-plugins\maven-it-plugin-core-stubs\maven-javadoc-plugin\src\main\java
[withMaven] openTasksPublisher - Scan Tasks for Maven artifact org.apache.maven.plugins:maven-plugin-plugin:maven-plugin:0.1-stub-SNAPSHOT in source directory core-it-support\core-it-plugins\maven-it-plugin-core-stubs\maven-plugin-plugin\src\main\java
[withMaven] openTasksPublisher - Scan Tasks for Maven artifact org.apache.maven.plugins:maven-rar-plugin:maven-plugin:0.1-stub-SNAPSHOT in source directory core-it-support\core-it-plugins\maven-it-plugin-core-stubs\maven-rar-plugin\src\main\java
[withMaven] openTasksPublisher - Scan Tasks for Maven artifact org.apache.maven.plugins:maven-resources-plugin:maven-plugin:0.1-stub-SNAPSHOT in source directory core-it-support\core-it-plugins\maven-it-plugin-core-stubs\maven-resources-plugin\src\main\java
[withMaven] openTasksPublisher - Scan Tasks for Maven artifact org.apache.maven.plugins:maven-site-plugin:maven-plugin:0.1-stub-SNAPSHOT in source directory core-it-support\core-it-plugins\maven-it-plugin-core-stubs\maven-site-plugin\src\main\java
[withMaven] openTasksPublisher - Scan Tasks for Maven artifact org.apache.maven.plugins:maven-source-plugin:maven-plugin:0.1-stub-SNAPSHOT in source directory core-it-support\core-it-plugins\maven-it-plugin-core-stubs\maven-source-plugin\src\main\java
[withMaven] openTasksPublisher - Scan Tasks for Maven artifact org.apache.maven.plugins:maven-surefire-plugin:maven-plugin:0.1-stub-SNAPSHOT in source directory core-it-support\core-it-plugins\maven-it-plugin-core-stubs\maven-surefire-plugin\src\main\java
[withMaven] openTasksPublisher - Scan Tasks for Maven artifact org.apache.maven.plugins:maven-war-plugin:maven-plugin:0.1-stub-SNAPSHOT in source directory core-it-support\core-it-plugins\maven-it-plugin-core-stubs\maven-war-plugin\src\main\java
[withMaven] openTasksPublisher - Scan Tasks for Maven artifact org.apache.maven.its.plugins:maven-it-plugin-dependency-collection:maven-plugin:2.1-SNAPSHOT in source directory core-it-support\core-it-plugins\maven-it-plugin-dependency-collection\src\main\java
[withMaven] openTasksPublisher - Scan Tasks for Maven artifact org.apache.maven.its.plugins:maven-it-plugin-dependency-resolution:maven-plugin:2.1-SNAPSHOT in source directory core-it-support\core-it-plugins\maven-it-plugin-dependency-resolution\src\main\java
[withMaven] openTasksPublisher - Scan Tasks for Maven artifact org.apache.maven.its.plugins:maven-it-plugin-expression:maven-plugin:2.1-SNAPSHOT in source directory core-it-support\core-it-plugins\maven-it-plugin-expression\src\main\java
[withMaven] openTasksPublisher - Scan Tasks for Maven artifact org.apache.maven.its.plugins:maven-it-plugin-error:maven-plugin:2.1-SNAPSHOT in source directory core-it-support\core-it-plugins\maven-it-plugin-error\src\main\java
[withMaven] openTasksPublisher - Scan Tasks for Maven artifact org.apache.maven.its:core-it-component:jar:2.1-SNAPSHOT in source directory core-it-support\core-it-component\src\main\java
[withMaven] openTasksPublisher - Scan Tasks for Maven artifact org.apache.maven.its.plugins:maven-it-plugin-extension-consumer:maven-plugin:2.1-SNAPSHOT in source directory core-it-support\core-it-plugins\maven-it-plugin-extension-consumer\src\main\java
[withMaven] openTasksPublisher - Scan Tasks for Maven artifact org.apache.maven.its.plugins:maven-it-plugin-extension-provider:maven-plugin:2.1-SNAPSHOT in source directory core-it-support\core-it-plugins\maven-it-plugin-extension-provider\src\main\java
[withMaven] openTasksPublisher - Scan Tasks for Maven artifact org.apache.maven.its.plugins:maven-it-plugin-fork:maven-plugin:2.1-SNAPSHOT in source directory core-it-support\core-it-plugins\maven-it-plugin-fork\src\main\java
[withMaven] openTasksPublisher - Scan Tasks for Maven artifact org.apache.maven.its.plugins:maven-it-plugin-invalid-descriptor:maven-plugin:2.1-SNAPSHOT in source directory core-it-support\core-it-plugins\maven-it-plugin-invalid-descriptor\src\main\java
[withMaven] openTasksPublisher - Scan Tasks for Maven artifact org.apache.maven.its.plugins:maven-it-plugin-log-file:maven-plugin:2.1-SNAPSHOT in source directory core-it-support\core-it-plugins\maven-it-plugin-log-file\src\main\java
[Pipeline] fileExists
[withMaven] openTasksPublisher - Scan Tasks for Maven artifact org.apache.maven.its:maven-it-helper:jar:2.1-SNAPSHOT in source directory core-it-support\maven-it-helper\src\main\java
[withMaven] openTasksPublisher - Scan Tasks for Maven artifact org.apache.maven.its.plugins:maven-it-plugin-model-interpolation:maven-plugin:2.1-SNAPSHOT in source directory core-it-support\core-it-plugins\maven-it-plugin-model-interpolation\src\main\java
[withMaven] openTasksPublisher - Scan Tasks for Maven artifact org.apache.maven.its.plugins:maven-it-plugin-no-default-comp:maven-plugin:2.1-SNAPSHOT in source directory core-it-support\core-it-plugins\maven-it-plugin-no-default-comp\src\main\java
[withMaven] openTasksPublisher - Scan Tasks for Maven artifact org.apache.maven.its.plugins:maven-it-plugin-no-project:maven-plugin:2.1-SNAPSHOT in source directory core-it-support\core-it-plugins\maven-it-plugin-no-project\src\main\java
[Pipeline] zip
[withMaven] openTasksPublisher - Scan Tasks for Maven artifact org.apache.maven.its.plugins:maven-it-plugin-online:maven-plugin:2.1-SNAPSHOT in source directory core-it-support\core-it-plugins\maven-it-plugin-online\src\main\java
[withMaven] openTasksPublisher - Scan Tasks for Maven artifact org.apache.maven.its.plugins:maven-it-plugin-optional-mojos:maven-plugin:2.1-SNAPSHOT in source directory core-it-support\core-it-plugins\maven-it-plugin-optional-mojos\src\main\java
[withMaven] openTasksPublisher - Scan Tasks for Maven artifact org.apache.maven.its.plugins:maven-it-plugin-packaging:maven-plugin:2.1-SNAPSHOT in source directory core-it-support\core-it-plugins\maven-it-plugin-packaging\src\main\java
Writing zip file of c:\mvn-it-0.tmp\core-it-suite\target\surefire-reports to c:\mvn-it-0.tmp\core-it-suite-reports-windows-jdk8.zip
[withMaven] openTasksPublisher - Scan Tasks for Maven artifact org.apache.maven.its.plugins:maven-it-plugin-parameter-implementation:maven-plugin:2.1-SNAPSHOT in source directory core-it-support\core-it-plugins\maven-it-plugin-parameter-implementation\src\main\java
[withMaven] openTasksPublisher - Scan Tasks for Maven artifact org.apache.maven.its.plugins:maven-it-plugin-plugin-dependency:maven-plugin:2.1-SNAPSHOT in source directory core-it-support\core-it-plugins\maven-it-plugin-plugin-dependency\src\main\java
[withMaven] openTasksPublisher - Scan Tasks for Maven artifact org.apache.maven.its.plugins:maven-it-plugin-project:maven-plugin:2.1-SNAPSHOT in source directory core-it-support\core-it-plugins\maven-it-plugin-project\src\main\java
Zipped 4 entries.
Archiving c:\mvn-it-0.tmp\core-it-suite-reports-windows-jdk8.zip
[withMaven] openTasksPublisher - Scan Tasks for Maven artifact org.apache.maven.its.plugins:maven-it-plugin-project-interpolation:maven-plugin:2.1-SNAPSHOT in source directory core-it-support\core-it-plugins\maven-it-plugin-project-interpolation\src\main\java
[withMaven] openTasksPublisher - Scan Tasks for Maven artifact org.apache.maven.its.plugins:maven-it-plugin-setter:maven-plugin:2.1-SNAPSHOT in source directory core-it-support\core-it-plugins\maven-it-plugin-setter\src\main\java
[withMaven] openTasksPublisher - Scan Tasks for Maven artifact org.apache.maven.its.plugins:maven-it-plugin-singleton-component:maven-plugin:2.1-SNAPSHOT in source directory core-it-support\core-it-plugins\maven-it-plugin-singleton-component\src\main\java
[withMaven] openTasksPublisher - Scan Tasks for Maven artifact org.apache.maven.its.plugins:maven-it-plugin-site:maven-plugin:2.1-SNAPSHOT in source directory core-it-support\core-it-plugins\maven-it-plugin-site\src\main\java
[withMaven] openTasksPublisher - Scan Tasks for Maven artifact org.apache.maven.its.plugins:maven-it-plugin-toolchain:maven-plugin:2.1-SNAPSHOT in source directory core-it-support\core-it-plugins\maven-it-plugin-toolchain\src\main\java
[withMaven] openTasksPublisher - Scan Tasks for Maven artifact org.apache.maven.its.plugins:maven-it-plugin-touch:maven-plugin:2.1-SNAPSHOT in source directory core-it-support\core-it-plugins\maven-it-plugin-touch\src\main\java
[withMaven] openTasksPublisher - Scan Tasks for Maven artifact org.apache.maven.its.plugins:maven-it-plugin-uses-properties:maven-plugin:2.1-SNAPSHOT in source directory core-it-support\core-it-plugins\maven-it-plugin-uses-properties\src\main\java
[withMaven] openTasksPublisher - Scan Tasks for Maven artifact org.apache.maven.its.plugins:maven-it-plugin-uses-wagon:maven-plugin:2.1-SNAPSHOT in source directory core-it-support\core-it-plugins\maven-it-plugin-uses-wagon\src\main\java
[withMaven] openTasksPublisher - Scan Tasks for Maven artifact org.apache.maven.its.plugins:maven-it-plugin-all:maven-plugin:2.1-SNAPSHOT in source directory core-it-support\core-it-plugins\maven-it-plugin-all\src\main\java
[withMaven] openTasksPublisher - Scan Tasks for Maven artifact org.apache.maven.its.plugins:maven-it-plugin-plexus-utils-11:maven-plugin:2.1-SNAPSHOT in source directory core-it-support\core-it-plugins\maven-it-plugin-plexus-utils-11\src\main\java
[withMaven] openTasksPublisher - Scan Tasks for Maven artifact org.apache.maven.its.plugins:maven-it-plugin-plexus-utils-new:maven-plugin:2.1-SNAPSHOT in source directory core-it-support\core-it-plugins\maven-it-plugin-plexus-utils-new\src\main\java
[withMaven] openTasksPublisher - Scan Tasks for Maven artifact org.apache.maven.its.plugins:maven-it-plugin-plexus-component-api:maven-plugin:2.1-SNAPSHOT in source directory core-it-support\core-it-plugins\maven-it-plugin-plexus-component-api\src\main\java
[withMaven] openTasksPublisher - Scan Tasks for Maven artifact org.apache.maven.its.plugins:maven-it-plugin-log4j:maven-plugin:2.1-SNAPSHOT in source directory core-it-support\core-it-plugins\maven-it-plugin-log4j\src\main\java
[Pipeline] deleteDir
[withMaven] openTasksPublisher - Scan Tasks for Maven artifact org.apache.maven.its.plugins:maven-it-plugin-extension1:maven-plugin:2.1-SNAPSHOT in source directory core-it-support\core-it-plugins\maven-it-plugin-extension1\src\main\java
[withMaven] openTasksPublisher - Scan Tasks for Maven artifact org.apache.maven.its.plugins:maven-it-plugin-extension2:maven-plugin:2.1-SNAPSHOT in source directory core-it-support\core-it-plugins\maven-it-plugin-extension2\src\main\java
[withMaven] openTasksPublisher - Scan Tasks for Maven artifact org.apache.maven.its.plugins:maven-it-plugin-plexus-lifecycle:maven-plugin:2.1-SNAPSHOT in source directory core-it-support\core-it-plugins\maven-it-plugin-plexus-lifecycle\src\main\java
[withMaven] openTasksPublisher - Scan Tasks for Maven artifact org.apache.maven.its.plugins:maven-it-plugin-settings:maven-plugin:2.1-SNAPSHOT in source directory core-it-support\core-it-plugins\maven-it-plugin-settings\src\main\java
[withMaven] openTasksPublisher - Scan Tasks for Maven artifact org.apache.maven.its.plugins:mng-5805-pkg-type-mojo-configuration-plugin:maven-plugin:2.1-SNAPSHOT in source directory core-it-support\core-it-plugins\mng5805-plugin\src\main\java
[withMaven] openTasksPublisher - Scan Tasks for Maven artifact org.apache.maven.its.plugins:mng-5805-pkg-type-mojo-configuration-plugin-dep:jar:2.1-SNAPSHOT in source directory core-it-support\core-it-plugins\mng5805-plugin-dep\src\main\java
[withMaven] openTasksPublisher - Scan Tasks for Maven artifact org.apache.maven.its.plugins:mng-5958-pkg-type-extension:jar:2.1-SNAPSHOT in source directory core-it-support\core-it-plugins\mng5958-extension\src\main\java
[withMaven] openTasksPublisher - Scan Tasks for Maven artifact org.apache.maven.its.plugins:mng-6759-resolves-project-dependencies-plugin:maven-plugin:2.1-SNAPSHOT in source directory core-it-support\core-it-plugins\mng6759-plugin-resolves-project-dependencies\src\main\java
[withMaven] openTasksPublisher - Scan Tasks for Maven artifact org.apache.maven.its:core-it-toolchain:jar:2.1-SNAPSHOT in source directory core-it-support\core-it-toolchain\src\main\java
[withMaven] openTasksPublisher - Scan Tasks for Maven artifact org.apache.maven.its:core-it-wagon:jar:2.1-SNAPSHOT in source directory core-it-support\core-it-wagon\src\main\java
[withMaven] openTasksPublisher - Scan Tasks for Maven artifact mng-coreit:javaagent:jar:1.0-SNAPSHOT in source directory core-it-support\core-it-javaagent\src\main\java
[TASKS] Scanning folder 'c:\mvn-it-0.tmp' for files matching the pattern 'core-it-support\core-it-plugins\maven-it-plugin-active-collection\src\main\java\**\*,core-it-support\core-it-plugins\maven-it-plugin-artifact\src\main\java\**\*,core-it-support\core-it-plugins\maven-it-plugin-class-loader\dep-a\src\main\java\**\*,core-it-support\core-it-plugins\maven-it-plugin-class-loader\dep-b\src\main\java\**\*,core-it-support\core-it-plugins\maven-it-plugin-class-loader\maven-it-plugin-class-loader\src\main\java\**\*,core-it-support\core-it-plugins\maven-it-plugin-configuration\src\main\java\**\*,core-it-support\core-it-plugins\maven-it-plugin-context-passing\src\main\java\**\*,core-it-support\core-it-plugins\maven-it-plugin-core-stubs\maven-clean-plugin\src\main\java\**\*,core-it-support\core-it-plugins\maven-it-plugin-core-stubs\maven-compiler-plugin\src\main\java\**\*,core-it-support\core-it-plugins\maven-it-plugin-core-stubs\maven-deploy-plugin\src\main\java\**\*,core-it-support\core-it-plugins\maven-it-plugin-core-stubs\maven-ear-plugin\src\main\java\**\*,core-it-support\core-it-plugins\maven-it-plugin-core-stubs\maven-ejb-plugin\src\main\java\**\*,core-it-support\core-it-plugins\maven-it-plugin-core-stubs\maven-install-plugin\src\main\java\**\*,core-it-support\core-it-plugins\maven-it-plugin-core-stubs\maven-jar-plugin\src\main\java\**\*,core-it-support\core-it-plugins\maven-it-plugin-core-stubs\maven-javadoc-plugin\src\main\java\**\*,core-it-support\core-it-plugins\maven-it-plugin-core-stubs\maven-plugin-plugin\src\main\java\**\*,core-it-support\core-it-plugins\maven-it-plugin-core-stubs\maven-rar-plugin\src\main\java\**\*,core-it-support\core-it-plugins\maven-it-plugin-core-stubs\maven-resources-plugin\src\main\java\**\*,core-it-support\core-it-plugins\maven-it-plugin-core-stubs\maven-site-plugin\src\main\java\**\*,core-it-support\core-it-plugins\maven-it-plugin-core-stubs\maven-source-plugin\src\main\java\**\*,core-it-support\core-it-plugins\maven-it-plugin-core-stubs\maven-surefire-plugin\src\main\java\**\*,core-it-support\core-it-plugins\maven-it-plugin-core-stubs\maven-war-plugin\src\main\java\**\*,core-it-support\core-it-plugins\maven-it-plugin-dependency-collection\src\main\java\**\*,core-it-support\core-it-plugins\maven-it-plugin-dependency-resolution\src\main\java\**\*,core-it-support\core-it-plugins\maven-it-plugin-expression\src\main\java\**\*,core-it-support\core-it-plugins\maven-it-plugin-error\src\main\java\**\*,core-it-support\core-it-component\src\main\java\**\*,core-it-support\core-it-plugins\maven-it-plugin-extension-consumer\src\main\java\**\*,core-it-support\core-it-plugins\maven-it-plugin-extension-provider\src\main\java\**\*,core-it-support\core-it-plugins\maven-it-plugin-fork\src\main\java\**\*,core-it-support\core-it-plugins\maven-it-plugin-invalid-descriptor\src\main\java\**\*,core-it-support\core-it-plugins\maven-it-plugin-log-file\src\main\java\**\*,core-it-support\maven-it-helper\src\main\java\**\*,core-it-support\core-it-plugins\maven-it-plugin-model-interpolation\src\main\java\**\*,core-it-support\core-it-plugins\maven-it-plugin-no-default-comp\src\main\java\**\*,core-it-support\core-it-plugins\maven-it-plugin-no-project\src\main\java\**\*,core-it-support\core-it-plugins\maven-it-plugin-online\src\main\java\**\*,core-it-support\core-it-plugins\maven-it-plugin-optional-mojos\src\main\java\**\*,core-it-support\core-it-plugins\maven-it-plugin-packaging\src\main\java\**\*,core-it-support\core-it-plugins\maven-it-plugin-parameter-implementation\src\main\java\**\*,core-it-support\core-it-plugins\maven-it-plugin-plugin-dependency\src\main\java\**\*,core-it-support\core-it-plugins\maven-it-plugin-project\src\main\java\**\*,core-it-support\core-it-plugins\maven-it-plugin-project-interpolation\src\main\java\**\*,core-it-support\core-it-plugins\maven-it-plugin-setter\src\main\java\**\*,core-it-support\core-it-plugins\maven-it-plugin-singleton-component\src\main\java\**\*,core-it-support\core-it-plugins\maven-it-plugin-site\src\main\java\**\*,core-it-support\core-it-plugins\maven-it-plugin-toolchain\src\main\java\**\*,core-it-support\core-it-plugins\maven-it-plugin-touch\src\main\java\**\*,core-it-support\core-it-plugins\maven-it-plugin-uses-properties\src\main\java\**\*,core-it-support\core-it-plugins\maven-it-plugin-uses-wagon\src\main\java\**\*,core-it-support\core-it-plugins\maven-it-plugin-all\src\main\java\**\*,core-it-support\core-it-plugins\maven-it-plugin-plexus-utils-11\src\main\java\**\*,core-it-support\core-it-plugins\maven-it-plugin-plexus-utils-new\src\main\java\**\*,core-it-support\core-it-plugins\maven-it-plugin-plexus-component-api\src\main\java\**\*,core-it-support\core-it-plugins\maven-it-plugin-log4j\src\main\java\**\*,core-it-support\core-it-plugins\maven-it-plugin-extension1\src\main\java\**\*,core-it-support\core-it-plugins\maven-it-plugin-extension2\src\main\java\**\*,core-it-support\core-it-plugins\maven-it-plugin-plexus-lifecycle\src\main\java\**\*,core-it-support\core-it-plugins\maven-it-plugin-settings\src\main\java\**\*,core-it-support\core-it-plugins\mng5805-plugin\src\main\java\**\*,core-it-support\core-it-plugins\mng5805-plugin-dep\src\main\java\**\*,core-it-support\core-it-plugins\mng5958-extension\src\main\java\**\*,core-it-support\core-it-plugins\mng6759-plugin-resolves-project-dependencies\src\main\java\**\*,core-it-support\core-it-toolchain\src\main\java\**\*,core-it-support\core-it-wagon\src\main\java\**\*,core-it-support\core-it-javaagent\src\main\java\**\*' - excludes: null
[TASKS] Found 167 files to scan for tasks
[TASKS] Found 0 open tasks.
Skipping warnings blame since pipelines do not have an SCM link.%n
[TASKS] Computing warning deltas based on reference build #2
[DevOpticsMavenPublisher] dependencies consumed: 5, artifacts produced: 156
[withMaven] Publishers: Pipeline Graph Publisher: 15 ms, Generated Artifacts Publisher: 84857 ms, Invoker Publisher: 2 ms, Junit Publisher: 51982 ms, Concordion Publisher: 2 ms, Dependencies Fingerprint Publisher: 1174 ms, Findbugs Publisher: 1 ms, JGiven Publisher: 1 ms, Jacoco Publisher: 1 ms, SpotBugs Publisher: 1 ms, Open Task Scanner Publisher: 2451 ms, CloudBees DevOptics Gate Artifact Publisher: 97889 ms
[Pipeline] // withMaven
[Pipeline] fileExists
[Pipeline] zip
Writing zip file of c:\mvn-it-1.tmp\core-it-suite\target\test-classes to c:\mvn-it-1.tmp\core-it-suite-logs-windows-jdk14.zip
Zipped 6735 entries.
Archiving c:\mvn-it-1.tmp\core-it-suite-logs-windows-jdk14.zip
[Pipeline] fileExists
[Pipeline] zip
Writing zip file of c:\mvn-it-1.tmp\core-it-suite\target\surefire-reports to c:\mvn-it-1.tmp\core-it-suite-reports-windows-jdk14.zip
Zipped 4 entries.
Archiving c:\mvn-it-1.tmp\core-it-suite-reports-windows-jdk14.zip
[Pipeline] deleteDir
[Pipeline] }
[Pipeline] // dir
[Pipeline] }
[Pipeline] // stage
[Pipeline] }
[Pipeline] // node
[Pipeline] }
[Pipeline] }
[Pipeline] // dir
[Pipeline] }
[Pipeline] // stage
[Pipeline] }
[Pipeline] // node
[Pipeline] }
[DevOpticsMavenPublisher] dependencies consumed: 5, artifacts produced: 156
[withMaven] Publishers: Pipeline Graph Publisher: 24 ms, Generated Artifacts Publisher: 60594 ms, Invoker Publisher: 2 ms, Junit Publisher: 51284 ms, Concordion Publisher: 4 ms, Dependencies Fingerprint Publisher: 1076 ms, Findbugs Publisher: 1 ms, JGiven Publisher: 1 ms, Jacoco Publisher: 1 ms, SpotBugs Publisher: 1 ms, Open Task Scanner Publisher: 2341 ms, CloudBees DevOptics Gate Artifact Publisher: 140545 ms
[Pipeline] // withMaven
[Pipeline] fileExists
[Pipeline] zip
Writing zip file of c:\mvn-it-0.tmp\core-it-suite\target\test-classes to c:\mvn-it-0.tmp\core-it-suite-logs-windows-jdk11.zip
Zipped 6735 entries.
Archiving c:\mvn-it-0.tmp\core-it-suite-logs-windows-jdk11.zip
[Pipeline] fileExists
[Pipeline] zip
Writing zip file of c:\mvn-it-0.tmp\core-it-suite\target\surefire-reports to c:\mvn-it-0.tmp\core-it-suite-reports-windows-jdk11.zip
Zipped 4 entries.
Archiving c:\mvn-it-0.tmp\core-it-suite-reports-windows-jdk11.zip
[Pipeline] deleteDir
[Pipeline] }
[Pipeline] // dir
[Pipeline] }
[Pipeline] // stage
[Pipeline] }
[Pipeline] // node
[Pipeline] }
[Pipeline] // parallel
[Pipeline] stage
[Pipeline] { (Notifications)
[Pipeline] echo
Build result: UNSTABLE
[Pipeline] jiraIssueSelector
[Pipeline] echo
The authors of changes [rfscholte].
[Pipeline] echo
Sending email ...
[Pipeline] emailext
Reply | Threaded
Open this post in threaded view
|

Build succeeded in Jenkins: Maven » Maven TLP » maven » MNG-6957 #4

Apache Jenkins Server-2
See https://ci-builds.apache.org/job/Maven/job/maven-box/job/maven/job/MNG-6957/4/

Changes:

* Improve parentFilter, change requirement getRawModel by Path

All tests passed