Build succeeded in Jenkins: Maven TLP » maven-release » master #2

Previous Topic Next Topic
 
classic Classic list List threaded Threaded
3 messages Options
Reply | Threaded
Open this post in threaded view
|

Build succeeded in Jenkins: Maven TLP » maven-release » master #2

Apache Jenkins Server-2
See https://builds.apache.org/job/maven-box/job/maven-release/job/master/2/

Changes:

* Add notify step
* Let's see if this works
* typo
* Add another layer of unwrapping
* Better commit message formatting
* [MNG-6316] Try adding JIRA notification
* [MNG-6316] Don't let JIRA step timeouts fail build
* [MNG-6316] Pick up jira issue keys using selector
* [MNG-6316] Set the build description to include jira issues
* Add notify step
* [MNG-6316] Add an explicit notification stage
Reply | Threaded
Open this post in threaded view
|

Build failed in Jenkins: Maven TLP » maven-release » master #3

Apache Jenkins Server-2
See https://builds.apache.org/job/maven-box/job/maven-release/job/master/3/

Changes:

* testing emailext templates
* testing emailext templates
* tweaks
* debugging
* formatting
* Formatting
* trying to debug failing build issue
* more safety
* Add license headers
* [JENKINS-34376] Workaround Jenkins issue to detect aborted builds better
* More tweaking... ffs pipeline you don't make it easy to get the actual
* Allow failing tests to be recorded as unstable build
* Ensure the email on failure is always sent if we start the build
* No need to collect findbugs etc on anything other than the first
* syntax
* syntax again
* Allow 'jdk' or 'jdks'
* Better report collection optimization
* syntax ftw
* syntax take 5
* build the command line in more extensible way
* Aha\! first was being evaluated after adding the task
* capture another
* [MRELEASE-993] Use shallow checkout per default (git scm)
* [MRELEASE-993] Use shallow checkout per default (git scm)
* [MRELEASE-993] Use shallow checkout per default (git scm)
* [MRELEASE-993] Use shallow checkout per default (git scm)
* [MRELEASE-993] Use shallow checkout per default (git scm)
* [MRELEASE-993] Use shallow checkout per default (git scm)

No tests ran.

Build log:
[...truncated 1.76 MB...]
[linux-jdk9] [INFO] Changes detected - recompiling the module!
[linux-jdk9] [INFO] Compiling 103 source files to /home/jenkins/jenkins-slave/workspace/en-box_maven-release_master-OCKGULQBCZ67VBKJ7HF6E7KZUCKX7ZC6FX64GH66OHP7A4VAQBIQ/m/maven-release-manager/target/classes
[windows-jdk9] [INFO] Downloaded: http://repository.apache.org/snapshots/org/apache/maven/scm/maven-scm-provider-cvsexe/1.9.6-SNAPSHOT/maven-scm-provider-cvsexe-1.9.6-20171201.232646-12.jar (31 kB at 63 kB/s)
[windows-jdk9] [INFO] Downloading: http://repository.apache.org/snapshots/org/apache/maven/scm/maven-scm-provider-cvsjava/1.9.6-SNAPSHOT/maven-scm-provider-cvsjava-1.9.6-20171201.232651-12.jar
[windows-jdk9] [INFO] Downloaded: http://repository.apache.org/snapshots/org/apache/maven/scm/maven-scm-provider-bazaar/1.9.6-SNAPSHOT/maven-scm-provider-bazaar-1.9.6-20171201.232629-12.jar (57 kB at 107 kB/s)
[windows-jdk9] [INFO] Downloading: http://repository.apache.org/snapshots/org/apache/maven/scm/maven-scm-provider-gitexe/1.9.6-SNAPSHOT/maven-scm-provider-gitexe-1.9.6-20171201.232709-12.jar
[windows-jdk9] [INFO] Downloaded: http://repository.apache.org/snapshots/org/apache/maven/scm/maven-scm-provider-accurev/1.9.6-SNAPSHOT/maven-scm-provider-accurev-1.9.6-20171201.232623-12.jar (97 kB at 158 kB/s)
[windows-jdk9] [INFO] Downloaded: http://repository.apache.org/snapshots/org/apache/maven/scm/maven-scm-provider-cvs-commons/1.9.6-SNAPSHOT/maven-scm-provider-cvs-commons-1.9.6-20171201.232640-12.jar (78 kB at 128 kB/s)
[windows-jdk9] [INFO] Downloading: http://repository.apache.org/snapshots/org/apache/maven/scm/maven-scm-provider-git-commons/1.9.6-SNAPSHOT/maven-scm-provider-git-commons-1.9.6-20171201.232703-12.jar
[windows-jdk9] [INFO] Downloading: http://repository.apache.org/snapshots/org/apache/maven/scm/maven-scm-provider-jgit/1.9.6-SNAPSHOT/maven-scm-provider-jgit-1.9.6-20171201.232739-12.jar
[windows-jdk9] [INFO] Downloaded: http://repository.apache.org/snapshots/org/apache/maven/scm/maven-scm-provider-clearcase/1.9.6-SNAPSHOT/maven-scm-provider-clearcase-1.9.6-20171201.232634-12.jar (70 kB at 114 kB/s)
[windows-jdk9] [INFO] Downloading: http://repository.apache.org/snapshots/org/apache/maven/scm/maven-scm-provider-hg/1.9.6-SNAPSHOT/maven-scm-provider-hg-1.9.6-20171201.232721-12.jar
[windows-jdk9] [INFO] Downloaded: http://repository.apache.org/snapshots/org/apache/maven/scm/maven-scm-provider-cvsjava/1.9.6-SNAPSHOT/maven-scm-provider-cvsjava-1.9.6-20171201.232651-12.jar (45 kB at 44 kB/s)
[windows-jdk9] [INFO] Downloading: http://repository.apache.org/snapshots/org/apache/maven/scm/maven-scm-provider-perforce/1.9.6-SNAPSHOT/maven-scm-provider-perforce-1.9.6-20171201.232800-12.jar
[windows-jdk9] [INFO] Downloaded: http://repository.apache.org/snapshots/org/apache/maven/scm/maven-scm-provider-git-commons/1.9.6-SNAPSHOT/maven-scm-provider-git-commons-1.9.6-20171201.232703-12.jar (35 kB at 33 kB/s)
[windows-jdk9] [INFO] Downloading: http://repository.apache.org/snapshots/org/apache/maven/scm/maven-scm-provider-starteam/1.9.6-SNAPSHOT/maven-scm-provider-starteam-1.9.6-20171201.232806-12.jar
[windows-jdk9] [INFO] Downloaded: http://repository.apache.org/snapshots/org/apache/maven/scm/maven-scm-provider-gitexe/1.9.6-SNAPSHOT/maven-scm-provider-gitexe-1.9.6-20171201.232709-12.jar (69 kB at 64 kB/s)
[windows-jdk9] [INFO] Downloading: http://repository.apache.org/snapshots/org/apache/maven/scm/maven-scm-provider-svnexe/1.9.6-SNAPSHOT/maven-scm-provider-svnexe-1.9.6-20171201.232817-12.jar
[windows-jdk9] [INFO] Downloaded: http://repository.apache.org/snapshots/org/apache/maven/scm/maven-scm-provider-hg/1.9.6-SNAPSHOT/maven-scm-provider-hg-1.9.6-20171201.232721-12.jar (69 kB at 60 kB/s)
[windows-jdk9] [INFO] Downloading: http://repository.apache.org/snapshots/org/apache/maven/scm/maven-scm-provider-synergy/1.9.6-SNAPSHOT/maven-scm-provider-synergy-1.9.6-20171201.232829-12.jar
[windows-jdk9] [INFO] Downloaded: http://repository.apache.org/snapshots/org/apache/maven/scm/maven-scm-provider-jgit/1.9.6-SNAPSHOT/maven-scm-provider-jgit-1.9.6-20171201.232739-12.jar (53 kB at 46 kB/s)
[windows-jdk9] [INFO] Downloading: http://repository.apache.org/snapshots/org/apache/maven/scm/maven-scm-provider-vss/1.9.6-SNAPSHOT/maven-scm-provider-vss-1.9.6-20171201.232841-12.jar
[linux-jdk7] Failed in branch linux-jdk7
[linux-jdk8] [INFO]
[linux-jdk8] [INFO] --- maven-resources-plugin:2.7:resources (default-resources) @ maven-release-manager ---
[linux-jdk8] [INFO] Using 'UTF-8' encoding to copy filtered resources.
[linux-jdk8] [INFO] Copying 3 resources
[linux-jdk8] [INFO] Copying 3 resources
[linux-jdk8] [INFO]
[linux-jdk8] [INFO] --- maven-compiler-plugin:3.2:compile (default-compile) @ maven-release-manager ---
[linux-jdk8] [INFO] Changes detected - recompiling the module!
[linux-jdk8] [INFO] Compiling 103 source files to /home/jenkins/jenkins-slave/workspace/en-box_maven-release_master-OCKGULQBCZ67VBKJ7HF6E7KZUCKX7ZC6FX64GH66OHP7A4VAQBIQ/m/maven-release-manager/target/classes
[linux-jdk9] Sending interrupt signal to process
[windows-jdk9] [INFO] Downloaded: http://repository.apache.org/snapshots/org/apache/maven/scm/maven-scm-provider-perforce/1.9.6-SNAPSHOT/maven-scm-provider-perforce-1.9.6-20171201.232800-12.jar (86 kB at 55 kB/s)
[windows-jdk9] [INFO] Downloading: http://repository.apache.org/snapshots/org/apache/maven/scm/maven-scm-provider-tfs/1.9.6-SNAPSHOT/maven-scm-provider-tfs-1.9.6-20171201.232835-12.jar
[windows-jdk9] [INFO] Downloaded: http://repository.apache.org/snapshots/org/apache/maven/scm/maven-scm-provider-starteam/1.9.6-SNAPSHOT/maven-scm-provider-starteam-1.9.6-20171201.232806-12.jar (73 kB at 45 kB/s)
[windows-jdk9] [INFO] Downloading: http://repository.apache.org/snapshots/org/apache/maven/scm/maven-scm-provider-integrity/1.9.6-SNAPSHOT/maven-scm-provider-integrity-1.9.6-20171201.232727-12.jar
[windows-jdk9] [INFO] Downloaded: http://repository.apache.org/snapshots/org/apache/maven/scm/maven-scm-provider-svnexe/1.9.6-SNAPSHOT/maven-scm-provider-svnexe-1.9.6-20171201.232817-12.jar (81 kB at 50 kB/s)
[windows-jdk9] [INFO] Downloading: http://repository.apache.org/snapshots/org/apache/maven/scm/maven-scm-provider-jazz/1.9.6-SNAPSHOT/maven-scm-provider-jazz-1.9.6-20171201.232733-12.jar
[windows-jdk9] [INFO] Downloaded: http://repository.apache.org/snapshots/org/apache/maven/scm/maven-scm-provider-synergy/1.9.6-SNAPSHOT/maven-scm-provider-synergy-1.9.6-20171201.232829-12.jar (60 kB at 35 kB/s)
[windows-jdk9] [INFO] Downloading: http://repository.apache.org/snapshots/org/apache/maven/scm/maven-scm-api/1.9.6-SNAPSHOT/maven-scm-api-1.9.6-20171201.232556-12.jar
[windows-jdk9] [INFO] Downloaded: http://repository.apache.org/snapshots/org/apache/maven/scm/maven-scm-provider-vss/1.9.6-SNAPSHOT/maven-scm-provider-vss-1.9.6-20171201.232841-12.jar (72 kB at 42 kB/s)
[windows-jdk9] [INFO] Downloading: http://repository.apache.org/snapshots/org/apache/maven/scm/maven-scm-provider-svn-commons/1.9.6-SNAPSHOT/maven-scm-provider-svn-commons-1.9.6-20171201.232812-12.jar
[windows-jdk9] [INFO] Downloaded: http://repository.apache.org/snapshots/org/apache/maven/scm/maven-scm-provider-tfs/1.9.6-SNAPSHOT/maven-scm-provider-tfs-1.9.6-20171201.232835-12.jar (45 kB at 21 kB/s)
[windows-jdk9] [INFO] Downloading: http://repository.apache.org/snapshots/org/apache/maven/scm/maven-scm-test/1.9.6-SNAPSHOT/maven-scm-test-1.9.6-20171201.232918-12.jar
[windows-jdk9] [INFO] Downloaded: http://repository.apache.org/snapshots/org/apache/maven/scm/maven-scm-provider-integrity/1.9.6-SNAPSHOT/maven-scm-provider-integrity-1.9.6-20171201.232727-12.jar (82 kB at 38 kB/s)
[windows-jdk9] [INFO] Downloaded: http://repository.apache.org/snapshots/org/apache/maven/scm/maven-scm-provider-svn-commons/1.9.6-SNAPSHOT/maven-scm-provider-svn-commons-1.9.6-20171201.232812-12.jar (38 kB at 18 kB/s)
[windows-jdk9] [INFO] Downloaded: http://repository.apache.org/snapshots/org/apache/maven/scm/maven-scm-provider-jazz/1.9.6-SNAPSHOT/maven-scm-provider-jazz-1.9.6-20171201.232733-12.jar (69 kB at 32 kB/s)
[windows-jdk9] [INFO] Downloaded: http://repository.apache.org/snapshots/org/apache/maven/scm/maven-scm-api/1.9.6-SNAPSHOT/maven-scm-api-1.9.6-20171201.232556-12.jar (109 kB at 47 kB/s)
[windows-jdk7] Sending interrupt signal to process
[windows-jdk7] [INFO] Rat check: Summary of files. Unapproved: 0 unknown: 0 generated: 0 approved: 1077 licence.
[windows-jdk7] [INFO]
[windows-jdk7] [INFO] --- modello-maven-plugin:1.7:xpp3-reader (default) @ maven-release-manager ---
[windows-jdk7] [INFO] Downloading: https://repo.maven.apache.org/maven2/org/apache/maven/maven-plugin-api/2.0.7/maven-plugin-api-2.0.7.pom
[windows-jdk7] [INFO] Downloaded: https://repo.maven.apache.org/maven2/org/apache/maven/maven-plugin-api/2.0.7/maven-plugin-api-2.0.7.pom (1.5 kB at 121 kB/s)
[windows-jdk7] [INFO] Downloading: https://repo.maven.apache.org/maven2/org/apache/maven/maven/2.0.7/maven-2.0.7.pom
[windows-jdk7] [INFO] Downloaded: https://repo.maven.apache.org/maven2/org/apache/maven/maven/2.0.7/maven-2.0.7.pom (11 kB at 1.2 MB/s)
[windows-jdk7] [INFO] Downloading: https://repo.maven.apache.org/maven2/org/codehaus/modello/modello-core/1.7/modello-core-1.7.pom
[windows-jdk7] [INFO] Downloaded: https://repo.maven.apache.org/maven2/org/codehaus/modello/modello-core/1.7/modello-core-1.7.pom (1.5 kB at 136 kB/s)
[windows-jdk7] [INFO] Downloading: https://repo.maven.apache.org/maven2/org/sonatype/plexus/plexus-build-api/0.0.7/plexus-build-api-0.0.7.pom
[windows-jdk9] [INFO] Downloaded: http://repository.apache.org/snapshots/org/apache/maven/scm/maven-scm-test/1.9.6-SNAPSHOT/maven-scm-test-1.9.6-20171201.232918-12.jar (51 kB at 19 kB/s)
[windows-jdk9] [INFO]
[windows-jdk9] [INFO] --- maven-clean-plugin:2.5:clean (default-clean) @ maven-release-manager ---
[windows-jdk9] [INFO]
[windows-jdk9] [INFO] --- maven-enforcer-plugin:1.3.1:enforce (enforce-bytecode-version) @ maven-release-manager ---
[windows-jdk8] [INFO] Rat check: Summary of files. Unapproved: 0 unknown: 0 generated: 0 approved: 1077 licence.
[windows-jdk8] [INFO]
[windows-jdk8] [INFO] --- modello-maven-plugin:1.7:xpp3-reader (default) @ maven-release-manager ---
[windows-jdk8] [INFO] Downloading: https://repo.maven.apache.org/maven2/org/apache/maven/maven-plugin-api/2.0.7/maven-plugin-api-2.0.7.pom
[windows-jdk8] [INFO] Downloaded: https://repo.maven.apache.org/maven2/org/apache/maven/maven-plugin-api/2.0.7/maven-plugin-api-2.0.7.pom (1.5 kB at 132 kB/s)
[windows-jdk8] [INFO] Downloading: https://repo.maven.apache.org/maven2/org/apache/maven/maven/2.0.7/maven-2.0.7.pom
[windows-jdk8] [INFO] Downloaded: https://repo.maven.apache.org/maven2/org/apache/maven/maven/2.0.7/maven-2.0.7.pom (11 kB at 1.3 MB/s)
[windows-jdk8] [INFO] Downloading: https://repo.maven.apache.org/maven2/org/codehaus/modello/modello-core/1.7/modello-core-1.7.pom
[windows-jdk8] [INFO] Downloaded: https://repo.maven.apache.org/maven2/org/codehaus/modello/modello-core/1.7/modello-core-1.7.pom (1.5 kB at 167 kB/s)
[windows-jdk8] [INFO] Downloading: https://repo.maven.apache.org/maven2/org/sonatype/plexus/plexus-build-api/0.0.7/plexus-build-api-0.0.7.pom
[windows-jdk8] [INFO] Downloaded: https://repo.maven.apache.org/maven2/org/sonatype/plexus/plexus-build-api/0.0.7/plexus-build-api-0.0.7.pom (3.2 kB at 320 kB/s)
[windows-jdk8] [INFO] Downloading: https://repo.maven.apache.org/maven2/org/sonatype/spice/spice-parent/15/spice-parent-15.pom
[windows-jdk8] [INFO] Downloaded: https://repo.maven.apache.org/maven2/org/sonatype/spice/spice-parent/15/spice-parent-15.pom (8.4 kB at 696 kB/s)
[windows-jdk8] [INFO] Downloading: https://repo.maven.apache.org/maven2/org/codehaus/plexus/plexus-utils/3.0.9/plexus-utils-3.0.9.pom
[windows-jdk8] [INFO] Downloaded: https://repo.maven.apache.org/maven2/org/codehaus/plexus/plexus-utils/3.0.9/plexus-utils-3.0.9.pom (3.1 kB at 286 kB/s)
[windows-jdk8] [INFO] Downloading: https://repo.maven.apache.org/maven2/org/apache/maven/maven-project/2.0.7/maven-project-2.0.7.pom
[windows-jdk8] [INFO] Downloaded: https://repo.maven.apache.org/maven2/org/apache/maven/maven-project/2.0.7/maven-project-2.0.7.pom (2.6 kB at 240 kB/s)
[windows-jdk8] [INFO] Downloading: https://repo.maven.apache.org/maven2/org/apache/maven/maven-settings/2.0.7/maven-settings-2.0.7.pom
[windows-jdk8] [INFO] Downloaded: https://repo.maven.apache.org/maven2/org/apache/maven/maven-settings/2.0.7/maven-settings-2.0.7.pom (2.0 kB at 250 kB/s)
[windows-jdk8] [INFO] Downloading: https://repo.maven.apache.org/maven2/org/apache/maven/maven-model/2.0.7/maven-model-2.0.7.pom
[windows-jdk8] [INFO] Downloaded: https://repo.maven.apache.org/maven2/org/apache/maven/maven-model/2.0.7/maven-model-2.0.7.pom (3.0 kB at 381 kB/s)
[windows-jdk8] [INFO] Downloading: https://repo.maven.apache.org/maven2/org/apache/maven/maven-profile/2.0.7/maven-profile-2.0.7.pom
[windows-jdk8] [INFO] Downloaded: https://repo.maven.apache.org/maven2/org/apache/maven/maven-profile/2.0.7/maven-profile-2.0.7.pom (2.0 kB at 248 kB/s)
[windows-jdk8] [INFO] Downloading: https://repo.maven.apache.org/maven2/org/apache/maven/maven-artifact-manager/2.0.7/maven-artifact-manager-2.0.7.pom
[windows-jdk8] [INFO] Downloaded: https://repo.maven.apache.org/maven2/org/apache/maven/maven-artifact-manager/2.0.7/maven-artifact-manager-2.0.7.pom (2.6 kB at 291 kB/s)
[windows-jdk8] [INFO] Downloading: https://repo.maven.apache.org/maven2/org/apache/maven/maven-repository-metadata/2.0.7/maven-repository-metadata-2.0.7.pom
[windows-jdk8] [INFO] Downloaded: https://repo.maven.apache.org/maven2/org/apache/maven/maven-repository-metadata/2.0.7/maven-repository-metadata-2.0.7.pom (1.9 kB at 168 kB/s)
[windows-jdk8] [INFO] Downloading: https://repo.maven.apache.org/maven2/org/apache/maven/maven-artifact/2.0.7/maven-artifact-2.0.7.pom
[windows-jdk8] [INFO] Downloaded: https://repo.maven.apache.org/maven2/org/apache/maven/maven-artifact/2.0.7/maven-artifact-2.0.7.pom (1.6 kB at 225 kB/s)
[windows-jdk8] [INFO] Downloading: https://repo.maven.apache.org/maven2/org/apache/maven/maven-plugin-registry/2.0.7/maven-plugin-registry-2.0.7.pom
[windows-jdk8] [INFO] Downloaded: https://repo.maven.apache.org/maven2/org/apache/maven/maven-plugin-registry/2.0.7/maven-plugin-registry-2.0.7.pom (1.9 kB at 278 kB/s)
[windows-jdk8] [INFO] Downloading: https://repo.maven.apache.org/maven2/org/codehaus/modello/modello-plugin-converters/1.7/modello-plugin-converters-1.7.pom
[windows-jdk8] [INFO] Downloaded: https://repo.maven.apache.org/maven2/org/codehaus/modello/modello-plugin-converters/1.7/modello-plugin-converters-1.7.pom (1.6 kB at 200 kB/s)
[windows-jdk8] [INFO] Downloading: https://repo.maven.apache.org/maven2/org/codehaus/modello/modello-plugins/1.7/modello-plugins-1.7.pom
[windows-jdk8] [INFO] Downloaded: https://repo.maven.apache.org/maven2/org/codehaus/modello/modello-plugins/1.7/modello-plugins-1.7.pom (2.3 kB at 258 kB/s)
[windows-jdk8] [INFO] Downloading: https://repo.maven.apache.org/maven2/org/codehaus/modello/modello-plugin-java/1.7/modello-plugin-java-1.7.pom
[windows-jdk8] [INFO] Downloaded: https://repo.maven.apache.org/maven2/org/codehaus/modello/modello-plugin-java/1.7/modello-plugin-java-1.7.pom (2.6 kB at 323 kB/s)
[windows-jdk8] [INFO] Downloading: https://repo.maven.apache.org/maven2/org/codehaus/modello/modello-plugin-dom4j/1.7/modello-plugin-dom4j-1.7.pom
[windows-jdk8] [INFO] Downloaded: https://repo.maven.apache.org/maven2/org/codehaus/modello/modello-plugin-dom4j/1.7/modello-plugin-dom4j-1.7.pom (1.6 kB at 197 kB/s)
[windows-jdk8] [INFO] Downloading: https://repo.maven.apache.org/maven2/org/codehaus/modello/modello-plugin-xml/1.7/modello-plugin-xml-1.7.pom
[windows-jdk8] [INFO] Downloaded: https://repo.maven.apache.org/maven2/org/codehaus/modello/modello-plugin-xml/1.7/modello-plugin-xml-1.7.pom (1.0 kB at 149 kB/s)
[windows-jdk8] [INFO] Downloading: https://repo.maven.apache.org/maven2/org/codehaus/modello/modello-plugin-jdom/1.7/modello-plugin-jdom-1.7.pom
[windows-jdk8] [INFO] Downloaded: https://repo.maven.apache.org/maven2/org/codehaus/modello/modello-plugin-jdom/1.7/modello-plugin-jdom-1.7.pom (1.9 kB at 268 kB/s)
[windows-jdk8] [INFO] Downloading: https://repo.maven.apache.org/maven2/org/codehaus/modello/modello-plugin-stax/1.7/modello-plugin-stax-1.7.pom
[windows-jdk8] [INFO] Downloaded: https://repo.maven.apache.org/maven2/org/codehaus/modello/modello-plugin-stax/1.7/modello-plugin-stax-1.7.pom (2.3 kB at 290 kB/s)
[windows-jdk8] [INFO] Downloading: https://repo.maven.apache.org/maven2/org/codehaus/modello/modello-plugin-xdoc/1.7/modello-plugin-xdoc-1.7.pom
[windows-jdk8] [INFO] Downloaded: https://repo.maven.apache.org/maven2/org/codehaus/modello/modello-plugin-xdoc/1.7/modello-plugin-xdoc-1.7.pom (1.2 kB at 206 kB/s)
[windows-jdk8] [INFO] Downloading: https://repo.maven.apache.org/maven2/org/codehaus/modello/modello-plugin-xsd/1.7/modello-plugin-xsd-1.7.pom
[windows-jdk8] [INFO] Downloaded: https://repo.maven.apache.org/maven2/org/codehaus/modello/modello-plugin-xsd/1.7/modello-plugin-xsd-1.7.pom (1.3 kB at 191 kB/s)
[windows-jdk8] [INFO] Downloading: https://repo.maven.apache.org/maven2/org/codehaus/modello/modello-plugin-xpp3/1.7/modello-plugin-xpp3-1.7.pom
[windows-jdk8] [INFO] Downloaded: https://repo.maven.apache.org/maven2/org/codehaus/modello/modello-plugin-xpp3/1.7/modello-plugin-xpp3-1.7.pom (1.4 kB at 179 kB/s)
[windows-jdk8] [INFO] Downloading: https://repo.maven.apache.org/maven2/org/apache/maven/maven-plugin-api/2.0.7/maven-plugin-api-2.0.7.jar
[windows-jdk8] [INFO] Downloading: https://repo.maven.apache.org/maven2/org/codehaus/modello/modello-core/1.7/modello-core-1.7.jar
[windows-jdk8] [INFO] Downloading: https://repo.maven.apache.org/maven2/org/apache/maven/maven-settings/2.0.7/maven-settings-2.0.7.jar
[windows-jdk8] [INFO] Downloading: https://repo.maven.apache.org/maven2/org/apache/maven/maven-profile/2.0.7/maven-profile-2.0.7.jar
[windows-jdk8] [INFO] Downloading: https://repo.maven.apache.org/maven2/org/apache/maven/maven-project/2.0.7/maven-project-2.0.7.jar
[windows-jdk8] [INFO] Downloaded: https://repo.maven.apache.org/maven2/org/codehaus/modello/modello-core/1.7/modello-core-1.7.jar (58 kB at 3.6 MB/s)
[windows-jdk8] [INFO] Downloading: https://repo.maven.apache.org/maven2/org/apache/maven/maven-artifact-manager/2.0.7/maven-artifact-manager-2.0.7.jar
[windows-jdk8] [INFO] Downloaded: https://repo.maven.apache.org/maven2/org/apache/maven/maven-profile/2.0.7/maven-profile-2.0.7.jar (35 kB at 2.1 MB/s)
[windows-jdk8] [INFO] Downloading: https://repo.maven.apache.org/maven2/org/apache/maven/maven-repository-metadata/2.0.7/maven-repository-metadata-2.0.7.jar
[windows-jdk8] [INFO] Downloaded: https://repo.maven.apache.org/maven2/org/apache/maven/maven-settings/2.0.7/maven-settings-2.0.7.jar (49 kB at 2.7 MB/s)
[windows-jdk8] [INFO] Downloading: https://repo.maven.apache.org/maven2/org/apache/maven/maven-plugin-registry/2.0.7/maven-plugin-registry-2.0.7.jar
[windows-jdk8] [INFO] Downloaded: https://repo.maven.apache.org/maven2/org/apache/maven/maven-plugin-api/2.0.7/maven-plugin-api-2.0.7.jar (13 kB at 559 kB/s)
[windows-jdk8] [INFO] Downloading: https://repo.maven.apache.org/maven2/org/apache/maven/maven-artifact/2.0.7/maven-artifact-2.0.7.jar
[windows-jdk8] [INFO] Downloaded: https://repo.maven.apache.org/maven2/org/apache/maven/maven-project/2.0.7/maven-project-2.0.7.jar (117 kB at 4.9 MB/s)
[windows-jdk8] [INFO] Downloading: https://repo.maven.apache.org/maven2/org/apache/maven/maven-model/2.0.7/maven-model-2.0.7.jar
[windows-jdk8] [INFO] Downloaded: https://repo.maven.apache.org/maven2/org/apache/maven/maven-repository-metadata/2.0.7/maven-repository-metadata-2.0.7.jar (24 kB at 874 kB/s)
[windows-jdk8] [INFO] Downloading: https://repo.maven.apache.org/maven2/org/codehaus/plexus/plexus-utils/3.0.9/plexus-utils-3.0.9.jar
[windows-jdk8] [INFO] Downloaded: https://repo.maven.apache.org/maven2/org/apache/maven/maven-artifact-manager/2.0.7/maven-artifact-manager-2.0.7.jar (57 kB at 1.9 MB/s)
[windows-jdk8] [INFO] Downloading: https://repo.maven.apache.org/maven2/org/codehaus/modello/modello-plugin-converters/1.7/modello-plugin-converters-1.7.jar
[windows-jdk8] [INFO] Downloaded: https://repo.maven.apache.org/maven2/org/apache/maven/maven-plugin-registry/2.0.7/maven-plugin-registry-2.0.7.jar (29 kB at 877 kB/s)
[windows-jdk8] [INFO] Downloading: https://repo.maven.apache.org/maven2/org/codehaus/modello/modello-plugin-dom4j/1.7/modello-plugin-dom4j-1.7.jar
[windows-jdk8] [INFO] Downloaded: https://repo.maven.apache.org/maven2/org/apache/maven/maven-artifact/2.0.7/maven-artifact-2.0.7.jar (88 kB at 2.4 MB/s)
[windows-jdk8] [INFO] Downloading: https://repo.maven.apache.org/maven2/org/codehaus/modello/modello-plugin-xml/1.7/modello-plugin-xml-1.7.jar
[windows-jdk8] [INFO] Downloaded: https://repo.maven.apache.org/maven2/org/apache/maven/maven-model/2.0.7/maven-model-2.0.7.jar (86 kB at 2.2 MB/s)
[windows-jdk8] [INFO] Downloading: https://repo.maven.apache.org/maven2/org/codehaus/modello/modello-plugin-java/1.7/modello-plugin-java-1.7.jar
[windows-jdk8] [INFO] Downloaded: https://repo.maven.apache.org/maven2/org/codehaus/modello/modello-plugin-converters/1.7/modello-plugin-converters-1.7.jar (9.4 kB at 224 kB/s)
[windows-jdk8] [INFO] Downloading: https://repo.maven.apache.org/maven2/org/codehaus/modello/modello-plugin-jdom/1.7/modello-plugin-jdom-1.7.jar
[windows-jdk8] [INFO] Downloaded: https://repo.maven.apache.org/maven2/org/codehaus/modello/modello-plugin-dom4j/1.7/modello-plugin-dom4j-1.7.jar (18 kB at 427 kB/s)
[windows-jdk8] [INFO] Downloading: https://repo.maven.apache.org/maven2/org/codehaus/modello/modello-plugin-stax/1.7/modello-plugin-stax-1.7.jar
[windows-jdk8] [INFO] Downloaded: https://repo.maven.apache.org/maven2/org/codehaus/modello/modello-plugin-xml/1.7/modello-plugin-xml-1.7.jar (15 kB at 307 kB/s)
[windows-jdk8] [INFO] Downloading: https://repo.maven.apache.org/maven2/org/codehaus/modello/modello-plugin-xdoc/1.7/modello-plugin-xdoc-1.7.jar
[windows-jdk8] [INFO] Downloaded: https://repo.maven.apache.org/maven2/org/codehaus/plexus/plexus-utils/3.0.9/plexus-utils-3.0.9.jar (232 kB at 4.6 MB/s)
[windows-jdk8] [INFO] Downloading: https://repo.maven.apache.org/maven2/org/codehaus/modello/modello-plugin-xpp3/1.7/modello-plugin-xpp3-1.7.jar
[windows-jdk8] [INFO] Downloaded: https://repo.maven.apache.org/maven2/org/codehaus/modello/modello-plugin-jdom/1.7/modello-plugin-jdom-1.7.jar (14 kB at 269 kB/s)
[windows-jdk8] [INFO] Downloading: https://repo.maven.apache.org/maven2/org/codehaus/modello/modello-plugin-xsd/1.7/modello-plugin-xsd-1.7.jar
[windows-jdk8] [INFO] Downloaded: https://repo.maven.apache.org/maven2/org/codehaus/modello/modello-plugin-stax/1.7/modello-plugin-stax-1.7.jar (37 kB at 666 kB/s)
[windows-jdk8] [INFO] Downloading: https://repo.maven.apache.org/maven2/org/sonatype/plexus/plexus-build-api/0.0.7/plexus-build-api-0.0.7.jar
[windows-jdk8] [INFO] Downloaded: https://repo.maven.apache.org/maven2/org/codehaus/modello/modello-plugin-java/1.7/modello-plugin-java-1.7.jar (84 kB at 1.4 MB/s)
[windows-jdk8] [INFO] Downloaded: https://repo.maven.apache.org/maven2/org/codehaus/modello/modello-plugin-xpp3/1.7/modello-plugin-xpp3-1.7.jar (29 kB at 471 kB/s)
[windows-jdk8] [INFO] Downloaded: https://repo.maven.apache.org/maven2/org/codehaus/modello/modello-plugin-xdoc/1.7/modello-plugin-xdoc-1.7.jar (14 kB at 223 kB/s)
[windows-jdk8] [INFO] Downloaded: https://repo.maven.apache.org/maven2/org/codehaus/modello/modello-plugin-xsd/1.7/modello-plugin-xsd-1.7.jar (14 kB at 217 kB/s)
[windows-jdk8] [INFO] Downloaded: https://repo.maven.apache.org/maven2/org/sonatype/plexus/plexus-build-api/0.0.7/plexus-build-api-0.0.7.jar (8.5 kB at 127 kB/s)
[windows-jdk8] [INFO] outputDirectory: F:\jenkins\jenkins-slave\workspace\en-box_maven-release_master-OCKGULQBCZ67VBKJ7HF6E7KZUCKX7ZC6FX64GH66OHP7A4VAQBIQ\m\maven-release-manager\target\generated-sources\modello
[windows-jdk8] [INFO] Working on model: src/main/mdo/release-descriptor.mdo
[windows-jdk8] [INFO] Generating current version: 3.0.0
[windows-jdk8] [INFO]
[windows-jdk8] [INFO] --- modello-maven-plugin:1.7:java (default) @ maven-release-manager ---
[windows-jdk8] [INFO] outputDirectory: F:\jenkins\jenkins-slave\workspace\en-box_maven-release_master-OCKGULQBCZ67VBKJ7HF6E7KZUCKX7ZC6FX64GH66OHP7A4VAQBIQ\m\maven-release-manager\target\generated-sources\modello
[windows-jdk8] [INFO] Working on model: src/main/mdo/release-descriptor.mdo
[windows-jdk8] [INFO] Generating current version: 3.0.0
[windows-jdk8] [INFO]
[windows-jdk8] [INFO] --- modello-maven-plugin:1.7:xpp3-writer (default) @ maven-release-manager ---
[windows-jdk8] [INFO] outputDirectory: F:\jenkins\jenkins-slave\workspace\en-box_maven-release_master-OCKGULQBCZ67VBKJ7HF6E7KZUCKX7ZC6FX64GH66OHP7A4VAQBIQ\m\maven-release-manager\target\generated-sources\modello
[windows-jdk8] [INFO] Working on model: src/main/mdo/release-descriptor.mdo
[windows-jdk8] [INFO] Generating current version: 3.0.0
[windows-jdk8] [INFO]
[windows-jdk8] [INFO] --- maven-remote-resources-plugin:1.5:process (default) @ maven-release-manager ---
[windows-jdk8] [INFO] Downloading: http://repository.apache.org/snapshots/org/apache/maven/scm/maven-scm-providers/1.9.6-SNAPSHOT/maven-scm-providers-1.9.6-20171201.232846-12.pom
[windows-jdk7] [INFO] Downloaded: https://repo.maven.apache.org/maven2/org/sonatype/plexus/plexus-build-api/0.0.7/plexus-build-api-0.0.7.pom (3.2 kB at 400 kB/s)
[windows-jdk7] [INFO] Downloading: https://repo.maven.apache.org/maven2/org/sonatype/spice/spice-parent/15/spice-parent-15.pom
[windows-jdk7] [INFO] Downloaded: https://repo.maven.apache.org/maven2/org/sonatype/spice/spice-parent/15/spice-parent-15.pom (8.4 kB at 1.0 MB/s)
[windows-jdk8] [INFO] Downloaded: http://repository.apache.org/snapshots/org/apache/maven/scm/maven-scm-providers/1.9.6-SNAPSHOT/maven-scm-providers-1.9.6-20171201.232846-12.pom (0 B at 0 B/s)
[windows-jdk8] [INFO] Downloading: http://repository.apache.org/snapshots/org/apache/maven/scm/maven-scm/1.9.6-SNAPSHOT/maven-scm-1.9.6-20171201.232549-12.pom
[windows-jdk8] [INFO] Downloaded: http://repository.apache.org/snapshots/org/apache/maven/scm/maven-scm/1.9.6-SNAPSHOT/maven-scm-1.9.6-20171201.232549-12.pom (0 B at 0 B/s)
[windows-jdk8] [INFO] Downloading: http://repository.apache.org/snapshots/org/apache/maven/scm/maven-scm-providers-cvs/1.9.6-SNAPSHOT/maven-scm-providers-cvs-1.9.6-20171201.232853-12.pom
[windows-jdk8] Sending interrupt signal to process
[windows-jdk8] [INFO] Downloaded: http://repository.apache.org/snapshots/org/apache/maven/scm/maven-scm-providers-cvs/1.9.6-SNAPSHOT/maven-scm-providers-cvs-1.9.6-20171201.232853-12.pom (0 B at 0 B/s)
[windows-jdk8] [INFO] Downloading: http://repository.apache.org/snapshots/org/apache/maven/scm/maven-scm-providers-git/1.9.6-SNAPSHOT/maven-scm-providers-git-1.9.6-20171201.232900-12.pom
[windows-jdk9] Sending interrupt signal to process
[Pipeline] [windows-jdk8] }
[Pipeline] [windows-jdk7] }
[Pipeline] [linux-jdk8] }
[Pipeline] [linux-jdk9] }
[Pipeline] [windows-jdk8] // dir
[Pipeline] [windows-jdk7] // dir
[Pipeline] [linux-jdk8] // dir
[Pipeline] [linux-jdk9] // dir
[Pipeline] [windows-jdk8] }
[windows-jdk8] [withMaven] One or multiple Maven executions have been ignored by the Jenkins Pipeline Maven Plugin because they have been interrupted before completion (1). See Pipeline Maven Plugin FAQ for more details.
[Pipeline] [windows-jdk7] }
[windows-jdk7] [withMaven] One or multiple Maven executions have been ignored by the Jenkins Pipeline Maven Plugin because they have been interrupted before completion (1). See Pipeline Maven Plugin FAQ for more details.
[Pipeline] [linux-jdk8] }
[linux-jdk8] [withMaven] One or multiple Maven executions have been ignored by the Jenkins Pipeline Maven Plugin because they have been interrupted before completion (1). See Pipeline Maven Plugin FAQ for more details.
[Pipeline] [linux-jdk9] }
[linux-jdk9] [withMaven] One or multiple Maven executions have been ignored by the Jenkins Pipeline Maven Plugin because they have been interrupted before completion (1). See Pipeline Maven Plugin FAQ for more details.
[Pipeline] [windows-jdk8] // withMaven
[Pipeline] [windows-jdk7] // withMaven
[Pipeline] [linux-jdk8] // withMaven
[Pipeline] [linux-jdk9] // withMaven
[Pipeline] [windows-jdk8] }
[Pipeline] [windows-jdk7] }
[Pipeline] [linux-jdk8] }
[Pipeline] [linux-jdk9] }
[Pipeline] [windows-jdk9] }
[Pipeline] [windows-jdk8] // stage
[Pipeline] [windows-jdk7] // stage
[Pipeline] [linux-jdk8] // stage
[Pipeline] [linux-jdk9] // stage
[Pipeline] [windows-jdk9] // dir
[Pipeline] [linux-jdk8] }
[Pipeline] [linux-jdk9] }
[Pipeline] [windows-jdk7] }
[Pipeline] [windows-jdk8] }
[Pipeline] [windows-jdk9] }
[windows-jdk9] [withMaven] One or multiple Maven executions have been ignored by the Jenkins Pipeline Maven Plugin because they have been interrupted before completion (1). See Pipeline Maven Plugin FAQ for more details.
[Pipeline] [linux-jdk8] // node
[Pipeline] [linux-jdk9] // node
[Pipeline] [windows-jdk7] // node
[Pipeline] [windows-jdk8] // node
[Pipeline] [windows-jdk9] // withMaven
[Pipeline] [linux-jdk8] }
[linux-jdk8] Failed in branch linux-jdk8
[Pipeline] [linux-jdk9] }
[linux-jdk9] Failed in branch linux-jdk9
[Pipeline] [windows-jdk7] }
[windows-jdk7] Failed in branch windows-jdk7
[Pipeline] [windows-jdk8] }
[windows-jdk8] Failed in branch windows-jdk8
[Pipeline] [windows-jdk9] }
[Pipeline] [windows-jdk9] // stage
[Pipeline] [windows-jdk9] }
[Pipeline] [windows-jdk9] // node
[Pipeline] [windows-jdk9] }
[windows-jdk9] Failed in branch windows-jdk9
[Pipeline] // parallel
[Pipeline] stage
[Pipeline] { (Notifications)
[Pipeline] echo
Build result: FAILURE
[Pipeline] jiraIssueSelector
[Pipeline] jiraComment
[Pipeline] jiraComment
[Pipeline] emailext
Reply | Threaded
Open this post in threaded view
|

Build failed in Jenkins: Maven TLP » maven-release » master #4

Apache Jenkins Server-2
See https://builds.apache.org/job/maven-box/job/maven-release/job/master/4/

No changes.

No tests ran.

Build log:
[...truncated 923.15 KB...]
[linux-jdk8] [INFO] Downloading from central: https://repo.maven.apache.org/maven2/org/apache/maven/maven-artifact/2.0.7/maven-artifact-2.0.7.jar
[linux-jdk8] [INFO] Downloaded from central: https://repo.maven.apache.org/maven2/org/apache/maven/maven-project/2.0.7/maven-project-2.0.7.jar (117 kB at 5.5 MB/s)
[linux-jdk8] [INFO] Downloading from central: https://repo.maven.apache.org/maven2/org/apache/maven/maven-model/2.0.7/maven-model-2.0.7.jar
[linux-jdk8] [INFO] Downloaded from central: https://repo.maven.apache.org/maven2/org/apache/maven/maven-artifact-manager/2.0.7/maven-artifact-manager-2.0.7.jar (57 kB at 1.9 MB/s)
[linux-jdk8] [INFO] Downloading from central: https://repo.maven.apache.org/maven2/org/codehaus/plexus/plexus-utils/3.0.9/plexus-utils-3.0.9.jar
[linux-jdk8] [INFO] Downloaded from central: https://repo.maven.apache.org/maven2/org/apache/maven/maven-repository-metadata/2.0.7/maven-repository-metadata-2.0.7.jar (24 kB at 874 kB/s)
[linux-jdk8] [INFO] Downloading from central: https://repo.maven.apache.org/maven2/org/codehaus/modello/modello-plugin-converters/1.7/modello-plugin-converters-1.7.jar
[linux-jdk8] [INFO] Downloaded from central: https://repo.maven.apache.org/maven2/org/apache/maven/maven-plugin-registry/2.0.7/maven-plugin-registry-2.0.7.jar (29 kB at 933 kB/s)
[linux-jdk8] [INFO] Downloading from central: https://repo.maven.apache.org/maven2/org/codehaus/modello/modello-plugin-dom4j/1.7/modello-plugin-dom4j-1.7.jar
[linux-jdk8] [INFO] Downloaded from central: https://repo.maven.apache.org/maven2/org/apache/maven/maven-model/2.0.7/maven-model-2.0.7.jar (86 kB at 2.5 MB/s)
[linux-jdk8] [INFO] Downloading from central: https://repo.maven.apache.org/maven2/org/codehaus/modello/modello-plugin-xml/1.7/modello-plugin-xml-1.7.jar
[linux-jdk8] [INFO] Downloaded from central: https://repo.maven.apache.org/maven2/org/apache/maven/maven-artifact/2.0.7/maven-artifact-2.0.7.jar (88 kB at 2.4 MB/s)
[linux-jdk8] [INFO] Downloading from central: https://repo.maven.apache.org/maven2/org/codehaus/modello/modello-plugin-java/1.7/modello-plugin-java-1.7.jar
[linux-jdk8] [INFO] Downloaded from central: https://repo.maven.apache.org/maven2/org/codehaus/modello/modello-plugin-converters/1.7/modello-plugin-converters-1.7.jar (9.4 kB at 230 kB/s)
[linux-jdk8] [INFO] Downloading from central: https://repo.maven.apache.org/maven2/org/codehaus/modello/modello-plugin-jdom/1.7/modello-plugin-jdom-1.7.jar
[linux-jdk8] [INFO] Downloaded from central: https://repo.maven.apache.org/maven2/org/codehaus/modello/modello-plugin-dom4j/1.7/modello-plugin-dom4j-1.7.jar (18 kB at 427 kB/s)
[linux-jdk8] [INFO] Downloading from central: https://repo.maven.apache.org/maven2/org/codehaus/modello/modello-plugin-stax/1.7/modello-plugin-stax-1.7.jar
[linux-jdk8] [INFO] Downloaded from central: https://repo.maven.apache.org/maven2/org/codehaus/modello/modello-plugin-xml/1.7/modello-plugin-xml-1.7.jar (15 kB at 320 kB/s)
[linux-jdk8] [INFO] Downloading from central: https://repo.maven.apache.org/maven2/org/codehaus/modello/modello-plugin-xdoc/1.7/modello-plugin-xdoc-1.7.jar
[linux-jdk8] [INFO] Downloaded from central: https://repo.maven.apache.org/maven2/org/codehaus/plexus/plexus-utils/3.0.9/plexus-utils-3.0.9.jar (232 kB at 4.5 MB/s)
[linux-jdk8] [INFO] Downloading from central: https://repo.maven.apache.org/maven2/org/codehaus/modello/modello-plugin-xpp3/1.7/modello-plugin-xpp3-1.7.jar
[linux-jdk8] [INFO] Downloaded from central: https://repo.maven.apache.org/maven2/org/codehaus/modello/modello-plugin-java/1.7/modello-plugin-java-1.7.jar (84 kB at 1.6 MB/s)
[linux-jdk8] [INFO] Downloading from central: https://repo.maven.apache.org/maven2/org/codehaus/modello/modello-plugin-xsd/1.7/modello-plugin-xsd-1.7.jar
[linux-jdk8] [INFO] Downloaded from central: https://repo.maven.apache.org/maven2/org/codehaus/modello/modello-plugin-jdom/1.7/modello-plugin-jdom-1.7.jar (14 kB at 274 kB/s)
[linux-jdk8] [INFO] Downloading from central: https://repo.maven.apache.org/maven2/org/sonatype/plexus/plexus-build-api/0.0.7/plexus-build-api-0.0.7.jar
[linux-jdk8] [INFO] Downloaded from central: https://repo.maven.apache.org/maven2/org/codehaus/modello/modello-plugin-stax/1.7/modello-plugin-stax-1.7.jar (37 kB at 654 kB/s)
[linux-jdk8] [INFO] Downloaded from central: https://repo.maven.apache.org/maven2/org/codehaus/modello/modello-plugin-xdoc/1.7/modello-plugin-xdoc-1.7.jar (14 kB at 234 kB/s)
[linux-jdk8] [INFO] Downloaded from central: https://repo.maven.apache.org/maven2/org/sonatype/plexus/plexus-build-api/0.0.7/plexus-build-api-0.0.7.jar (8.5 kB at 133 kB/s)
[linux-jdk8] [INFO] Downloaded from central: https://repo.maven.apache.org/maven2/org/codehaus/modello/modello-plugin-xsd/1.7/modello-plugin-xsd-1.7.jar (14 kB at 220 kB/s)
[linux-jdk8] [INFO] Downloaded from central: https://repo.maven.apache.org/maven2/org/codehaus/modello/modello-plugin-xpp3/1.7/modello-plugin-xpp3-1.7.jar (29 kB at 429 kB/s)
[linux-jdk8] [INFO] outputDirectory: /home/jenkins/jenkins-slave/workspace/en-box_maven-release_master-OCKGULQBCZ67VBKJ7HF6E7KZUCKX7ZC6FX64GH66OHP7A4VAQBIQ/m/maven-release-manager/target/generated-sources/modello
[linux-jdk8] [INFO] Working on model: src/main/mdo/release-descriptor.mdo
[linux-jdk8] [INFO] Generating current version: 3.0.0
[linux-jdk8] [INFO]
[linux-jdk8] [INFO] --- modello-maven-plugin:1.7:java (default) @ maven-release-manager ---
[linux-jdk8] [INFO] outputDirectory: /home/jenkins/jenkins-slave/workspace/en-box_maven-release_master-OCKGULQBCZ67VBKJ7HF6E7KZUCKX7ZC6FX64GH66OHP7A4VAQBIQ/m/maven-release-manager/target/generated-sources/modello
[linux-jdk8] [INFO] Working on model: src/main/mdo/release-descriptor.mdo
[linux-jdk8] [INFO] Generating current version: 3.0.0
[linux-jdk8] [INFO]
[linux-jdk8] [INFO] --- modello-maven-plugin:1.7:xpp3-writer (default) @ maven-release-manager ---
[linux-jdk8] [INFO] outputDirectory: /home/jenkins/jenkins-slave/workspace/en-box_maven-release_master-OCKGULQBCZ67VBKJ7HF6E7KZUCKX7ZC6FX64GH66OHP7A4VAQBIQ/m/maven-release-manager/target/generated-sources/modello
[linux-jdk8] [INFO] Working on model: src/main/mdo/release-descriptor.mdo
[linux-jdk8] [INFO] Generating current version: 3.0.0
[linux-jdk8] [INFO]
[linux-jdk8] [INFO] --- maven-remote-resources-plugin:1.5:process (default) @ maven-release-manager ---
[linux-jdk7] [INFO] Downloading from central: https://repo.maven.apache.org/maven2/org/apache/maven/scm/maven-scm-api/1.8/maven-scm-api-1.8.jar
[linux-jdk7] [INFO] Downloaded from central: https://repo.maven.apache.org/maven2/org/apache/maven/scm/maven-scm-api/1.8/maven-scm-api-1.8.jar (105 kB at 6.2 MB/s)
[linux-jdk7] [INFO] Downloading from central: https://repo.maven.apache.org/maven2/org/slf4j/slf4j-api/1.5.3/slf4j-api-1.5.3.jar
[linux-jdk7] [INFO] Downloaded from central: https://repo.maven.apache.org/maven2/org/slf4j/slf4j-api/1.5.3/slf4j-api-1.5.3.jar (20 kB at 1.4 MB/s)
[linux-jdk7] [INFO] Downloading from central: https://repo.maven.apache.org/maven2/commons-codec/commons-codec/1.2/commons-codec-1.2.jar
[linux-jdk7] [INFO] Downloaded from central: https://repo.maven.apache.org/maven2/commons-codec/commons-codec/1.2/commons-codec-1.2.jar (30 kB at 2.5 MB/s)
[linux-jdk7] [INFO] Downloading from Nexus: http://repository.apache.org/snapshots/org/apache/maven/scm/maven-scm-manager-plexus/1.9.6-SNAPSHOT/maven-scm-manager-plexus-1.9.6-20171202.110510-14.jar
[linux-jdk8] [INFO]
[linux-jdk8] [INFO] --- maven-resources-plugin:2.7:resources (default-resources) @ maven-release-manager ---
[linux-jdk8] [INFO] Using 'UTF-8' encoding to copy filtered resources.
[linux-jdk8] [INFO] Copying 3 resources
[linux-jdk8] [INFO] Copying 3 resources
[linux-jdk8] [INFO]
[linux-jdk8] [INFO] --- maven-compiler-plugin:3.2:compile (default-compile) @ maven-release-manager ---
[linux-jdk8] [INFO] Changes detected - recompiling the module!
[linux-jdk8] [INFO] Compiling 103 source files to /home/jenkins/jenkins-slave/workspace/en-box_maven-release_master-OCKGULQBCZ67VBKJ7HF6E7KZUCKX7ZC6FX64GH66OHP7A4VAQBIQ/m/maven-release-manager/target/classes
[linux-jdk7] [INFO] Downloaded from Nexus: http://repository.apache.org/snapshots/org/apache/maven/scm/maven-scm-manager-plexus/1.9.6-SNAPSHOT/maven-scm-manager-plexus-1.9.6-20171202.110510-14.jar (11 kB at 30 kB/s)
[linux-jdk7] [INFO] Downloading from central: https://repo.maven.apache.org/maven2/org/hamcrest/hamcrest-core/1.1/hamcrest-core-1.1.jar
[linux-jdk7] [INFO] Downloaded from central: https://repo.maven.apache.org/maven2/org/hamcrest/hamcrest-core/1.1/hamcrest-core-1.1.jar (77 kB at 3.3 MB/s)
[linux-jdk7] [INFO]
[linux-jdk7] [INFO] --- maven-enforcer-plugin:1.3.1:enforce (ban-known-bad-maven-versions) @ maven-release-manager ---
[linux-jdk7] [INFO]
[linux-jdk7] [INFO] --- apache-rat-plugin:0.11:check (rat-check) @ maven-release-manager ---
[linux-jdk7] [INFO] 51 implicit excludes (use -debug for more details).
[linux-jdk7] [INFO] Exclude: maven-release-policies/maven-release-semver-policy/**/*.*
[linux-jdk7] [INFO] Exclude: .repository
[linux-jdk7] [INFO] Exclude: Jenkinsfile
[linux-jdk7] [INFO] Exclude: DEPENDENCIES
[linux-jdk7] [INFO] 1093 resources included (use -debug for more details)
[linux-jdk8] [INFO] /home/jenkins/jenkins-slave/workspace/en-box_maven-release_master-OCKGULQBCZ67VBKJ7HF6E7KZUCKX7ZC6FX64GH66OHP7A4VAQBIQ/m/maven-release-manager/src/main/java/org/apache/maven/shared/release/phase/AbstractReleasePhase.java: Some input files use or override a deprecated API.
[linux-jdk8] [INFO] /home/jenkins/jenkins-slave/workspace/en-box_maven-release_master-OCKGULQBCZ67VBKJ7HF6E7KZUCKX7ZC6FX64GH66OHP7A4VAQBIQ/m/maven-release-manager/src/main/java/org/apache/maven/shared/release/phase/AbstractReleasePhase.java: Recompile with -Xlint:deprecation for details.
[linux-jdk8] [INFO] /home/jenkins/jenkins-slave/workspace/en-box_maven-release_master-OCKGULQBCZ67VBKJ7HF6E7KZUCKX7ZC6FX64GH66OHP7A4VAQBIQ/m/maven-release-manager/target/generated-sources/modello/org/apache/maven/shared/release/config/ReleaseDescriptor.java: Some input files use unchecked or unsafe operations.
[linux-jdk8] [INFO] /home/jenkins/jenkins-slave/workspace/en-box_maven-release_master-OCKGULQBCZ67VBKJ7HF6E7KZUCKX7ZC6FX64GH66OHP7A4VAQBIQ/m/maven-release-manager/target/generated-sources/modello/org/apache/maven/shared/release/config/ReleaseDescriptor.java: Recompile with -Xlint:unchecked for details.
[linux-jdk8] [INFO]
[linux-jdk8] [INFO] --- plexus-component-metadata:1.6:generate-metadata (default) @ maven-release-manager ---
[linux-jdk8] [INFO] Downloading from central: https://repo.maven.apache.org/maven2/org/codehaus/plexus/plexus-container-default/1.6/plexus-container-default-1.6.pom
[linux-jdk8] [INFO] Downloaded from central: https://repo.maven.apache.org/maven2/org/codehaus/plexus/plexus-container-default/1.6/plexus-container-default-1.6.pom (2.7 kB at 205 kB/s)
[linux-jdk8] [INFO] Downloading from central: https://repo.maven.apache.org/maven2/org/codehaus/plexus/plexus-classworlds/2.5.1/plexus-classworlds-2.5.1.pom
[linux-jdk8] [INFO] Downloaded from central: https://repo.maven.apache.org/maven2/org/codehaus/plexus/plexus-classworlds/2.5.1/plexus-classworlds-2.5.1.pom (5.0 kB at 385 kB/s)
[linux-jdk8] [INFO] Downloading from central: https://repo.maven.apache.org/maven2/org/apache/xbean/xbean-reflect/3.7/xbean-reflect-3.7.pom
[linux-jdk8] [INFO] Downloaded from central: https://repo.maven.apache.org/maven2/org/apache/xbean/xbean-reflect/3.7/xbean-reflect-3.7.pom (5.1 kB at 424 kB/s)
[linux-jdk8] [INFO] Downloading from central: https://repo.maven.apache.org/maven2/org/apache/xbean/xbean/3.7/xbean-3.7.pom
[linux-jdk8] [INFO] Downloaded from central: https://repo.maven.apache.org/maven2/org/apache/xbean/xbean/3.7/xbean-3.7.pom (15 kB at 1.3 MB/s)
[linux-jdk8] [INFO] Downloading from central: https://repo.maven.apache.org/maven2/org/apache/geronimo/genesis/genesis-java5-flava/2.0/genesis-java5-flava-2.0.pom
[linux-jdk8] [INFO] Downloaded from central: https://repo.maven.apache.org/maven2/org/apache/geronimo/genesis/genesis-java5-flava/2.0/genesis-java5-flava-2.0.pom (5.5 kB at 498 kB/s)
[linux-jdk8] [INFO] Downloading from central: https://repo.maven.apache.org/maven2/org/apache/geronimo/genesis/genesis-default-flava/2.0/genesis-default-flava-2.0.pom
[linux-jdk8] [INFO] Downloaded from central: https://repo.maven.apache.org/maven2/org/apache/geronimo/genesis/genesis-default-flava/2.0/genesis-default-flava-2.0.pom (18 kB at 1.5 MB/s)
[linux-jdk8] [INFO] Downloading from central: https://repo.maven.apache.org/maven2/org/apache/geronimo/genesis/genesis/2.0/genesis-2.0.pom
[linux-jdk8] [INFO] Downloaded from central: https://repo.maven.apache.org/maven2/org/apache/geronimo/genesis/genesis/2.0/genesis-2.0.pom (18 kB at 1.7 MB/s)
[linux-jdk8] [INFO] Downloading from central: https://repo.maven.apache.org/maven2/org/codehaus/plexus/plexus-component-annotations/1.6/plexus-component-annotations-1.6.pom
[linux-jdk8] [INFO] Downloaded from central: https://repo.maven.apache.org/maven2/org/codehaus/plexus/plexus-component-annotations/1.6/plexus-component-annotations-1.6.pom (748 B at 58 kB/s)
[linux-jdk8] [INFO] Downloading from central: https://repo.maven.apache.org/maven2/com/thoughtworks/qdox/qdox/2.0-M2/qdox-2.0-M2.pom
[linux-jdk8] [INFO] Downloaded from central: https://repo.maven.apache.org/maven2/com/thoughtworks/qdox/qdox/2.0-M2/qdox-2.0-M2.pom (18 kB at 1.4 MB/s)
[linux-jdk8] [INFO] Downloading from central: https://repo.maven.apache.org/maven2/jdom/jdom/1.1/jdom-1.1.pom
[linux-jdk8] [INFO] Downloaded from central: https://repo.maven.apache.org/maven2/jdom/jdom/1.1/jdom-1.1.pom (526 B at 38 kB/s)
[linux-jdk8] [INFO] Downloading from central: https://repo.maven.apache.org/maven2/org/codehaus/plexus/plexus-cli/1.6/plexus-cli-1.6.pom
[linux-jdk8] [INFO] Downloaded from central: https://repo.maven.apache.org/maven2/org/codehaus/plexus/plexus-cli/1.6/plexus-cli-1.6.pom (1.4 kB at 128 kB/s)
[linux-jdk8] [INFO] Downloading from central: https://repo.maven.apache.org/maven2/org/codehaus/plexus/plexus-components/1.1.20/plexus-components-1.1.20.pom
[linux-jdk8] [INFO] Downloaded from central: https://repo.maven.apache.org/maven2/org/codehaus/plexus/plexus-components/1.1.20/plexus-components-1.1.20.pom (3.0 kB at 274 kB/s)
[linux-jdk8] [INFO] Downloading from central: https://repo.maven.apache.org/maven2/org/codehaus/plexus/plexus/3.1/plexus-3.1.pom
[linux-jdk8] [INFO] Downloaded from central: https://repo.maven.apache.org/maven2/org/codehaus/plexus/plexus/3.1/plexus-3.1.pom (19 kB at 1.2 MB/s)
[linux-jdk8] [INFO] Downloading from central: https://repo.maven.apache.org/maven2/org/ow2/asm/asm-all/5.0.2/asm-all-5.0.2.pom
[linux-jdk8] [INFO] Downloaded from central: https://repo.maven.apache.org/maven2/org/ow2/asm/asm-all/5.0.2/asm-all-5.0.2.pom (2.0 kB at 152 kB/s)
[linux-jdk8] [INFO] Downloading from central: https://repo.maven.apache.org/maven2/org/ow2/asm/asm-parent/5.0.2/asm-parent-5.0.2.pom
[linux-jdk8] [INFO] Downloaded from central: https://repo.maven.apache.org/maven2/org/ow2/asm/asm-parent/5.0.2/asm-parent-5.0.2.pom (5.5 kB at 458 kB/s)
[linux-jdk8] [INFO] Downloading from central: https://repo.maven.apache.org/maven2/org/codehaus/plexus/plexus-container-default/1.6/plexus-container-default-1.6.jar
[linux-jdk8] [INFO] Downloading from central: https://repo.maven.apache.org/maven2/org/codehaus/plexus/plexus-classworlds/2.5.1/plexus-classworlds-2.5.1.jar
[linux-jdk8] [INFO] Downloading from central: https://repo.maven.apache.org/maven2/org/apache/xbean/xbean-reflect/3.7/xbean-reflect-3.7.jar
[linux-jdk8] [INFO] Downloading from central: https://repo.maven.apache.org/maven2/org/codehaus/plexus/plexus-component-annotations/1.6/plexus-component-annotations-1.6.jar
[linux-jdk8] [INFO] Downloading from central: https://repo.maven.apache.org/maven2/com/thoughtworks/qdox/qdox/2.0-M2/qdox-2.0-M2.jar
[linux-jdk8] [INFO] Downloaded from central: https://repo.maven.apache.org/maven2/org/codehaus/plexus/plexus-component-annotations/1.6/plexus-component-annotations-1.6.jar (4.3 kB at 251 kB/s)
[linux-jdk8] [INFO] Downloading from central: https://repo.maven.apache.org/maven2/org/codehaus/plexus/plexus-cli/1.6/plexus-cli-1.6.jar
[linux-jdk8] [INFO] Downloaded from central: https://repo.maven.apache.org/maven2/org/codehaus/plexus/plexus-classworlds/2.5.1/plexus-classworlds-2.5.1.jar (50 kB at 2.6 MB/s)
[linux-jdk8] [INFO] Downloading from central: https://repo.maven.apache.org/maven2/org/ow2/asm/asm-all/5.0.2/asm-all-5.0.2.jar
[linux-jdk8] [INFO] Downloaded from central: https://repo.maven.apache.org/maven2/org/apache/xbean/xbean-reflect/3.7/xbean-reflect-3.7.jar (148 kB at 5.1 MB/s)
[linux-jdk8] [INFO] Downloaded from central: https://repo.maven.apache.org/maven2/org/codehaus/plexus/plexus-cli/1.6/plexus-cli-1.6.jar (7.4 kB at 264 kB/s)
[linux-jdk8] [INFO] Downloaded from central: https://repo.maven.apache.org/maven2/org/codehaus/plexus/plexus-container-default/1.6/plexus-container-default-1.6.jar (224 kB at 6.8 MB/s)
[linux-jdk8] [INFO] Downloaded from central: https://repo.maven.apache.org/maven2/com/thoughtworks/qdox/qdox/2.0-M2/qdox-2.0-M2.jar (292 kB at 7.7 MB/s)
[linux-jdk8] [INFO] Downloaded from central: https://repo.maven.apache.org/maven2/org/ow2/asm/asm-all/5.0.2/asm-all-5.0.2.jar (242 kB at 6.0 MB/s)
[Pipeline] [linux-jdk9] }
[linux-jdk9] [withMaven] Skip 'Generated Artifacts Publisher' disabled by configuration
[linux-jdk9] [withMaven] junitPublisher - Archive test results for Maven artifact org.apache.maven.release:maven-release-api:3.0.0-SNAPSHOT generated by maven-surefire-plugin:test (default-test): m/maven-release-api/target/surefire-reports/*.xml
[linux-jdk9] [withMaven] junitPublisher - Jenkins JUnit Attachments Plugin not found, can't publish test attachments.Recording test results
[linux-jdk9] None of the test reports contained any result
[linux-jdk9] [withMaven] Skip 'Findbugs Publisher' disabled by configuration
[linux-jdk9] [withMaven] Skip 'Open Task Scanner Publisher' disabled by configuration
[Pipeline] [linux-jdk9] // withMaven
[Pipeline] [linux-jdk9] }
[Pipeline] [linux-jdk9] // stage
[Pipeline] [linux-jdk9] }
[Pipeline] [linux-jdk9] // node
[Pipeline] [linux-jdk9] }
[linux-jdk7] Sending interrupt signal to process
[linux-jdk8] [INFO] Discovered 33 component descriptors(s)
[linux-jdk8] [INFO]
[linux-jdk8] [INFO] --- plexus-component-metadata:1.6:merge-metadata (merge) @ maven-release-manager ---
[linux-jdk8] [INFO]
[linux-jdk8] [INFO] --- maven-resources-plugin:2.7:testResources (default-testResources) @ maven-release-manager ---
[linux-jdk8] [INFO] Using 'UTF-8' encoding to copy filtered resources.
[linux-jdk8] [INFO] Copying 890 resources
[linux-jdk8] [INFO] Copying 3 resources
[linux-jdk8] [INFO]
[linux-jdk8] [INFO] --- maven-compiler-plugin:3.2:testCompile (default-testCompile) @ maven-release-manager ---
[linux-jdk8] [INFO] Changes detected - recompiling the module!
[linux-jdk8] [INFO] Compiling 65 source files to /home/jenkins/jenkins-slave/workspace/en-box_maven-release_master-OCKGULQBCZ67VBKJ7HF6E7KZUCKX7ZC6FX64GH66OHP7A4VAQBIQ/m/maven-release-manager/target/test-classes
[linux-jdk9] Failed in branch linux-jdk9
[linux-jdk8] [INFO] /home/jenkins/jenkins-slave/workspace/en-box_maven-release_master-OCKGULQBCZ67VBKJ7HF6E7KZUCKX7ZC6FX64GH66OHP7A4VAQBIQ/m/maven-release-manager/src/test/java/org/apache/maven/shared/release/phase/AbstractReleaseTestCase.java: Some input files use or override a deprecated API.
[linux-jdk8] [INFO] /home/jenkins/jenkins-slave/workspace/en-box_maven-release_master-OCKGULQBCZ67VBKJ7HF6E7KZUCKX7ZC6FX64GH66OHP7A4VAQBIQ/m/maven-release-manager/src/test/java/org/apache/maven/shared/release/phase/AbstractReleaseTestCase.java: Recompile with -Xlint:deprecation for details.
[linux-jdk8] [INFO] /home/jenkins/jenkins-slave/workspace/en-box_maven-release_master-OCKGULQBCZ67VBKJ7HF6E7KZUCKX7ZC6FX64GH66OHP7A4VAQBIQ/m/maven-release-manager/src/test/java/org/apache/maven/shared/release/config/ReleaseUtilsTest.java: /home/jenkins/jenkins-slave/workspace/en-box_maven-release_master-OCKGULQBCZ67VBKJ7HF6E7KZUCKX7ZC6FX64GH66OHP7A4VAQBIQ/m/maven-release-manager/src/test/java/org/apache/maven/shared/release/config/ReleaseUtilsTest.java uses unchecked or unsafe operations.
[linux-jdk8] [INFO] /home/jenkins/jenkins-slave/workspace/en-box_maven-release_master-OCKGULQBCZ67VBKJ7HF6E7KZUCKX7ZC6FX64GH66OHP7A4VAQBIQ/m/maven-release-manager/src/test/java/org/apache/maven/shared/release/config/ReleaseUtilsTest.java: Recompile with -Xlint:unchecked for details.
[linux-jdk8] [INFO]
[linux-jdk8] [INFO] --- maven-surefire-plugin:2.18.1:test (default-test) @ maven-release-manager ---
[linux-jdk8] Sending interrupt signal to process
[linux-jdk8] [INFO] Surefire report directory: /home/jenkins/jenkins-slave/workspace/en-box_maven-release_master-OCKGULQBCZ67VBKJ7HF6E7KZUCKX7ZC6FX64GH66OHP7A4VAQBIQ/m/maven-release-manager/target/surefire-reports
[linux-jdk8] [INFO] Downloading from central: https://repo.maven.apache.org/maven2/org/apache/maven/surefire/surefire-junit4/2.18.1/surefire-junit4-2.18.1.pom
[linux-jdk8] [INFO] Downloaded from central: https://repo.maven.apache.org/maven2/org/apache/maven/surefire/surefire-junit4/2.18.1/surefire-junit4-2.18.1.pom (2.5 kB at 208 kB/s)
[linux-jdk8] [INFO] Downloading from central: https://repo.maven.apache.org/maven2/org/apache/maven/surefire/surefire-providers/2.18.1/surefire-providers-2.18.1.pom
[linux-jdk8] [INFO] Downloaded from central: https://repo.maven.apache.org/maven2/org/apache/maven/surefire/surefire-providers/2.18.1/surefire-providers-2.18.1.pom (2.5 kB at 196 kB/s)
[linux-jdk8] [INFO] Downloading from central: https://repo.maven.apache.org/maven2/org/apache/maven/surefire/surefire-junit4/2.18.1/surefire-junit4-2.18.1.jar
[linux-jdk8] [INFO] Downloaded from central: https://repo.maven.apache.org/maven2/org/apache/maven/surefire/surefire-junit4/2.18.1/surefire-junit4-2.18.1.jar (68 kB at 4.5 MB/s)
[linux-jdk8]
[linux-jdk8] -------------------------------------------------------
[linux-jdk8]  T E S T S
[linux-jdk8] -------------------------------------------------------
[linux-jdk8] Picked up JAVA_TOOL_OPTIONS: -Dmaven.ext.class.path="/home/jenkins/jenkins-slave/workspace/en-box_maven-release_master-OCKGULQBCZ67VBKJ7HF6E7KZUCKX7ZC6FX64GH66OHP7A4VAQBIQ@tmp/withMaven418e5ede/pipeline-maven-spy.jar" -Dorg.jenkinsci.plugins.pipeline.maven.reportsFolder="/home/jenkins/jenkins-slave/workspace/en-box_maven-release_master-OCKGULQBCZ67VBKJ7HF6E7KZUCKX7ZC6FX64GH66OHP7A4VAQBIQ@tmp/withMaven418e5ede"
[linux-jdk8]
[linux-jdk8] Results :
[linux-jdk8]
[linux-jdk8] Tests run: 0, Failures: 0, Errors: 0, Skipped: 0
[linux-jdk8]
[linux-jdk8] [INFO] ------------------------------------------------------------------------
[linux-jdk8] [INFO] Reactor Summary:
[linux-jdk8] [INFO]
[linux-jdk8] [INFO] Maven Release ...................................... SUCCESS [ 10.127 s]
[linux-jdk8] [INFO] Maven Release APIs ................................. SUCCESS [  2.467 s]
[linux-jdk8] [INFO] Maven Release Manager .............................. FAILURE [ 34.477 s]
[linux-jdk8] [INFO] Maven Release Plugin ............................... SKIPPED
[linux-jdk8] [INFO] Maven Release Odd-Even Policy ...................... SKIPPED
[linux-jdk8] [INFO] ------------------------------------------------------------------------
[linux-jdk8] [INFO] BUILD FAILURE
[linux-jdk8] [INFO] ------------------------------------------------------------------------
[linux-jdk8] [INFO] Total time: 48.314 s
[linux-jdk8] [INFO] Finished at: 2017-12-06T22:02:58Z
[linux-jdk8] [INFO] Final Memory: 59M/2013M
[linux-jdk8] [INFO] ------------------------------------------------------------------------
[linux-jdk8] [jenkins-maven-event-spy] INFO generated /home/jenkins/jenkins-slave/workspace/en-box_maven-release_master-OCKGULQBCZ67VBKJ7HF6E7KZUCKX7ZC6FX64GH66OHP7A4VAQBIQ@tmp/withMaven418e5ede/maven-spy-20171206-220210-3862112064756998469095.log
[linux-jdk8] [ERROR] Failed to execute goal org.apache.maven.plugins:maven-surefire-plugin:2.18.1:test (default-test) on project maven-release-manager: Execution default-test of goal org.apache.maven.plugins:maven-surefire-plugin:2.18.1:test failed: The forked VM terminated without properly saying goodbye. VM crash or System.exit called?
[linux-jdk8] [ERROR] Command was /bin/sh -c cd /home/jenkins/jenkins-slave/workspace/en-box_maven-release_master-OCKGULQBCZ67VBKJ7HF6E7KZUCKX7ZC6FX64GH66OHP7A4VAQBIQ/m/maven-release-manager && /usr/local/asfpackages/java/jdk1.8.0_152/jre/bin/java -Xmx256m -jar /home/jenkins/jenkins-slave/workspace/en-box_maven-release_master-OCKGULQBCZ67VBKJ7HF6E7KZUCKX7ZC6FX64GH66OHP7A4VAQBIQ/m/maven-release-manager/target/surefire/surefirebooter851813511503452085.jar /home/jenkins/jenkins-slave/workspace/en-box_maven-release_master-OCKGULQBCZ67VBKJ7HF6E7KZUCKX7ZC6FX64GH66OHP7A4VAQBIQ/m/maven-release-manager/target/surefire/surefire8260366983404525345tmp /home/jenkins/jenkins-slave/workspace/en-box_maven-release_master-OCKGULQBCZ67VBKJ7HF6E7KZUCKX7ZC6FX64GH66OHP7A4VAQBIQ/m/maven-release-manager/target/surefire/surefire_06568238240062157757tmp
[linux-jdk8] [ERROR] -> [Help 1]
[linux-jdk8] [ERROR]
[linux-jdk8] [ERROR] To see the full stack trace of the errors, re-run Maven with the -e switch.
[linux-jdk8] [ERROR] Re-run Maven using the -X switch to enable full debug logging.
[linux-jdk8] [ERROR]
[linux-jdk8] [ERROR] For more information about the errors and possible solutions, please read the following articles:
[linux-jdk8] [ERROR] [Help 1] http://cwiki.apache.org/confluence/display/MAVEN/PluginExecutionException
[linux-jdk8] [ERROR]
[linux-jdk8] [ERROR] After correcting the problems, you can resume the build with the command
[linux-jdk8] [ERROR]   mvn <goals> -rf :maven-release-manager
[Pipeline] [windows-jdk7] // node
[Pipeline] [windows-jdk8] // node
[Pipeline] [windows-jdk9] // node
[Pipeline] [windows-jdk7] }
[windows-jdk7] Failed in branch windows-jdk7
[Pipeline] [windows-jdk8] }
[windows-jdk8] Failed in branch windows-jdk8
[Pipeline] [windows-jdk9] }
[windows-jdk9] Failed in branch windows-jdk9
[Pipeline] [linux-jdk7] }
[Pipeline] [linux-jdk7] // dir
[Pipeline] [linux-jdk7] }
[linux-jdk7] [withMaven] One or multiple Maven executions have been ignored by the Jenkins Pipeline Maven Plugin because they have been interrupted before completion (1). See Pipeline Maven Plugin FAQ for more details.
[Pipeline] [linux-jdk7] // withMaven
[Pipeline] [linux-jdk7] }
[Pipeline] [linux-jdk8] }
[Pipeline] [linux-jdk7] // stage
[Pipeline] [linux-jdk8] // dir
[Pipeline] [linux-jdk7] }
[Pipeline] [linux-jdk8] }
[linux-jdk8] [withMaven] Skip 'Generated Artifacts Publisher' disabled by configuration
[linux-jdk8] [withMaven] junitPublisher - Archive test results for Maven artifact org.apache.maven.release:maven-release-api:3.0.0-SNAPSHOT generated by maven-surefire-plugin:test (default-test): m/maven-release-api/target/surefire-reports/*.xml
[linux-jdk8] [withMaven] junitPublisher - Jenkins JUnit Attachments Plugin not found, can't publish test attachments.Recording test results
[linux-jdk8] None of the test reports contained any result
[linux-jdk8] [withMaven] junitPublisher - Archive test results for Maven artifact org.apache.maven.release:maven-release-manager:3.0.0-SNAPSHOT generated by maven-surefire-plugin:test (default-test): m/maven-release-manager/target/surefire-reports/*.xml
[linux-jdk8] [withMaven] junitPublisher - Jenkins JUnit Attachments Plugin not found, can't publish test attachments.Recording test results
[linux-jdk8] None of the test reports contained any result
[linux-jdk8] [withMaven] Skip 'Findbugs Publisher' disabled by configuration
[linux-jdk8] [withMaven] Skip 'Open Task Scanner Publisher' disabled by configuration
[Pipeline] [linux-jdk7] // node
[Pipeline] [linux-jdk8] // withMaven
[Pipeline] [linux-jdk7] }
[linux-jdk7] Failed in branch linux-jdk7
[Pipeline] [linux-jdk8] }
[Pipeline] [linux-jdk8] // stage
[Pipeline] [linux-jdk8] }
[Pipeline] [linux-jdk8] // node
[Pipeline] [linux-jdk8] }
[linux-jdk8] Failed in branch linux-jdk8
[Pipeline] // parallel
[Pipeline] stage
[Pipeline] { (Notifications)
[Pipeline] echo
Build result: FAILURE
[Pipeline] jiraIssueSelector
[Pipeline] emailext