Build succeeded in Jenkins: Maven TLP » maven-enforcer » MENFORCER-293 #1

Previous Topic Next Topic
 
classic Classic list List threaded Threaded
3 messages Options
Reply | Threaded
Open this post in threaded view
|

Build succeeded in Jenkins: Maven TLP » maven-enforcer » MENFORCER-293 #1

Apache Jenkins Server-2
Reply | Threaded
Open this post in threaded view
|

Build failed in Jenkins: Maven TLP » maven-enforcer » MENFORCER-293 #2

Apache Jenkins Server-2
See https://builds.apache.org/job/maven-box/job/maven-enforcer/job/MENFORCER-293/2/

Changes:

* Stop commenting on INFRA tickets

All tests passed

Build log:
[...truncated 1.92 MB...]
[linux-jdk9] at org.jenkinsci.plugins.scriptsecurity.sandbox.groovy.GroovySandbox.runInSandbox(GroovySandbox.java:108)
[linux-jdk9] at org.jenkinsci.plugins.workflow.cps.SandboxContinuable.run0(SandboxContinuable.java:32)
[linux-jdk9] at org.jenkinsci.plugins.workflow.cps.CpsThread.runNextChunk(CpsThread.java:174)
[linux-jdk9] at org.jenkinsci.plugins.workflow.cps.CpsThreadGroup.run(CpsThreadGroup.java:331)
[linux-jdk9] at org.jenkinsci.plugins.workflow.cps.CpsThreadGroup.access$100(CpsThreadGroup.java:82)
[linux-jdk9] at org.jenkinsci.plugins.workflow.cps.CpsThreadGroup$2.call(CpsThreadGroup.java:243)
[linux-jdk9] at org.jenkinsci.plugins.workflow.cps.CpsThreadGroup$2.call(CpsThreadGroup.java:231)
[linux-jdk9] at org.jenkinsci.plugins.workflow.cps.CpsVmExecutorService$2.call(CpsVmExecutorService.java:64)
[linux-jdk9] at java.util.concurrent.FutureTask.run(FutureTask.java:266)
[linux-jdk9] at hudson.remoting.SingleLaneExecutorService$1.run(SingleLaneExecutorService.java:112)
[linux-jdk9] at jenkins.util.ContextResettingExecutorService$1.run(ContextResettingExecutorService.java:28)
[linux-jdk9] at java.util.concurrent.Executors$RunnableAdapter.call(Executors.java:511)
[linux-jdk9] at java.util.concurrent.FutureTask.run(FutureTask.java:266)
[linux-jdk9] at java.util.concurrent.ThreadPoolExecutor.runWorker(ThreadPoolExecutor.java:1149)
[linux-jdk9] at java.util.concurrent.ThreadPoolExecutor$Worker.run(ThreadPoolExecutor.java:624)
[linux-jdk9] at java.lang.Thread.run(Thread.java:748)
[linux-jdk9] [withMaven] junitPublisher - Archive test results for Maven artifact org.apache.maven.enforcer:enforcer-api:3.0.0-SNAPSHOT generated by maven-surefire-plugin:test (default-test): m/enforcer-api/target/surefire-reports/*.xml
[linux-jdk9] [withMaven] junitPublisher - Jenkins JUnit Attachments Plugin not found, can't publish test attachments.Recording test results
[linux-jdk9] None of the test reports contained any result
[linux-jdk9] [withMaven] junitPublisher - Archive test results for Maven artifact org.apache.maven.enforcer:enforcer-rules:3.0.0-SNAPSHOT generated by maven-surefire-plugin:test (default-test): m/enforcer-rules/target/surefire-reports/*.xml
[linux-jdk9] [withMaven] junitPublisher - Jenkins JUnit Attachments Plugin not found, can't publish test attachments.Recording test results
[linux-jdk9] [withMaven] junitPublisher - Archive test results for Maven artifact org.apache.maven.plugins:maven-enforcer-plugin:3.0.0-SNAPSHOT generated by maven-surefire-plugin:test (default-test): m/maven-enforcer-plugin/target/surefire-reports/*.xml
[linux-jdk9] [withMaven] junitPublisher - Jenkins JUnit Attachments Plugin not found, can't publish test attachments.Recording test results
[linux-jdk9] [withMaven] Skip 'Findbugs Publisher' disabled by configuration
[linux-jdk9] [withMaven] Skip 'Open Task Scanner Publisher' disabled by configuration
[Pipeline] [linux-jdk9] // withMaven
[Pipeline] [linux-jdk9] }
[Pipeline] [linux-jdk9] // stage
[Pipeline] [linux-jdk9] }
[Pipeline] [linux-jdk9] // node
[Pipeline] [linux-jdk9] }
[linux-jdk8] [INFO] snapshot org.apache.maven.its.enforcer:module1:1.0-SNAPSHOT: checking for updates from Nexus
[linux-jdk8] [INFO] artifact org.apache.maven.its.enforcer.module1:1.0-SNAPSHOT: checking for updates from central
[linux-jdk8] [INFO] org.apache.maven.its.enforcer.module1.1.0-SNAPSHOT: checking for updates from central
[linux-jdk8] [INFO] run script verify.groovy
[linux-jdk8] [INFO] ..SUCCESS (7.6 s)
[linux-jdk8] [INFO] Building: multimodule/pom.xml
[linux-jdk8] [INFO] ..SUCCESS (7.3 s)
[linux-jdk8] [INFO] Building: ban-distribution-management-multi-module-build/pom.xml
[linux-jdk8] [INFO] run script verify.groovy
[linux-jdk8] [INFO] ..SUCCESS (5.6 s)
[linux-jdk8] [INFO] Building: require-no-repositories/pom.xml
[linux-jdk8] [INFO] ..SUCCESS (7.0 s)
[linux-jdk8] [INFO] Building: require-property/pom.xml
[linux-jdk8] [INFO] ..SUCCESS (4.8 s)
[linux-jdk8] [INFO] Building: banned-plugins/pom.xml
[linux-jdk8] [INFO] ..SUCCESS (5.6 s)
[linux-jdk8] [INFO] Building: require-plugin-versions-ci/pom.xml
[linux-jdk8] [INFO] run script verify.groovy
[linux-jdk8] [INFO] ..SUCCESS (5.0 s)
[linux-jdk8] [INFO] Building: banned-dependencies-versionrange-fail/pom.xml
[linux-jdk8] [INFO] run script verify.groovy
[linux-jdk8] [INFO] ..SUCCESS (7.6 s)
[linux-jdk8] [INFO] Building: require-no-repositories-allow-repo/pom.xml
[linux-jdk7]
[linux-jdk7] Results :
[linux-jdk7]
[linux-jdk7] Tests run: 0, Failures: 0, Errors: 0, Skipped: 0
[linux-jdk7]
[linux-jdk7] [INFO] ------------------------------------------------------------------------
[linux-jdk7] [INFO] Reactor Summary:
[linux-jdk7] [INFO]
[linux-jdk7] [INFO] Apache Maven Enforcer .............................. SUCCESS [ 28.532 s]
[linux-jdk7] [INFO] Apache Maven Enforcer API .......................... SUCCESS [  8.685 s]
[linux-jdk7] [INFO] Apache Maven Enforcer Built-In Rules ............... SUCCESS [ 23.673 s]
[linux-jdk7] [INFO] Apache Maven Enforcer Plugin ....................... FAILURE [01:29 min]
[linux-jdk7] [INFO] ------------------------------------------------------------------------
[linux-jdk7] [INFO] BUILD FAILURE
[linux-jdk7] [INFO] ------------------------------------------------------------------------
[linux-jdk7] [INFO] Total time: 02:59 min
[linux-jdk7] [INFO] Finished at: 2018-01-08T18:51:15Z
[linux-jdk7] [INFO] Final Memory: 51M/1813M
[linux-jdk7] [INFO] ------------------------------------------------------------------------
[linux-jdk7] [INFO] [jenkins-event-spy] Generated /home/jenkins/jenkins-slave/workspace/aven-enforcer_MENFORCER-293-BI6CM2W3BNDO6DUVOPHWEAS5QUASQ5XTKEGCRN3NMUSWBTSOFRDQ@tmp/withMaven32cb6878/maven-spy-20180108-184815-2551103861593120407241.log
[linux-jdk7] [ERROR] Failed to execute goal org.apache.maven.plugins:maven-surefire-plugin:2.19.1:test (default-test) on project maven-enforcer-plugin: Execution default-test of goal org.apache.maven.plugins:maven-surefire-plugin:2.19.1:test failed: The forked VM terminated without properly saying goodbye. VM crash or System.exit called?
[linux-jdk7] [ERROR] Command was /bin/sh -c cd /home/jenkins/jenkins-slave/workspace/aven-enforcer_MENFORCER-293-BI6CM2W3BNDO6DUVOPHWEAS5QUASQ5XTKEGCRN3NMUSWBTSOFRDQ/m/maven-enforcer-plugin && /usr/local/asfpackages/java/jdk1.7.0_80/jre/bin/java -jar /home/jenkins/jenkins-slave/workspace/aven-enforcer_MENFORCER-293-BI6CM2W3BNDO6DUVOPHWEAS5QUASQ5XTKEGCRN3NMUSWBTSOFRDQ/m/maven-enforcer-plugin/target/surefire/surefirebooter4597624269095303658.jar /home/jenkins/jenkins-slave/workspace/aven-enforcer_MENFORCER-293-BI6CM2W3BNDO6DUVOPHWEAS5QUASQ5XTKEGCRN3NMUSWBTSOFRDQ/m/maven-enforcer-plugin/target/surefire/surefire9107084120165003199tmp /home/jenkins/jenkins-slave/workspace/aven-enforcer_MENFORCER-293-BI6CM2W3BNDO6DUVOPHWEAS5QUASQ5XTKEGCRN3NMUSWBTSOFRDQ/m/maven-enforcer-plugin/target/surefire/surefire_1577904788795368005tmp
[linux-jdk7] [ERROR] -> [Help 1]
[linux-jdk7] [ERROR]
[linux-jdk7] [ERROR] To see the full stack trace of the errors, re-run Maven with the -e switch.
[linux-jdk7] [ERROR] Re-run Maven using the -X switch to enable full debug logging.
[linux-jdk7] [ERROR]
[linux-jdk7] [ERROR] For more information about the errors and possible solutions, please read the following articles:
[linux-jdk7] [ERROR] [Help 1] http://cwiki.apache.org/confluence/display/MAVEN/PluginExecutionException
[linux-jdk7] [ERROR]
[linux-jdk7] [ERROR] After correcting the problems, you can resume the build with the command
[linux-jdk7] [ERROR]   mvn <goals> -rf :maven-enforcer-plugin
[Pipeline] [linux-jdk7] }
[Pipeline] [linux-jdk7] // dir
[linux-jdk8] [INFO] run script verify.groovy
[linux-jdk8] [INFO] ..SUCCESS (7.1 s)
[linux-jdk8] [INFO] Building: require-java-version/pom.xml
[linux-jdk8] [INFO] ..SUCCESS (6.2 s)
[linux-jdk8] [INFO] Building: require-no-repositories_failure_allowed-plugin-repo/pom.xml
[linux-jdk8] [INFO] run script verify.groovy
[linux-jdk8] [INFO] ..SUCCESS (3.8 s)
[linux-jdk8] [INFO] Building: always-pass/pom.xml
[linux-jdk8] [INFO] ..SUCCESS (3.7 s)
[linux-jdk8] [INFO] Building: resolve_collect_dependencies/pom.xml
[linux-jdk8] [INFO] run script verify.groovy
[linux-jdk8] [INFO] ..SUCCESS (5.0 s)
[linux-jdk8] [INFO] Building: builds_a_pom_noop/pom.xml
[linux-jdk8] [INFO] ..SUCCESS (3.2 s)
[linux-jdk8] [INFO] Building: banned-dependencies-wildcards/pom.xml
[linux-jdk8] [INFO] ..SUCCESS (3.5 s)
[linux-jdk8] [INFO] Building: ban-pom-dependency-version/pom.xml
[linux-jdk8] [INFO] run script verify.groovy
[linux-jdk8] [INFO] ..SUCCESS (3.5 s)
[linux-jdk8] [INFO] Building: require-release-dependencies-excludes_failure/pom.xml
[linux-jdk8] [INFO] ..SUCCESS (3.3 s)
[linux-jdk8] [INFO] Building: require-active-profile/pom.xml
[linux-jdk8] [INFO] ..SUCCESS (3.4 s)
[linux-jdk8] [INFO] Building: require-upper-bound-dependencies-unique_failure/pom.xml
[linux-jdk8] [INFO] run script verify.groovy
[linux-jdk8] [INFO] ..SUCCESS (3.3 s)
[linux-jdk8] [INFO] Building: require-active-profile-from-settings/pom.xml
[linux-jdk8] [INFO] ..SUCCESS (3.2 s)
[linux-jdk8] [INFO] Building: require-no-repositories_failure_plugin-repositories/pom.xml
[linux-jdk8] [INFO] run script verify.groovy
[linux-jdk8] [INFO] ..SUCCESS (3.6 s)
[linux-jdk8] [INFO] Building: evaluate-beanshell/pom.xml
[linux-jdk8] [INFO] ..SUCCESS (3.6 s)
[linux-jdk8] [INFO] Building: ban-transitive-dependencies-fail/pom.xml
[linux-jdk8] [INFO] run script verify.groovy
[linux-jdk8] [INFO] ..SUCCESS (3.5 s)
[linux-jdk8] [INFO] -------------------------------------------------
[linux-jdk8] [INFO] Build Summary:
[linux-jdk8] [INFO]   Passed: 66, Failed: 0, Errors: 0, Skipped: 0
[linux-jdk8] [INFO] -------------------------------------------------
[linux-jdk8] [INFO]
[linux-jdk8] [INFO] --- mrm-maven-plugin:1.0.0:stop (default) @ maven-enforcer-plugin ---
[linux-jdk8] [INFO] Stopping Mock Repository Manager on http://localhost:39030
[linux-jdk8] [INFO] Mock Repository Manager http://localhost:39030 is stopped.
[linux-jdk8] [INFO]
[linux-jdk8] [INFO] --- maven-checkstyle-plugin:2.15:check (checkstyle-check) @ maven-enforcer-plugin ---
[linux-jdk8] [INFO] ------------------------------------------------------------------------
[linux-jdk8] [INFO] Reactor Summary:
[linux-jdk8] [INFO]
[linux-jdk8] [INFO] Apache Maven Enforcer .............................. SUCCESS [ 11.015 s]
[linux-jdk8] [INFO] Apache Maven Enforcer API .......................... SUCCESS [  2.783 s]
[linux-jdk8] [INFO] Apache Maven Enforcer Built-In Rules ............... SUCCESS [  8.304 s]
[linux-jdk8] [INFO] Apache Maven Enforcer Plugin ....................... SUCCESS [06:34 min]
[linux-jdk8] [INFO] ------------------------------------------------------------------------
[linux-jdk8] [INFO] BUILD SUCCESS
[linux-jdk8] [INFO] ------------------------------------------------------------------------
[linux-jdk8] [INFO] Total time: 06:58 min
[linux-jdk8] [INFO] Finished at: 2018-01-08T18:52:15Z
[linux-jdk8] [INFO] Final Memory: 69M/3190M
[linux-jdk8] [INFO] ------------------------------------------------------------------------
[linux-jdk8] [INFO] [jenkins-event-spy] Generated /home/jenkins/jenkins-slave/workspace/aven-enforcer_MENFORCER-293-BI6CM2W3BNDO6DUVOPHWEAS5QUASQ5XTKEGCRN3NMUSWBTSOFRDQ@tmp/withMavencf029351/maven-spy-20180108-184517-427758860536783457228.log
[Pipeline] [linux-jdk7] }
[linux-jdk7] [withMaven] artifactsPublisher - Archive artifact m/pom.xml under org/apache/maven/enforcer/enforcer/3.0.0-SNAPSHOT/enforcer-3.0.0-SNAPSHOT.pom
[linux-jdk7] [withMaven] artifactsPublisher - Archive artifact m/enforcer-api/pom.xml under org/apache/maven/enforcer/enforcer-api/3.0.0-SNAPSHOT/enforcer-api-3.0.0-SNAPSHOT.pom
[linux-jdk7] [withMaven] artifactsPublisher - Archive artifact m/enforcer-api/target/enforcer-api-3.0.0-SNAPSHOT.jar under org/apache/maven/enforcer/enforcer-api/3.0.0-SNAPSHOT/enforcer-api-3.0.0-SNAPSHOT.jar
[linux-jdk7] [withMaven] artifactsPublisher - Archive artifact m/enforcer-rules/pom.xml under org/apache/maven/enforcer/enforcer-rules/3.0.0-SNAPSHOT/enforcer-rules-3.0.0-SNAPSHOT.pom
[linux-jdk7] [withMaven] artifactsPublisher - Archive artifact m/enforcer-rules/target/enforcer-rules-3.0.0-SNAPSHOT.jar under org/apache/maven/enforcer/enforcer-rules/3.0.0-SNAPSHOT/enforcer-rules-3.0.0-SNAPSHOT.jar
[linux-jdk7] [withMaven] artifactsPublisher - Archive artifact m/target/enforcer-3.0.0-SNAPSHOT-site.xml under org/apache/maven/enforcer/enforcer/3.0.0-SNAPSHOT/enforcer-3.0.0-SNAPSHOT-site.xml
[linux-jdk7] [withMaven] artifactsPublisher - Archive artifact m/enforcer-rules/target/enforcer-rules-3.0.0-SNAPSHOT-tests.jar under org/apache/maven/enforcer/enforcer-rules/3.0.0-SNAPSHOT/enforcer-rules-3.0.0-SNAPSHOT-tests.jar
[linux-jdk7] [Fast Archiver] No prior successful build to compare, so performing full copy of artifacts
[linux-jdk7] [withMaven] junitPublisher - Archive test results for Maven artifact org.apache.maven.enforcer:enforcer-api:3.0.0-SNAPSHOT generated by maven-surefire-plugin:test (default-test): m/enforcer-api/target/surefire-reports/*.xml
[linux-jdk7] [withMaven] junitPublisher - Jenkins JUnit Attachments Plugin not found, can't publish test attachments.Recording test results
[linux-jdk7] None of the test reports contained any result
[linux-jdk7] [withMaven] junitPublisher - Archive test results for Maven artifact org.apache.maven.enforcer:enforcer-rules:3.0.0-SNAPSHOT generated by maven-surefire-plugin:test (default-test): m/enforcer-rules/target/surefire-reports/*.xml
[linux-jdk7] [withMaven] junitPublisher - Jenkins JUnit Attachments Plugin not found, can't publish test attachments.Recording test results
[linux-jdk7] [withMaven] junitPublisher - Archive test results for Maven artifact org.apache.maven.plugins:maven-enforcer-plugin:3.0.0-SNAPSHOT generated by maven-surefire-plugin:test (default-test): m/maven-enforcer-plugin/target/surefire-reports/*.xml
[linux-jdk7] [withMaven] junitPublisher - Jenkins JUnit Attachments Plugin not found, can't publish test attachments.Recording test results
[linux-jdk7] None of the test reports contained any result
[linux-jdk7] [withMaven] openTasksPublisher - Scan Tasks for Maven artifact org.apache.maven.enforcer:enforcer-api:3.0.0-SNAPSHOT in source directory m/enforcer-api/src/main/java
[linux-jdk7] [withMaven] openTasksPublisher - Scan Tasks for Maven artifact org.apache.maven.enforcer:enforcer-rules:3.0.0-SNAPSHOT in source directory m/enforcer-rules/src/main/java
[linux-jdk7] [withMaven] openTasksPublisher - Scan Tasks for Maven artifact org.apache.maven.plugins:maven-enforcer-plugin:3.0.0-SNAPSHOT in source directory m/maven-enforcer-plugin/src/main/java
[linux-jdk7] [TASKS] Scanning folder '/home/jenkins/jenkins-slave/workspace/aven-enforcer_MENFORCER-293-BI6CM2W3BNDO6DUVOPHWEAS5QUASQ5XTKEGCRN3NMUSWBTSOFRDQ' for files matching the pattern 'm/enforcer-api/src/main/java/**/*,m/enforcer-rules/src/main/java/**/*,m/maven-enforcer-plugin/src/main/java/**/*' - excludes: null
[linux-jdk7] [TASKS] Found 51 files to scan for tasks
[linux-jdk7] [TASKS] Found 5 open tasks.
[linux-jdk7] Skipping warnings blame since pipelines do not have an SCM link.%n
[Pipeline] [linux-jdk7] // withMaven
[Pipeline] [linux-jdk7] echo
[linux-jdk7] [FAIL FAST] This is the first failure and likely root cause
[Pipeline] [linux-jdk7] }
[Pipeline] [linux-jdk8] }
[Pipeline] [linux-jdk7] // stage
[Pipeline] [linux-jdk8] // dir
[Pipeline] [linux-jdk7] }
[Pipeline] [linux-jdk8] }
[linux-jdk8] [withMaven] Skip 'Generated Artifacts Publisher' disabled by configuration
[linux-jdk8] ERROR: [withMaven] WARNING Exception executing Maven reporter 'Invoker Publisher' / org.jenkinsci.plugins.pipeline.maven.publishers.InvokerRunsPublisher. Please report a bug associated for the component 'pipeline-maven-plugin' at https://issues.jenkins-ci.org 
[linux-jdk8] java.lang.IllegalArgumentException: Cannot relativize 'src/it/projects' relatively to '/home/jenkins/jenkins-slave/workspace/aven-enforcer_MENFORCER-293-BI6CM2W3BNDO6DUVOPHWEAS5QUASQ5XTKEGCRN3NMUSWBTSOFRDQ'
[linux-jdk8] at org.jenkinsci.plugins.pipeline.maven.util.XmlUtils.getPathInWorkspace(XmlUtils.java:319)
[linux-jdk8] at org.jenkinsci.plugins.pipeline.maven.publishers.InvokerRunsPublisher.expandAndRelativize(InvokerRunsPublisher.java:178)
[linux-jdk8] at org.jenkinsci.plugins.pipeline.maven.publishers.InvokerRunsPublisher.executeReporter(InvokerRunsPublisher.java:126)
[linux-jdk8] at org.jenkinsci.plugins.pipeline.maven.publishers.InvokerRunsPublisher.process(InvokerRunsPublisher.java:103)
[linux-jdk8] at org.jenkinsci.plugins.pipeline.maven.MavenSpyLogProcessor.processMavenSpyLogs(MavenSpyLogProcessor.java:109)
[linux-jdk8] at org.jenkinsci.plugins.pipeline.maven.WithMavenStepExecution$WorkspaceCleanupCallback.finished(WithMavenStepExecution.java:914)
[linux-jdk8] at org.jenkinsci.plugins.workflow.steps.BodyExecutionCallback$TailCall.onSuccess(BodyExecutionCallback.java:114)
[linux-jdk8] at org.jenkinsci.plugins.workflow.cps.CpsBodyExecution$SuccessAdapter.receive(CpsBodyExecution.java:362)
[linux-jdk8] at com.cloudbees.groovy.cps.Outcome.resumeFrom(Outcome.java:73)
[linux-jdk8] at com.cloudbees.groovy.cps.Continuable$1.call(Continuable.java:166)
[linux-jdk8] at com.cloudbees.groovy.cps.Continuable$1.call(Continuable.java:163)
[linux-jdk8] at org.codehaus.groovy.runtime.GroovyCategorySupport$ThreadCategoryInfo.use(GroovyCategorySupport.java:122)
[linux-jdk8] at org.codehaus.groovy.runtime.GroovyCategorySupport.use(GroovyCategorySupport.java:261)
[linux-jdk8] at com.cloudbees.groovy.cps.Continuable.run0(Continuable.java:163)
[linux-jdk8] at org.jenkinsci.plugins.workflow.cps.SandboxContinuable.access$001(SandboxContinuable.java:19)
[linux-jdk8] at org.jenkinsci.plugins.workflow.cps.SandboxContinuable$1.call(SandboxContinuable.java:35)
[linux-jdk8] at org.jenkinsci.plugins.workflow.cps.SandboxContinuable$1.call(SandboxContinuable.java:32)
[linux-jdk8] at org.jenkinsci.plugins.scriptsecurity.sandbox.groovy.GroovySandbox.runInSandbox(GroovySandbox.java:108)
[linux-jdk8] at org.jenkinsci.plugins.workflow.cps.SandboxContinuable.run0(SandboxContinuable.java:32)
[linux-jdk8] at org.jenkinsci.plugins.workflow.cps.CpsThread.runNextChunk(CpsThread.java:174)
[linux-jdk8] at org.jenkinsci.plugins.workflow.cps.CpsThreadGroup.run(CpsThreadGroup.java:331)
[linux-jdk8] at org.jenkinsci.plugins.workflow.cps.CpsThreadGroup.access$100(CpsThreadGroup.java:82)
[linux-jdk8] at org.jenkinsci.plugins.workflow.cps.CpsThreadGroup$2.call(CpsThreadGroup.java:243)
[linux-jdk8] at org.jenkinsci.plugins.workflow.cps.CpsThreadGroup$2.call(CpsThreadGroup.java:231)
[linux-jdk8] at org.jenkinsci.plugins.workflow.cps.CpsVmExecutorService$2.call(CpsVmExecutorService.java:64)
[linux-jdk8] at java.util.concurrent.FutureTask.run(FutureTask.java:266)
[linux-jdk8] at hudson.remoting.SingleLaneExecutorService$1.run(SingleLaneExecutorService.java:112)
[linux-jdk8] at jenkins.util.ContextResettingExecutorService$1.run(ContextResettingExecutorService.java:28)
[linux-jdk8] at java.util.concurrent.Executors$RunnableAdapter.call(Executors.java:511)
[linux-jdk8] at java.util.concurrent.FutureTask.run(FutureTask.java:266)
[linux-jdk8] at java.util.concurrent.ThreadPoolExecutor.runWorker(ThreadPoolExecutor.java:1149)
[linux-jdk8] at java.util.concurrent.ThreadPoolExecutor$Worker.run(ThreadPoolExecutor.java:624)
[linux-jdk8] at java.lang.Thread.run(Thread.java:748)
[linux-jdk8] [withMaven] junitPublisher - Archive test results for Maven artifact org.apache.maven.enforcer:enforcer-api:3.0.0-SNAPSHOT generated by maven-surefire-plugin:test (default-test): m/enforcer-api/target/surefire-reports/*.xml
[linux-jdk8] [withMaven] junitPublisher - Jenkins JUnit Attachments Plugin not found, can't publish test attachments.Recording test results
[linux-jdk8] None of the test reports contained any result
[linux-jdk8] [withMaven] junitPublisher - Archive test results for Maven artifact org.apache.maven.enforcer:enforcer-rules:3.0.0-SNAPSHOT generated by maven-surefire-plugin:test (default-test): m/enforcer-rules/target/surefire-reports/*.xml
[linux-jdk8] [withMaven] junitPublisher - Jenkins JUnit Attachments Plugin not found, can't publish test attachments.Recording test results
[linux-jdk8] [withMaven] junitPublisher - Archive test results for Maven artifact org.apache.maven.plugins:maven-enforcer-plugin:3.0.0-SNAPSHOT generated by maven-surefire-plugin:test (default-test): m/maven-enforcer-plugin/target/surefire-reports/*.xml
[linux-jdk8] [withMaven] junitPublisher - Jenkins JUnit Attachments Plugin not found, can't publish test attachments.Recording test results
[linux-jdk8] [withMaven] Skip 'Findbugs Publisher' disabled by configuration
[linux-jdk8] [withMaven] Skip 'Open Task Scanner Publisher' disabled by configuration
[Pipeline] [linux-jdk7] // node
[Pipeline] [linux-jdk8] // withMaven
[Pipeline] [linux-jdk7] }
[linux-jdk7] Failed in branch linux-jdk7
[Pipeline] [linux-jdk8] }
[Pipeline] [linux-jdk8] // stage
[Pipeline] [linux-jdk8] }
[Pipeline] [linux-jdk8] // node
[Pipeline] [linux-jdk8] }
[Pipeline] // parallel
[Pipeline] echo
***** FAST FAILURE *****

Fast failure triggered by linux-jdk7

***** FAST FAILURE *****
[Pipeline] stage
[Pipeline] { (Notifications)
[Pipeline] echo
Build result: FAILURE
[Pipeline] jiraIssueSelector
[Pipeline] emailext
Reply | Threaded
Open this post in threaded view
|

Build succeeded in Jenkins: Maven TLP » maven-enforcer » MENFORCER-293 #3

Apache Jenkins Server-2