Build failed in Jenkins: maven-skins #278

Previous Topic Next Topic
 
classic Classic list List threaded Threaded
2 messages Options
Reply | Threaded
Open this post in threaded view
|

Build failed in Jenkins: maven-skins #278

Apache Jenkins Server-2
See <https://builds.apache.org/job/maven-skins/278/display/redirect?page=changes>

Changes:

[hboutemy] [MSKINS-136] switched to Git

------------------------------------------
[...truncated 957 B...]

Parsing POMs
Modules changed, recalculating dependency graph
Established TCP socket on 40892
maven3-agent.jar already up to date
maven3-interceptor.jar already up to date
maven3-interceptor-commons.jar already up to date
[maven-skins] $ /home/jenkins/tools/java/latest1.7/bin/java -Xmx2g -Xms256m -cp /home/jenkins/jenkins-slave/maven3-agent.jar:/home/jenkins/tools/maven/apache-maven-3.0.5/boot/plexus-classworlds-2.4.jar org.jvnet.hudson.maven3.agent.Maven3Main /home/jenkins/tools/maven/apache-maven-3.0.5 /home/jenkins/jenkins-slave/slave.jar /home/jenkins/jenkins-slave/maven3-interceptor.jar /home/jenkins/jenkins-slave/maven3-interceptor-commons.jar 40892
<===[JENKINS REMOTING CAPACITY]===>   channel started
ERROR: ================================================================================
ERROR: Invalid project setup: jenkins/security/MasterToSlaveCallable : Unsupported major.minor version 52.0
ERROR: [JENKINS-18403][JENKINS-28294] JDK 'JDK 1.7 (latest)' not supported to run Maven projects.
ERROR: Maven projects have to be launched with a Java version greater or equal to the minimum version required by the master.
ERROR: Use the Maven JDK Toolchains (plugin) to build your maven project with an older JDK.
ERROR: Retrying with slave Java and setting compile/test properties to point to /home/jenkins/tools/java/latest1.7.
ERROR: ================================================================================
Established TCP socket on 36310
maven3-agent.jar already up to date
maven3-interceptor.jar already up to date
maven3-interceptor-commons.jar already up to date
[maven-skins] $ /usr/local/asfpackages/java/jdk1.8.0_131/jre/bin/java -Xmx2g -Xms256m -cp /home/jenkins/jenkins-slave/maven3-agent.jar:/home/jenkins/tools/maven/apache-maven-3.0.5/boot/plexus-classworlds-2.4.jar org.jvnet.hudson.maven3.agent.Maven3Main /home/jenkins/tools/maven/apache-maven-3.0.5 /home/jenkins/jenkins-slave/slave.jar /home/jenkins/jenkins-slave/maven3-interceptor.jar /home/jenkins/jenkins-slave/maven3-interceptor-commons.jar 36310
<===[JENKINS REMOTING CAPACITY]===>   channel started
Executing Maven:  -B -f <https://builds.apache.org/job/maven-skins/ws/pom.xml> -Dmaven.repo.local=/home/jenkins/jenkins-slave/maven-repositories/0 clean install -B -U -e -fae -V -Prun-its
Apache Maven 3.0.5 (r01de14724cdef164cd33c7c8c2fe155faf9602da; 2013-02-19 13:51:28+0000)
Maven home: /usr/local/asfpackages/maven/apache-maven-3.0.5
Java version: 1.8.0_131, vendor: Oracle Corporation
Java home: /usr/local/asfpackages/java/jdk1.8.0_131/jre
Default locale: en_US, platform encoding: ISO-8859-1
OS name: "linux", version: "4.4.0-43-generic", arch: "amd64", family: "unix"
[INFO] Error stacktraces are turned on.
[INFO] Scanning for projects...
[WARNING]
[WARNING] Some problems were encountered while building the effective model for org.apache.maven.skins:maven-default-skin:jar:1.3-SNAPSHOT
[WARNING] 'reporting.plugins.plugin.version' for org.apache.maven.plugins:maven-project-info-reports-plugin is missing. @ org.apache.maven:maven-parent:30, /home/jenkins/jenkins-slave/maven-repositories/0/org/apache/maven/maven-parent/30/maven-parent-30.pom, line 1065, column 15
[WARNING]
[WARNING] Some problems were encountered while building the effective model for org.apache.maven.skins:maven-fluido-skin:jar:1.7-SNAPSHOT
[WARNING] 'reporting.plugins.plugin.version' for org.apache.maven.plugins:maven-project-info-reports-plugin is missing. @ org.apache.maven:maven-parent:30, /home/jenkins/jenkins-slave/maven-repositories/0/org/apache/maven/maven-parent/30/maven-parent-30.pom, line 1065, column 15
[WARNING]
[WARNING] It is highly recommended to fix these problems because they threaten the stability of your build.
[WARNING]
[WARNING] For this reason, future Maven versions might no longer support building such malformed projects.
[WARNING]
[INFO] ------------------------------------------------------------------------
[INFO] Reactor Build Order:
[INFO]
[INFO] Maven Default Skin
[INFO] Apache Maven Fluido Skin
[INFO] Maven Skins Aggregator
[INFO]                                                                        
[INFO] ------------------------------------------------------------------------
[INFO] Building Maven Default Skin 1.3-SNAPSHOT
[INFO] ------------------------------------------------------------------------
[INFO]
[INFO] --- maven-clean-plugin:3.0.0:clean (default-clean) @ maven-default-skin ---
[INFO] Deleting <https://builds.apache.org/job/maven-skins/ws/maven-default-skin/target>
[INFO]
[INFO] --- maven-enforcer-plugin:1.4.1:enforce (enforce-bytecode-version) @ maven-default-skin ---
[INFO]
[INFO] --- maven-enforcer-plugin:1.4.1:enforce (ban-known-bad-maven-versions) @ maven-default-skin ---
[INFO]
[INFO] --- apache-rat-plugin:0.11:check (rat-check) @ maven-default-skin ---
[INFO] 51 implicit excludes (use -debug for more details).
[INFO] Exclude: DEPENDENCIES
[INFO] 18 resources included (use -debug for more details)
[INFO] Rat check: Summary of files. Unapproved: 1 unknown: 1 generated: 0 approved: 11 licence.
[INFO]                                                                        
[INFO] ------------------------------------------------------------------------
[INFO] Building Apache Maven Fluido Skin 1.7-SNAPSHOT
[INFO] ------------------------------------------------------------------------
[INFO]
[INFO] --- maven-clean-plugin:3.0.0:clean (default-clean) @ maven-fluido-skin ---
[INFO] Deleting <https://builds.apache.org/job/maven-skins/ws/maven-fluido-skin/target>
[INFO]
[INFO] --- maven-enforcer-plugin:1.4.1:enforce (enforce-bytecode-version) @ maven-fluido-skin ---
[INFO]
[INFO] --- maven-enforcer-plugin:1.4.1:enforce (ban-known-bad-maven-versions) @ maven-fluido-skin ---
[INFO]
[INFO] --- apache-rat-plugin:0.11:check (rat-check) @ maven-fluido-skin ---
[INFO] 51 implicit excludes (use -debug for more details).
[INFO] Exclude: DEPENDENCIES
[INFO] Exclude: src/main/resources/fonts/glyphicons-halflings-regular.svg
[INFO] Exclude: src/main/resources/js/prettify.js
[INFO] Exclude: src/main/resources/js/jquery-*.js
[INFO] 170 resources included (use -debug for more details)
[INFO] Rat check: Summary of files. Unapproved: 1 unknown: 1 generated: 0 approved: 133 licence.
[INFO]                                                                        
[INFO] ------------------------------------------------------------------------
[INFO] Building Maven Skins Aggregator 1-SNAPSHOT
[INFO] ------------------------------------------------------------------------
[INFO]
[INFO] --- maven-clean-plugin:2.5:clean (default-clean) @ maven-skins-aggregator ---
[INFO] Deleting <https://builds.apache.org/job/maven-skins/ws/target>
[INFO]
[INFO] --- maven-enforcer-plugin:1.3.1:enforce (enforce-bytecode-version) @ maven-skins-aggregator ---
[INFO]
[INFO] --- maven-enforcer-plugin:1.3.1:enforce (ban-known-bad-maven-versions) @ maven-skins-aggregator ---
[INFO]
[INFO] --- apache-rat-plugin:0.11:check (rat-check) @ maven-skins-aggregator ---
[INFO] 53 implicit excludes (use -debug for more details).
[INFO] Exclude: DEPENDENCIES
[INFO] 4 resources included (use -debug for more details)
Warning: org.apache.xerces.jaxp.SAXParserImpl$JAXPSAXParser: Property 'http://www.oracle.com/xml/jaxp/properties/entityExpansionLimit' is not recognized.
Compiler warnings:
  WARNING:  'org.apache.xerces.jaxp.SAXParserImpl: Property 'http://javax.xml.XMLConstants/property/accessExternalDTD' is not recognized.'
[INFO] Rat check: Summary of files. Unapproved: 1 unknown: 1 generated: 0 approved: 2 licence.
[INFO] ------------------------------------------------------------------------
[INFO] Reactor Summary:
[INFO]
[INFO] Maven Default Skin ................................ FAILURE [8.435s]
[INFO] Apache Maven Fluido Skin .......................... FAILURE [3.433s]
[INFO] Maven Skins Aggregator ............................ FAILURE [3.263s]
[INFO] ------------------------------------------------------------------------
[INFO] BUILD FAILURE
[INFO] ------------------------------------------------------------------------
[INFO] Total time: 23.966s
[INFO] Finished at: Sat Nov 04 11:02:58 UTC 2017
[INFO] Final Memory: 19M/298M
[INFO] ------------------------------------------------------------------------
Waiting for Jenkins to finish collecting data
[ERROR] Failed to execute goal org.apache.rat:apache-rat-plugin:0.11:check (rat-check) on project maven-default-skin: Too many files with unapproved license: 1 See RAT report in: <https://builds.apache.org/job/maven-skins/ws/maven-default-skin/target/rat.txt> -> [Help 1]
org.apache.maven.lifecycle.LifecycleExecutionException: Failed to execute goal org.apache.rat:apache-rat-plugin:0.11:check (rat-check) on project maven-default-skin: Too many files with unapproved license: 1 See RAT report in: <https://builds.apache.org/job/maven-skins/ws/maven-default-skin/target/rat.txt>
        at org.apache.maven.lifecycle.internal.MojoExecutor.execute(MojoExecutor.java:213)
        at org.apache.maven.lifecycle.internal.MojoExecutor.execute(MojoExecutor.java:153)
        at org.apache.maven.lifecycle.internal.MojoExecutor.execute(MojoExecutor.java:145)
        at org.apache.maven.lifecycle.internal.LifecycleModuleBuilder.buildProject(LifecycleModuleBuilder.java:84)
        at org.apache.maven.lifecycle.internal.LifecycleModuleBuilder.buildProject(LifecycleModuleBuilder.java:59)
        at org.apache.maven.lifecycle.internal.LifecycleStarter.singleThreadedBuild(LifecycleStarter.java:183)
        at org.apache.maven.lifecycle.internal.LifecycleStarter.execute(LifecycleStarter.java:161)
        at org.apache.maven.DefaultMaven.doExecute(DefaultMaven.java:320)
        at org.apache.maven.DefaultMaven.execute(DefaultMaven.java:156)
        at org.jvnet.hudson.maven3.launcher.Maven3Launcher.main(Maven3Launcher.java:117)
        at sun.reflect.NativeMethodAccessorImpl.invoke0(Native Method)
        at sun.reflect.NativeMethodAccessorImpl.invoke(NativeMethodAccessorImpl.java:62)
        at sun.reflect.DelegatingMethodAccessorImpl.invoke(DelegatingMethodAccessorImpl.java:43)
        at java.lang.reflect.Method.invoke(Method.java:498)
        at org.codehaus.plexus.classworlds.launcher.Launcher.launchStandard(Launcher.java:329)
        at org.codehaus.plexus.classworlds.launcher.Launcher.launch(Launcher.java:239)
        at org.jvnet.hudson.maven3.agent.Maven3Main.launch(Maven3Main.java:181)
        at sun.reflect.NativeMethodAccessorImpl.invoke0(Native Method)
        at sun.reflect.NativeMethodAccessorImpl.invoke(NativeMethodAccessorImpl.java:62)
        at sun.reflect.DelegatingMethodAccessorImpl.invoke(DelegatingMethodAccessorImpl.java:43)
        at java.lang.reflect.Method.invoke(Method.java:498)
        at hudson.maven.Maven3Builder.call(Maven3Builder.java:139)
        at hudson.maven.Maven3Builder.call(Maven3Builder.java:70)
        at hudson.remoting.UserRequest.perform(UserRequest.java:181)
        at hudson.remoting.UserRequest.perform(UserRequest.java:52)
        at hudson.remoting.Request$2.run(Request.java:336)
        at hudson.remoting.InterceptingExecutorService$1.call(InterceptingExecutorService.java:68)
        at java.util.concurrent.FutureTask.run(FutureTask.java:266)
        at java.util.concurrent.ThreadPoolExecutor.runWorker(ThreadPoolExecutor.java:1142)
        at java.util.concurrent.ThreadPoolExecutor$Worker.run(ThreadPoolExecutor.java:617)
        at java.lang.Thread.run(Thread.java:748)
Caused by: org.apache.rat.mp.RatCheckException: Too many files with unapproved license: 1 See RAT report in: <https://builds.apache.org/job/maven-skins/ws/maven-default-skin/target/rat.txt>
        at org.apache.rat.mp.RatCheckMojo.check(RatCheckMojo.java:194)
        at org.apache.rat.mp.RatCheckMojo.execute(RatCheckMojo.java:182)
        at org.apache.maven.plugin.DefaultBuildPluginManager.executeMojo(DefaultBuildPluginManager.java:101)
        at org.apache.maven.lifecycle.internal.MojoExecutor.execute(MojoExecutor.java:209)
        ... 30 more
[ERROR] Failed to execute goal org.apache.rat:apache-rat-plugin:0.11:check (rat-check) on project maven-fluido-skin: Too many files with unapproved license: 1 See RAT report in: <https://builds.apache.org/job/maven-skins/ws/maven-fluido-skin/target/rat.txt> -> [Help 1]
org.apache.maven.lifecycle.LifecycleExecutionException: Failed to execute goal org.apache.rat:apache-rat-plugin:0.11:check (rat-check) on project maven-fluido-skin: Too many files with unapproved license: 1 See RAT report in: <https://builds.apache.org/job/maven-skins/ws/maven-fluido-skin/target/rat.txt>
        at org.apache.maven.lifecycle.internal.MojoExecutor.execute(MojoExecutor.java:213)
        at org.apache.maven.lifecycle.internal.MojoExecutor.execute(MojoExecutor.java:153)
        at org.apache.maven.lifecycle.internal.MojoExecutor.execute(MojoExecutor.java:145)
        at org.apache.maven.lifecycle.internal.LifecycleModuleBuilder.buildProject(LifecycleModuleBuilder.java:84)
        at org.apache.maven.lifecycle.internal.LifecycleModuleBuilder.buildProject(LifecycleModuleBuilder.java:59)
        at org.apache.maven.lifecycle.internal.LifecycleStarter.singleThreadedBuild(LifecycleStarter.java:183)
        at org.apache.maven.lifecycle.internal.LifecycleStarter.execute(LifecycleStarter.java:161)
        at org.apache.maven.DefaultMaven.doExecute(DefaultMaven.java:320)
        at org.apache.maven.DefaultMaven.execute(DefaultMaven.java:156)
        at org.jvnet.hudson.maven3.launcher.Maven3Launcher.main(Maven3Launcher.java:117)
        at sun.reflect.NativeMethodAccessorImpl.invoke0(Native Method)
        at sun.reflect.NativeMethodAccessorImpl.invoke(NativeMethodAccessorImpl.java:62)
        at sun.reflect.DelegatingMethodAccessorImpl.invoke(DelegatingMethodAccessorImpl.java:43)
        at java.lang.reflect.Method.invoke(Method.java:498)
        at org.codehaus.plexus.classworlds.launcher.Launcher.launchStandard(Launcher.java:329)
        at org.codehaus.plexus.classworlds.launcher.Launcher.launch(Launcher.java:239)
        at org.jvnet.hudson.maven3.agent.Maven3Main.launch(Maven3Main.java:181)
        at sun.reflect.NativeMethodAccessorImpl.invoke0(Native Method)
        at sun.reflect.NativeMethodAccessorImpl.invoke(NativeMethodAccessorImpl.java:62)
        at sun.reflect.DelegatingMethodAccessorImpl.invoke(DelegatingMethodAccessorImpl.java:43)
        at java.lang.reflect.Method.invoke(Method.java:498)
        at hudson.maven.Maven3Builder.call(Maven3Builder.java:139)
        at hudson.maven.Maven3Builder.call(Maven3Builder.java:70)
        at hudson.remoting.UserRequest.perform(UserRequest.java:181)
        at hudson.remoting.UserRequest.perform(UserRequest.java:52)
        at hudson.remoting.Request$2.run(Request.java:336)
        at hudson.remoting.InterceptingExecutorService$1.call(InterceptingExecutorService.java:68)
        at java.util.concurrent.FutureTask.run(FutureTask.java:266)
        at java.util.concurrent.ThreadPoolExecutor.runWorker(ThreadPoolExecutor.java:1142)
        at java.util.concurrent.ThreadPoolExecutor$Worker.run(ThreadPoolExecutor.java:617)
        at java.lang.Thread.run(Thread.java:748)
Caused by: org.apache.rat.mp.RatCheckException: Too many files with unapproved license: 1 See RAT report in: <https://builds.apache.org/job/maven-skins/ws/maven-fluido-skin/target/rat.txt>
        at org.apache.rat.mp.RatCheckMojo.check(RatCheckMojo.java:194)
        at org.apache.rat.mp.RatCheckMojo.execute(RatCheckMojo.java:182)
        at org.apache.maven.plugin.DefaultBuildPluginManager.executeMojo(DefaultBuildPluginManager.java:101)
        at org.apache.maven.lifecycle.internal.MojoExecutor.execute(MojoExecutor.java:209)
        ... 30 more
[ERROR] Failed to execute goal org.apache.rat:apache-rat-plugin:0.11:check (rat-check) on project maven-skins-aggregator: Too many files with unapproved license: 1 See RAT report in: <https://builds.apache.org/job/maven-skins/ws/target/rat.txt> -> [Help 1]
org.apache.maven.lifecycle.LifecycleExecutionException: Failed to execute goal org.apache.rat:apache-rat-plugin:0.11:check (rat-check) on project maven-skins-aggregator: Too many files with unapproved license: 1 See RAT report in: <https://builds.apache.org/job/maven-skins/ws/target/rat.txt>
        at org.apache.maven.lifecycle.internal.MojoExecutor.execute(MojoExecutor.java:213)
        at org.apache.maven.lifecycle.internal.MojoExecutor.execute(MojoExecutor.java:153)
        at org.apache.maven.lifecycle.internal.MojoExecutor.execute(MojoExecutor.java:145)
        at org.apache.maven.lifecycle.internal.LifecycleModuleBuilder.buildProject(LifecycleModuleBuilder.java:84)
        at org.apache.maven.lifecycle.internal.LifecycleModuleBuilder.buildProject(LifecycleModuleBuilder.java:59)
        at org.apache.maven.lifecycle.internal.LifecycleStarter.singleThreadedBuild(LifecycleStarter.java:183)
        at org.apache.maven.lifecycle.internal.LifecycleStarter.execute(LifecycleStarter.java:161)
        at org.apache.maven.DefaultMaven.doExecute(DefaultMaven.java:320)
        at org.apache.maven.DefaultMaven.execute(DefaultMaven.java:156)
        at org.jvnet.hudson.maven3.launcher.Maven3Launcher.main(Maven3Launcher.java:117)
        at sun.reflect.NativeMethodAccessorImpl.invoke0(Native Method)
        at sun.reflect.NativeMethodAccessorImpl.invoke(NativeMethodAccessorImpl.java:62)
        at sun.reflect.DelegatingMethodAccessorImpl.invoke(DelegatingMethodAccessorImpl.java:43)
        at java.lang.reflect.Method.invoke(Method.java:498)
        at org.codehaus.plexus.classworlds.launcher.Launcher.launchStandard(Launcher.java:329)
        at org.codehaus.plexus.classworlds.launcher.Launcher.launch(Launcher.java:239)
        at org.jvnet.hudson.maven3.agent.Maven3Main.launch(Maven3Main.java:181)
        at sun.reflect.NativeMethodAccessorImpl.invoke0(Native Method)
        at sun.reflect.NativeMethodAccessorImpl.invoke(NativeMethodAccessorImpl.java:62)
        at sun.reflect.DelegatingMethodAccessorImpl.invoke(DelegatingMethodAccessorImpl.java:43)
        at java.lang.reflect.Method.invoke(Method.java:498)
        at hudson.maven.Maven3Builder.call(Maven3Builder.java:139)
        at hudson.maven.Maven3Builder.call(Maven3Builder.java:70)
        at hudson.remoting.UserRequest.perform(UserRequest.java:181)
        at hudson.remoting.UserRequest.perform(UserRequest.java:52)
        at hudson.remoting.Request$2.run(Request.java:336)
        at hudson.remoting.InterceptingExecutorService$1.call(InterceptingExecutorService.java:68)
        at java.util.concurrent.FutureTask.run(FutureTask.java:266)
        at java.util.concurrent.ThreadPoolExecutor.runWorker(ThreadPoolExecutor.java:1142)
        at java.util.concurrent.ThreadPoolExecutor$Worker.run(ThreadPoolExecutor.java:617)
        at java.lang.Thread.run(Thread.java:748)
Caused by: org.apache.rat.mp.RatCheckException: Too many files with unapproved license: 1 See RAT report in: <https://builds.apache.org/job/maven-skins/ws/target/rat.txt>
        at org.apache.rat.mp.RatCheckMojo.check(RatCheckMojo.java:194)
        at org.apache.rat.mp.RatCheckMojo.execute(RatCheckMojo.java:182)
        at org.apache.maven.plugin.DefaultBuildPluginManager.executeMojo(DefaultBuildPluginManager.java:101)
        at org.apache.maven.lifecycle.internal.MojoExecutor.execute(MojoExecutor.java:209)
        ... 30 more
[ERROR]
[ERROR] Re-run Maven using the -X switch to enable full debug logging.
[ERROR]
[ERROR] For more information about the errors and possible solutions, please read the following articles:
[ERROR] [Help 1] http://cwiki.apache.org/confluence/display/MAVEN/MojoFailureException
[JENKINS] Archiving <https://builds.apache.org/job/maven-skins/ws/maven-fluido-skin/pom.xml> to org.apache.maven.skins/maven-fluido-skin/1.7-SNAPSHOT/maven-fluido-skin-1.7-SNAPSHOT.pom
[JENKINS] Archiving <https://builds.apache.org/job/maven-skins/ws/pom.xml> to org.apache.maven.skins/maven-skins-aggregator/1-SNAPSHOT/maven-skins-aggregator-1-SNAPSHOT.pom
[JENKINS] Archiving <https://builds.apache.org/job/maven-skins/ws/maven-default-skin/pom.xml> to org.apache.maven.skins/maven-default-skin/1.3-SNAPSHOT/maven-default-skin-1.3-SNAPSHOT.pom
Sending e-mails to: [hidden email] [hidden email]
Sending e-mails to: [hidden email] [hidden email]
Sending e-mails to: [hidden email] [hidden email]
channel stopped
[JIRA] Updating issue MSKINS-136
Reply | Threaded
Open this post in threaded view
|

Build failed in Jenkins: maven-skins #279

Apache Jenkins Server-2
See <https://builds.apache.org/job/maven-skins/279/display/redirect>

------------------------------------------
Started by user hboutemy
[EnvInject] - Loading node environment variables.
Building remotely on H14 (couchdbtest ubuntu xenial) in workspace <https://builds.apache.org/job/maven-skins/ws/>
Updating http://svn.apache.org/repos/asf/maven/skins/trunk at revision '2017-11-04T12:26:07.299 +0000'
At revision 1814280

No changes for http://svn.apache.org/repos/asf/maven/skins/trunk since the previous build
Parsing POMs
Modules changed, recalculating dependency graph
Established TCP socket on 35940
maven35-agent.jar already up to date
maven35-interceptor.jar already up to date
maven3-interceptor-commons.jar already up to date
[maven-skins] $ /home/jenkins/tools/java/latest1.7/bin/java -Xmx2g -Xms256m -cp /home/jenkins/jenkins-slave/maven35-agent.jar:/home/jenkins/tools/maven/latest3/boot/plexus-classworlds-2.5.2.jar:/home/jenkins/tools/maven/latest3/conf/logging jenkins.maven3.agent.Maven35Main /home/jenkins/tools/maven/latest3/ /home/jenkins/jenkins-slave/slave.jar /home/jenkins/jenkins-slave/maven35-interceptor.jar /home/jenkins/jenkins-slave/maven3-interceptor-commons.jar 35940
<===[JENKINS REMOTING CAPACITY]===>   channel started
ERROR: ================================================================================
ERROR: Invalid project setup: jenkins/security/MasterToSlaveCallable : Unsupported major.minor version 52.0
ERROR: [JENKINS-18403][JENKINS-28294] JDK 'JDK 1.7 (latest)' not supported to run Maven projects.
ERROR: Maven projects have to be launched with a Java version greater or equal to the minimum version required by the master.
ERROR: Use the Maven JDK Toolchains (plugin) to build your maven project with an older JDK.
ERROR: Retrying with slave Java and setting compile/test properties to point to /home/jenkins/tools/java/latest1.7.
ERROR: ================================================================================
Established TCP socket on 43791
maven35-agent.jar already up to date
maven35-interceptor.jar already up to date
maven3-interceptor-commons.jar already up to date
[maven-skins] $ /usr/local/asfpackages/java/jdk1.8.0_131/jre/bin/java -Xmx2g -Xms256m -cp /home/jenkins/jenkins-slave/maven35-agent.jar:/home/jenkins/tools/maven/latest3/boot/plexus-classworlds-2.5.2.jar:/home/jenkins/tools/maven/latest3/conf/logging jenkins.maven3.agent.Maven35Main /home/jenkins/tools/maven/latest3/ /home/jenkins/jenkins-slave/slave.jar /home/jenkins/jenkins-slave/maven35-interceptor.jar /home/jenkins/jenkins-slave/maven3-interceptor-commons.jar 43791
<===[JENKINS REMOTING CAPACITY]===>   channel started
Executing Maven:  -B -f <https://builds.apache.org/job/maven-skins/ws/pom.xml> -Dmaven.repo.local=/home/jenkins/jenkins-slave/maven-repositories/0 clean install -B -U -e -fae -V -Prun-its
Apache Maven 3.5.0 (ff8f5e7444045639af65f6095c62210b5713f426; 2017-04-03T19:39:06Z)
Maven home: /usr/local/asfpackages/maven/apache-maven-3.5.0
Java version: 1.8.0_131, vendor: Oracle Corporation
Java home: /usr/local/asfpackages/java/jdk1.8.0_131/jre
Default locale: en_US, platform encoding: ISO-8859-1
OS name: "linux", version: "4.4.0-43-generic", arch: "amd64", family: "unix"
[INFO] Error stacktraces are turned on.
[INFO] Scanning for projects...
[INFO] ------------------------------------------------------------------------
[INFO] Reactor Build Order:
[INFO]
[INFO] Maven Default Skin
[INFO] Apache Maven Fluido Skin
[INFO] Maven Skins Aggregator
[INFO]
[INFO] ------------------------------------------------------------------------
[INFO] Building Maven Default Skin 1.3-SNAPSHOT
[INFO] ------------------------------------------------------------------------
[INFO]
[INFO] --- maven-clean-plugin:3.0.0:clean (default-clean) @ maven-default-skin ---
[INFO] Deleting <https://builds.apache.org/job/maven-skins/ws/maven-default-skin/target>
[INFO]
[INFO] --- maven-enforcer-plugin:1.4.1:enforce (enforce-bytecode-version) @ maven-default-skin ---
[INFO]
[INFO] --- maven-enforcer-plugin:1.4.1:enforce (ban-known-bad-maven-versions) @ maven-default-skin ---
[INFO]
[INFO] --- apache-rat-plugin:0.11:check (rat-check) @ maven-default-skin ---
[INFO] 51 implicit excludes (use -debug for more details).
[INFO] Exclude: DEPENDENCIES
[INFO] 18 resources included (use -debug for more details)
[INFO] Rat check: Summary of files. Unapproved: 1 unknown: 1 generated: 0 approved: 11 licence.
[INFO]
[INFO] ------------------------------------------------------------------------
[INFO] Building Apache Maven Fluido Skin 1.7-SNAPSHOT
[INFO] ------------------------------------------------------------------------
[INFO]
[INFO] --- maven-clean-plugin:3.0.0:clean (default-clean) @ maven-fluido-skin ---
[INFO] Deleting <https://builds.apache.org/job/maven-skins/ws/maven-fluido-skin/target>
[INFO]
[INFO] --- maven-enforcer-plugin:1.4.1:enforce (enforce-bytecode-version) @ maven-fluido-skin ---
[INFO]
[INFO] --- maven-enforcer-plugin:1.4.1:enforce (ban-known-bad-maven-versions) @ maven-fluido-skin ---
[INFO]
[INFO] --- apache-rat-plugin:0.11:check (rat-check) @ maven-fluido-skin ---
[INFO] 51 implicit excludes (use -debug for more details).
[INFO] Exclude: DEPENDENCIES
[INFO] Exclude: src/main/resources/fonts/glyphicons-halflings-regular.svg
[INFO] Exclude: src/main/resources/js/prettify.js
[INFO] Exclude: src/main/resources/js/jquery-*.js
[INFO] 170 resources included (use -debug for more details)
[INFO] Rat check: Summary of files. Unapproved: 1 unknown: 1 generated: 0 approved: 133 licence.
[INFO]
[INFO] ------------------------------------------------------------------------
[INFO] Building Maven Skins Aggregator 1-SNAPSHOT
[INFO] ------------------------------------------------------------------------
[INFO]
[INFO] --- maven-clean-plugin:2.5:clean (default-clean) @ maven-skins-aggregator ---
[INFO] Deleting <https://builds.apache.org/job/maven-skins/ws/target>
[INFO]
[INFO] --- maven-enforcer-plugin:1.3.1:enforce (enforce-bytecode-version) @ maven-skins-aggregator ---
[INFO]
[INFO] --- maven-enforcer-plugin:1.3.1:enforce (ban-known-bad-maven-versions) @ maven-skins-aggregator ---
[INFO]
[INFO] --- apache-rat-plugin:0.11:check (rat-check) @ maven-skins-aggregator ---
[INFO] 53 implicit excludes (use -debug for more details).
[INFO] Exclude: DEPENDENCIES
[INFO] 4 resources included (use -debug for more details)
Warning: org.apache.xerces.jaxp.SAXParserImpl$JAXPSAXParser: Property 'http://www.oracle.com/xml/jaxp/properties/entityExpansionLimit' is not recognized.
Compiler warnings:
  WARNING:  'org.apache.xerces.jaxp.SAXParserImpl: Property 'http://javax.xml.XMLConstants/property/accessExternalDTD' is not recognized.'
[INFO] Rat check: Summary of files. Unapproved: 1 unknown: 1 generated: 0 approved: 2 licence.
[INFO] ------------------------------------------------------------------------
[INFO] Reactor Summary:
[INFO]
[INFO] Maven Default Skin ................................. FAILURE [  5.677 s]
[INFO] Apache Maven Fluido Skin ........................... FAILURE [  1.303 s]
[INFO] Maven Skins Aggregator ............................. FAILURE [  2.054 s]
[INFO] ------------------------------------------------------------------------
[INFO] BUILD FAILURE
[INFO] ------------------------------------------------------------------------
[INFO] Total time: 19.052 s
[INFO] Finished at: 2017-11-04T12:27:34Z
[INFO] Final Memory: 25M/383M
[INFO] ------------------------------------------------------------------------
[ERROR] Failed to execute goal org.apache.rat:apache-rat-plugin:0.11:check (rat-check) on project maven-default-skin: Too many files with unapproved license: 1 See RAT report in: <https://builds.apache.org/job/maven-skins/ws/maven-default-skin/target/rat.txt> -> [Help 1]
org.apache.maven.lifecycle.LifecycleExecutionException: Failed to execute goal org.apache.rat:apache-rat-plugin:0.11:check (rat-check) on project maven-default-skin: Too many files with unapproved license: 1 See RAT report in: <https://builds.apache.org/job/maven-skins/ws/maven-default-skin/target/rat.txt>
        at org.apache.maven.lifecycle.internal.MojoExecutor.execute(MojoExecutor.java:213)
        at org.apache.maven.lifecycle.internal.MojoExecutor.execute(MojoExecutor.java:154)
        at org.apache.maven.lifecycle.internal.MojoExecutor.execute(MojoExecutor.java:146)
        at org.apache.maven.lifecycle.internal.LifecycleModuleBuilder.buildProject(LifecycleModuleBuilder.java:117)
        at org.apache.maven.lifecycle.internal.LifecycleModuleBuilder.buildProject(LifecycleModuleBuilder.java:81)
        at org.apache.maven.lifecycle.internal.builder.singlethreaded.SingleThreadedBuilder.build(SingleThreadedBuilder.java:51)
        at org.apache.maven.lifecycle.internal.LifecycleStarter.execute(LifecycleStarter.java:128)
        at org.apache.maven.DefaultMaven.doExecute(DefaultMaven.java:309)
        at org.apache.maven.DefaultMaven.doExecute(DefaultMaven.java:194)
        at org.apache.maven.DefaultMaven.execute(DefaultMaven.java:107)
        at org.jvnet.hudson.maven3.launcher.Maven35Launcher.main(Maven35Launcher.java:130)
        at sun.reflect.NativeMethodAccessorImpl.invoke0(Native Method)
        at sun.reflect.NativeMethodAccessorImpl.invoke(NativeMethodAccessorImpl.java:62)
        at sun.reflect.DelegatingMethodAccessorImpl.invoke(DelegatingMethodAccessorImpl.java:43)
        at java.lang.reflect.Method.invoke(Method.java:498)
        at org.codehaus.plexus.classworlds.launcher.Launcher.launchEnhanced(Launcher.java:289)
        at org.codehaus.plexus.classworlds.launcher.Launcher.launch(Launcher.java:229)
        at jenkins.maven3.agent.Maven35Main.launch(Maven35Main.java:176)
        at sun.reflect.NativeMethodAccessorImpl.invoke0(Native Method)
        at sun.reflect.NativeMethodAccessorImpl.invoke(NativeMethodAccessorImpl.java:62)
        at sun.reflect.DelegatingMethodAccessorImpl.invoke(DelegatingMethodAccessorImpl.java:43)
        at java.lang.reflect.Method.invoke(Method.java:498)
        at hudson.maven.Maven3Builder.call(Maven3Builder.java:139)
        at hudson.maven.Maven3Builder.call(Maven3Builder.java:70)
        at hudson.remoting.UserRequest.perform(UserRequest.java:181)
        at hudson.remoting.UserRequest.perform(UserRequest.java:52)
        at hudson.remoting.Request$2.run(Request.java:336)
        at hudson.remoting.InterceptingExecutorService$1.call(InterceptingExecutorService.java:68)
        at java.util.concurrent.FutureTask.run(FutureTask.java:266)
        at java.util.concurrent.ThreadPoolExecutor.runWorker(ThreadPoolExecutor.java:1142)
        at java.util.concurrent.ThreadPoolExecutor$Worker.run(ThreadPoolExecutor.java:617)
        at java.lang.Thread.run(Thread.java:748)
Caused by: org.apache.rat.mp.RatCheckException: Too many files with unapproved license: 1 See RAT report in: <https://builds.apache.org/job/maven-skins/ws/maven-default-skin/target/rat.txt>
        at org.apache.rat.mp.RatCheckMojo.check(RatCheckMojo.java:194)
        at org.apache.rat.mp.RatCheckMojo.execute(RatCheckMojo.java:182)
        at org.apache.maven.plugin.DefaultBuildPluginManager.executeMojo(DefaultBuildPluginManager.java:134)
        at org.apache.maven.lifecycle.internal.MojoExecutor.execute(MojoExecutor.java:208)
        ... 31 more
[ERROR] Failed to execute goal org.apache.rat:apache-rat-plugin:0.11:check (rat-check) on project maven-fluido-skin: Too many files with unapproved license: 1 See RAT report in: <https://builds.apache.org/job/maven-skins/ws/maven-fluido-skin/target/rat.txt> -> [Help 1]
org.apache.maven.lifecycle.LifecycleExecutionException: Failed to execute goal org.apache.rat:apache-rat-plugin:0.11:check (rat-check) on project maven-fluido-skin: Too many files with unapproved license: 1 See RAT report in: <https://builds.apache.org/job/maven-skins/ws/maven-fluido-skin/target/rat.txt>
        at org.apache.maven.lifecycle.internal.MojoExecutor.execute(MojoExecutor.java:213)
        at org.apache.maven.lifecycle.internal.MojoExecutor.execute(MojoExecutor.java:154)
        at org.apache.maven.lifecycle.internal.MojoExecutor.execute(MojoExecutor.java:146)
        at org.apache.maven.lifecycle.internal.LifecycleModuleBuilder.buildProject(LifecycleModuleBuilder.java:117)
        at org.apache.maven.lifecycle.internal.LifecycleModuleBuilder.buildProject(LifecycleModuleBuilder.java:81)
        at org.apache.maven.lifecycle.internal.builder.singlethreaded.SingleThreadedBuilder.build(SingleThreadedBuilder.java:51)
        at org.apache.maven.lifecycle.internal.LifecycleStarter.execute(LifecycleStarter.java:128)
        at org.apache.maven.DefaultMaven.doExecute(DefaultMaven.java:309)
        at org.apache.maven.DefaultMaven.doExecute(DefaultMaven.java:194)
        at org.apache.maven.DefaultMaven.execute(DefaultMaven.java:107)
        at org.jvnet.hudson.maven3.launcher.Maven35Launcher.main(Maven35Launcher.java:130)
        at sun.reflect.NativeMethodAccessorImpl.invoke0(Native Method)
        at sun.reflect.NativeMethodAccessorImpl.invoke(NativeMethodAccessorImpl.java:62)
        at sun.reflect.DelegatingMethodAccessorImpl.invoke(DelegatingMethodAccessorImpl.java:43)
        at java.lang.reflect.Method.invoke(Method.java:498)
        at org.codehaus.plexus.classworlds.launcher.Launcher.launchEnhanced(Launcher.java:289)
        at org.codehaus.plexus.classworlds.launcher.Launcher.launch(Launcher.java:229)
        at jenkins.maven3.agent.Maven35Main.launch(Maven35Main.java:176)
        at sun.reflect.NativeMethodAccessorImpl.invoke0(Native Method)
        at sun.reflect.NativeMethodAccessorImpl.invoke(NativeMethodAccessorImpl.java:62)
        at sun.reflect.DelegatingMethodAccessorImpl.invoke(DelegatingMethodAccessorImpl.java:43)
        at java.lang.reflect.Method.invoke(Method.java:498)
        at hudson.maven.Maven3Builder.call(Maven3Builder.java:139)
        at hudson.maven.Maven3Builder.call(Maven3Builder.java:70)
        at hudson.remoting.UserRequest.perform(UserRequest.java:181)
        at hudson.remoting.UserRequest.perform(UserRequest.java:52)
        at hudson.remoting.Request$2.run(Request.java:336)
        at hudson.remoting.InterceptingExecutorService$1.call(InterceptingExecutorService.java:68)
        at java.util.concurrent.FutureTask.run(FutureTask.java:266)
        at java.util.concurrent.ThreadPoolExecutor.runWorker(ThreadPoolExecutor.java:1142)
        at java.util.concurrent.ThreadPoolExecutor$Worker.run(ThreadPoolExecutor.java:617)
        at java.lang.Thread.run(Thread.java:748)
Caused by: org.apache.rat.mp.RatCheckException: Too many files with unapproved license: 1 See RAT report in: <https://builds.apache.org/job/maven-skins/ws/maven-fluido-skin/target/rat.txt>
        at org.apache.rat.mp.RatCheckMojo.check(RatCheckMojo.java:194)
        at org.apache.rat.mp.RatCheckMojo.execute(RatCheckMojo.java:182)
        at org.apache.maven.plugin.DefaultBuildPluginManager.executeMojo(DefaultBuildPluginManager.java:134)
        at org.apache.maven.lifecycle.internal.MojoExecutor.execute(MojoExecutor.java:208)
        ... 31 more
[ERROR] Failed to execute goal org.apache.rat:apache-rat-plugin:0.11:check (rat-check) on project maven-skins-aggregator: Too many files with unapproved license: 1 See RAT report in: <https://builds.apache.org/job/maven-skins/ws/target/rat.txt> -> [Help 1]
org.apache.maven.lifecycle.LifecycleExecutionException: Failed to execute goal org.apache.rat:apache-rat-plugin:0.11:check (rat-check) on project maven-skins-aggregator: Too many files with unapproved license: 1 See RAT report in: <https://builds.apache.org/job/maven-skins/ws/target/rat.txt>
        at org.apache.maven.lifecycle.internal.MojoExecutor.execute(MojoExecutor.java:213)
        at org.apache.maven.lifecycle.internal.MojoExecutor.execute(MojoExecutor.java:154)
        at org.apache.maven.lifecycle.internal.MojoExecutor.execute(MojoExecutor.java:146)
        at org.apache.maven.lifecycle.internal.LifecycleModuleBuilder.buildProject(LifecycleModuleBuilder.java:117)
        at org.apache.maven.lifecycle.internal.LifecycleModuleBuilder.buildProject(LifecycleModuleBuilder.java:81)
        at org.apache.maven.lifecycle.internal.builder.singlethreaded.SingleThreadedBuilder.build(SingleThreadedBuilder.java:51)
        at org.apache.maven.lifecycle.internal.LifecycleStarter.execute(LifecycleStarter.java:128)
        at org.apache.maven.DefaultMaven.doExecute(DefaultMaven.java:309)
        at org.apache.maven.DefaultMaven.doExecute(DefaultMaven.java:194)
        at org.apache.maven.DefaultMaven.execute(DefaultMaven.java:107)
        at org.jvnet.hudson.maven3.launcher.Maven35Launcher.main(Maven35Launcher.java:130)
        at sun.reflect.NativeMethodAccessorImpl.invoke0(Native Method)
        at sun.reflect.NativeMethodAccessorImpl.invoke(NativeMethodAccessorImpl.java:62)
        at sun.reflect.DelegatingMethodAccessorImpl.invoke(DelegatingMethodAccessorImpl.java:43)
        at java.lang.reflect.Method.invoke(Method.java:498)
        at org.codehaus.plexus.classworlds.launcher.Launcher.launchEnhanced(Launcher.java:289)
        at org.codehaus.plexus.classworlds.launcher.Launcher.launch(Launcher.java:229)
        at jenkins.maven3.agent.Maven35Main.launch(Maven35Main.java:176)
        at sun.reflect.NativeMethodAccessorImpl.invoke0(Native Method)
        at sun.reflect.NativeMethodAccessorImpl.invoke(NativeMethodAccessorImpl.java:62)
        at sun.reflect.DelegatingMethodAccessorImpl.invoke(DelegatingMethodAccessorImpl.java:43)
        at java.lang.reflect.Method.invoke(Method.java:498)
        at hudson.maven.Maven3Builder.call(Maven3Builder.java:139)
        at hudson.maven.Maven3Builder.call(Maven3Builder.java:70)
        at hudson.remoting.UserRequest.perform(UserRequest.java:181)
        at hudson.remoting.UserRequest.perform(UserRequest.java:52)
        at hudson.remoting.Request$2.run(Request.java:336)
        at hudson.remoting.InterceptingExecutorService$1.call(InterceptingExecutorService.java:68)
        at java.util.concurrent.FutureTask.run(FutureTask.java:266)
        at java.util.concurrent.ThreadPoolExecutor.runWorker(ThreadPoolExecutor.java:1142)
        at java.util.concurrent.ThreadPoolExecutor$Worker.run(ThreadPoolExecutor.java:617)
        at java.lang.Thread.run(Thread.java:748)
Caused by: org.apache.rat.mp.RatCheckException: Too many files with unapproved license: 1 See RAT report in: <https://builds.apache.org/job/maven-skins/ws/target/rat.txt>
        at org.apache.rat.mp.RatCheckMojo.check(RatCheckMojo.java:194)
        at org.apache.rat.mp.RatCheckMojo.execute(RatCheckMojo.java:182)
        at org.apache.maven.plugin.DefaultBuildPluginManager.executeMojo(DefaultBuildPluginManager.java:134)
        at org.apache.maven.lifecycle.internal.MojoExecutor.execute(MojoExecutor.java:208)
        ... 31 more
[ERROR]
[ERROR] Re-run Maven using the -X switch to enable full debug logging.
[ERROR]
[ERROR] For more information about the errors and possible solutions, please read the following articles:
[ERROR] [Help 1] http://cwiki.apache.org/confluence/display/MAVEN/MojoFailureException
[JENKINS] Archiving <https://builds.apache.org/job/maven-skins/ws/maven-fluido-skin/pom.xml> to org.apache.maven.skins/maven-fluido-skin/1.7-SNAPSHOT/maven-fluido-skin-1.7-SNAPSHOT.pom
[JENKINS] Archiving <https://builds.apache.org/job/maven-skins/ws/pom.xml> to org.apache.maven.skins/maven-skins-aggregator/1-SNAPSHOT/maven-skins-aggregator-1-SNAPSHOT.pom
[JENKINS] Archiving <https://builds.apache.org/job/maven-skins/ws/maven-default-skin/pom.xml> to org.apache.maven.skins/maven-default-skin/1.3-SNAPSHOT/maven-default-skin-1.3-SNAPSHOT.pom
Sending e-mails to: [hidden email] [hidden email]
Sending e-mails to: [hidden email] [hidden email]
Sending e-mails to: [hidden email] [hidden email]
channel stopped