Build failed in Jenkins: maven-plugins-windows #1990

Previous Topic Next Topic
 
classic Classic list List threaded Threaded
6 messages Options
Reply | Threaded
Open this post in threaded view
|  
Report Content as Inappropriate

Build failed in Jenkins: maven-plugins-windows #1990

Apache Jenkins Server-2
See <https://builds.apache.org/job/maven-plugins-windows/1990/display/redirect?page=changes>

Changes:

[olamy] [maven-release-plugin] prepare for next development iteration

[olamy] [maven-release-plugin] prepare release maven-invoker-plugin-3.0.1

[olamy] use staged version

[olamy] avoid javadoc failure

------------------------------------------
[...truncated 588.90 KB...]
Tests run: 8, Failures: 0, Errors: 0, Skipped: 0, Time elapsed: 0.019 sec - in org.apache.maven.plugins.dependency.utils.filters.TestDestFileFilter
Running org.apache.maven.plugins.dependency.utils.filters.TestMarkerFileFilter
Tests run: 5, Failures: 0, Errors: 0, Skipped: 0, Time elapsed: 0.009 sec - in org.apache.maven.plugins.dependency.utils.filters.TestMarkerFileFilter
Running org.apache.maven.plugins.dependency.utils.filters.TestResolveMarkerFileFilter
Tests run: 1, Failures: 0, Errors: 0, Skipped: 0, Time elapsed: 0.002 sec - in org.apache.maven.plugins.dependency.utils.filters.TestResolveMarkerFileFilter
Running org.apache.maven.plugins.dependency.utils.markers.TestDefaultMarkerFileHandler
Tests run: 6, Failures: 0, Errors: 0, Skipped: 0, Time elapsed: 0.012 sec - in org.apache.maven.plugins.dependency.utils.markers.TestDefaultMarkerFileHandler
Running org.apache.maven.plugins.dependency.utils.markers.TestSourcesMarkerFileHandler
Tests run: 10, Failures: 0, Errors: 0, Skipped: 0, Time elapsed: 0.013 sec - in org.apache.maven.plugins.dependency.utils.markers.TestSourcesMarkerFileHandler
Running org.apache.maven.plugins.dependency.utils.markers.TestUnpackMarkerFileHandler
Tests run: 9, Failures: 0, Errors: 0, Skipped: 0, Time elapsed: 1.068 sec - in org.apache.maven.plugins.dependency.utils.markers.TestUnpackMarkerFileHandler
Running org.apache.maven.plugins.dependency.utils.TestDependencyStatusSets
Tests run: 5, Failures: 0, Errors: 0, Skipped: 0, Time elapsed: 0.776 sec - in org.apache.maven.plugins.dependency.utils.TestDependencyStatusSets
Running org.apache.maven.plugins.dependency.utils.TestDependencyUtil
Tests run: 9, Failures: 0, Errors: 0, Skipped: 0, Time elapsed: 0.003 sec - in org.apache.maven.plugins.dependency.utils.TestDependencyUtil
Running org.apache.maven.plugins.dependency.utils.TestSilentLog
Tests run: 2, Failures: 0, Errors: 0, Skipped: 0, Time elapsed: 0 sec - in org.apache.maven.plugins.dependency.utils.TestSilentLog
Running org.apache.maven.plugins.dependency.utils.translators.TestClassifierTypeTranslator
Tests run: 6, Failures: 0, Errors: 0, Skipped: 0, Time elapsed: 0.719 sec - in org.apache.maven.plugins.dependency.utils.translators.TestClassifierTypeTranslator

Results :

Tests run: 244, Failures: 0, Errors: 0, Skipped: 0

[JENKINS] Recording test results
[INFO]
[INFO] --- maven-jar-plugin:3.0.0:jar (default-jar) @ maven-dependency-plugin ---
[INFO] Building jar: F:\jenkins\jenkins-slave\workspace\maven-plugins-windows\maven-dependency-plugin\target\maven-dependency-plugin-3.0.2-SNAPSHOT.jar
[INFO]
[INFO] --- maven-plugin-plugin:3.4:addPluginArtifactMetadata (default-addPluginArtifactMetadata) @ maven-dependency-plugin ---
[INFO]
[INFO] --- maven-site-plugin:3.5.1:attach-descriptor (attach-descriptor) @ maven-dependency-plugin ---
[INFO]
[INFO] --- maven-checkstyle-plugin:2.15:check (checkstyle-check) @ maven-dependency-plugin ---
[INFO] There is 1 error reported by Checkstyle 6.1.1 with config/maven_checks.xml ruleset.
[INFO] Ignored 1 error, 0 violation remaining.
[INFO]
[INFO] --- maven-install-plugin:2.5.2:install (default-install) @ maven-dependency-plugin ---
[INFO] Installing F:\jenkins\jenkins-slave\workspace\maven-plugins-windows\maven-dependency-plugin\target\maven-dependency-plugin-3.0.2-SNAPSHOT.jar to f:\jenkins\jenkins-slave\maven-repositories\1\org\apache\maven\plugins\maven-dependency-plugin\3.0.2-SNAPSHOT\maven-dependency-plugin-3.0.2-SNAPSHOT.jar
[INFO] Installing F:\jenkins\jenkins-slave\workspace\maven-plugins-windows\maven-dependency-plugin\pom.xml to f:\jenkins\jenkins-slave\maven-repositories\1\org\apache\maven\plugins\maven-dependency-plugin\3.0.2-SNAPSHOT\maven-dependency-plugin-3.0.2-SNAPSHOT.pom
[INFO]                                                                        
[INFO] ------------------------------------------------------------------------
[INFO] Building Apache Maven Plugins Aggregator 1-SNAPSHOT
[INFO] ------------------------------------------------------------------------
[INFO]
[INFO] --- maven-clean-plugin:2.5:clean (default-clean) @ maven-plugins-aggregator ---
[INFO] Deleting <https://builds.apache.org/job/maven-plugins-windows/ws/target>
[INFO]
[INFO] --- maven-enforcer-plugin:1.3.1:enforce (enforce-bytecode-version) @ maven-plugins-aggregator ---
[INFO]
[INFO] --- maven-enforcer-plugin:1.3.1:enforce (ban-known-bad-maven-versions) @ maven-plugins-aggregator ---
[INFO]
[INFO] --- maven-remote-resources-plugin:1.5:process (default) @ maven-plugins-aggregator ---
[INFO]
[INFO] --- maven-site-plugin:3.3:attach-descriptor (attach-descriptor) @ maven-plugins-aggregator ---
[INFO]
[INFO] --- maven-install-plugin:2.5.1:install (default-install) @ maven-plugins-aggregator ---
[INFO] Installing <https://builds.apache.org/job/maven-plugins-windows/ws/pom.xml> to f:\jenkins\jenkins-slave\maven-repositories\1\org\apache\maven\plugins\maven-plugins-aggregator\1-SNAPSHOT\maven-plugins-aggregator-1-SNAPSHOT.pom
[INFO] ------------------------------------------------------------------------
[INFO] Reactor Summary:
[INFO]
[INFO] Apache Maven ACR Plugin ........................... SUCCESS [22.609s]
[INFO] Apache Maven AntRun Plugin ........................ SUCCESS [1:20.820s]
[INFO] Apache Maven Changelog Plugin ..................... SUCCESS [20.998s]
[INFO] Apache Maven Changes Plugin ....................... SUCCESS [30.647s]
[INFO] Apache Maven Clean Plugin ......................... SUCCESS [15.574s]
[INFO] Apache Maven Compiler Plugin ...................... SUCCESS [23.828s]
[INFO] Apache Maven Deploy Plugin ........................ SUCCESS [15.434s]
[INFO] Apache Maven Documentation Checker Plugin ......... SUCCESS [9.990s]
[INFO] Apache Maven EAR Plugin ........................... SUCCESS [15.661s]
[INFO] Apache Maven EJB Plugin ........................... SUCCESS [17.148s]
[INFO] Apache Maven Help Plugin .......................... SUCCESS [17.855s]
[INFO] Apache Maven Install Plugin ....................... SUCCESS [16.743s]
[INFO] Apache Maven Jarsigner Plugin ..................... SUCCESS [5.892s]
[INFO] Apache Maven Javadoc Plugin ....................... SUCCESS [2:47.835s]
[INFO] Apache Maven JDeps Plugin ......................... SUCCESS [7.761s]
[INFO] Apache Maven Linkcheck Plugin ..................... SUCCESS [7.991s]
[INFO] Apache Maven Patch Plugin ......................... SUCCESS [5.453s]
[INFO] Apache Maven PDF Plugin ........................... SUCCESS [16.862s]
[INFO] Apache Maven RAR Plugin ........................... SUCCESS [11.554s]
[INFO] Apache Maven Repository Plugin .................... SUCCESS [9.765s]
[INFO] Apache Maven Resources Plugin ..................... SUCCESS [30.887s]
[INFO] Apache Maven Site Plugin .......................... SUCCESS [26.879s]
[INFO] Apache Maven Source Plugin ........................ SUCCESS [13.887s]
[INFO] Apache Maven Stage Plugin ......................... SUCCESS [7.767s]
[INFO] Apache Maven Toolchains Plugin .................... SUCCESS [6.130s]
[INFO] Apache Maven Verifier Plugin ...................... SUCCESS [8.397s]
[INFO] Apache Maven WAR Plugin ........................... SUCCESS [26.152s]
[INFO] Apache Maven DOAP Plugin .......................... SUCCESS [12.518s]
[INFO] Apache Maven Invoker Plugin ....................... FAILURE [0.649s]
[INFO] Apache Maven JAR Plugin ........................... SUCCESS [9.903s]
[INFO] Apache Maven Assembly Plugin ...................... SUCCESS [27.615s]
[INFO] Apache Maven Checkstyle Plugin .................... SUCCESS [38.122s]
[INFO] Apache Maven PMD Plugin ........................... SUCCESS [25.685s]
[INFO] Apache Maven Project Info Reports Plugin .......... SUCCESS [31.769s]
[INFO] Apache Maven Remote Resources Plugin .............. SUCCESS [14.012s]
[INFO] Apache Maven Shade Plugin ......................... SUCCESS [17.882s]
[INFO] Apache Maven SCM Publish Plugin ................... SUCCESS [8.228s]
[INFO] Apache Maven Dependency Plugin .................... SUCCESS [1:11.560s]
[INFO] Apache Maven Plugins Aggregator ................... SUCCESS [2.911s]
[INFO] ------------------------------------------------------------------------
[INFO] BUILD FAILURE
[INFO] ------------------------------------------------------------------------
[INFO] Total time: 16:38.046s
[INFO] Finished at: Wed Jul 12 12:42:48 UTC 2017
[INFO] Final Memory: 136M/686M
[INFO] ------------------------------------------------------------------------
[ERROR] Failed to execute goal on project maven-invoker-plugin: Could not resolve dependencies for project org.apache.maven.plugins:maven-invoker-plugin:maven-plugin:3.0.2-SNAPSHOT: Could not find artifact org.apache.maven.shared:maven-script-interpreter:jar:1.2 in central (http://repo.maven.apache.org/maven2) -> [Help 1]
org.apache.maven.lifecycle.LifecycleExecutionException: Failed to execute goal on project maven-invoker-plugin: Could not resolve dependencies for project org.apache.maven.plugins:maven-invoker-plugin:maven-plugin:3.0.2-SNAPSHOT: Could not find artifact org.apache.maven.shared:maven-script-interpreter:jar:1.2 in central (http://repo.maven.apache.org/maven2)
        at org.apache.maven.lifecycle.internal.LifecycleDependencyResolver.getDependencies(LifecycleDependencyResolver.java:210)
        at org.apache.maven.lifecycle.internal.LifecycleDependencyResolver.resolveProjectDependencies(LifecycleDependencyResolver.java:117)
        at org.apache.maven.lifecycle.internal.MojoExecutor.ensureDependenciesAreResolved(MojoExecutor.java:258)
        at org.apache.maven.lifecycle.internal.MojoExecutor.execute(MojoExecutor.java:201)
        at org.apache.maven.lifecycle.internal.MojoExecutor.execute(MojoExecutor.java:153)
        at org.apache.maven.lifecycle.internal.MojoExecutor.execute(MojoExecutor.java:145)
        at org.apache.maven.lifecycle.internal.LifecycleModuleBuilder.buildProject(LifecycleModuleBuilder.java:84)
        at org.apache.maven.lifecycle.internal.LifecycleModuleBuilder.buildProject(LifecycleModuleBuilder.java:59)
        at org.apache.maven.lifecycle.internal.LifecycleStarter.singleThreadedBuild(LifecycleStarter.java:183)
        at org.apache.maven.lifecycle.internal.LifecycleStarter.execute(LifecycleStarter.java:161)
        at org.apache.maven.DefaultMaven.doExecute(DefaultMaven.java:320)
        at org.apache.maven.DefaultMaven.execute(DefaultMaven.java:156)
        at org.jvnet.hudson.maven3.launcher.Maven3Launcher.main(Maven3Launcher.java:117)
        at sun.reflect.NativeMethodAccessorImpl.invoke0(Native Method)
        at sun.reflect.NativeMethodAccessorImpl.invoke(NativeMethodAccessorImpl.java:57)
        at sun.reflect.DelegatingMethodAccessorImpl.invoke(DelegatingMethodAccessorImpl.java:43)
        at java.lang.reflect.Method.invoke(Method.java:606)
        at org.codehaus.plexus.classworlds.launcher.Launcher.launchStandard(Launcher.java:329)
        at org.codehaus.plexus.classworlds.launcher.Launcher.launch(Launcher.java:239)
        at org.jvnet.hudson.maven3.agent.Maven3Main.launch(Maven3Main.java:181)
        at sun.reflect.NativeMethodAccessorImpl.invoke0(Native Method)
        at sun.reflect.NativeMethodAccessorImpl.invoke(NativeMethodAccessorImpl.java:57)
        at sun.reflect.DelegatingMethodAccessorImpl.invoke(DelegatingMethodAccessorImpl.java:43)
        at java.lang.reflect.Method.invoke(Method.java:606)
        at hudson.maven.Maven3Builder.call(Maven3Builder.java:139)
        at hudson.maven.Maven3Builder.call(Maven3Builder.java:70)
        at hudson.remoting.UserRequest.perform(UserRequest.java:120)
        at hudson.remoting.UserRequest.perform(UserRequest.java:48)
        at hudson.remoting.Request$2.run(Request.java:326)
        at hudson.remoting.InterceptingExecutorService$1.call(InterceptingExecutorService.java:68)
        at java.util.concurrent.FutureTask.run(FutureTask.java:262)
        at java.util.concurrent.ThreadPoolExecutor.runWorker(ThreadPoolExecutor.java:1145)
        at java.util.concurrent.ThreadPoolExecutor$Worker.run(ThreadPoolExecutor.java:615)
        at java.lang.Thread.run(Thread.java:745)
Caused by: org.apache.maven.project.DependencyResolutionException: Could not resolve dependencies for project org.apache.maven.plugins:maven-invoker-plugin:maven-plugin:3.0.2-SNAPSHOT: Could not find artifact org.apache.maven.shared:maven-script-interpreter:jar:1.2 in central (http://repo.maven.apache.org/maven2)
        at org.apache.maven.project.DefaultProjectDependenciesResolver.resolve(DefaultProjectDependenciesResolver.java:189)
        at org.apache.maven.lifecycle.internal.LifecycleDependencyResolver.getDependencies(LifecycleDependencyResolver.java:185)
        ... 33 more
Caused by: org.sonatype.aether.resolution.DependencyResolutionException: Could not find artifact org.apache.maven.shared:maven-script-interpreter:jar:1.2 in central (http://repo.maven.apache.org/maven2)
        at org.sonatype.aether.impl.internal.DefaultRepositorySystem.resolveDependencies(DefaultRepositorySystem.java:375)
        at org.apache.maven.project.DefaultProjectDependenciesResolver.resolve(DefaultProjectDependenciesResolver.java:183)
        ... 34 more
Caused by: org.sonatype.aether.resolution.ArtifactResolutionException: Could not find artifact org.apache.maven.shared:maven-script-interpreter:jar:1.2 in central (http://repo.maven.apache.org/maven2)
        at org.sonatype.aether.impl.internal.DefaultArtifactResolver.resolve(DefaultArtifactResolver.java:538)
        at org.sonatype.aether.impl.internal.DefaultArtifactResolver.resolveArtifacts(DefaultArtifactResolver.java:216)
        at org.sonatype.aether.impl.internal.DefaultRepositorySystem.resolveDependencies(DefaultRepositorySystem.java:358)
        ... 35 more
Caused by: org.sonatype.aether.transfer.ArtifactNotFoundException: Could not find artifact org.apache.maven.shared:maven-script-interpreter:jar:1.2 in central (http://repo.maven.apache.org/maven2)
        at org.sonatype.aether.connector.wagon.WagonRepositoryConnector$4.wrap(WagonRepositoryConnector.java:947)
        at org.sonatype.aether.connector.wagon.WagonRepositoryConnector$4.wrap(WagonRepositoryConnector.java:941)
        at org.sonatype.aether.connector.wagon.WagonRepositoryConnector$GetTask.run(WagonRepositoryConnector.java:669)
        at org.sonatype.aether.util.concurrency.RunnableErrorForwarder$1.run(RunnableErrorForwarder.java:60)
        ... 3 more
[ERROR]
[ERROR] Re-run Maven using the -X switch to enable full debug logging.
[ERROR]
[ERROR] For more information about the errors and possible solutions, please read the following articles:
[ERROR] [Help 1] http://cwiki.apache.org/confluence/display/MAVEN/DependencyResolutionException
[ERROR]
[ERROR] After correcting the problems, you can resume the build with the command
[ERROR]   mvn <goals> -rf :maven-invoker-plugin
[JENKINS] Archiving F:\jenkins\jenkins-slave\workspace\maven-plugins-windows\maven-antrun-plugin\pom.xml to org.apache.maven.plugins/maven-antrun-plugin/3.0.0-SNAPSHOT/maven-antrun-plugin-3.0.0-SNAPSHOT.pom
[JENKINS] Archiving F:\jenkins\jenkins-slave\workspace\maven-plugins-windows\maven-antrun-plugin\target\maven-antrun-plugin-3.0.0-SNAPSHOT.jar to org.apache.maven.plugins/maven-antrun-plugin/3.0.0-SNAPSHOT/maven-antrun-plugin-3.0.0-SNAPSHOT.jar
[JENKINS] Archiving F:\jenkins\jenkins-slave\workspace\maven-plugins-windows\maven-linkcheck-plugin\pom.xml to org.apache.maven.plugins/maven-linkcheck-plugin/1.3-SNAPSHOT/maven-linkcheck-plugin-1.3-SNAPSHOT.pom
[JENKINS] Archiving F:\jenkins\jenkins-slave\workspace\maven-plugins-windows\maven-linkcheck-plugin\target\maven-linkcheck-plugin-1.3-SNAPSHOT.jar to org.apache.maven.plugins/maven-linkcheck-plugin/1.3-SNAPSHOT/maven-linkcheck-plugin-1.3-SNAPSHOT.jar
[JENKINS] Archiving F:\jenkins\jenkins-slave\workspace\maven-plugins-windows\maven-scm-publish-plugin\pom.xml to org.apache.maven.plugins/maven-scm-publish-plugin/1.2-SNAPSHOT/maven-scm-publish-plugin-1.2-SNAPSHOT.pom
[JENKINS] Archiving F:\jenkins\jenkins-slave\workspace\maven-plugins-windows\maven-scm-publish-plugin\target\maven-scm-publish-plugin-1.2-SNAPSHOT.jar to org.apache.maven.plugins/maven-scm-publish-plugin/1.2-SNAPSHOT/maven-scm-publish-plugin-1.2-SNAPSHOT.jar
[JENKINS] Archiving F:\jenkins\jenkins-slave\workspace\maven-plugins-windows\maven-acr-plugin\pom.xml to org.apache.maven.plugins/maven-acr-plugin/3.0.1-SNAPSHOT/maven-acr-plugin-3.0.1-SNAPSHOT.pom
[JENKINS] Archiving F:\jenkins\jenkins-slave\workspace\maven-plugins-windows\maven-acr-plugin\target\maven-acr-plugin-3.0.1-SNAPSHOT.jar to org.apache.maven.plugins/maven-acr-plugin/3.0.1-SNAPSHOT/maven-acr-plugin-3.0.1-SNAPSHOT.jar
[JENKINS] Archiving F:\jenkins\jenkins-slave\workspace\maven-plugins-windows\maven-install-plugin\pom.xml to org.apache.maven.plugins/maven-install-plugin/3.0.0-SNAPSHOT/maven-install-plugin-3.0.0-SNAPSHOT.pom
[JENKINS] Archiving F:\jenkins\jenkins-slave\workspace\maven-plugins-windows\maven-install-plugin\target\maven-install-plugin-3.0.0-SNAPSHOT.jar to org.apache.maven.plugins/maven-install-plugin/3.0.0-SNAPSHOT/maven-install-plugin-3.0.0-SNAPSHOT.jar
[JENKINS] Archiving F:\jenkins\jenkins-slave\workspace\maven-plugins-windows\maven-assembly-plugin\pom.xml to org.apache.maven.plugins/maven-assembly-plugin/3.1.0-SNAPSHOT/maven-assembly-plugin-3.1.0-SNAPSHOT.pom
[JENKINS] Archiving F:\jenkins\jenkins-slave\workspace\maven-plugins-windows\maven-assembly-plugin\target\maven-assembly-plugin-3.1.0-SNAPSHOT.jar to org.apache.maven.plugins/maven-assembly-plugin/3.1.0-SNAPSHOT/maven-assembly-plugin-3.1.0-SNAPSHOT.jar
[JENKINS] Archiving F:\jenkins\jenkins-slave\workspace\maven-plugins-windows\maven-docck-plugin\pom.xml to org.apache.maven.plugins/maven-docck-plugin/1.2-SNAPSHOT/maven-docck-plugin-1.2-SNAPSHOT.pom
[JENKINS] Archiving F:\jenkins\jenkins-slave\workspace\maven-plugins-windows\maven-docck-plugin\target\maven-docck-plugin-1.2-SNAPSHOT.jar to org.apache.maven.plugins/maven-docck-plugin/1.2-SNAPSHOT/maven-docck-plugin-1.2-SNAPSHOT.jar
[JENKINS] Archiving <https://builds.apache.org/job/maven-plugins-windows/ws/pom.xml> to org.apache.maven.plugins/maven-plugins-aggregator/1-SNAPSHOT/maven-plugins-aggregator-1-SNAPSHOT.pom
[JENKINS] Archiving F:\jenkins\jenkins-slave\workspace\maven-plugins-windows\maven-clean-plugin\pom.xml to org.apache.maven.plugins/maven-clean-plugin/3.0.1-SNAPSHOT/maven-clean-plugin-3.0.1-SNAPSHOT.pom
[JENKINS] Archiving F:\jenkins\jenkins-slave\workspace\maven-plugins-windows\maven-clean-plugin\target\maven-clean-plugin-3.0.1-SNAPSHOT.jar to org.apache.maven.plugins/maven-clean-plugin/3.0.1-SNAPSHOT/maven-clean-plugin-3.0.1-SNAPSHOT.jar
[JENKINS] Archiving F:\jenkins\jenkins-slave\workspace\maven-plugins-windows\maven-resources-plugin\pom.xml to org.apache.maven.plugins/maven-resources-plugin/3.0.3-SNAPSHOT/maven-resources-plugin-3.0.3-SNAPSHOT.pom
[JENKINS] Archiving F:\jenkins\jenkins-slave\workspace\maven-plugins-windows\maven-resources-plugin\target\maven-resources-plugin-3.0.3-SNAPSHOT.jar to org.apache.maven.plugins/maven-resources-plugin/3.0.3-SNAPSHOT/maven-resources-plugin-3.0.3-SNAPSHOT.jar
[JENKINS] Archiving F:\jenkins\jenkins-slave\workspace\maven-plugins-windows\maven-pmd-plugin\pom.xml to org.apache.maven.plugins/maven-pmd-plugin/3.9-SNAPSHOT/maven-pmd-plugin-3.9-SNAPSHOT.pom
[JENKINS] Archiving F:\jenkins\jenkins-slave\workspace\maven-plugins-windows\maven-pmd-plugin\target\maven-pmd-plugin-3.9-SNAPSHOT.jar to org.apache.maven.plugins/maven-pmd-plugin/3.9-SNAPSHOT/maven-pmd-plugin-3.9-SNAPSHOT.jar
[JENKINS] Archiving F:\jenkins\jenkins-slave\workspace\maven-plugins-windows\maven-shade-plugin\pom.xml to org.apache.maven.plugins/maven-shade-plugin/3.0.1-SNAPSHOT/maven-shade-plugin-3.0.1-SNAPSHOT.pom
[JENKINS] Archiving F:\jenkins\jenkins-slave\workspace\maven-plugins-windows\maven-shade-plugin\target\maven-shade-plugin-3.0.1-SNAPSHOT.jar to org.apache.maven.plugins/maven-shade-plugin/3.0.1-SNAPSHOT/maven-shade-plugin-3.0.1-SNAPSHOT.jar
[JENKINS] Archiving F:\jenkins\jenkins-slave\workspace\maven-plugins-windows\maven-toolchains-plugin\pom.xml to org.apache.maven.plugins/maven-toolchains-plugin/3.0.0-SNAPSHOT/maven-toolchains-plugin-3.0.0-SNAPSHOT.pom
[JENKINS] Archiving F:\jenkins\jenkins-slave\workspace\maven-plugins-windows\maven-toolchains-plugin\target\maven-toolchains-plugin-3.0.0-SNAPSHOT.jar to org.apache.maven.plugins/maven-toolchains-plugin/3.0.0-SNAPSHOT/maven-toolchains-plugin-3.0.0-SNAPSHOT.jar
[JENKINS] Archiving F:\jenkins\jenkins-slave\workspace\maven-plugins-windows\maven-remote-resources-plugin\pom.xml to org.apache.maven.plugins/maven-remote-resources-plugin/1.6-SNAPSHOT/maven-remote-resources-plugin-1.6-SNAPSHOT.pom
[JENKINS] Archiving F:\jenkins\jenkins-slave\workspace\maven-plugins-windows\maven-remote-resources-plugin\target\maven-remote-resources-plugin-1.6-SNAPSHOT.jar to org.apache.maven.plugins/maven-remote-resources-plugin/1.6-SNAPSHOT/maven-remote-resources-plugin-1.6-SNAPSHOT.jar
[JENKINS] Archiving F:\jenkins\jenkins-slave\workspace\maven-plugins-windows\maven-project-info-reports-plugin\pom.xml to org.apache.maven.plugins/maven-project-info-reports-plugin/2.10-SNAPSHOT/maven-project-info-reports-plugin-2.10-SNAPSHOT.pom
[JENKINS] Archiving F:\jenkins\jenkins-slave\workspace\maven-plugins-windows\maven-project-info-reports-plugin\target\maven-project-info-reports-plugin-2.10-SNAPSHOT.jar to org.apache.maven.plugins/maven-project-info-reports-plugin/2.10-SNAPSHOT/maven-project-info-reports-plugin-2.10-SNAPSHOT.jar
[JENKINS] Archiving F:\jenkins\jenkins-slave\workspace\maven-plugins-windows\maven-patch-plugin\pom.xml to org.apache.maven.plugins/maven-patch-plugin/1.3-SNAPSHOT/maven-patch-plugin-1.3-SNAPSHOT.pom
[JENKINS] Archiving F:\jenkins\jenkins-slave\workspace\maven-plugins-windows\maven-patch-plugin\target\maven-patch-plugin-1.3-SNAPSHOT.jar to org.apache.maven.plugins/maven-patch-plugin/1.3-SNAPSHOT/maven-patch-plugin-1.3-SNAPSHOT.jar
[JENKINS] Archiving F:\jenkins\jenkins-slave\workspace\maven-plugins-windows\maven-compiler-plugin\pom.xml to org.apache.maven.plugins/maven-compiler-plugin/3.6.2-SNAPSHOT/maven-compiler-plugin-3.6.2-SNAPSHOT.pom
[JENKINS] Archiving F:\jenkins\jenkins-slave\workspace\maven-plugins-windows\maven-compiler-plugin\target\maven-compiler-plugin-3.6.2-SNAPSHOT.jar to org.apache.maven.plugins/maven-compiler-plugin/3.6.2-SNAPSHOT/maven-compiler-plugin-3.6.2-SNAPSHOT.jar
[JENKINS] Archiving F:\jenkins\jenkins-slave\workspace\maven-plugins-windows\maven-stage-plugin\pom.xml to org.apache.maven.plugins/maven-stage-plugin/1.1-SNAPSHOT/maven-stage-plugin-1.1-SNAPSHOT.pom
[JENKINS] Archiving F:\jenkins\jenkins-slave\workspace\maven-plugins-windows\maven-stage-plugin\target\maven-stage-plugin-1.1-SNAPSHOT.jar to org.apache.maven.plugins/maven-stage-plugin/1.1-SNAPSHOT/maven-stage-plugin-1.1-SNAPSHOT.jar
[JENKINS] Archiving F:\jenkins\jenkins-slave\workspace\maven-plugins-windows\maven-verifier-plugin\pom.xml to org.apache.maven.plugins/maven-verifier-plugin/3.0.0-SNAPSHOT/maven-verifier-plugin-3.0.0-SNAPSHOT.pom
[JENKINS] Archiving F:\jenkins\jenkins-slave\workspace\maven-plugins-windows\maven-verifier-plugin\target\maven-verifier-plugin-3.0.0-SNAPSHOT.jar to org.apache.maven.plugins/maven-verifier-plugin/3.0.0-SNAPSHOT/maven-verifier-plugin-3.0.0-SNAPSHOT.jar
[JENKINS] Archiving F:\jenkins\jenkins-slave\workspace\maven-plugins-windows\maven-jarsigner-plugin\pom.xml to org.apache.maven.plugins/maven-jarsigner-plugin/1.5-SNAPSHOT/maven-jarsigner-plugin-1.5-SNAPSHOT.pom
[JENKINS] Archiving F:\jenkins\jenkins-slave\workspace\maven-plugins-windows\maven-jarsigner-plugin\target\maven-jarsigner-plugin-1.5-SNAPSHOT.jar to org.apache.maven.plugins/maven-jarsigner-plugin/1.5-SNAPSHOT/maven-jarsigner-plugin-1.5-SNAPSHOT.jar
[JENKINS] Archiving F:\jenkins\jenkins-slave\workspace\maven-plugins-windows\maven-ejb-plugin\pom.xml to org.apache.maven.plugins/maven-ejb-plugin/3.0.0-SNAPSHOT/maven-ejb-plugin-3.0.0-SNAPSHOT.pom
[JENKINS] Archiving F:\jenkins\jenkins-slave\workspace\maven-plugins-windows\maven-ejb-plugin\target\maven-ejb-plugin-3.0.0-SNAPSHOT.jar to org.apache.maven.plugins/maven-ejb-plugin/3.0.0-SNAPSHOT/maven-ejb-plugin-3.0.0-SNAPSHOT.jar
[JENKINS] Archiving F:\jenkins\jenkins-slave\workspace\maven-plugins-windows\maven-changelog-plugin\pom.xml to org.apache.maven.plugins/maven-changelog-plugin/2.4-SNAPSHOT/maven-changelog-plugin-2.4-SNAPSHOT.pom
[JENKINS] Archiving F:\jenkins\jenkins-slave\workspace\maven-plugins-windows\maven-changelog-plugin\target\maven-changelog-plugin-2.4-SNAPSHOT.jar to org.apache.maven.plugins/maven-changelog-plugin/2.4-SNAPSHOT/maven-changelog-plugin-2.4-SNAPSHOT.jar
[JENKINS] Archiving F:\jenkins\jenkins-slave\workspace\maven-plugins-windows\maven-help-plugin\pom.xml to org.apache.maven.plugins/maven-help-plugin/3.0.0-SNAPSHOT/maven-help-plugin-3.0.0-SNAPSHOT.pom
[JENKINS] Archiving F:\jenkins\jenkins-slave\workspace\maven-plugins-windows\maven-help-plugin\target\maven-help-plugin-3.0.0-SNAPSHOT.jar to org.apache.maven.plugins/maven-help-plugin/3.0.0-SNAPSHOT/maven-help-plugin-3.0.0-SNAPSHOT.jar
[JENKINS] Archiving F:\jenkins\jenkins-slave\workspace\maven-plugins-windows\maven-war-plugin\pom.xml to org.apache.maven.plugins/maven-war-plugin/3.1.1-SNAPSHOT/maven-war-plugin-3.1.1-SNAPSHOT.pom
[JENKINS] Archiving F:\jenkins\jenkins-slave\workspace\maven-plugins-windows\maven-war-plugin\target\maven-war-plugin-3.1.1-SNAPSHOT.jar to org.apache.maven.plugins/maven-war-plugin/3.1.1-SNAPSHOT/maven-war-plugin-3.1.1-SNAPSHOT.jar
[JENKINS] Archiving F:\jenkins\jenkins-slave\workspace\maven-plugins-windows\maven-ear-plugin\pom.xml to org.apache.maven.plugins/maven-ear-plugin/3.0.0-SNAPSHOT/maven-ear-plugin-3.0.0-SNAPSHOT.pom
[JENKINS] Archiving F:\jenkins\jenkins-slave\workspace\maven-plugins-windows\maven-ear-plugin\target\maven-ear-plugin-3.0.0-SNAPSHOT.jar to org.apache.maven.plugins/maven-ear-plugin/3.0.0-SNAPSHOT/maven-ear-plugin-3.0.0-SNAPSHOT.jar
[JENKINS] Archiving F:\jenkins\jenkins-slave\workspace\maven-plugins-windows\maven-invoker-plugin\pom.xml to org.apache.maven.plugins/maven-invoker-plugin/3.0.2-SNAPSHOT/maven-invoker-plugin-3.0.2-SNAPSHOT.pom
[JENKINS] Archiving F:\jenkins\jenkins-slave\workspace\maven-plugins-windows\maven-jdeps-plugin\pom.xml to org.apache.maven.plugins/maven-jdeps-plugin/3.0.1-SNAPSHOT/maven-jdeps-plugin-3.0.1-SNAPSHOT.pom
[JENKINS] Archiving F:\jenkins\jenkins-slave\workspace\maven-plugins-windows\maven-jdeps-plugin\target\maven-jdeps-plugin-3.0.1-SNAPSHOT.jar to org.apache.maven.plugins/maven-jdeps-plugin/3.0.1-SNAPSHOT/maven-jdeps-plugin-3.0.1-SNAPSHOT.jar
[JENKINS] Archiving F:\jenkins\jenkins-slave\workspace\maven-plugins-windows\maven-doap-plugin\pom.xml to org.apache.maven.plugins/maven-doap-plugin/1.3-SNAPSHOT/maven-doap-plugin-1.3-SNAPSHOT.pom
[JENKINS] Archiving F:\jenkins\jenkins-slave\workspace\maven-plugins-windows\maven-doap-plugin\target\maven-doap-plugin-1.3-SNAPSHOT.jar to org.apache.maven.plugins/maven-doap-plugin/1.3-SNAPSHOT/maven-doap-plugin-1.3-SNAPSHOT.jar
[JENKINS] Archiving F:\jenkins\jenkins-slave\workspace\maven-plugins-windows\maven-site-plugin\dependency-reduced-pom.xml to org.apache.maven.plugins/maven-site-plugin/3.7-SNAPSHOT/maven-site-plugin-3.7-SNAPSHOT.pom
[JENKINS] Archiving F:\jenkins\jenkins-slave\workspace\maven-plugins-windows\maven-site-plugin\target\maven-site-plugin-3.7-SNAPSHOT.jar to org.apache.maven.plugins/maven-site-plugin/3.7-SNAPSHOT/maven-site-plugin-3.7-SNAPSHOT.jar
[JENKINS] Archiving F:\jenkins\jenkins-slave\workspace\maven-plugins-windows\maven-changes-plugin\pom.xml to org.apache.maven.plugins/maven-changes-plugin/3.0.0-SNAPSHOT/maven-changes-plugin-3.0.0-SNAPSHOT.pom
[JENKINS] Archiving F:\jenkins\jenkins-slave\workspace\maven-plugins-windows\maven-changes-plugin\target\maven-changes-plugin-3.0.0-SNAPSHOT.jar to org.apache.maven.plugins/maven-changes-plugin/3.0.0-SNAPSHOT/maven-changes-plugin-3.0.0-SNAPSHOT.jar
[JENKINS] Archiving F:\jenkins\jenkins-slave\workspace\maven-plugins-windows\maven-deploy-plugin\pom.xml to org.apache.maven.plugins/maven-deploy-plugin/3.0.0-SNAPSHOT/maven-deploy-plugin-3.0.0-SNAPSHOT.pom
[JENKINS] Archiving F:\jenkins\jenkins-slave\workspace\maven-plugins-windows\maven-deploy-plugin\target\maven-deploy-plugin-3.0.0-SNAPSHOT.jar to org.apache.maven.plugins/maven-deploy-plugin/3.0.0-SNAPSHOT/maven-deploy-plugin-3.0.0-SNAPSHOT.jar
[JENKINS] Archiving F:\jenkins\jenkins-slave\workspace\maven-plugins-windows\maven-repository-plugin\pom.xml to org.apache.maven.plugins/maven-repository-plugin/2.5-SNAPSHOT/maven-repository-plugin-2.5-SNAPSHOT.pom
[JENKINS] Archiving F:\jenkins\jenkins-slave\workspace\maven-plugins-windows\maven-repository-plugin\target\maven-repository-plugin-2.5-SNAPSHOT.jar to org.apache.maven.plugins/maven-repository-plugin/2.5-SNAPSHOT/maven-repository-plugin-2.5-SNAPSHOT.jar
[JENKINS] Archiving F:\jenkins\jenkins-slave\workspace\maven-plugins-windows\maven-source-plugin\pom.xml to org.apache.maven.plugins/maven-source-plugin/3.0.2-SNAPSHOT/maven-source-plugin-3.0.2-SNAPSHOT.pom
[JENKINS] Archiving F:\jenkins\jenkins-slave\workspace\maven-plugins-windows\maven-source-plugin\target\maven-source-plugin-3.0.2-SNAPSHOT.jar to org.apache.maven.plugins/maven-source-plugin/3.0.2-SNAPSHOT/maven-source-plugin-3.0.2-SNAPSHOT.jar
[JENKINS] Archiving F:\jenkins\jenkins-slave\workspace\maven-plugins-windows\maven-pdf-plugin\pom.xml to org.apache.maven.plugins/maven-pdf-plugin/1.4-SNAPSHOT/maven-pdf-plugin-1.4-SNAPSHOT.pom
[JENKINS] Archiving F:\jenkins\jenkins-slave\workspace\maven-plugins-windows\maven-pdf-plugin\target\maven-pdf-plugin-1.4-SNAPSHOT.jar to org.apache.maven.plugins/maven-pdf-plugin/1.4-SNAPSHOT/maven-pdf-plugin-1.4-SNAPSHOT.jar
[JENKINS] Archiving F:\jenkins\jenkins-slave\workspace\maven-plugins-windows\maven-jar-plugin\pom.xml to org.apache.maven.plugins/maven-jar-plugin/3.0.3-SNAPSHOT/maven-jar-plugin-3.0.3-SNAPSHOT.pom
[JENKINS] Archiving F:\jenkins\jenkins-slave\workspace\maven-plugins-windows\maven-jar-plugin\target\maven-jar-plugin-3.0.3-SNAPSHOT.jar to org.apache.maven.plugins/maven-jar-plugin/3.0.3-SNAPSHOT/maven-jar-plugin-3.0.3-SNAPSHOT.jar
[JENKINS] Archiving F:\jenkins\jenkins-slave\workspace\maven-plugins-windows\maven-javadoc-plugin\pom.xml to org.apache.maven.plugins/maven-javadoc-plugin/3.0.0-SNAPSHOT/maven-javadoc-plugin-3.0.0-SNAPSHOT.pom
[JENKINS] Archiving F:\jenkins\jenkins-slave\workspace\maven-plugins-windows\maven-javadoc-plugin\target\maven-javadoc-plugin-3.0.0-SNAPSHOT.jar to org.apache.maven.plugins/maven-javadoc-plugin/3.0.0-SNAPSHOT/maven-javadoc-plugin-3.0.0-SNAPSHOT.jar
[JENKINS] Archiving F:\jenkins\jenkins-slave\workspace\maven-plugins-windows\maven-dependency-plugin\pom.xml to org.apache.maven.plugins/maven-dependency-plugin/3.0.2-SNAPSHOT/maven-dependency-plugin-3.0.2-SNAPSHOT.pom
[JENKINS] Archiving F:\jenkins\jenkins-slave\workspace\maven-plugins-windows\maven-dependency-plugin\target\maven-dependency-plugin-3.0.2-SNAPSHOT.jar to org.apache.maven.plugins/maven-dependency-plugin/3.0.2-SNAPSHOT/maven-dependency-plugin-3.0.2-SNAPSHOT.jar
[JENKINS] Archiving F:\jenkins\jenkins-slave\workspace\maven-plugins-windows\maven-rar-plugin\pom.xml to org.apache.maven.plugins/maven-rar-plugin/3.0.0-SNAPSHOT/maven-rar-plugin-3.0.0-SNAPSHOT.pom
[JENKINS] Archiving F:\jenkins\jenkins-slave\workspace\maven-plugins-windows\maven-rar-plugin\target\maven-rar-plugin-3.0.0-SNAPSHOT.jar to org.apache.maven.plugins/maven-rar-plugin/3.0.0-SNAPSHOT/maven-rar-plugin-3.0.0-SNAPSHOT.jar
[JENKINS] Archiving F:\jenkins\jenkins-slave\workspace\maven-plugins-windows\maven-checkstyle-plugin\pom.xml to org.apache.maven.plugins/maven-checkstyle-plugin/3.0.0-SNAPSHOT/maven-checkstyle-plugin-3.0.0-SNAPSHOT.pom
[JENKINS] Archiving F:\jenkins\jenkins-slave\workspace\maven-plugins-windows\maven-checkstyle-plugin\target\maven-checkstyle-plugin-3.0.0-SNAPSHOT.jar to org.apache.maven.plugins/maven-checkstyle-plugin/3.0.0-SNAPSHOT/maven-checkstyle-plugin-3.0.0-SNAPSHOT.jar
Sending e-mails to: [hidden email] [hidden email]
channel stopped
[WARNINGS] Skipping publisher since build result is FAILURE
Reply | Threaded
Open this post in threaded view
|  
Report Content as Inappropriate

Build failed in Jenkins: maven-plugins-windows #1991

Apache Jenkins Server-2
See <https://builds.apache.org/job/maven-plugins-windows/1991/display/redirect?page=changes>

Changes:

[Robert Scholte] [MJAVADOC-456] Upgrade to Maven3 plugin
Change package to org.apache.maven.plugins

------------------------------------------
[...truncated 605.54 KB...]
Tests run: 8, Failures: 0, Errors: 0, Skipped: 0, Time elapsed: 0.025 sec - in org.apache.maven.plugins.dependency.utils.filters.TestDestFileFilter
Running org.apache.maven.plugins.dependency.utils.filters.TestMarkerFileFilter
Tests run: 5, Failures: 0, Errors: 0, Skipped: 0, Time elapsed: 0 sec - in org.apache.maven.plugins.dependency.utils.filters.TestMarkerFileFilter
Running org.apache.maven.plugins.dependency.utils.filters.TestResolveMarkerFileFilter
Tests run: 1, Failures: 0, Errors: 0, Skipped: 0, Time elapsed: 0.002 sec - in org.apache.maven.plugins.dependency.utils.filters.TestResolveMarkerFileFilter
Running org.apache.maven.plugins.dependency.utils.markers.TestDefaultMarkerFileHandler
Tests run: 6, Failures: 0, Errors: 0, Skipped: 0, Time elapsed: 0.037 sec - in org.apache.maven.plugins.dependency.utils.markers.TestDefaultMarkerFileHandler
Running org.apache.maven.plugins.dependency.utils.markers.TestSourcesMarkerFileHandler
Tests run: 10, Failures: 0, Errors: 0, Skipped: 0, Time elapsed: 0 sec - in org.apache.maven.plugins.dependency.utils.markers.TestSourcesMarkerFileHandler
Running org.apache.maven.plugins.dependency.utils.markers.TestUnpackMarkerFileHandler
Tests run: 9, Failures: 0, Errors: 0, Skipped: 0, Time elapsed: 1.044 sec - in org.apache.maven.plugins.dependency.utils.markers.TestUnpackMarkerFileHandler
Running org.apache.maven.plugins.dependency.utils.TestDependencyStatusSets
Tests run: 5, Failures: 0, Errors: 0, Skipped: 0, Time elapsed: 0.669 sec - in org.apache.maven.plugins.dependency.utils.TestDependencyStatusSets
Running org.apache.maven.plugins.dependency.utils.TestDependencyUtil
Tests run: 9, Failures: 0, Errors: 0, Skipped: 0, Time elapsed: 0.003 sec - in org.apache.maven.plugins.dependency.utils.TestDependencyUtil
Running org.apache.maven.plugins.dependency.utils.TestSilentLog
Tests run: 2, Failures: 0, Errors: 0, Skipped: 0, Time elapsed: 0 sec - in org.apache.maven.plugins.dependency.utils.TestSilentLog
Running org.apache.maven.plugins.dependency.utils.translators.TestClassifierTypeTranslator
Tests run: 6, Failures: 0, Errors: 0, Skipped: 0, Time elapsed: 0.575 sec - in org.apache.maven.plugins.dependency.utils.translators.TestClassifierTypeTranslator

Results :

Tests run: 244, Failures: 0, Errors: 0, Skipped: 0

[JENKINS] Recording test results
[INFO]
[INFO] --- maven-jar-plugin:3.0.0:jar (default-jar) @ maven-dependency-plugin ---
[INFO] Building jar: F:\jenkins\jenkins-slave\workspace\maven-plugins-windows\maven-dependency-plugin\target\maven-dependency-plugin-3.0.2-SNAPSHOT.jar
[INFO]
[INFO] --- maven-plugin-plugin:3.4:addPluginArtifactMetadata (default-addPluginArtifactMetadata) @ maven-dependency-plugin ---
[INFO]
[INFO] --- maven-site-plugin:3.5.1:attach-descriptor (attach-descriptor) @ maven-dependency-plugin ---
[INFO]
[INFO] --- maven-checkstyle-plugin:2.15:check (checkstyle-check) @ maven-dependency-plugin ---
[INFO] There is 1 error reported by Checkstyle 6.1.1 with config/maven_checks.xml ruleset.
[INFO] Ignored 1 error, 0 violation remaining.
[INFO]
[INFO] --- maven-install-plugin:2.5.2:install (default-install) @ maven-dependency-plugin ---
[INFO] Installing F:\jenkins\jenkins-slave\workspace\maven-plugins-windows\maven-dependency-plugin\target\maven-dependency-plugin-3.0.2-SNAPSHOT.jar to f:\jenkins\jenkins-slave\maven-repositories\0\org\apache\maven\plugins\maven-dependency-plugin\3.0.2-SNAPSHOT\maven-dependency-plugin-3.0.2-SNAPSHOT.jar
[INFO] Installing F:\jenkins\jenkins-slave\workspace\maven-plugins-windows\maven-dependency-plugin\pom.xml to f:\jenkins\jenkins-slave\maven-repositories\0\org\apache\maven\plugins\maven-dependency-plugin\3.0.2-SNAPSHOT\maven-dependency-plugin-3.0.2-SNAPSHOT.pom
[INFO]                                                                        
[INFO] ------------------------------------------------------------------------
[INFO] Building Apache Maven Plugins Aggregator 1-SNAPSHOT
[INFO] ------------------------------------------------------------------------
[INFO]
[INFO] --- maven-clean-plugin:2.5:clean (default-clean) @ maven-plugins-aggregator ---
[INFO] Deleting <https://builds.apache.org/job/maven-plugins-windows/ws/target>
[INFO]
[INFO] --- maven-enforcer-plugin:1.3.1:enforce (enforce-bytecode-version) @ maven-plugins-aggregator ---
[INFO]
[INFO] --- maven-enforcer-plugin:1.3.1:enforce (ban-known-bad-maven-versions) @ maven-plugins-aggregator ---
[INFO]
[INFO] --- maven-remote-resources-plugin:1.5:process (default) @ maven-plugins-aggregator ---
[INFO]
[INFO] --- maven-site-plugin:3.3:attach-descriptor (attach-descriptor) @ maven-plugins-aggregator ---
[INFO]
[INFO] --- maven-install-plugin:2.5.1:install (default-install) @ maven-plugins-aggregator ---
[INFO] Installing <https://builds.apache.org/job/maven-plugins-windows/ws/pom.xml> to f:\jenkins\jenkins-slave\maven-repositories\0\org\apache\maven\plugins\maven-plugins-aggregator\1-SNAPSHOT\maven-plugins-aggregator-1-SNAPSHOT.pom
[INFO] ------------------------------------------------------------------------
[INFO] Reactor Summary:
[INFO]
[INFO] Apache Maven ACR Plugin ........................... SUCCESS [22.272s]
[INFO] Apache Maven AntRun Plugin ........................ SUCCESS [1:11.847s]
[INFO] Apache Maven Changelog Plugin ..................... SUCCESS [18.002s]
[INFO] Apache Maven Changes Plugin ....................... SUCCESS [25.237s]
[INFO] Apache Maven Clean Plugin ......................... SUCCESS [12.223s]
[INFO] Apache Maven Compiler Plugin ...................... SUCCESS [19.970s]
[INFO] Apache Maven Deploy Plugin ........................ SUCCESS [13.441s]
[INFO] Apache Maven Documentation Checker Plugin ......... SUCCESS [6.359s]
[INFO] Apache Maven EAR Plugin ........................... SUCCESS [14.035s]
[INFO] Apache Maven EJB Plugin ........................... SUCCESS [13.097s]
[INFO] Apache Maven Help Plugin .......................... SUCCESS [14.453s]
[INFO] Apache Maven Install Plugin ....................... SUCCESS [14.072s]
[INFO] Apache Maven Jarsigner Plugin ..................... SUCCESS [5.485s]
[INFO] Apache Maven Javadoc Plugin ....................... SUCCESS [2:14.182s]
[INFO] Apache Maven JDeps Plugin ......................... SUCCESS [7.185s]
[INFO] Apache Maven Linkcheck Plugin ..................... SUCCESS [7.455s]
[INFO] Apache Maven Patch Plugin ......................... SUCCESS [5.289s]
[INFO] Apache Maven PDF Plugin ........................... SUCCESS [13.778s]
[INFO] Apache Maven RAR Plugin ........................... SUCCESS [12.889s]
[INFO] Apache Maven Repository Plugin .................... SUCCESS [8.547s]
[INFO] Apache Maven Resources Plugin ..................... SUCCESS [15.052s]
[INFO] Apache Maven Site Plugin .......................... SUCCESS [28.522s]
[INFO] Apache Maven Source Plugin ........................ SUCCESS [12.285s]
[INFO] Apache Maven Stage Plugin ......................... SUCCESS [6.819s]
[INFO] Apache Maven Toolchains Plugin .................... SUCCESS [6.129s]
[INFO] Apache Maven Verifier Plugin ...................... SUCCESS [7.614s]
[INFO] Apache Maven WAR Plugin ........................... SUCCESS [23.564s]
[INFO] Apache Maven DOAP Plugin .......................... SUCCESS [11.305s]
[INFO] Apache Maven Invoker Plugin ....................... FAILURE [0.668s]
[INFO] Apache Maven JAR Plugin ........................... SUCCESS [9.596s]
[INFO] Apache Maven Assembly Plugin ...................... SUCCESS [31.391s]
[INFO] Apache Maven Checkstyle Plugin .................... SUCCESS [34.561s]
[INFO] Apache Maven PMD Plugin ........................... SUCCESS [22.954s]
[INFO] Apache Maven Project Info Reports Plugin .......... SUCCESS [30.422s]
[INFO] Apache Maven Remote Resources Plugin .............. SUCCESS [12.253s]
[INFO] Apache Maven Shade Plugin ......................... SUCCESS [17.573s]
[INFO] Apache Maven SCM Publish Plugin ................... SUCCESS [7.759s]
[INFO] Apache Maven Dependency Plugin .................... SUCCESS [1:07.832s]
[INFO] Apache Maven Plugins Aggregator ................... SUCCESS [2.293s]
[INFO] ------------------------------------------------------------------------
[INFO] BUILD FAILURE
[INFO] ------------------------------------------------------------------------
[INFO] Total time: 14:26.865s
[INFO] Finished at: Wed Jul 12 21:34:19 UTC 2017
[INFO] Final Memory: 137M/731M
[INFO] ------------------------------------------------------------------------
[ERROR] Failed to execute goal on project maven-invoker-plugin: Could not resolve dependencies for project org.apache.maven.plugins:maven-invoker-plugin:maven-plugin:3.0.2-SNAPSHOT: Could not find artifact org.apache.maven.shared:maven-script-interpreter:jar:1.2 in central (http://repo.maven.apache.org/maven2) -> [Help 1]
org.apache.maven.lifecycle.LifecycleExecutionException: Failed to execute goal on project maven-invoker-plugin: Could not resolve dependencies for project org.apache.maven.plugins:maven-invoker-plugin:maven-plugin:3.0.2-SNAPSHOT: Could not find artifact org.apache.maven.shared:maven-script-interpreter:jar:1.2 in central (http://repo.maven.apache.org/maven2)
        at org.apache.maven.lifecycle.internal.LifecycleDependencyResolver.getDependencies(LifecycleDependencyResolver.java:210)
        at org.apache.maven.lifecycle.internal.LifecycleDependencyResolver.resolveProjectDependencies(LifecycleDependencyResolver.java:117)
        at org.apache.maven.lifecycle.internal.MojoExecutor.ensureDependenciesAreResolved(MojoExecutor.java:258)
        at org.apache.maven.lifecycle.internal.MojoExecutor.execute(MojoExecutor.java:201)
        at org.apache.maven.lifecycle.internal.MojoExecutor.execute(MojoExecutor.java:153)
        at org.apache.maven.lifecycle.internal.MojoExecutor.execute(MojoExecutor.java:145)
        at org.apache.maven.lifecycle.internal.LifecycleModuleBuilder.buildProject(LifecycleModuleBuilder.java:84)
        at org.apache.maven.lifecycle.internal.LifecycleModuleBuilder.buildProject(LifecycleModuleBuilder.java:59)
        at org.apache.maven.lifecycle.internal.LifecycleStarter.singleThreadedBuild(LifecycleStarter.java:183)
        at org.apache.maven.lifecycle.internal.LifecycleStarter.execute(LifecycleStarter.java:161)
        at org.apache.maven.DefaultMaven.doExecute(DefaultMaven.java:320)
        at org.apache.maven.DefaultMaven.execute(DefaultMaven.java:156)
        at org.jvnet.hudson.maven3.launcher.Maven3Launcher.main(Maven3Launcher.java:117)
        at sun.reflect.NativeMethodAccessorImpl.invoke0(Native Method)
        at sun.reflect.NativeMethodAccessorImpl.invoke(NativeMethodAccessorImpl.java:57)
        at sun.reflect.DelegatingMethodAccessorImpl.invoke(DelegatingMethodAccessorImpl.java:43)
        at java.lang.reflect.Method.invoke(Method.java:606)
        at org.codehaus.plexus.classworlds.launcher.Launcher.launchStandard(Launcher.java:329)
        at org.codehaus.plexus.classworlds.launcher.Launcher.launch(Launcher.java:239)
        at org.jvnet.hudson.maven3.agent.Maven3Main.launch(Maven3Main.java:181)
        at sun.reflect.NativeMethodAccessorImpl.invoke0(Native Method)
        at sun.reflect.NativeMethodAccessorImpl.invoke(NativeMethodAccessorImpl.java:57)
        at sun.reflect.DelegatingMethodAccessorImpl.invoke(DelegatingMethodAccessorImpl.java:43)
        at java.lang.reflect.Method.invoke(Method.java:606)
        at hudson.maven.Maven3Builder.call(Maven3Builder.java:139)
        at hudson.maven.Maven3Builder.call(Maven3Builder.java:70)
        at hudson.remoting.UserRequest.perform(UserRequest.java:120)
        at hudson.remoting.UserRequest.perform(UserRequest.java:48)
        at hudson.remoting.Request$2.run(Request.java:326)
        at hudson.remoting.InterceptingExecutorService$1.call(InterceptingExecutorService.java:68)
        at java.util.concurrent.FutureTask.run(FutureTask.java:262)
        at java.util.concurrent.ThreadPoolExecutor.runWorker(ThreadPoolExecutor.java:1145)
        at java.util.concurrent.ThreadPoolExecutor$Worker.run(ThreadPoolExecutor.java:615)
        at java.lang.Thread.run(Thread.java:745)
Caused by: org.apache.maven.project.DependencyResolutionException: Could not resolve dependencies for project org.apache.maven.plugins:maven-invoker-plugin:maven-plugin:3.0.2-SNAPSHOT: Could not find artifact org.apache.maven.shared:maven-script-interpreter:jar:1.2 in central (http://repo.maven.apache.org/maven2)
        at org.apache.maven.project.DefaultProjectDependenciesResolver.resolve(DefaultProjectDependenciesResolver.java:189)
        at org.apache.maven.lifecycle.internal.LifecycleDependencyResolver.getDependencies(LifecycleDependencyResolver.java:185)
        ... 33 more
Caused by: org.sonatype.aether.resolution.DependencyResolutionException: Could not find artifact org.apache.maven.shared:maven-script-interpreter:jar:1.2 in central (http://repo.maven.apache.org/maven2)
        at org.sonatype.aether.impl.internal.DefaultRepositorySystem.resolveDependencies(DefaultRepositorySystem.java:375)
        at org.apache.maven.project.DefaultProjectDependenciesResolver.resolve(DefaultProjectDependenciesResolver.java:183)
        ... 34 more
Caused by: org.sonatype.aether.resolution.ArtifactResolutionException: Could not find artifact org.apache.maven.shared:maven-script-interpreter:jar:1.2 in central (http://repo.maven.apache.org/maven2)
        at org.sonatype.aether.impl.internal.DefaultArtifactResolver.resolve(DefaultArtifactResolver.java:538)
        at org.sonatype.aether.impl.internal.DefaultArtifactResolver.resolveArtifacts(DefaultArtifactResolver.java:216)
        at org.sonatype.aether.impl.internal.DefaultRepositorySystem.resolveDependencies(DefaultRepositorySystem.java:358)
        ... 35 more
Caused by: org.sonatype.aether.transfer.ArtifactNotFoundException: Could not find artifact org.apache.maven.shared:maven-script-interpreter:jar:1.2 in central (http://repo.maven.apache.org/maven2)
        at org.sonatype.aether.connector.wagon.WagonRepositoryConnector$4.wrap(WagonRepositoryConnector.java:947)
        at org.sonatype.aether.connector.wagon.WagonRepositoryConnector$4.wrap(WagonRepositoryConnector.java:941)
        at org.sonatype.aether.connector.wagon.WagonRepositoryConnector$GetTask.run(WagonRepositoryConnector.java:669)
        at org.sonatype.aether.util.concurrency.RunnableErrorForwarder$1.run(RunnableErrorForwarder.java:60)
        ... 3 more
[ERROR]
[ERROR] Re-run Maven using the -X switch to enable full debug logging.
[ERROR]
[ERROR] For more information about the errors and possible solutions, please read the following articles:
[ERROR] [Help 1] http://cwiki.apache.org/confluence/display/MAVEN/DependencyResolutionException
[ERROR]
[ERROR] After correcting the problems, you can resume the build with the command
[ERROR]   mvn <goals> -rf :maven-invoker-plugin
[JENKINS] Archiving F:\jenkins\jenkins-slave\workspace\maven-plugins-windows\maven-antrun-plugin\pom.xml to org.apache.maven.plugins/maven-antrun-plugin/3.0.0-SNAPSHOT/maven-antrun-plugin-3.0.0-SNAPSHOT.pom
[JENKINS] Archiving F:\jenkins\jenkins-slave\workspace\maven-plugins-windows\maven-antrun-plugin\target\maven-antrun-plugin-3.0.0-SNAPSHOT.jar to org.apache.maven.plugins/maven-antrun-plugin/3.0.0-SNAPSHOT/maven-antrun-plugin-3.0.0-SNAPSHOT.jar
[JENKINS] Archiving F:\jenkins\jenkins-slave\workspace\maven-plugins-windows\maven-linkcheck-plugin\pom.xml to org.apache.maven.plugins/maven-linkcheck-plugin/1.3-SNAPSHOT/maven-linkcheck-plugin-1.3-SNAPSHOT.pom
[JENKINS] Archiving F:\jenkins\jenkins-slave\workspace\maven-plugins-windows\maven-linkcheck-plugin\target\maven-linkcheck-plugin-1.3-SNAPSHOT.jar to org.apache.maven.plugins/maven-linkcheck-plugin/1.3-SNAPSHOT/maven-linkcheck-plugin-1.3-SNAPSHOT.jar
[JENKINS] Archiving F:\jenkins\jenkins-slave\workspace\maven-plugins-windows\maven-scm-publish-plugin\pom.xml to org.apache.maven.plugins/maven-scm-publish-plugin/1.2-SNAPSHOT/maven-scm-publish-plugin-1.2-SNAPSHOT.pom
[JENKINS] Archiving F:\jenkins\jenkins-slave\workspace\maven-plugins-windows\maven-scm-publish-plugin\target\maven-scm-publish-plugin-1.2-SNAPSHOT.jar to org.apache.maven.plugins/maven-scm-publish-plugin/1.2-SNAPSHOT/maven-scm-publish-plugin-1.2-SNAPSHOT.jar
[JENKINS] Archiving F:\jenkins\jenkins-slave\workspace\maven-plugins-windows\maven-acr-plugin\pom.xml to org.apache.maven.plugins/maven-acr-plugin/3.0.1-SNAPSHOT/maven-acr-plugin-3.0.1-SNAPSHOT.pom
[JENKINS] Archiving F:\jenkins\jenkins-slave\workspace\maven-plugins-windows\maven-acr-plugin\target\maven-acr-plugin-3.0.1-SNAPSHOT.jar to org.apache.maven.plugins/maven-acr-plugin/3.0.1-SNAPSHOT/maven-acr-plugin-3.0.1-SNAPSHOT.jar
[JENKINS] Archiving F:\jenkins\jenkins-slave\workspace\maven-plugins-windows\maven-install-plugin\pom.xml to org.apache.maven.plugins/maven-install-plugin/3.0.0-SNAPSHOT/maven-install-plugin-3.0.0-SNAPSHOT.pom
[JENKINS] Archiving F:\jenkins\jenkins-slave\workspace\maven-plugins-windows\maven-install-plugin\target\maven-install-plugin-3.0.0-SNAPSHOT.jar to org.apache.maven.plugins/maven-install-plugin/3.0.0-SNAPSHOT/maven-install-plugin-3.0.0-SNAPSHOT.jar
[JENKINS] Archiving F:\jenkins\jenkins-slave\workspace\maven-plugins-windows\maven-assembly-plugin\pom.xml to org.apache.maven.plugins/maven-assembly-plugin/3.1.0-SNAPSHOT/maven-assembly-plugin-3.1.0-SNAPSHOT.pom
[JENKINS] Archiving F:\jenkins\jenkins-slave\workspace\maven-plugins-windows\maven-assembly-plugin\target\maven-assembly-plugin-3.1.0-SNAPSHOT.jar to org.apache.maven.plugins/maven-assembly-plugin/3.1.0-SNAPSHOT/maven-assembly-plugin-3.1.0-SNAPSHOT.jar
[JENKINS] Archiving F:\jenkins\jenkins-slave\workspace\maven-plugins-windows\maven-docck-plugin\pom.xml to org.apache.maven.plugins/maven-docck-plugin/1.2-SNAPSHOT/maven-docck-plugin-1.2-SNAPSHOT.pom
[JENKINS] Archiving F:\jenkins\jenkins-slave\workspace\maven-plugins-windows\maven-docck-plugin\target\maven-docck-plugin-1.2-SNAPSHOT.jar to org.apache.maven.plugins/maven-docck-plugin/1.2-SNAPSHOT/maven-docck-plugin-1.2-SNAPSHOT.jar
[JENKINS] Archiving <https://builds.apache.org/job/maven-plugins-windows/ws/pom.xml> to org.apache.maven.plugins/maven-plugins-aggregator/1-SNAPSHOT/maven-plugins-aggregator-1-SNAPSHOT.pom
[JENKINS] Archiving F:\jenkins\jenkins-slave\workspace\maven-plugins-windows\maven-clean-plugin\pom.xml to org.apache.maven.plugins/maven-clean-plugin/3.0.1-SNAPSHOT/maven-clean-plugin-3.0.1-SNAPSHOT.pom
[JENKINS] Archiving F:\jenkins\jenkins-slave\workspace\maven-plugins-windows\maven-clean-plugin\target\maven-clean-plugin-3.0.1-SNAPSHOT.jar to org.apache.maven.plugins/maven-clean-plugin/3.0.1-SNAPSHOT/maven-clean-plugin-3.0.1-SNAPSHOT.jar
[JENKINS] Archiving F:\jenkins\jenkins-slave\workspace\maven-plugins-windows\maven-resources-plugin\pom.xml to org.apache.maven.plugins/maven-resources-plugin/3.0.3-SNAPSHOT/maven-resources-plugin-3.0.3-SNAPSHOT.pom
[JENKINS] Archiving F:\jenkins\jenkins-slave\workspace\maven-plugins-windows\maven-resources-plugin\target\maven-resources-plugin-3.0.3-SNAPSHOT.jar to org.apache.maven.plugins/maven-resources-plugin/3.0.3-SNAPSHOT/maven-resources-plugin-3.0.3-SNAPSHOT.jar
[JENKINS] Archiving F:\jenkins\jenkins-slave\workspace\maven-plugins-windows\maven-pmd-plugin\pom.xml to org.apache.maven.plugins/maven-pmd-plugin/3.9-SNAPSHOT/maven-pmd-plugin-3.9-SNAPSHOT.pom
[JENKINS] Archiving F:\jenkins\jenkins-slave\workspace\maven-plugins-windows\maven-pmd-plugin\target\maven-pmd-plugin-3.9-SNAPSHOT.jar to org.apache.maven.plugins/maven-pmd-plugin/3.9-SNAPSHOT/maven-pmd-plugin-3.9-SNAPSHOT.jar
[JENKINS] Archiving F:\jenkins\jenkins-slave\workspace\maven-plugins-windows\maven-shade-plugin\pom.xml to org.apache.maven.plugins/maven-shade-plugin/3.0.1-SNAPSHOT/maven-shade-plugin-3.0.1-SNAPSHOT.pom
[JENKINS] Archiving F:\jenkins\jenkins-slave\workspace\maven-plugins-windows\maven-shade-plugin\target\maven-shade-plugin-3.0.1-SNAPSHOT.jar to org.apache.maven.plugins/maven-shade-plugin/3.0.1-SNAPSHOT/maven-shade-plugin-3.0.1-SNAPSHOT.jar
[JENKINS] Archiving F:\jenkins\jenkins-slave\workspace\maven-plugins-windows\maven-toolchains-plugin\pom.xml to org.apache.maven.plugins/maven-toolchains-plugin/3.0.0-SNAPSHOT/maven-toolchains-plugin-3.0.0-SNAPSHOT.pom
[JENKINS] Archiving F:\jenkins\jenkins-slave\workspace\maven-plugins-windows\maven-toolchains-plugin\target\maven-toolchains-plugin-3.0.0-SNAPSHOT.jar to org.apache.maven.plugins/maven-toolchains-plugin/3.0.0-SNAPSHOT/maven-toolchains-plugin-3.0.0-SNAPSHOT.jar
[JENKINS] Archiving F:\jenkins\jenkins-slave\workspace\maven-plugins-windows\maven-remote-resources-plugin\pom.xml to org.apache.maven.plugins/maven-remote-resources-plugin/1.6-SNAPSHOT/maven-remote-resources-plugin-1.6-SNAPSHOT.pom
[JENKINS] Archiving F:\jenkins\jenkins-slave\workspace\maven-plugins-windows\maven-remote-resources-plugin\target\maven-remote-resources-plugin-1.6-SNAPSHOT.jar to org.apache.maven.plugins/maven-remote-resources-plugin/1.6-SNAPSHOT/maven-remote-resources-plugin-1.6-SNAPSHOT.jar
[JENKINS] Archiving F:\jenkins\jenkins-slave\workspace\maven-plugins-windows\maven-project-info-reports-plugin\pom.xml to org.apache.maven.plugins/maven-project-info-reports-plugin/2.10-SNAPSHOT/maven-project-info-reports-plugin-2.10-SNAPSHOT.pom
[JENKINS] Archiving F:\jenkins\jenkins-slave\workspace\maven-plugins-windows\maven-project-info-reports-plugin\target\maven-project-info-reports-plugin-2.10-SNAPSHOT.jar to org.apache.maven.plugins/maven-project-info-reports-plugin/2.10-SNAPSHOT/maven-project-info-reports-plugin-2.10-SNAPSHOT.jar
[JENKINS] Archiving F:\jenkins\jenkins-slave\workspace\maven-plugins-windows\maven-patch-plugin\pom.xml to org.apache.maven.plugins/maven-patch-plugin/1.3-SNAPSHOT/maven-patch-plugin-1.3-SNAPSHOT.pom
[JENKINS] Archiving F:\jenkins\jenkins-slave\workspace\maven-plugins-windows\maven-patch-plugin\target\maven-patch-plugin-1.3-SNAPSHOT.jar to org.apache.maven.plugins/maven-patch-plugin/1.3-SNAPSHOT/maven-patch-plugin-1.3-SNAPSHOT.jar
[JENKINS] Archiving F:\jenkins\jenkins-slave\workspace\maven-plugins-windows\maven-compiler-plugin\pom.xml to org.apache.maven.plugins/maven-compiler-plugin/3.6.2-SNAPSHOT/maven-compiler-plugin-3.6.2-SNAPSHOT.pom
[JENKINS] Archiving F:\jenkins\jenkins-slave\workspace\maven-plugins-windows\maven-compiler-plugin\target\maven-compiler-plugin-3.6.2-SNAPSHOT.jar to org.apache.maven.plugins/maven-compiler-plugin/3.6.2-SNAPSHOT/maven-compiler-plugin-3.6.2-SNAPSHOT.jar
[JENKINS] Archiving F:\jenkins\jenkins-slave\workspace\maven-plugins-windows\maven-stage-plugin\pom.xml to org.apache.maven.plugins/maven-stage-plugin/1.1-SNAPSHOT/maven-stage-plugin-1.1-SNAPSHOT.pom
[JENKINS] Archiving F:\jenkins\jenkins-slave\workspace\maven-plugins-windows\maven-stage-plugin\target\maven-stage-plugin-1.1-SNAPSHOT.jar to org.apache.maven.plugins/maven-stage-plugin/1.1-SNAPSHOT/maven-stage-plugin-1.1-SNAPSHOT.jar
[JENKINS] Archiving F:\jenkins\jenkins-slave\workspace\maven-plugins-windows\maven-verifier-plugin\pom.xml to org.apache.maven.plugins/maven-verifier-plugin/3.0.0-SNAPSHOT/maven-verifier-plugin-3.0.0-SNAPSHOT.pom
[JENKINS] Archiving F:\jenkins\jenkins-slave\workspace\maven-plugins-windows\maven-verifier-plugin\target\maven-verifier-plugin-3.0.0-SNAPSHOT.jar to org.apache.maven.plugins/maven-verifier-plugin/3.0.0-SNAPSHOT/maven-verifier-plugin-3.0.0-SNAPSHOT.jar
[JENKINS] Archiving F:\jenkins\jenkins-slave\workspace\maven-plugins-windows\maven-jarsigner-plugin\pom.xml to org.apache.maven.plugins/maven-jarsigner-plugin/1.5-SNAPSHOT/maven-jarsigner-plugin-1.5-SNAPSHOT.pom
[JENKINS] Archiving F:\jenkins\jenkins-slave\workspace\maven-plugins-windows\maven-jarsigner-plugin\target\maven-jarsigner-plugin-1.5-SNAPSHOT.jar to org.apache.maven.plugins/maven-jarsigner-plugin/1.5-SNAPSHOT/maven-jarsigner-plugin-1.5-SNAPSHOT.jar
[JENKINS] Archiving F:\jenkins\jenkins-slave\workspace\maven-plugins-windows\maven-ejb-plugin\pom.xml to org.apache.maven.plugins/maven-ejb-plugin/3.0.0-SNAPSHOT/maven-ejb-plugin-3.0.0-SNAPSHOT.pom
[JENKINS] Archiving F:\jenkins\jenkins-slave\workspace\maven-plugins-windows\maven-ejb-plugin\target\maven-ejb-plugin-3.0.0-SNAPSHOT.jar to org.apache.maven.plugins/maven-ejb-plugin/3.0.0-SNAPSHOT/maven-ejb-plugin-3.0.0-SNAPSHOT.jar
[JENKINS] Archiving F:\jenkins\jenkins-slave\workspace\maven-plugins-windows\maven-changelog-plugin\pom.xml to org.apache.maven.plugins/maven-changelog-plugin/2.4-SNAPSHOT/maven-changelog-plugin-2.4-SNAPSHOT.pom
[JENKINS] Archiving F:\jenkins\jenkins-slave\workspace\maven-plugins-windows\maven-changelog-plugin\target\maven-changelog-plugin-2.4-SNAPSHOT.jar to org.apache.maven.plugins/maven-changelog-plugin/2.4-SNAPSHOT/maven-changelog-plugin-2.4-SNAPSHOT.jar
[JENKINS] Archiving F:\jenkins\jenkins-slave\workspace\maven-plugins-windows\maven-help-plugin\pom.xml to org.apache.maven.plugins/maven-help-plugin/3.0.0-SNAPSHOT/maven-help-plugin-3.0.0-SNAPSHOT.pom
[JENKINS] Archiving F:\jenkins\jenkins-slave\workspace\maven-plugins-windows\maven-help-plugin\target\maven-help-plugin-3.0.0-SNAPSHOT.jar to org.apache.maven.plugins/maven-help-plugin/3.0.0-SNAPSHOT/maven-help-plugin-3.0.0-SNAPSHOT.jar
[JENKINS] Archiving F:\jenkins\jenkins-slave\workspace\maven-plugins-windows\maven-war-plugin\pom.xml to org.apache.maven.plugins/maven-war-plugin/3.1.1-SNAPSHOT/maven-war-plugin-3.1.1-SNAPSHOT.pom
[JENKINS] Archiving F:\jenkins\jenkins-slave\workspace\maven-plugins-windows\maven-war-plugin\target\maven-war-plugin-3.1.1-SNAPSHOT.jar to org.apache.maven.plugins/maven-war-plugin/3.1.1-SNAPSHOT/maven-war-plugin-3.1.1-SNAPSHOT.jar
[JENKINS] Archiving F:\jenkins\jenkins-slave\workspace\maven-plugins-windows\maven-ear-plugin\pom.xml to org.apache.maven.plugins/maven-ear-plugin/3.0.0-SNAPSHOT/maven-ear-plugin-3.0.0-SNAPSHOT.pom
[JENKINS] Archiving F:\jenkins\jenkins-slave\workspace\maven-plugins-windows\maven-ear-plugin\target\maven-ear-plugin-3.0.0-SNAPSHOT.jar to org.apache.maven.plugins/maven-ear-plugin/3.0.0-SNAPSHOT/maven-ear-plugin-3.0.0-SNAPSHOT.jar
[JENKINS] Archiving F:\jenkins\jenkins-slave\workspace\maven-plugins-windows\maven-invoker-plugin\pom.xml to org.apache.maven.plugins/maven-invoker-plugin/3.0.2-SNAPSHOT/maven-invoker-plugin-3.0.2-SNAPSHOT.pom
[JENKINS] Archiving F:\jenkins\jenkins-slave\workspace\maven-plugins-windows\maven-jdeps-plugin\pom.xml to org.apache.maven.plugins/maven-jdeps-plugin/3.0.1-SNAPSHOT/maven-jdeps-plugin-3.0.1-SNAPSHOT.pom
[JENKINS] Archiving F:\jenkins\jenkins-slave\workspace\maven-plugins-windows\maven-jdeps-plugin\target\maven-jdeps-plugin-3.0.1-SNAPSHOT.jar to org.apache.maven.plugins/maven-jdeps-plugin/3.0.1-SNAPSHOT/maven-jdeps-plugin-3.0.1-SNAPSHOT.jar
[JENKINS] Archiving F:\jenkins\jenkins-slave\workspace\maven-plugins-windows\maven-doap-plugin\pom.xml to org.apache.maven.plugins/maven-doap-plugin/1.3-SNAPSHOT/maven-doap-plugin-1.3-SNAPSHOT.pom
[JENKINS] Archiving F:\jenkins\jenkins-slave\workspace\maven-plugins-windows\maven-doap-plugin\target\maven-doap-plugin-1.3-SNAPSHOT.jar to org.apache.maven.plugins/maven-doap-plugin/1.3-SNAPSHOT/maven-doap-plugin-1.3-SNAPSHOT.jar
[JENKINS] Archiving F:\jenkins\jenkins-slave\workspace\maven-plugins-windows\maven-site-plugin\dependency-reduced-pom.xml to org.apache.maven.plugins/maven-site-plugin/3.7-SNAPSHOT/maven-site-plugin-3.7-SNAPSHOT.pom
[JENKINS] Archiving F:\jenkins\jenkins-slave\workspace\maven-plugins-windows\maven-site-plugin\target\maven-site-plugin-3.7-SNAPSHOT.jar to org.apache.maven.plugins/maven-site-plugin/3.7-SNAPSHOT/maven-site-plugin-3.7-SNAPSHOT.jar
[JENKINS] Archiving F:\jenkins\jenkins-slave\workspace\maven-plugins-windows\maven-changes-plugin\pom.xml to org.apache.maven.plugins/maven-changes-plugin/3.0.0-SNAPSHOT/maven-changes-plugin-3.0.0-SNAPSHOT.pom
[JENKINS] Archiving F:\jenkins\jenkins-slave\workspace\maven-plugins-windows\maven-changes-plugin\target\maven-changes-plugin-3.0.0-SNAPSHOT.jar to org.apache.maven.plugins/maven-changes-plugin/3.0.0-SNAPSHOT/maven-changes-plugin-3.0.0-SNAPSHOT.jar
[JENKINS] Archiving F:\jenkins\jenkins-slave\workspace\maven-plugins-windows\maven-deploy-plugin\pom.xml to org.apache.maven.plugins/maven-deploy-plugin/3.0.0-SNAPSHOT/maven-deploy-plugin-3.0.0-SNAPSHOT.pom
[JENKINS] Archiving F:\jenkins\jenkins-slave\workspace\maven-plugins-windows\maven-deploy-plugin\target\maven-deploy-plugin-3.0.0-SNAPSHOT.jar to org.apache.maven.plugins/maven-deploy-plugin/3.0.0-SNAPSHOT/maven-deploy-plugin-3.0.0-SNAPSHOT.jar
[JENKINS] Archiving F:\jenkins\jenkins-slave\workspace\maven-plugins-windows\maven-repository-plugin\pom.xml to org.apache.maven.plugins/maven-repository-plugin/2.5-SNAPSHOT/maven-repository-plugin-2.5-SNAPSHOT.pom
[JENKINS] Archiving F:\jenkins\jenkins-slave\workspace\maven-plugins-windows\maven-repository-plugin\target\maven-repository-plugin-2.5-SNAPSHOT.jar to org.apache.maven.plugins/maven-repository-plugin/2.5-SNAPSHOT/maven-repository-plugin-2.5-SNAPSHOT.jar
[JENKINS] Archiving F:\jenkins\jenkins-slave\workspace\maven-plugins-windows\maven-source-plugin\pom.xml to org.apache.maven.plugins/maven-source-plugin/3.0.2-SNAPSHOT/maven-source-plugin-3.0.2-SNAPSHOT.pom
[JENKINS] Archiving F:\jenkins\jenkins-slave\workspace\maven-plugins-windows\maven-source-plugin\target\maven-source-plugin-3.0.2-SNAPSHOT.jar to org.apache.maven.plugins/maven-source-plugin/3.0.2-SNAPSHOT/maven-source-plugin-3.0.2-SNAPSHOT.jar
[JENKINS] Archiving F:\jenkins\jenkins-slave\workspace\maven-plugins-windows\maven-pdf-plugin\pom.xml to org.apache.maven.plugins/maven-pdf-plugin/1.4-SNAPSHOT/maven-pdf-plugin-1.4-SNAPSHOT.pom
[JENKINS] Archiving F:\jenkins\jenkins-slave\workspace\maven-plugins-windows\maven-pdf-plugin\target\maven-pdf-plugin-1.4-SNAPSHOT.jar to org.apache.maven.plugins/maven-pdf-plugin/1.4-SNAPSHOT/maven-pdf-plugin-1.4-SNAPSHOT.jar
[JENKINS] Archiving F:\jenkins\jenkins-slave\workspace\maven-plugins-windows\maven-jar-plugin\pom.xml to org.apache.maven.plugins/maven-jar-plugin/3.0.3-SNAPSHOT/maven-jar-plugin-3.0.3-SNAPSHOT.pom
[JENKINS] Archiving F:\jenkins\jenkins-slave\workspace\maven-plugins-windows\maven-jar-plugin\target\maven-jar-plugin-3.0.3-SNAPSHOT.jar to org.apache.maven.plugins/maven-jar-plugin/3.0.3-SNAPSHOT/maven-jar-plugin-3.0.3-SNAPSHOT.jar
[JENKINS] Archiving F:\jenkins\jenkins-slave\workspace\maven-plugins-windows\maven-javadoc-plugin\pom.xml to org.apache.maven.plugins/maven-javadoc-plugin/3.0.0-SNAPSHOT/maven-javadoc-plugin-3.0.0-SNAPSHOT.pom
[JENKINS] Archiving F:\jenkins\jenkins-slave\workspace\maven-plugins-windows\maven-javadoc-plugin\target\maven-javadoc-plugin-3.0.0-SNAPSHOT.jar to org.apache.maven.plugins/maven-javadoc-plugin/3.0.0-SNAPSHOT/maven-javadoc-plugin-3.0.0-SNAPSHOT.jar
[JENKINS] Archiving F:\jenkins\jenkins-slave\workspace\maven-plugins-windows\maven-dependency-plugin\pom.xml to org.apache.maven.plugins/maven-dependency-plugin/3.0.2-SNAPSHOT/maven-dependency-plugin-3.0.2-SNAPSHOT.pom
[JENKINS] Archiving F:\jenkins\jenkins-slave\workspace\maven-plugins-windows\maven-dependency-plugin\target\maven-dependency-plugin-3.0.2-SNAPSHOT.jar to org.apache.maven.plugins/maven-dependency-plugin/3.0.2-SNAPSHOT/maven-dependency-plugin-3.0.2-SNAPSHOT.jar
[JENKINS] Archiving F:\jenkins\jenkins-slave\workspace\maven-plugins-windows\maven-rar-plugin\pom.xml to org.apache.maven.plugins/maven-rar-plugin/3.0.0-SNAPSHOT/maven-rar-plugin-3.0.0-SNAPSHOT.pom
[JENKINS] Archiving F:\jenkins\jenkins-slave\workspace\maven-plugins-windows\maven-rar-plugin\target\maven-rar-plugin-3.0.0-SNAPSHOT.jar to org.apache.maven.plugins/maven-rar-plugin/3.0.0-SNAPSHOT/maven-rar-plugin-3.0.0-SNAPSHOT.jar
[JENKINS] Archiving F:\jenkins\jenkins-slave\workspace\maven-plugins-windows\maven-checkstyle-plugin\pom.xml to org.apache.maven.plugins/maven-checkstyle-plugin/3.0.0-SNAPSHOT/maven-checkstyle-plugin-3.0.0-SNAPSHOT.pom
[JENKINS] Archiving F:\jenkins\jenkins-slave\workspace\maven-plugins-windows\maven-checkstyle-plugin\target\maven-checkstyle-plugin-3.0.0-SNAPSHOT.jar to org.apache.maven.plugins/maven-checkstyle-plugin/3.0.0-SNAPSHOT/maven-checkstyle-plugin-3.0.0-SNAPSHOT.jar
Sending e-mails to: [hidden email]
channel stopped
[WARNINGS] Skipping publisher since build result is FAILURE
Reply | Threaded
Open this post in threaded view
|  
Report Content as Inappropriate

Build failed in Jenkins: maven-plugins-windows #1992

Apache Jenkins Server-2
See <https://builds.apache.org/job/maven-plugins-windows/1992/display/redirect?page=changes>

Changes:

[Robert Scholte] [MJAVADOC-456] Upgrade to Maven3 plugin
No need to resolve transitive dependencies twice

------------------------------------------
[...truncated 597.38 KB...]
Running org.apache.maven.plugins.dependency.utils.filters.TestMarkerFileFilter
Tests run: 5, Failures: 0, Errors: 0, Skipped: 0, Time elapsed: 0.006 sec - in org.apache.maven.plugins.dependency.utils.filters.TestMarkerFileFilter
Running org.apache.maven.plugins.dependency.utils.filters.TestResolveMarkerFileFilter
Tests run: 1, Failures: 0, Errors: 0, Skipped: 0, Time elapsed: 0.001 sec - in org.apache.maven.plugins.dependency.utils.filters.TestResolveMarkerFileFilter
Running org.apache.maven.plugins.dependency.utils.markers.TestDefaultMarkerFileHandler
Tests run: 6, Failures: 0, Errors: 0, Skipped: 0, Time elapsed: 0.008 sec - in org.apache.maven.plugins.dependency.utils.markers.TestDefaultMarkerFileHandler
Running org.apache.maven.plugins.dependency.utils.markers.TestSourcesMarkerFileHandler
Tests run: 10, Failures: 0, Errors: 0, Skipped: 0, Time elapsed: 0.01 sec - in org.apache.maven.plugins.dependency.utils.markers.TestSourcesMarkerFileHandler
Running org.apache.maven.plugins.dependency.utils.markers.TestUnpackMarkerFileHandler
Tests run: 9, Failures: 0, Errors: 0, Skipped: 0, Time elapsed: 0.782 sec - in org.apache.maven.plugins.dependency.utils.markers.TestUnpackMarkerFileHandler
Running org.apache.maven.plugins.dependency.utils.TestDependencyStatusSets
Tests run: 5, Failures: 0, Errors: 0, Skipped: 0, Time elapsed: 0.602 sec - in org.apache.maven.plugins.dependency.utils.TestDependencyStatusSets
Running org.apache.maven.plugins.dependency.utils.TestDependencyUtil
Tests run: 9, Failures: 0, Errors: 0, Skipped: 0, Time elapsed: 0.004 sec - in org.apache.maven.plugins.dependency.utils.TestDependencyUtil
Running org.apache.maven.plugins.dependency.utils.TestSilentLog
Tests run: 2, Failures: 0, Errors: 0, Skipped: 0, Time elapsed: 0 sec - in org.apache.maven.plugins.dependency.utils.TestSilentLog
Running org.apache.maven.plugins.dependency.utils.translators.TestClassifierTypeTranslator
Tests run: 6, Failures: 0, Errors: 0, Skipped: 0, Time elapsed: 0.514 sec - in org.apache.maven.plugins.dependency.utils.translators.TestClassifierTypeTranslator

Results :

Tests run: 244, Failures: 0, Errors: 0, Skipped: 0

[JENKINS] Recording test results
[INFO]
[INFO] --- maven-jar-plugin:3.0.0:jar (default-jar) @ maven-dependency-plugin ---
[INFO] Building jar: F:\jenkins\jenkins-slave\workspace\maven-plugins-windows\maven-dependency-plugin\target\maven-dependency-plugin-3.0.2-SNAPSHOT.jar
[INFO]
[INFO] --- maven-plugin-plugin:3.4:addPluginArtifactMetadata (default-addPluginArtifactMetadata) @ maven-dependency-plugin ---
[INFO]
[INFO] --- maven-site-plugin:3.5.1:attach-descriptor (attach-descriptor) @ maven-dependency-plugin ---
[INFO]
[INFO] --- maven-checkstyle-plugin:2.15:check (checkstyle-check) @ maven-dependency-plugin ---
[INFO] There is 1 error reported by Checkstyle 6.1.1 with config/maven_checks.xml ruleset.
[INFO] Ignored 1 error, 0 violation remaining.
[INFO]
[INFO] --- maven-install-plugin:2.5.2:install (default-install) @ maven-dependency-plugin ---
[INFO] Installing F:\jenkins\jenkins-slave\workspace\maven-plugins-windows\maven-dependency-plugin\target\maven-dependency-plugin-3.0.2-SNAPSHOT.jar to f:\jenkins\jenkins-slave\maven-repositories\1\org\apache\maven\plugins\maven-dependency-plugin\3.0.2-SNAPSHOT\maven-dependency-plugin-3.0.2-SNAPSHOT.jar
[INFO] Installing F:\jenkins\jenkins-slave\workspace\maven-plugins-windows\maven-dependency-plugin\pom.xml to f:\jenkins\jenkins-slave\maven-repositories\1\org\apache\maven\plugins\maven-dependency-plugin\3.0.2-SNAPSHOT\maven-dependency-plugin-3.0.2-SNAPSHOT.pom
[INFO]                                                                        
[INFO] ------------------------------------------------------------------------
[INFO] Building Apache Maven Plugins Aggregator 1-SNAPSHOT
[INFO] ------------------------------------------------------------------------
[INFO]
[INFO] --- maven-clean-plugin:2.5:clean (default-clean) @ maven-plugins-aggregator ---
[INFO] Deleting <https://builds.apache.org/job/maven-plugins-windows/ws/target>
[INFO]
[INFO] --- maven-enforcer-plugin:1.3.1:enforce (enforce-bytecode-version) @ maven-plugins-aggregator ---
[INFO]
[INFO] --- maven-enforcer-plugin:1.3.1:enforce (ban-known-bad-maven-versions) @ maven-plugins-aggregator ---
[INFO]
[INFO] --- maven-remote-resources-plugin:1.5:process (default) @ maven-plugins-aggregator ---
[INFO]
[INFO] --- maven-site-plugin:3.3:attach-descriptor (attach-descriptor) @ maven-plugins-aggregator ---
[INFO]
[INFO] --- maven-install-plugin:2.5.1:install (default-install) @ maven-plugins-aggregator ---
[INFO] Installing <https://builds.apache.org/job/maven-plugins-windows/ws/pom.xml> to f:\jenkins\jenkins-slave\maven-repositories\1\org\apache\maven\plugins\maven-plugins-aggregator\1-SNAPSHOT\maven-plugins-aggregator-1-SNAPSHOT.pom
[INFO] ------------------------------------------------------------------------
[INFO] Reactor Summary:
[INFO]
[INFO] Apache Maven ACR Plugin ........................... SUCCESS [26.690s]
[INFO] Apache Maven AntRun Plugin ........................ SUCCESS [1:14.141s]
[INFO] Apache Maven Changelog Plugin ..................... SUCCESS [19.812s]
[INFO] Apache Maven Changes Plugin ....................... SUCCESS [25.486s]
[INFO] Apache Maven Clean Plugin ......................... SUCCESS [13.484s]
[INFO] Apache Maven Compiler Plugin ...................... SUCCESS [48.716s]
[INFO] Apache Maven Deploy Plugin ........................ SUCCESS [13.487s]
[INFO] Apache Maven Documentation Checker Plugin ......... SUCCESS [6.955s]
[INFO] Apache Maven EAR Plugin ........................... SUCCESS [11.768s]
[INFO] Apache Maven EJB Plugin ........................... SUCCESS [12.084s]
[INFO] Apache Maven Help Plugin .......................... SUCCESS [16.522s]
[INFO] Apache Maven Install Plugin ....................... SUCCESS [12.607s]
[INFO] Apache Maven Jarsigner Plugin ..................... SUCCESS [5.554s]
[INFO] Apache Maven Javadoc Plugin ....................... SUCCESS [2:06.039s]
[INFO] Apache Maven JDeps Plugin ......................... SUCCESS [13.554s]
[INFO] Apache Maven Linkcheck Plugin ..................... SUCCESS [9.010s]
[INFO] Apache Maven Patch Plugin ......................... SUCCESS [6.544s]
[INFO] Apache Maven PDF Plugin ........................... SUCCESS [19.250s]
[INFO] Apache Maven RAR Plugin ........................... SUCCESS [12.635s]
[INFO] Apache Maven Repository Plugin .................... SUCCESS [11.144s]
[INFO] Apache Maven Resources Plugin ..................... SUCCESS [14.419s]
[INFO] Apache Maven Site Plugin .......................... SUCCESS [34.303s]
[INFO] Apache Maven Source Plugin ........................ SUCCESS [21.205s]
[INFO] Apache Maven Stage Plugin ......................... SUCCESS [8.570s]
[INFO] Apache Maven Toolchains Plugin .................... SUCCESS [7.349s]
[INFO] Apache Maven Verifier Plugin ...................... SUCCESS [16.098s]
[INFO] Apache Maven WAR Plugin ........................... SUCCESS [21.200s]
[INFO] Apache Maven DOAP Plugin .......................... SUCCESS [13.434s]
[INFO] Apache Maven Invoker Plugin ....................... FAILURE [0.940s]
[INFO] Apache Maven JAR Plugin ........................... SUCCESS [10.987s]
[INFO] Apache Maven Assembly Plugin ...................... SUCCESS [30.895s]
[INFO] Apache Maven Checkstyle Plugin .................... SUCCESS [35.854s]
[INFO] Apache Maven PMD Plugin ........................... SUCCESS [27.830s]
[INFO] Apache Maven Project Info Reports Plugin .......... SUCCESS [49.812s]
[INFO] Apache Maven Remote Resources Plugin .............. SUCCESS [15.736s]
[INFO] Apache Maven Shade Plugin ......................... SUCCESS [20.750s]
[INFO] Apache Maven SCM Publish Plugin ................... SUCCESS [11.232s]
[INFO] Apache Maven Dependency Plugin .................... SUCCESS [1:05.874s]
[INFO] Apache Maven Plugins Aggregator ................... SUCCESS [4.023s]
[INFO] ------------------------------------------------------------------------
[INFO] BUILD FAILURE
[INFO] ------------------------------------------------------------------------
[INFO] Total time: 17:17.288s
[INFO] Finished at: Wed Jul 12 23:43:06 UTC 2017
[INFO] Final Memory: 138M/719M
[INFO] ------------------------------------------------------------------------
[ERROR] Failed to execute goal on project maven-invoker-plugin: Could not resolve dependencies for project org.apache.maven.plugins:maven-invoker-plugin:maven-plugin:3.0.2-SNAPSHOT: Could not find artifact org.apache.maven.shared:maven-script-interpreter:jar:1.2 in central (http://repo.maven.apache.org/maven2) -> [Help 1]
org.apache.maven.lifecycle.LifecycleExecutionException: Failed to execute goal on project maven-invoker-plugin: Could not resolve dependencies for project org.apache.maven.plugins:maven-invoker-plugin:maven-plugin:3.0.2-SNAPSHOT: Could not find artifact org.apache.maven.shared:maven-script-interpreter:jar:1.2 in central (http://repo.maven.apache.org/maven2)
        at org.apache.maven.lifecycle.internal.LifecycleDependencyResolver.getDependencies(LifecycleDependencyResolver.java:210)
        at org.apache.maven.lifecycle.internal.LifecycleDependencyResolver.resolveProjectDependencies(LifecycleDependencyResolver.java:117)
        at org.apache.maven.lifecycle.internal.MojoExecutor.ensureDependenciesAreResolved(MojoExecutor.java:258)
        at org.apache.maven.lifecycle.internal.MojoExecutor.execute(MojoExecutor.java:201)
        at org.apache.maven.lifecycle.internal.MojoExecutor.execute(MojoExecutor.java:153)
        at org.apache.maven.lifecycle.internal.MojoExecutor.execute(MojoExecutor.java:145)
        at org.apache.maven.lifecycle.internal.LifecycleModuleBuilder.buildProject(LifecycleModuleBuilder.java:84)
        at org.apache.maven.lifecycle.internal.LifecycleModuleBuilder.buildProject(LifecycleModuleBuilder.java:59)
        at org.apache.maven.lifecycle.internal.LifecycleStarter.singleThreadedBuild(LifecycleStarter.java:183)
        at org.apache.maven.lifecycle.internal.LifecycleStarter.execute(LifecycleStarter.java:161)
        at org.apache.maven.DefaultMaven.doExecute(DefaultMaven.java:320)
        at org.apache.maven.DefaultMaven.execute(DefaultMaven.java:156)
        at org.jvnet.hudson.maven3.launcher.Maven3Launcher.main(Maven3Launcher.java:117)
        at sun.reflect.NativeMethodAccessorImpl.invoke0(Native Method)
        at sun.reflect.NativeMethodAccessorImpl.invoke(NativeMethodAccessorImpl.java:57)
        at sun.reflect.DelegatingMethodAccessorImpl.invoke(DelegatingMethodAccessorImpl.java:43)
        at java.lang.reflect.Method.invoke(Method.java:606)
        at org.codehaus.plexus.classworlds.launcher.Launcher.launchStandard(Launcher.java:329)
        at org.codehaus.plexus.classworlds.launcher.Launcher.launch(Launcher.java:239)
        at org.jvnet.hudson.maven3.agent.Maven3Main.launch(Maven3Main.java:181)
        at sun.reflect.NativeMethodAccessorImpl.invoke0(Native Method)
        at sun.reflect.NativeMethodAccessorImpl.invoke(NativeMethodAccessorImpl.java:57)
        at sun.reflect.DelegatingMethodAccessorImpl.invoke(DelegatingMethodAccessorImpl.java:43)
        at java.lang.reflect.Method.invoke(Method.java:606)
        at hudson.maven.Maven3Builder.call(Maven3Builder.java:139)
        at hudson.maven.Maven3Builder.call(Maven3Builder.java:70)
        at hudson.remoting.UserRequest.perform(UserRequest.java:120)
        at hudson.remoting.UserRequest.perform(UserRequest.java:48)
        at hudson.remoting.Request$2.run(Request.java:326)
        at hudson.remoting.InterceptingExecutorService$1.call(InterceptingExecutorService.java:68)
        at java.util.concurrent.FutureTask.run(FutureTask.java:262)
        at java.util.concurrent.ThreadPoolExecutor.runWorker(ThreadPoolExecutor.java:1145)
        at java.util.concurrent.ThreadPoolExecutor$Worker.run(ThreadPoolExecutor.java:615)
        at java.lang.Thread.run(Thread.java:745)
Caused by: org.apache.maven.project.DependencyResolutionException: Could not resolve dependencies for project org.apache.maven.plugins:maven-invoker-plugin:maven-plugin:3.0.2-SNAPSHOT: Could not find artifact org.apache.maven.shared:maven-script-interpreter:jar:1.2 in central (http://repo.maven.apache.org/maven2)
        at org.apache.maven.project.DefaultProjectDependenciesResolver.resolve(DefaultProjectDependenciesResolver.java:189)
        at org.apache.maven.lifecycle.internal.LifecycleDependencyResolver.getDependencies(LifecycleDependencyResolver.java:185)
        ... 33 more
Caused by: org.sonatype.aether.resolution.DependencyResolutionException: Could not find artifact org.apache.maven.shared:maven-script-interpreter:jar:1.2 in central (http://repo.maven.apache.org/maven2)
        at org.sonatype.aether.impl.internal.DefaultRepositorySystem.resolveDependencies(DefaultRepositorySystem.java:375)
        at org.apache.maven.project.DefaultProjectDependenciesResolver.resolve(DefaultProjectDependenciesResolver.java:183)
        ... 34 more
Caused by: org.sonatype.aether.resolution.ArtifactResolutionException: Could not find artifact org.apache.maven.shared:maven-script-interpreter:jar:1.2 in central (http://repo.maven.apache.org/maven2)
        at org.sonatype.aether.impl.internal.DefaultArtifactResolver.resolve(DefaultArtifactResolver.java:538)
        at org.sonatype.aether.impl.internal.DefaultArtifactResolver.resolveArtifacts(DefaultArtifactResolver.java:216)
        at org.sonatype.aether.impl.internal.DefaultRepositorySystem.resolveDependencies(DefaultRepositorySystem.java:358)
        ... 35 more
Caused by: org.sonatype.aether.transfer.ArtifactNotFoundException: Could not find artifact org.apache.maven.shared:maven-script-interpreter:jar:1.2 in central (http://repo.maven.apache.org/maven2)
        at org.sonatype.aether.connector.wagon.WagonRepositoryConnector$4.wrap(WagonRepositoryConnector.java:947)
        at org.sonatype.aether.connector.wagon.WagonRepositoryConnector$4.wrap(WagonRepositoryConnector.java:941)
        at org.sonatype.aether.connector.wagon.WagonRepositoryConnector$GetTask.run(WagonRepositoryConnector.java:669)
        at org.sonatype.aether.util.concurrency.RunnableErrorForwarder$1.run(RunnableErrorForwarder.java:60)
        ... 3 more
[ERROR]
[ERROR] Re-run Maven using the -X switch to enable full debug logging.
[ERROR]
[ERROR] For more information about the errors and possible solutions, please read the following articles:
[ERROR] [Help 1] http://cwiki.apache.org/confluence/display/MAVEN/DependencyResolutionException
[ERROR]
[ERROR] After correcting the problems, you can resume the build with the command
[ERROR]   mvn <goals> -rf :maven-invoker-plugin
[JENKINS] Archiving F:\jenkins\jenkins-slave\workspace\maven-plugins-windows\maven-antrun-plugin\pom.xml to org.apache.maven.plugins/maven-antrun-plugin/3.0.0-SNAPSHOT/maven-antrun-plugin-3.0.0-SNAPSHOT.pom
[JENKINS] Archiving F:\jenkins\jenkins-slave\workspace\maven-plugins-windows\maven-antrun-plugin\target\maven-antrun-plugin-3.0.0-SNAPSHOT.jar to org.apache.maven.plugins/maven-antrun-plugin/3.0.0-SNAPSHOT/maven-antrun-plugin-3.0.0-SNAPSHOT.jar
[JENKINS] Archiving F:\jenkins\jenkins-slave\workspace\maven-plugins-windows\maven-linkcheck-plugin\pom.xml to org.apache.maven.plugins/maven-linkcheck-plugin/1.3-SNAPSHOT/maven-linkcheck-plugin-1.3-SNAPSHOT.pom
[JENKINS] Archiving F:\jenkins\jenkins-slave\workspace\maven-plugins-windows\maven-linkcheck-plugin\target\maven-linkcheck-plugin-1.3-SNAPSHOT.jar to org.apache.maven.plugins/maven-linkcheck-plugin/1.3-SNAPSHOT/maven-linkcheck-plugin-1.3-SNAPSHOT.jar
[JENKINS] Archiving F:\jenkins\jenkins-slave\workspace\maven-plugins-windows\maven-scm-publish-plugin\pom.xml to org.apache.maven.plugins/maven-scm-publish-plugin/1.2-SNAPSHOT/maven-scm-publish-plugin-1.2-SNAPSHOT.pom
[JENKINS] Archiving F:\jenkins\jenkins-slave\workspace\maven-plugins-windows\maven-scm-publish-plugin\target\maven-scm-publish-plugin-1.2-SNAPSHOT.jar to org.apache.maven.plugins/maven-scm-publish-plugin/1.2-SNAPSHOT/maven-scm-publish-plugin-1.2-SNAPSHOT.jar
[JENKINS] Archiving F:\jenkins\jenkins-slave\workspace\maven-plugins-windows\maven-acr-plugin\pom.xml to org.apache.maven.plugins/maven-acr-plugin/3.0.1-SNAPSHOT/maven-acr-plugin-3.0.1-SNAPSHOT.pom
[JENKINS] Archiving F:\jenkins\jenkins-slave\workspace\maven-plugins-windows\maven-acr-plugin\target\maven-acr-plugin-3.0.1-SNAPSHOT.jar to org.apache.maven.plugins/maven-acr-plugin/3.0.1-SNAPSHOT/maven-acr-plugin-3.0.1-SNAPSHOT.jar
[JENKINS] Archiving F:\jenkins\jenkins-slave\workspace\maven-plugins-windows\maven-install-plugin\pom.xml to org.apache.maven.plugins/maven-install-plugin/3.0.0-SNAPSHOT/maven-install-plugin-3.0.0-SNAPSHOT.pom
[JENKINS] Archiving F:\jenkins\jenkins-slave\workspace\maven-plugins-windows\maven-install-plugin\target\maven-install-plugin-3.0.0-SNAPSHOT.jar to org.apache.maven.plugins/maven-install-plugin/3.0.0-SNAPSHOT/maven-install-plugin-3.0.0-SNAPSHOT.jar
[JENKINS] Archiving F:\jenkins\jenkins-slave\workspace\maven-plugins-windows\maven-assembly-plugin\pom.xml to org.apache.maven.plugins/maven-assembly-plugin/3.1.0-SNAPSHOT/maven-assembly-plugin-3.1.0-SNAPSHOT.pom
[JENKINS] Archiving F:\jenkins\jenkins-slave\workspace\maven-plugins-windows\maven-assembly-plugin\target\maven-assembly-plugin-3.1.0-SNAPSHOT.jar to org.apache.maven.plugins/maven-assembly-plugin/3.1.0-SNAPSHOT/maven-assembly-plugin-3.1.0-SNAPSHOT.jar
[JENKINS] Archiving F:\jenkins\jenkins-slave\workspace\maven-plugins-windows\maven-docck-plugin\pom.xml to org.apache.maven.plugins/maven-docck-plugin/1.2-SNAPSHOT/maven-docck-plugin-1.2-SNAPSHOT.pom
[JENKINS] Archiving F:\jenkins\jenkins-slave\workspace\maven-plugins-windows\maven-docck-plugin\target\maven-docck-plugin-1.2-SNAPSHOT.jar to org.apache.maven.plugins/maven-docck-plugin/1.2-SNAPSHOT/maven-docck-plugin-1.2-SNAPSHOT.jar
[JENKINS] Archiving <https://builds.apache.org/job/maven-plugins-windows/ws/pom.xml> to org.apache.maven.plugins/maven-plugins-aggregator/1-SNAPSHOT/maven-plugins-aggregator-1-SNAPSHOT.pom
[JENKINS] Archiving F:\jenkins\jenkins-slave\workspace\maven-plugins-windows\maven-clean-plugin\pom.xml to org.apache.maven.plugins/maven-clean-plugin/3.0.1-SNAPSHOT/maven-clean-plugin-3.0.1-SNAPSHOT.pom
[JENKINS] Archiving F:\jenkins\jenkins-slave\workspace\maven-plugins-windows\maven-clean-plugin\target\maven-clean-plugin-3.0.1-SNAPSHOT.jar to org.apache.maven.plugins/maven-clean-plugin/3.0.1-SNAPSHOT/maven-clean-plugin-3.0.1-SNAPSHOT.jar
[JENKINS] Archiving F:\jenkins\jenkins-slave\workspace\maven-plugins-windows\maven-resources-plugin\pom.xml to org.apache.maven.plugins/maven-resources-plugin/3.0.3-SNAPSHOT/maven-resources-plugin-3.0.3-SNAPSHOT.pom
[JENKINS] Archiving F:\jenkins\jenkins-slave\workspace\maven-plugins-windows\maven-resources-plugin\target\maven-resources-plugin-3.0.3-SNAPSHOT.jar to org.apache.maven.plugins/maven-resources-plugin/3.0.3-SNAPSHOT/maven-resources-plugin-3.0.3-SNAPSHOT.jar
[JENKINS] Archiving F:\jenkins\jenkins-slave\workspace\maven-plugins-windows\maven-pmd-plugin\pom.xml to org.apache.maven.plugins/maven-pmd-plugin/3.9-SNAPSHOT/maven-pmd-plugin-3.9-SNAPSHOT.pom
[JENKINS] Archiving F:\jenkins\jenkins-slave\workspace\maven-plugins-windows\maven-pmd-plugin\target\maven-pmd-plugin-3.9-SNAPSHOT.jar to org.apache.maven.plugins/maven-pmd-plugin/3.9-SNAPSHOT/maven-pmd-plugin-3.9-SNAPSHOT.jar
[JENKINS] Archiving F:\jenkins\jenkins-slave\workspace\maven-plugins-windows\maven-shade-plugin\pom.xml to org.apache.maven.plugins/maven-shade-plugin/3.0.1-SNAPSHOT/maven-shade-plugin-3.0.1-SNAPSHOT.pom
[JENKINS] Archiving F:\jenkins\jenkins-slave\workspace\maven-plugins-windows\maven-shade-plugin\target\maven-shade-plugin-3.0.1-SNAPSHOT.jar to org.apache.maven.plugins/maven-shade-plugin/3.0.1-SNAPSHOT/maven-shade-plugin-3.0.1-SNAPSHOT.jar
[JENKINS] Archiving F:\jenkins\jenkins-slave\workspace\maven-plugins-windows\maven-toolchains-plugin\pom.xml to org.apache.maven.plugins/maven-toolchains-plugin/3.0.0-SNAPSHOT/maven-toolchains-plugin-3.0.0-SNAPSHOT.pom
[JENKINS] Archiving F:\jenkins\jenkins-slave\workspace\maven-plugins-windows\maven-toolchains-plugin\target\maven-toolchains-plugin-3.0.0-SNAPSHOT.jar to org.apache.maven.plugins/maven-toolchains-plugin/3.0.0-SNAPSHOT/maven-toolchains-plugin-3.0.0-SNAPSHOT.jar
[JENKINS] Archiving F:\jenkins\jenkins-slave\workspace\maven-plugins-windows\maven-remote-resources-plugin\pom.xml to org.apache.maven.plugins/maven-remote-resources-plugin/1.6-SNAPSHOT/maven-remote-resources-plugin-1.6-SNAPSHOT.pom
[JENKINS] Archiving F:\jenkins\jenkins-slave\workspace\maven-plugins-windows\maven-remote-resources-plugin\target\maven-remote-resources-plugin-1.6-SNAPSHOT.jar to org.apache.maven.plugins/maven-remote-resources-plugin/1.6-SNAPSHOT/maven-remote-resources-plugin-1.6-SNAPSHOT.jar
[JENKINS] Archiving F:\jenkins\jenkins-slave\workspace\maven-plugins-windows\maven-project-info-reports-plugin\pom.xml to org.apache.maven.plugins/maven-project-info-reports-plugin/2.10-SNAPSHOT/maven-project-info-reports-plugin-2.10-SNAPSHOT.pom
[JENKINS] Archiving F:\jenkins\jenkins-slave\workspace\maven-plugins-windows\maven-project-info-reports-plugin\target\maven-project-info-reports-plugin-2.10-SNAPSHOT.jar to org.apache.maven.plugins/maven-project-info-reports-plugin/2.10-SNAPSHOT/maven-project-info-reports-plugin-2.10-SNAPSHOT.jar
[JENKINS] Archiving F:\jenkins\jenkins-slave\workspace\maven-plugins-windows\maven-patch-plugin\pom.xml to org.apache.maven.plugins/maven-patch-plugin/1.3-SNAPSHOT/maven-patch-plugin-1.3-SNAPSHOT.pom
[JENKINS] Archiving F:\jenkins\jenkins-slave\workspace\maven-plugins-windows\maven-patch-plugin\target\maven-patch-plugin-1.3-SNAPSHOT.jar to org.apache.maven.plugins/maven-patch-plugin/1.3-SNAPSHOT/maven-patch-plugin-1.3-SNAPSHOT.jar
[JENKINS] Archiving F:\jenkins\jenkins-slave\workspace\maven-plugins-windows\maven-compiler-plugin\pom.xml to org.apache.maven.plugins/maven-compiler-plugin/3.6.2-SNAPSHOT/maven-compiler-plugin-3.6.2-SNAPSHOT.pom
[JENKINS] Archiving F:\jenkins\jenkins-slave\workspace\maven-plugins-windows\maven-compiler-plugin\target\maven-compiler-plugin-3.6.2-SNAPSHOT.jar to org.apache.maven.plugins/maven-compiler-plugin/3.6.2-SNAPSHOT/maven-compiler-plugin-3.6.2-SNAPSHOT.jar
[JENKINS] Archiving F:\jenkins\jenkins-slave\workspace\maven-plugins-windows\maven-stage-plugin\pom.xml to org.apache.maven.plugins/maven-stage-plugin/1.1-SNAPSHOT/maven-stage-plugin-1.1-SNAPSHOT.pom
[JENKINS] Archiving F:\jenkins\jenkins-slave\workspace\maven-plugins-windows\maven-stage-plugin\target\maven-stage-plugin-1.1-SNAPSHOT.jar to org.apache.maven.plugins/maven-stage-plugin/1.1-SNAPSHOT/maven-stage-plugin-1.1-SNAPSHOT.jar
[JENKINS] Archiving F:\jenkins\jenkins-slave\workspace\maven-plugins-windows\maven-verifier-plugin\pom.xml to org.apache.maven.plugins/maven-verifier-plugin/3.0.0-SNAPSHOT/maven-verifier-plugin-3.0.0-SNAPSHOT.pom
[JENKINS] Archiving F:\jenkins\jenkins-slave\workspace\maven-plugins-windows\maven-verifier-plugin\target\maven-verifier-plugin-3.0.0-SNAPSHOT.jar to org.apache.maven.plugins/maven-verifier-plugin/3.0.0-SNAPSHOT/maven-verifier-plugin-3.0.0-SNAPSHOT.jar
[JENKINS] Archiving F:\jenkins\jenkins-slave\workspace\maven-plugins-windows\maven-jarsigner-plugin\pom.xml to org.apache.maven.plugins/maven-jarsigner-plugin/1.5-SNAPSHOT/maven-jarsigner-plugin-1.5-SNAPSHOT.pom
[JENKINS] Archiving F:\jenkins\jenkins-slave\workspace\maven-plugins-windows\maven-jarsigner-plugin\target\maven-jarsigner-plugin-1.5-SNAPSHOT.jar to org.apache.maven.plugins/maven-jarsigner-plugin/1.5-SNAPSHOT/maven-jarsigner-plugin-1.5-SNAPSHOT.jar
[JENKINS] Archiving F:\jenkins\jenkins-slave\workspace\maven-plugins-windows\maven-ejb-plugin\pom.xml to org.apache.maven.plugins/maven-ejb-plugin/3.0.0-SNAPSHOT/maven-ejb-plugin-3.0.0-SNAPSHOT.pom
[JENKINS] Archiving F:\jenkins\jenkins-slave\workspace\maven-plugins-windows\maven-ejb-plugin\target\maven-ejb-plugin-3.0.0-SNAPSHOT.jar to org.apache.maven.plugins/maven-ejb-plugin/3.0.0-SNAPSHOT/maven-ejb-plugin-3.0.0-SNAPSHOT.jar
[JENKINS] Archiving F:\jenkins\jenkins-slave\workspace\maven-plugins-windows\maven-changelog-plugin\pom.xml to org.apache.maven.plugins/maven-changelog-plugin/2.4-SNAPSHOT/maven-changelog-plugin-2.4-SNAPSHOT.pom
[JENKINS] Archiving F:\jenkins\jenkins-slave\workspace\maven-plugins-windows\maven-changelog-plugin\target\maven-changelog-plugin-2.4-SNAPSHOT.jar to org.apache.maven.plugins/maven-changelog-plugin/2.4-SNAPSHOT/maven-changelog-plugin-2.4-SNAPSHOT.jar
[JENKINS] Archiving F:\jenkins\jenkins-slave\workspace\maven-plugins-windows\maven-help-plugin\pom.xml to org.apache.maven.plugins/maven-help-plugin/3.0.0-SNAPSHOT/maven-help-plugin-3.0.0-SNAPSHOT.pom
[JENKINS] Archiving F:\jenkins\jenkins-slave\workspace\maven-plugins-windows\maven-help-plugin\target\maven-help-plugin-3.0.0-SNAPSHOT.jar to org.apache.maven.plugins/maven-help-plugin/3.0.0-SNAPSHOT/maven-help-plugin-3.0.0-SNAPSHOT.jar
[JENKINS] Archiving F:\jenkins\jenkins-slave\workspace\maven-plugins-windows\maven-war-plugin\pom.xml to org.apache.maven.plugins/maven-war-plugin/3.1.1-SNAPSHOT/maven-war-plugin-3.1.1-SNAPSHOT.pom
[JENKINS] Archiving F:\jenkins\jenkins-slave\workspace\maven-plugins-windows\maven-war-plugin\target\maven-war-plugin-3.1.1-SNAPSHOT.jar to org.apache.maven.plugins/maven-war-plugin/3.1.1-SNAPSHOT/maven-war-plugin-3.1.1-SNAPSHOT.jar
[JENKINS] Archiving F:\jenkins\jenkins-slave\workspace\maven-plugins-windows\maven-ear-plugin\pom.xml to org.apache.maven.plugins/maven-ear-plugin/3.0.0-SNAPSHOT/maven-ear-plugin-3.0.0-SNAPSHOT.pom
[JENKINS] Archiving F:\jenkins\jenkins-slave\workspace\maven-plugins-windows\maven-ear-plugin\target\maven-ear-plugin-3.0.0-SNAPSHOT.jar to org.apache.maven.plugins/maven-ear-plugin/3.0.0-SNAPSHOT/maven-ear-plugin-3.0.0-SNAPSHOT.jar
[JENKINS] Archiving F:\jenkins\jenkins-slave\workspace\maven-plugins-windows\maven-invoker-plugin\pom.xml to org.apache.maven.plugins/maven-invoker-plugin/3.0.2-SNAPSHOT/maven-invoker-plugin-3.0.2-SNAPSHOT.pom
[JENKINS] Archiving F:\jenkins\jenkins-slave\workspace\maven-plugins-windows\maven-jdeps-plugin\pom.xml to org.apache.maven.plugins/maven-jdeps-plugin/3.0.1-SNAPSHOT/maven-jdeps-plugin-3.0.1-SNAPSHOT.pom
[JENKINS] Archiving F:\jenkins\jenkins-slave\workspace\maven-plugins-windows\maven-jdeps-plugin\target\maven-jdeps-plugin-3.0.1-SNAPSHOT.jar to org.apache.maven.plugins/maven-jdeps-plugin/3.0.1-SNAPSHOT/maven-jdeps-plugin-3.0.1-SNAPSHOT.jar
[JENKINS] Archiving F:\jenkins\jenkins-slave\workspace\maven-plugins-windows\maven-doap-plugin\pom.xml to org.apache.maven.plugins/maven-doap-plugin/1.3-SNAPSHOT/maven-doap-plugin-1.3-SNAPSHOT.pom
[JENKINS] Archiving F:\jenkins\jenkins-slave\workspace\maven-plugins-windows\maven-doap-plugin\target\maven-doap-plugin-1.3-SNAPSHOT.jar to org.apache.maven.plugins/maven-doap-plugin/1.3-SNAPSHOT/maven-doap-plugin-1.3-SNAPSHOT.jar
[JENKINS] Archiving F:\jenkins\jenkins-slave\workspace\maven-plugins-windows\maven-site-plugin\dependency-reduced-pom.xml to org.apache.maven.plugins/maven-site-plugin/3.7-SNAPSHOT/maven-site-plugin-3.7-SNAPSHOT.pom
[JENKINS] Archiving F:\jenkins\jenkins-slave\workspace\maven-plugins-windows\maven-site-plugin\target\maven-site-plugin-3.7-SNAPSHOT.jar to org.apache.maven.plugins/maven-site-plugin/3.7-SNAPSHOT/maven-site-plugin-3.7-SNAPSHOT.jar
[JENKINS] Archiving F:\jenkins\jenkins-slave\workspace\maven-plugins-windows\maven-changes-plugin\pom.xml to org.apache.maven.plugins/maven-changes-plugin/3.0.0-SNAPSHOT/maven-changes-plugin-3.0.0-SNAPSHOT.pom
[JENKINS] Archiving F:\jenkins\jenkins-slave\workspace\maven-plugins-windows\maven-changes-plugin\target\maven-changes-plugin-3.0.0-SNAPSHOT.jar to org.apache.maven.plugins/maven-changes-plugin/3.0.0-SNAPSHOT/maven-changes-plugin-3.0.0-SNAPSHOT.jar
[JENKINS] Archiving F:\jenkins\jenkins-slave\workspace\maven-plugins-windows\maven-deploy-plugin\pom.xml to org.apache.maven.plugins/maven-deploy-plugin/3.0.0-SNAPSHOT/maven-deploy-plugin-3.0.0-SNAPSHOT.pom
[JENKINS] Archiving F:\jenkins\jenkins-slave\workspace\maven-plugins-windows\maven-deploy-plugin\target\maven-deploy-plugin-3.0.0-SNAPSHOT.jar to org.apache.maven.plugins/maven-deploy-plugin/3.0.0-SNAPSHOT/maven-deploy-plugin-3.0.0-SNAPSHOT.jar
[JENKINS] Archiving F:\jenkins\jenkins-slave\workspace\maven-plugins-windows\maven-repository-plugin\pom.xml to org.apache.maven.plugins/maven-repository-plugin/2.5-SNAPSHOT/maven-repository-plugin-2.5-SNAPSHOT.pom
[JENKINS] Archiving F:\jenkins\jenkins-slave\workspace\maven-plugins-windows\maven-repository-plugin\target\maven-repository-plugin-2.5-SNAPSHOT.jar to org.apache.maven.plugins/maven-repository-plugin/2.5-SNAPSHOT/maven-repository-plugin-2.5-SNAPSHOT.jar
[JENKINS] Archiving F:\jenkins\jenkins-slave\workspace\maven-plugins-windows\maven-source-plugin\pom.xml to org.apache.maven.plugins/maven-source-plugin/3.0.2-SNAPSHOT/maven-source-plugin-3.0.2-SNAPSHOT.pom
[JENKINS] Archiving F:\jenkins\jenkins-slave\workspace\maven-plugins-windows\maven-source-plugin\target\maven-source-plugin-3.0.2-SNAPSHOT.jar to org.apache.maven.plugins/maven-source-plugin/3.0.2-SNAPSHOT/maven-source-plugin-3.0.2-SNAPSHOT.jar
[JENKINS] Archiving F:\jenkins\jenkins-slave\workspace\maven-plugins-windows\maven-pdf-plugin\pom.xml to org.apache.maven.plugins/maven-pdf-plugin/1.4-SNAPSHOT/maven-pdf-plugin-1.4-SNAPSHOT.pom
[JENKINS] Archiving F:\jenkins\jenkins-slave\workspace\maven-plugins-windows\maven-pdf-plugin\target\maven-pdf-plugin-1.4-SNAPSHOT.jar to org.apache.maven.plugins/maven-pdf-plugin/1.4-SNAPSHOT/maven-pdf-plugin-1.4-SNAPSHOT.jar
[JENKINS] Archiving F:\jenkins\jenkins-slave\workspace\maven-plugins-windows\maven-jar-plugin\pom.xml to org.apache.maven.plugins/maven-jar-plugin/3.0.3-SNAPSHOT/maven-jar-plugin-3.0.3-SNAPSHOT.pom
[JENKINS] Archiving F:\jenkins\jenkins-slave\workspace\maven-plugins-windows\maven-jar-plugin\target\maven-jar-plugin-3.0.3-SNAPSHOT.jar to org.apache.maven.plugins/maven-jar-plugin/3.0.3-SNAPSHOT/maven-jar-plugin-3.0.3-SNAPSHOT.jar
[JENKINS] Archiving F:\jenkins\jenkins-slave\workspace\maven-plugins-windows\maven-javadoc-plugin\pom.xml to org.apache.maven.plugins/maven-javadoc-plugin/3.0.0-SNAPSHOT/maven-javadoc-plugin-3.0.0-SNAPSHOT.pom
[JENKINS] Archiving F:\jenkins\jenkins-slave\workspace\maven-plugins-windows\maven-javadoc-plugin\target\maven-javadoc-plugin-3.0.0-SNAPSHOT.jar to org.apache.maven.plugins/maven-javadoc-plugin/3.0.0-SNAPSHOT/maven-javadoc-plugin-3.0.0-SNAPSHOT.jar
Compressed 416.33 KB of artifacts by 38.4% relative to #1991
[JENKINS] Archiving F:\jenkins\jenkins-slave\workspace\maven-plugins-windows\maven-dependency-plugin\pom.xml to org.apache.maven.plugins/maven-dependency-plugin/3.0.2-SNAPSHOT/maven-dependency-plugin-3.0.2-SNAPSHOT.pom
[JENKINS] Archiving F:\jenkins\jenkins-slave\workspace\maven-plugins-windows\maven-dependency-plugin\target\maven-dependency-plugin-3.0.2-SNAPSHOT.jar to org.apache.maven.plugins/maven-dependency-plugin/3.0.2-SNAPSHOT/maven-dependency-plugin-3.0.2-SNAPSHOT.jar
[JENKINS] Archiving F:\jenkins\jenkins-slave\workspace\maven-plugins-windows\maven-rar-plugin\pom.xml to org.apache.maven.plugins/maven-rar-plugin/3.0.0-SNAPSHOT/maven-rar-plugin-3.0.0-SNAPSHOT.pom
[JENKINS] Archiving F:\jenkins\jenkins-slave\workspace\maven-plugins-windows\maven-rar-plugin\target\maven-rar-plugin-3.0.0-SNAPSHOT.jar to org.apache.maven.plugins/maven-rar-plugin/3.0.0-SNAPSHOT/maven-rar-plugin-3.0.0-SNAPSHOT.jar
[JENKINS] Archiving F:\jenkins\jenkins-slave\workspace\maven-plugins-windows\maven-checkstyle-plugin\pom.xml to org.apache.maven.plugins/maven-checkstyle-plugin/3.0.0-SNAPSHOT/maven-checkstyle-plugin-3.0.0-SNAPSHOT.pom
[JENKINS] Archiving F:\jenkins\jenkins-slave\workspace\maven-plugins-windows\maven-checkstyle-plugin\target\maven-checkstyle-plugin-3.0.0-SNAPSHOT.jar to org.apache.maven.plugins/maven-checkstyle-plugin/3.0.0-SNAPSHOT/maven-checkstyle-plugin-3.0.0-SNAPSHOT.jar
Sending e-mails to: [hidden email]
channel stopped
[WARNINGS] Skipping publisher since build result is FAILURE
Reply | Threaded
Open this post in threaded view
|  
Report Content as Inappropriate

Build failed in Jenkins: maven-plugins-windows #1993

Apache Jenkins Server-2
See <https://builds.apache.org/job/maven-plugins-windows/1993/display/redirect?page=changes>

Changes:

[Robert Scholte] [MJAVADOC-456] Upgrade to Maven3 plugin
make use of requiresDependencyResolution to get artifacts

[Robert Scholte] [MJAVADOC-456] Upgrade to Maven3 plugin
maven-compat no longer a compile scoped artifact

------------------------------------------
[...truncated 594.41 KB...]
Tests run: 8, Failures: 0, Errors: 0, Skipped: 0, Time elapsed: 0 sec - in org.apache.maven.plugins.dependency.utils.filters.TestDestFileFilter
Running org.apache.maven.plugins.dependency.utils.filters.TestMarkerFileFilter
Tests run: 5, Failures: 0, Errors: 0, Skipped: 0, Time elapsed: 0 sec - in org.apache.maven.plugins.dependency.utils.filters.TestMarkerFileFilter
Running org.apache.maven.plugins.dependency.utils.filters.TestResolveMarkerFileFilter
Tests run: 1, Failures: 0, Errors: 0, Skipped: 0, Time elapsed: 0 sec - in org.apache.maven.plugins.dependency.utils.filters.TestResolveMarkerFileFilter
Running org.apache.maven.plugins.dependency.utils.markers.TestDefaultMarkerFileHandler
Tests run: 6, Failures: 0, Errors: 0, Skipped: 0, Time elapsed: 0 sec - in org.apache.maven.plugins.dependency.utils.markers.TestDefaultMarkerFileHandler
Running org.apache.maven.plugins.dependency.utils.markers.TestSourcesMarkerFileHandler
Tests run: 10, Failures: 0, Errors: 0, Skipped: 0, Time elapsed: 0 sec - in org.apache.maven.plugins.dependency.utils.markers.TestSourcesMarkerFileHandler
Running org.apache.maven.plugins.dependency.utils.markers.TestUnpackMarkerFileHandler
Tests run: 9, Failures: 0, Errors: 0, Skipped: 0, Time elapsed: 0.898 sec - in org.apache.maven.plugins.dependency.utils.markers.TestUnpackMarkerFileHandler
Running org.apache.maven.plugins.dependency.utils.TestDependencyStatusSets
Tests run: 5, Failures: 0, Errors: 0, Skipped: 0, Time elapsed: 0.672 sec - in org.apache.maven.plugins.dependency.utils.TestDependencyStatusSets
Running org.apache.maven.plugins.dependency.utils.TestDependencyUtil
Tests run: 9, Failures: 0, Errors: 0, Skipped: 0, Time elapsed: 0.004 sec - in org.apache.maven.plugins.dependency.utils.TestDependencyUtil
Running org.apache.maven.plugins.dependency.utils.TestSilentLog
Tests run: 2, Failures: 0, Errors: 0, Skipped: 0, Time elapsed: 0 sec - in org.apache.maven.plugins.dependency.utils.TestSilentLog
Running org.apache.maven.plugins.dependency.utils.translators.TestClassifierTypeTranslator
Tests run: 6, Failures: 0, Errors: 0, Skipped: 0, Time elapsed: 0.59 sec - in org.apache.maven.plugins.dependency.utils.translators.TestClassifierTypeTranslator

Results :

Tests run: 244, Failures: 0, Errors: 0, Skipped: 0

[JENKINS] Recording test results
[INFO]
[INFO] --- maven-jar-plugin:3.0.0:jar (default-jar) @ maven-dependency-plugin ---
[INFO] Building jar: F:\jenkins\jenkins-slave\workspace\maven-plugins-windows\maven-dependency-plugin\target\maven-dependency-plugin-3.0.2-SNAPSHOT.jar
[INFO]
[INFO] --- maven-plugin-plugin:3.4:addPluginArtifactMetadata (default-addPluginArtifactMetadata) @ maven-dependency-plugin ---
[INFO]
[INFO] --- maven-site-plugin:3.5.1:attach-descriptor (attach-descriptor) @ maven-dependency-plugin ---
[INFO]
[INFO] --- maven-checkstyle-plugin:2.15:check (checkstyle-check) @ maven-dependency-plugin ---
[INFO] There is 1 error reported by Checkstyle 6.1.1 with config/maven_checks.xml ruleset.
[INFO] Ignored 1 error, 0 violation remaining.
[INFO]
[INFO] --- maven-install-plugin:2.5.2:install (default-install) @ maven-dependency-plugin ---
[INFO] Installing F:\jenkins\jenkins-slave\workspace\maven-plugins-windows\maven-dependency-plugin\target\maven-dependency-plugin-3.0.2-SNAPSHOT.jar to f:\jenkins\jenkins-slave\maven-repositories\1\org\apache\maven\plugins\maven-dependency-plugin\3.0.2-SNAPSHOT\maven-dependency-plugin-3.0.2-SNAPSHOT.jar
[INFO] Installing F:\jenkins\jenkins-slave\workspace\maven-plugins-windows\maven-dependency-plugin\pom.xml to f:\jenkins\jenkins-slave\maven-repositories\1\org\apache\maven\plugins\maven-dependency-plugin\3.0.2-SNAPSHOT\maven-dependency-plugin-3.0.2-SNAPSHOT.pom
[INFO]                                                                        
[INFO] ------------------------------------------------------------------------
[INFO] Building Apache Maven Plugins Aggregator 1-SNAPSHOT
[INFO] ------------------------------------------------------------------------
[INFO]
[INFO] --- maven-clean-plugin:2.5:clean (default-clean) @ maven-plugins-aggregator ---
[INFO] Deleting <https://builds.apache.org/job/maven-plugins-windows/ws/target>
[INFO]
[INFO] --- maven-enforcer-plugin:1.3.1:enforce (enforce-bytecode-version) @ maven-plugins-aggregator ---
[INFO]
[INFO] --- maven-enforcer-plugin:1.3.1:enforce (ban-known-bad-maven-versions) @ maven-plugins-aggregator ---
[INFO]
[INFO] --- maven-remote-resources-plugin:1.5:process (default) @ maven-plugins-aggregator ---
[INFO]
[INFO] --- maven-site-plugin:3.3:attach-descriptor (attach-descriptor) @ maven-plugins-aggregator ---
[INFO]
[INFO] --- maven-install-plugin:2.5.1:install (default-install) @ maven-plugins-aggregator ---
[INFO] Installing <https://builds.apache.org/job/maven-plugins-windows/ws/pom.xml> to f:\jenkins\jenkins-slave\maven-repositories\1\org\apache\maven\plugins\maven-plugins-aggregator\1-SNAPSHOT\maven-plugins-aggregator-1-SNAPSHOT.pom
[INFO] ------------------------------------------------------------------------
[INFO] Reactor Summary:
[INFO]
[INFO] Apache Maven ACR Plugin ........................... SUCCESS [23.757s]
[INFO] Apache Maven AntRun Plugin ........................ SUCCESS [1:14.399s]
[INFO] Apache Maven Changelog Plugin ..................... SUCCESS [26.774s]
[INFO] Apache Maven Changes Plugin ....................... SUCCESS [36.364s]
[INFO] Apache Maven Clean Plugin ......................... SUCCESS [22.506s]
[INFO] Apache Maven Compiler Plugin ...................... SUCCESS [26.373s]
[INFO] Apache Maven Deploy Plugin ........................ SUCCESS [21.226s]
[INFO] Apache Maven Documentation Checker Plugin ......... SUCCESS [10.805s]
[INFO] Apache Maven EAR Plugin ........................... SUCCESS [21.504s]
[INFO] Apache Maven EJB Plugin ........................... SUCCESS [22.648s]
[INFO] Apache Maven Help Plugin .......................... SUCCESS [16.846s]
[INFO] Apache Maven Install Plugin ....................... SUCCESS [17.093s]
[INFO] Apache Maven Jarsigner Plugin ..................... SUCCESS [13.297s]
[INFO] Apache Maven Javadoc Plugin ....................... SUCCESS [2:17.996s]
[INFO] Apache Maven JDeps Plugin ......................... SUCCESS [6.891s]
[INFO] Apache Maven Linkcheck Plugin ..................... SUCCESS [6.931s]
[INFO] Apache Maven Patch Plugin ......................... SUCCESS [5.679s]
[INFO] Apache Maven PDF Plugin ........................... SUCCESS [12.156s]
[INFO] Apache Maven RAR Plugin ........................... SUCCESS [12.634s]
[INFO] Apache Maven Repository Plugin .................... SUCCESS [8.841s]
[INFO] Apache Maven Resources Plugin ..................... SUCCESS [13.197s]
[INFO] Apache Maven Site Plugin .......................... SUCCESS [29.662s]
[INFO] Apache Maven Source Plugin ........................ SUCCESS [14.508s]
[INFO] Apache Maven Stage Plugin ......................... SUCCESS [8.144s]
[INFO] Apache Maven Toolchains Plugin .................... SUCCESS [5.694s]
[INFO] Apache Maven Verifier Plugin ...................... SUCCESS [8.790s]
[INFO] Apache Maven WAR Plugin ........................... SUCCESS [26.198s]
[INFO] Apache Maven DOAP Plugin .......................... SUCCESS [11.433s]
[INFO] Apache Maven Invoker Plugin ....................... FAILURE [0.551s]
[INFO] Apache Maven JAR Plugin ........................... SUCCESS [9.091s]
[INFO] Apache Maven Assembly Plugin ...................... SUCCESS [30.438s]
[INFO] Apache Maven Checkstyle Plugin .................... SUCCESS [41.961s]
[INFO] Apache Maven PMD Plugin ........................... SUCCESS [25.531s]
[INFO] Apache Maven Project Info Reports Plugin .......... SUCCESS [31.582s]
[INFO] Apache Maven Remote Resources Plugin .............. SUCCESS [12.838s]
[INFO] Apache Maven Shade Plugin ......................... SUCCESS [17.866s]
[INFO] Apache Maven SCM Publish Plugin ................... SUCCESS [8.508s]
[INFO] Apache Maven Dependency Plugin .................... SUCCESS [1:07.142s]
[INFO] Apache Maven Plugins Aggregator ................... SUCCESS [3.067s]
[INFO] ------------------------------------------------------------------------
[INFO] BUILD FAILURE
[INFO] ------------------------------------------------------------------------
[INFO] Total time: 17:03.446s
[INFO] Finished at: Fri Jul 14 23:24:48 UTC 2017
[INFO] Final Memory: 137M/574M
[INFO] ------------------------------------------------------------------------
[ERROR] Failed to execute goal on project maven-invoker-plugin: Could not resolve dependencies for project org.apache.maven.plugins:maven-invoker-plugin:maven-plugin:3.0.2-SNAPSHOT: Could not find artifact org.apache.maven.shared:maven-script-interpreter:jar:1.2 in central (http://repo.maven.apache.org/maven2) -> [Help 1]
org.apache.maven.lifecycle.LifecycleExecutionException: Failed to execute goal on project maven-invoker-plugin: Could not resolve dependencies for project org.apache.maven.plugins:maven-invoker-plugin:maven-plugin:3.0.2-SNAPSHOT: Could not find artifact org.apache.maven.shared:maven-script-interpreter:jar:1.2 in central (http://repo.maven.apache.org/maven2)
        at org.apache.maven.lifecycle.internal.LifecycleDependencyResolver.getDependencies(LifecycleDependencyResolver.java:210)
        at org.apache.maven.lifecycle.internal.LifecycleDependencyResolver.resolveProjectDependencies(LifecycleDependencyResolver.java:117)
        at org.apache.maven.lifecycle.internal.MojoExecutor.ensureDependenciesAreResolved(MojoExecutor.java:258)
        at org.apache.maven.lifecycle.internal.MojoExecutor.execute(MojoExecutor.java:201)
        at org.apache.maven.lifecycle.internal.MojoExecutor.execute(MojoExecutor.java:153)
        at org.apache.maven.lifecycle.internal.MojoExecutor.execute(MojoExecutor.java:145)
        at org.apache.maven.lifecycle.internal.LifecycleModuleBuilder.buildProject(LifecycleModuleBuilder.java:84)
        at org.apache.maven.lifecycle.internal.LifecycleModuleBuilder.buildProject(LifecycleModuleBuilder.java:59)
        at org.apache.maven.lifecycle.internal.LifecycleStarter.singleThreadedBuild(LifecycleStarter.java:183)
        at org.apache.maven.lifecycle.internal.LifecycleStarter.execute(LifecycleStarter.java:161)
        at org.apache.maven.DefaultMaven.doExecute(DefaultMaven.java:320)
        at org.apache.maven.DefaultMaven.execute(DefaultMaven.java:156)
        at org.jvnet.hudson.maven3.launcher.Maven3Launcher.main(Maven3Launcher.java:117)
        at sun.reflect.NativeMethodAccessorImpl.invoke0(Native Method)
        at sun.reflect.NativeMethodAccessorImpl.invoke(NativeMethodAccessorImpl.java:57)
        at sun.reflect.DelegatingMethodAccessorImpl.invoke(DelegatingMethodAccessorImpl.java:43)
        at java.lang.reflect.Method.invoke(Method.java:606)
        at org.codehaus.plexus.classworlds.launcher.Launcher.launchStandard(Launcher.java:329)
        at org.codehaus.plexus.classworlds.launcher.Launcher.launch(Launcher.java:239)
        at org.jvnet.hudson.maven3.agent.Maven3Main.launch(Maven3Main.java:181)
        at sun.reflect.NativeMethodAccessorImpl.invoke0(Native Method)
        at sun.reflect.NativeMethodAccessorImpl.invoke(NativeMethodAccessorImpl.java:57)
        at sun.reflect.DelegatingMethodAccessorImpl.invoke(DelegatingMethodAccessorImpl.java:43)
        at java.lang.reflect.Method.invoke(Method.java:606)
        at hudson.maven.Maven3Builder.call(Maven3Builder.java:139)
        at hudson.maven.Maven3Builder.call(Maven3Builder.java:70)
        at hudson.remoting.UserRequest.perform(UserRequest.java:120)
        at hudson.remoting.UserRequest.perform(UserRequest.java:48)
        at hudson.remoting.Request$2.run(Request.java:326)
        at hudson.remoting.InterceptingExecutorService$1.call(InterceptingExecutorService.java:68)
        at java.util.concurrent.FutureTask.run(FutureTask.java:262)
        at java.util.concurrent.ThreadPoolExecutor.runWorker(ThreadPoolExecutor.java:1145)
        at java.util.concurrent.ThreadPoolExecutor$Worker.run(ThreadPoolExecutor.java:615)
        at java.lang.Thread.run(Thread.java:745)
Caused by: org.apache.maven.project.DependencyResolutionException: Could not resolve dependencies for project org.apache.maven.plugins:maven-invoker-plugin:maven-plugin:3.0.2-SNAPSHOT: Could not find artifact org.apache.maven.shared:maven-script-interpreter:jar:1.2 in central (http://repo.maven.apache.org/maven2)
        at org.apache.maven.project.DefaultProjectDependenciesResolver.resolve(DefaultProjectDependenciesResolver.java:189)
        at org.apache.maven.lifecycle.internal.LifecycleDependencyResolver.getDependencies(LifecycleDependencyResolver.java:185)
        ... 33 more
Caused by: org.sonatype.aether.resolution.DependencyResolutionException: Could not find artifact org.apache.maven.shared:maven-script-interpreter:jar:1.2 in central (http://repo.maven.apache.org/maven2)
        at org.sonatype.aether.impl.internal.DefaultRepositorySystem.resolveDependencies(DefaultRepositorySystem.java:375)
        at org.apache.maven.project.DefaultProjectDependenciesResolver.resolve(DefaultProjectDependenciesResolver.java:183)
        ... 34 more
Caused by: org.sonatype.aether.resolution.ArtifactResolutionException: Could not find artifact org.apache.maven.shared:maven-script-interpreter:jar:1.2 in central (http://repo.maven.apache.org/maven2)
        at org.sonatype.aether.impl.internal.DefaultArtifactResolver.resolve(DefaultArtifactResolver.java:538)
        at org.sonatype.aether.impl.internal.DefaultArtifactResolver.resolveArtifacts(DefaultArtifactResolver.java:216)
        at org.sonatype.aether.impl.internal.DefaultRepositorySystem.resolveDependencies(DefaultRepositorySystem.java:358)
        ... 35 more
Caused by: org.sonatype.aether.transfer.ArtifactNotFoundException: Could not find artifact org.apache.maven.shared:maven-script-interpreter:jar:1.2 in central (http://repo.maven.apache.org/maven2)
        at org.sonatype.aether.connector.wagon.WagonRepositoryConnector$4.wrap(WagonRepositoryConnector.java:947)
        at org.sonatype.aether.connector.wagon.WagonRepositoryConnector$4.wrap(WagonRepositoryConnector.java:941)
        at org.sonatype.aether.connector.wagon.WagonRepositoryConnector$GetTask.run(WagonRepositoryConnector.java:669)
        at org.sonatype.aether.util.concurrency.RunnableErrorForwarder$1.run(RunnableErrorForwarder.java:60)
        ... 3 more
[ERROR]
[ERROR] Re-run Maven using the -X switch to enable full debug logging.
[ERROR]
[ERROR] For more information about the errors and possible solutions, please read the following articles:
[ERROR] [Help 1] http://cwiki.apache.org/confluence/display/MAVEN/DependencyResolutionException
[ERROR]
[ERROR] After correcting the problems, you can resume the build with the command
[ERROR]   mvn <goals> -rf :maven-invoker-plugin
[JENKINS] Archiving F:\jenkins\jenkins-slave\workspace\maven-plugins-windows\maven-antrun-plugin\pom.xml to org.apache.maven.plugins/maven-antrun-plugin/3.0.0-SNAPSHOT/maven-antrun-plugin-3.0.0-SNAPSHOT.pom
[JENKINS] Archiving F:\jenkins\jenkins-slave\workspace\maven-plugins-windows\maven-antrun-plugin\target\maven-antrun-plugin-3.0.0-SNAPSHOT.jar to org.apache.maven.plugins/maven-antrun-plugin/3.0.0-SNAPSHOT/maven-antrun-plugin-3.0.0-SNAPSHOT.jar
[JENKINS] Archiving F:\jenkins\jenkins-slave\workspace\maven-plugins-windows\maven-linkcheck-plugin\pom.xml to org.apache.maven.plugins/maven-linkcheck-plugin/1.3-SNAPSHOT/maven-linkcheck-plugin-1.3-SNAPSHOT.pom
[JENKINS] Archiving F:\jenkins\jenkins-slave\workspace\maven-plugins-windows\maven-linkcheck-plugin\target\maven-linkcheck-plugin-1.3-SNAPSHOT.jar to org.apache.maven.plugins/maven-linkcheck-plugin/1.3-SNAPSHOT/maven-linkcheck-plugin-1.3-SNAPSHOT.jar
[JENKINS] Archiving F:\jenkins\jenkins-slave\workspace\maven-plugins-windows\maven-scm-publish-plugin\pom.xml to org.apache.maven.plugins/maven-scm-publish-plugin/1.2-SNAPSHOT/maven-scm-publish-plugin-1.2-SNAPSHOT.pom
[JENKINS] Archiving F:\jenkins\jenkins-slave\workspace\maven-plugins-windows\maven-scm-publish-plugin\target\maven-scm-publish-plugin-1.2-SNAPSHOT.jar to org.apache.maven.plugins/maven-scm-publish-plugin/1.2-SNAPSHOT/maven-scm-publish-plugin-1.2-SNAPSHOT.jar
[JENKINS] Archiving F:\jenkins\jenkins-slave\workspace\maven-plugins-windows\maven-acr-plugin\pom.xml to org.apache.maven.plugins/maven-acr-plugin/3.0.1-SNAPSHOT/maven-acr-plugin-3.0.1-SNAPSHOT.pom
[JENKINS] Archiving F:\jenkins\jenkins-slave\workspace\maven-plugins-windows\maven-acr-plugin\target\maven-acr-plugin-3.0.1-SNAPSHOT.jar to org.apache.maven.plugins/maven-acr-plugin/3.0.1-SNAPSHOT/maven-acr-plugin-3.0.1-SNAPSHOT.jar
[JENKINS] Archiving F:\jenkins\jenkins-slave\workspace\maven-plugins-windows\maven-install-plugin\pom.xml to org.apache.maven.plugins/maven-install-plugin/3.0.0-SNAPSHOT/maven-install-plugin-3.0.0-SNAPSHOT.pom
[JENKINS] Archiving F:\jenkins\jenkins-slave\workspace\maven-plugins-windows\maven-install-plugin\target\maven-install-plugin-3.0.0-SNAPSHOT.jar to org.apache.maven.plugins/maven-install-plugin/3.0.0-SNAPSHOT/maven-install-plugin-3.0.0-SNAPSHOT.jar
[JENKINS] Archiving F:\jenkins\jenkins-slave\workspace\maven-plugins-windows\maven-assembly-plugin\pom.xml to org.apache.maven.plugins/maven-assembly-plugin/3.1.0-SNAPSHOT/maven-assembly-plugin-3.1.0-SNAPSHOT.pom
[JENKINS] Archiving F:\jenkins\jenkins-slave\workspace\maven-plugins-windows\maven-assembly-plugin\target\maven-assembly-plugin-3.1.0-SNAPSHOT.jar to org.apache.maven.plugins/maven-assembly-plugin/3.1.0-SNAPSHOT/maven-assembly-plugin-3.1.0-SNAPSHOT.jar
[JENKINS] Archiving F:\jenkins\jenkins-slave\workspace\maven-plugins-windows\maven-docck-plugin\pom.xml to org.apache.maven.plugins/maven-docck-plugin/1.2-SNAPSHOT/maven-docck-plugin-1.2-SNAPSHOT.pom
[JENKINS] Archiving F:\jenkins\jenkins-slave\workspace\maven-plugins-windows\maven-docck-plugin\target\maven-docck-plugin-1.2-SNAPSHOT.jar to org.apache.maven.plugins/maven-docck-plugin/1.2-SNAPSHOT/maven-docck-plugin-1.2-SNAPSHOT.jar
[JENKINS] Archiving <https://builds.apache.org/job/maven-plugins-windows/ws/pom.xml> to org.apache.maven.plugins/maven-plugins-aggregator/1-SNAPSHOT/maven-plugins-aggregator-1-SNAPSHOT.pom
[JENKINS] Archiving F:\jenkins\jenkins-slave\workspace\maven-plugins-windows\maven-clean-plugin\pom.xml to org.apache.maven.plugins/maven-clean-plugin/3.0.1-SNAPSHOT/maven-clean-plugin-3.0.1-SNAPSHOT.pom
[JENKINS] Archiving F:\jenkins\jenkins-slave\workspace\maven-plugins-windows\maven-clean-plugin\target\maven-clean-plugin-3.0.1-SNAPSHOT.jar to org.apache.maven.plugins/maven-clean-plugin/3.0.1-SNAPSHOT/maven-clean-plugin-3.0.1-SNAPSHOT.jar
[JENKINS] Archiving F:\jenkins\jenkins-slave\workspace\maven-plugins-windows\maven-resources-plugin\pom.xml to org.apache.maven.plugins/maven-resources-plugin/3.0.3-SNAPSHOT/maven-resources-plugin-3.0.3-SNAPSHOT.pom
[JENKINS] Archiving F:\jenkins\jenkins-slave\workspace\maven-plugins-windows\maven-resources-plugin\target\maven-resources-plugin-3.0.3-SNAPSHOT.jar to org.apache.maven.plugins/maven-resources-plugin/3.0.3-SNAPSHOT/maven-resources-plugin-3.0.3-SNAPSHOT.jar
[JENKINS] Archiving F:\jenkins\jenkins-slave\workspace\maven-plugins-windows\maven-pmd-plugin\pom.xml to org.apache.maven.plugins/maven-pmd-plugin/3.9-SNAPSHOT/maven-pmd-plugin-3.9-SNAPSHOT.pom
[JENKINS] Archiving F:\jenkins\jenkins-slave\workspace\maven-plugins-windows\maven-pmd-plugin\target\maven-pmd-plugin-3.9-SNAPSHOT.jar to org.apache.maven.plugins/maven-pmd-plugin/3.9-SNAPSHOT/maven-pmd-plugin-3.9-SNAPSHOT.jar
[JENKINS] Archiving F:\jenkins\jenkins-slave\workspace\maven-plugins-windows\maven-shade-plugin\pom.xml to org.apache.maven.plugins/maven-shade-plugin/3.0.1-SNAPSHOT/maven-shade-plugin-3.0.1-SNAPSHOT.pom
[JENKINS] Archiving F:\jenkins\jenkins-slave\workspace\maven-plugins-windows\maven-shade-plugin\target\maven-shade-plugin-3.0.1-SNAPSHOT.jar to org.apache.maven.plugins/maven-shade-plugin/3.0.1-SNAPSHOT/maven-shade-plugin-3.0.1-SNAPSHOT.jar
[JENKINS] Archiving F:\jenkins\jenkins-slave\workspace\maven-plugins-windows\maven-toolchains-plugin\pom.xml to org.apache.maven.plugins/maven-toolchains-plugin/3.0.0-SNAPSHOT/maven-toolchains-plugin-3.0.0-SNAPSHOT.pom
[JENKINS] Archiving F:\jenkins\jenkins-slave\workspace\maven-plugins-windows\maven-toolchains-plugin\target\maven-toolchains-plugin-3.0.0-SNAPSHOT.jar to org.apache.maven.plugins/maven-toolchains-plugin/3.0.0-SNAPSHOT/maven-toolchains-plugin-3.0.0-SNAPSHOT.jar
[JENKINS] Archiving F:\jenkins\jenkins-slave\workspace\maven-plugins-windows\maven-remote-resources-plugin\pom.xml to org.apache.maven.plugins/maven-remote-resources-plugin/1.6-SNAPSHOT/maven-remote-resources-plugin-1.6-SNAPSHOT.pom
[JENKINS] Archiving F:\jenkins\jenkins-slave\workspace\maven-plugins-windows\maven-remote-resources-plugin\target\maven-remote-resources-plugin-1.6-SNAPSHOT.jar to org.apache.maven.plugins/maven-remote-resources-plugin/1.6-SNAPSHOT/maven-remote-resources-plugin-1.6-SNAPSHOT.jar
[JENKINS] Archiving F:\jenkins\jenkins-slave\workspace\maven-plugins-windows\maven-project-info-reports-plugin\pom.xml to org.apache.maven.plugins/maven-project-info-reports-plugin/2.10-SNAPSHOT/maven-project-info-reports-plugin-2.10-SNAPSHOT.pom
[JENKINS] Archiving F:\jenkins\jenkins-slave\workspace\maven-plugins-windows\maven-project-info-reports-plugin\target\maven-project-info-reports-plugin-2.10-SNAPSHOT.jar to org.apache.maven.plugins/maven-project-info-reports-plugin/2.10-SNAPSHOT/maven-project-info-reports-plugin-2.10-SNAPSHOT.jar
[JENKINS] Archiving F:\jenkins\jenkins-slave\workspace\maven-plugins-windows\maven-patch-plugin\pom.xml to org.apache.maven.plugins/maven-patch-plugin/1.3-SNAPSHOT/maven-patch-plugin-1.3-SNAPSHOT.pom
[JENKINS] Archiving F:\jenkins\jenkins-slave\workspace\maven-plugins-windows\maven-patch-plugin\target\maven-patch-plugin-1.3-SNAPSHOT.jar to org.apache.maven.plugins/maven-patch-plugin/1.3-SNAPSHOT/maven-patch-plugin-1.3-SNAPSHOT.jar
[JENKINS] Archiving F:\jenkins\jenkins-slave\workspace\maven-plugins-windows\maven-compiler-plugin\pom.xml to org.apache.maven.plugins/maven-compiler-plugin/3.6.2-SNAPSHOT/maven-compiler-plugin-3.6.2-SNAPSHOT.pom
[JENKINS] Archiving F:\jenkins\jenkins-slave\workspace\maven-plugins-windows\maven-compiler-plugin\target\maven-compiler-plugin-3.6.2-SNAPSHOT.jar to org.apache.maven.plugins/maven-compiler-plugin/3.6.2-SNAPSHOT/maven-compiler-plugin-3.6.2-SNAPSHOT.jar
[JENKINS] Archiving F:\jenkins\jenkins-slave\workspace\maven-plugins-windows\maven-stage-plugin\pom.xml to org.apache.maven.plugins/maven-stage-plugin/1.1-SNAPSHOT/maven-stage-plugin-1.1-SNAPSHOT.pom
[JENKINS] Archiving F:\jenkins\jenkins-slave\workspace\maven-plugins-windows\maven-stage-plugin\target\maven-stage-plugin-1.1-SNAPSHOT.jar to org.apache.maven.plugins/maven-stage-plugin/1.1-SNAPSHOT/maven-stage-plugin-1.1-SNAPSHOT.jar
[JENKINS] Archiving F:\jenkins\jenkins-slave\workspace\maven-plugins-windows\maven-verifier-plugin\pom.xml to org.apache.maven.plugins/maven-verifier-plugin/3.0.0-SNAPSHOT/maven-verifier-plugin-3.0.0-SNAPSHOT.pom
[JENKINS] Archiving F:\jenkins\jenkins-slave\workspace\maven-plugins-windows\maven-verifier-plugin\target\maven-verifier-plugin-3.0.0-SNAPSHOT.jar to org.apache.maven.plugins/maven-verifier-plugin/3.0.0-SNAPSHOT/maven-verifier-plugin-3.0.0-SNAPSHOT.jar
[JENKINS] Archiving F:\jenkins\jenkins-slave\workspace\maven-plugins-windows\maven-jarsigner-plugin\pom.xml to org.apache.maven.plugins/maven-jarsigner-plugin/1.5-SNAPSHOT/maven-jarsigner-plugin-1.5-SNAPSHOT.pom
[JENKINS] Archiving F:\jenkins\jenkins-slave\workspace\maven-plugins-windows\maven-jarsigner-plugin\target\maven-jarsigner-plugin-1.5-SNAPSHOT.jar to org.apache.maven.plugins/maven-jarsigner-plugin/1.5-SNAPSHOT/maven-jarsigner-plugin-1.5-SNAPSHOT.jar
[JENKINS] Archiving F:\jenkins\jenkins-slave\workspace\maven-plugins-windows\maven-ejb-plugin\pom.xml to org.apache.maven.plugins/maven-ejb-plugin/3.0.0-SNAPSHOT/maven-ejb-plugin-3.0.0-SNAPSHOT.pom
[JENKINS] Archiving F:\jenkins\jenkins-slave\workspace\maven-plugins-windows\maven-ejb-plugin\target\maven-ejb-plugin-3.0.0-SNAPSHOT.jar to org.apache.maven.plugins/maven-ejb-plugin/3.0.0-SNAPSHOT/maven-ejb-plugin-3.0.0-SNAPSHOT.jar
[JENKINS] Archiving F:\jenkins\jenkins-slave\workspace\maven-plugins-windows\maven-changelog-plugin\pom.xml to org.apache.maven.plugins/maven-changelog-plugin/2.4-SNAPSHOT/maven-changelog-plugin-2.4-SNAPSHOT.pom
[JENKINS] Archiving F:\jenkins\jenkins-slave\workspace\maven-plugins-windows\maven-changelog-plugin\target\maven-changelog-plugin-2.4-SNAPSHOT.jar to org.apache.maven.plugins/maven-changelog-plugin/2.4-SNAPSHOT/maven-changelog-plugin-2.4-SNAPSHOT.jar
[JENKINS] Archiving F:\jenkins\jenkins-slave\workspace\maven-plugins-windows\maven-help-plugin\pom.xml to org.apache.maven.plugins/maven-help-plugin/3.0.0-SNAPSHOT/maven-help-plugin-3.0.0-SNAPSHOT.pom
[JENKINS] Archiving F:\jenkins\jenkins-slave\workspace\maven-plugins-windows\maven-help-plugin\target\maven-help-plugin-3.0.0-SNAPSHOT.jar to org.apache.maven.plugins/maven-help-plugin/3.0.0-SNAPSHOT/maven-help-plugin-3.0.0-SNAPSHOT.jar
[JENKINS] Archiving F:\jenkins\jenkins-slave\workspace\maven-plugins-windows\maven-war-plugin\pom.xml to org.apache.maven.plugins/maven-war-plugin/3.1.1-SNAPSHOT/maven-war-plugin-3.1.1-SNAPSHOT.pom
[JENKINS] Archiving F:\jenkins\jenkins-slave\workspace\maven-plugins-windows\maven-war-plugin\target\maven-war-plugin-3.1.1-SNAPSHOT.jar to org.apache.maven.plugins/maven-war-plugin/3.1.1-SNAPSHOT/maven-war-plugin-3.1.1-SNAPSHOT.jar
[JENKINS] Archiving F:\jenkins\jenkins-slave\workspace\maven-plugins-windows\maven-ear-plugin\pom.xml to org.apache.maven.plugins/maven-ear-plugin/3.0.0-SNAPSHOT/maven-ear-plugin-3.0.0-SNAPSHOT.pom
[JENKINS] Archiving F:\jenkins\jenkins-slave\workspace\maven-plugins-windows\maven-ear-plugin\target\maven-ear-plugin-3.0.0-SNAPSHOT.jar to org.apache.maven.plugins/maven-ear-plugin/3.0.0-SNAPSHOT/maven-ear-plugin-3.0.0-SNAPSHOT.jar
[JENKINS] Archiving F:\jenkins\jenkins-slave\workspace\maven-plugins-windows\maven-invoker-plugin\pom.xml to org.apache.maven.plugins/maven-invoker-plugin/3.0.2-SNAPSHOT/maven-invoker-plugin-3.0.2-SNAPSHOT.pom
[JENKINS] Archiving F:\jenkins\jenkins-slave\workspace\maven-plugins-windows\maven-jdeps-plugin\pom.xml to org.apache.maven.plugins/maven-jdeps-plugin/3.0.1-SNAPSHOT/maven-jdeps-plugin-3.0.1-SNAPSHOT.pom
[JENKINS] Archiving F:\jenkins\jenkins-slave\workspace\maven-plugins-windows\maven-jdeps-plugin\target\maven-jdeps-plugin-3.0.1-SNAPSHOT.jar to org.apache.maven.plugins/maven-jdeps-plugin/3.0.1-SNAPSHOT/maven-jdeps-plugin-3.0.1-SNAPSHOT.jar
[JENKINS] Archiving F:\jenkins\jenkins-slave\workspace\maven-plugins-windows\maven-doap-plugin\pom.xml to org.apache.maven.plugins/maven-doap-plugin/1.3-SNAPSHOT/maven-doap-plugin-1.3-SNAPSHOT.pom
[JENKINS] Archiving F:\jenkins\jenkins-slave\workspace\maven-plugins-windows\maven-doap-plugin\target\maven-doap-plugin-1.3-SNAPSHOT.jar to org.apache.maven.plugins/maven-doap-plugin/1.3-SNAPSHOT/maven-doap-plugin-1.3-SNAPSHOT.jar
[JENKINS] Archiving F:\jenkins\jenkins-slave\workspace\maven-plugins-windows\maven-site-plugin\dependency-reduced-pom.xml to org.apache.maven.plugins/maven-site-plugin/3.7-SNAPSHOT/maven-site-plugin-3.7-SNAPSHOT.pom
[JENKINS] Archiving F:\jenkins\jenkins-slave\workspace\maven-plugins-windows\maven-site-plugin\target\maven-site-plugin-3.7-SNAPSHOT.jar to org.apache.maven.plugins/maven-site-plugin/3.7-SNAPSHOT/maven-site-plugin-3.7-SNAPSHOT.jar
[JENKINS] Archiving F:\jenkins\jenkins-slave\workspace\maven-plugins-windows\maven-changes-plugin\pom.xml to org.apache.maven.plugins/maven-changes-plugin/3.0.0-SNAPSHOT/maven-changes-plugin-3.0.0-SNAPSHOT.pom
[JENKINS] Archiving F:\jenkins\jenkins-slave\workspace\maven-plugins-windows\maven-changes-plugin\target\maven-changes-plugin-3.0.0-SNAPSHOT.jar to org.apache.maven.plugins/maven-changes-plugin/3.0.0-SNAPSHOT/maven-changes-plugin-3.0.0-SNAPSHOT.jar
[JENKINS] Archiving F:\jenkins\jenkins-slave\workspace\maven-plugins-windows\maven-deploy-plugin\pom.xml to org.apache.maven.plugins/maven-deploy-plugin/3.0.0-SNAPSHOT/maven-deploy-plugin-3.0.0-SNAPSHOT.pom
[JENKINS] Archiving F:\jenkins\jenkins-slave\workspace\maven-plugins-windows\maven-deploy-plugin\target\maven-deploy-plugin-3.0.0-SNAPSHOT.jar to org.apache.maven.plugins/maven-deploy-plugin/3.0.0-SNAPSHOT/maven-deploy-plugin-3.0.0-SNAPSHOT.jar
[JENKINS] Archiving F:\jenkins\jenkins-slave\workspace\maven-plugins-windows\maven-repository-plugin\pom.xml to org.apache.maven.plugins/maven-repository-plugin/2.5-SNAPSHOT/maven-repository-plugin-2.5-SNAPSHOT.pom
[JENKINS] Archiving F:\jenkins\jenkins-slave\workspace\maven-plugins-windows\maven-repository-plugin\target\maven-repository-plugin-2.5-SNAPSHOT.jar to org.apache.maven.plugins/maven-repository-plugin/2.5-SNAPSHOT/maven-repository-plugin-2.5-SNAPSHOT.jar
[JENKINS] Archiving F:\jenkins\jenkins-slave\workspace\maven-plugins-windows\maven-source-plugin\pom.xml to org.apache.maven.plugins/maven-source-plugin/3.0.2-SNAPSHOT/maven-source-plugin-3.0.2-SNAPSHOT.pom
[JENKINS] Archiving F:\jenkins\jenkins-slave\workspace\maven-plugins-windows\maven-source-plugin\target\maven-source-plugin-3.0.2-SNAPSHOT.jar to org.apache.maven.plugins/maven-source-plugin/3.0.2-SNAPSHOT/maven-source-plugin-3.0.2-SNAPSHOT.jar
[JENKINS] Archiving F:\jenkins\jenkins-slave\workspace\maven-plugins-windows\maven-pdf-plugin\pom.xml to org.apache.maven.plugins/maven-pdf-plugin/1.4-SNAPSHOT/maven-pdf-plugin-1.4-SNAPSHOT.pom
[JENKINS] Archiving F:\jenkins\jenkins-slave\workspace\maven-plugins-windows\maven-pdf-plugin\target\maven-pdf-plugin-1.4-SNAPSHOT.jar to org.apache.maven.plugins/maven-pdf-plugin/1.4-SNAPSHOT/maven-pdf-plugin-1.4-SNAPSHOT.jar
[JENKINS] Archiving F:\jenkins\jenkins-slave\workspace\maven-plugins-windows\maven-jar-plugin\pom.xml to org.apache.maven.plugins/maven-jar-plugin/3.0.3-SNAPSHOT/maven-jar-plugin-3.0.3-SNAPSHOT.pom
[JENKINS] Archiving F:\jenkins\jenkins-slave\workspace\maven-plugins-windows\maven-jar-plugin\target\maven-jar-plugin-3.0.3-SNAPSHOT.jar to org.apache.maven.plugins/maven-jar-plugin/3.0.3-SNAPSHOT/maven-jar-plugin-3.0.3-SNAPSHOT.jar
[JENKINS] Archiving F:\jenkins\jenkins-slave\workspace\maven-plugins-windows\maven-javadoc-plugin\pom.xml to org.apache.maven.plugins/maven-javadoc-plugin/3.0.0-SNAPSHOT/maven-javadoc-plugin-3.0.0-SNAPSHOT.pom
[JENKINS] Archiving F:\jenkins\jenkins-slave\workspace\maven-plugins-windows\maven-javadoc-plugin\target\maven-javadoc-plugin-3.0.0-SNAPSHOT.jar to org.apache.maven.plugins/maven-javadoc-plugin/3.0.0-SNAPSHOT/maven-javadoc-plugin-3.0.0-SNAPSHOT.jar
[JENKINS] Archiving F:\jenkins\jenkins-slave\workspace\maven-plugins-windows\maven-dependency-plugin\pom.xml to org.apache.maven.plugins/maven-dependency-plugin/3.0.2-SNAPSHOT/maven-dependency-plugin-3.0.2-SNAPSHOT.pom
[JENKINS] Archiving F:\jenkins\jenkins-slave\workspace\maven-plugins-windows\maven-dependency-plugin\target\maven-dependency-plugin-3.0.2-SNAPSHOT.jar to org.apache.maven.plugins/maven-dependency-plugin/3.0.2-SNAPSHOT/maven-dependency-plugin-3.0.2-SNAPSHOT.jar
[JENKINS] Archiving F:\jenkins\jenkins-slave\workspace\maven-plugins-windows\maven-rar-plugin\pom.xml to org.apache.maven.plugins/maven-rar-plugin/3.0.0-SNAPSHOT/maven-rar-plugin-3.0.0-SNAPSHOT.pom
[JENKINS] Archiving F:\jenkins\jenkins-slave\workspace\maven-plugins-windows\maven-rar-plugin\target\maven-rar-plugin-3.0.0-SNAPSHOT.jar to org.apache.maven.plugins/maven-rar-plugin/3.0.0-SNAPSHOT/maven-rar-plugin-3.0.0-SNAPSHOT.jar
[JENKINS] Archiving F:\jenkins\jenkins-slave\workspace\maven-plugins-windows\maven-checkstyle-plugin\pom.xml to org.apache.maven.plugins/maven-checkstyle-plugin/3.0.0-SNAPSHOT/maven-checkstyle-plugin-3.0.0-SNAPSHOT.pom
[JENKINS] Archiving F:\jenkins\jenkins-slave\workspace\maven-plugins-windows\maven-checkstyle-plugin\target\maven-checkstyle-plugin-3.0.0-SNAPSHOT.jar to org.apache.maven.plugins/maven-checkstyle-plugin/3.0.0-SNAPSHOT/maven-checkstyle-plugin-3.0.0-SNAPSHOT.jar
Sending e-mails to: [hidden email]
channel stopped
[WARNINGS] Skipping publisher since build result is FAILURE
Reply | Threaded
Open this post in threaded view
|  
Report Content as Inappropriate

Build failed in Jenkins: maven-plugins-windows #1994

Apache Jenkins Server-2
See <https://builds.apache.org/job/maven-plugins-windows/1994/display/redirect?page=changes>

Changes:

[olamy] back to 3.0.1-SNAPSHOT

[gboue] [MASSEMBLY-857] Support for custom resource filters

Document container descriptor handlers in a dedicated page.

------------------------------------------
[...truncated 587.40 KB...]
[INFO] ------------------------------------------------------------------------
[INFO] Building Apache Maven Plugins Aggregator 1-SNAPSHOT
[INFO] ------------------------------------------------------------------------
[INFO]
[INFO] --- maven-clean-plugin:2.5:clean (default-clean) @ maven-plugins-aggregator ---
[INFO] Deleting <https://builds.apache.org/job/maven-plugins-windows/ws/target>
[INFO]
[INFO] --- maven-enforcer-plugin:1.3.1:enforce (enforce-bytecode-version) @ maven-plugins-aggregator ---
[INFO]
[INFO] --- maven-enforcer-plugin:1.3.1:enforce (ban-known-bad-maven-versions) @ maven-plugins-aggregator ---
[INFO]
[INFO] --- maven-remote-resources-plugin:1.5:process (default) @ maven-plugins-aggregator ---
[INFO]
[INFO] --- maven-site-plugin:3.3:attach-descriptor (attach-descriptor) @ maven-plugins-aggregator ---
[INFO]
[INFO] --- maven-install-plugin:2.5.1:install (default-install) @ maven-plugins-aggregator ---
[INFO] Installing <https://builds.apache.org/job/maven-plugins-windows/ws/pom.xml> to f:\jenkins\jenkins-slave\maven-repositories\0\org\apache\maven\plugins\maven-plugins-aggregator\1-SNAPSHOT\maven-plugins-aggregator-1-SNAPSHOT.pom
[INFO] ------------------------------------------------------------------------
[INFO] Reactor Summary:
[INFO]
[INFO] Apache Maven ACR Plugin ........................... SUCCESS [13.877s]
[INFO] Apache Maven AntRun Plugin ........................ SUCCESS [16.921s]
[INFO] Apache Maven Changelog Plugin ..................... SUCCESS [15.959s]
[INFO] Apache Maven Changes Plugin ....................... SUCCESS [25.742s]
[INFO] Apache Maven Clean Plugin ......................... SUCCESS [11.284s]
[INFO] Apache Maven Compiler Plugin ...................... SUCCESS [18.738s]
[INFO] Apache Maven Deploy Plugin ........................ SUCCESS [13.816s]
[INFO] Apache Maven Documentation Checker Plugin ......... SUCCESS [6.441s]
[INFO] Apache Maven EAR Plugin ........................... SUCCESS [12.269s]
[INFO] Apache Maven EJB Plugin ........................... SUCCESS [14.233s]
[INFO] Apache Maven Help Plugin .......................... SUCCESS [14.881s]
[INFO] Apache Maven Install Plugin ....................... SUCCESS [13.753s]
[INFO] Apache Maven Jarsigner Plugin ..................... SUCCESS [5.831s]
[INFO] Apache Maven Javadoc Plugin ....................... SUCCESS [2:37.939s]
[INFO] Apache Maven JDeps Plugin ......................... SUCCESS [6.452s]
[INFO] Apache Maven Linkcheck Plugin ..................... SUCCESS [5.587s]
[INFO] Apache Maven Patch Plugin ......................... SUCCESS [3.415s]
[INFO] Apache Maven PDF Plugin ........................... SUCCESS [12.946s]
[INFO] Apache Maven RAR Plugin ........................... SUCCESS [9.909s]
[INFO] Apache Maven Repository Plugin .................... SUCCESS [8.450s]
[INFO] Apache Maven Resources Plugin ..................... SUCCESS [13.177s]
[INFO] Apache Maven Site Plugin .......................... SUCCESS [24.899s]
[INFO] Apache Maven Source Plugin ........................ SUCCESS [11.798s]
[INFO] Apache Maven Stage Plugin ......................... SUCCESS [6.816s]
[INFO] Apache Maven Toolchains Plugin .................... SUCCESS [3.548s]
[INFO] Apache Maven Verifier Plugin ...................... SUCCESS [6.514s]
[INFO] Apache Maven WAR Plugin ........................... SUCCESS [24.968s]
[INFO] Apache Maven DOAP Plugin .......................... SUCCESS [11.396s]
[INFO] Apache Maven Invoker Plugin ....................... FAILURE [0.213s]
[INFO] Apache Maven JAR Plugin ........................... SUCCESS [8.606s]
[INFO] Apache Maven Assembly Plugin ...................... SUCCESS [25.641s]
[INFO] Apache Maven Checkstyle Plugin .................... SUCCESS [36.947s]
[INFO] Apache Maven PMD Plugin ........................... SUCCESS [24.392s]
[INFO] Apache Maven Project Info Reports Plugin .......... FAILURE [2.441s]
[INFO] Apache Maven Remote Resources Plugin .............. SUCCESS [10.829s]
[INFO] Apache Maven Shade Plugin ......................... SUCCESS [15.089s]
[INFO] Apache Maven SCM Publish Plugin ................... SUCCESS [6.154s]
[INFO] Apache Maven Dependency Plugin .................... SUCCESS [1:14.382s]
[INFO] Apache Maven Plugins Aggregator ................... SUCCESS [0.533s]
[INFO] ------------------------------------------------------------------------
[INFO] BUILD FAILURE
[INFO] ------------------------------------------------------------------------
[INFO] Total time: 11:46.926s
[INFO] Finished at: Mon Jul 17 03:28:00 UTC 2017
[INFO] Final Memory: 84M/748M
[INFO] ------------------------------------------------------------------------
[ERROR] Failed to execute goal on project maven-invoker-plugin: Could not resolve dependencies for project org.apache.maven.plugins:maven-invoker-plugin:maven-plugin:3.0.1-SNAPSHOT: Could not find artifact org.apache.maven.shared:maven-script-interpreter:jar:1.2 in central (http://repo.maven.apache.org/maven2) -> [Help 1]
org.apache.maven.lifecycle.LifecycleExecutionException: Failed to execute goal on project maven-invoker-plugin: Could not resolve dependencies for project org.apache.maven.plugins:maven-invoker-plugin:maven-plugin:3.0.1-SNAPSHOT: Could not find artifact org.apache.maven.shared:maven-script-interpreter:jar:1.2 in central (http://repo.maven.apache.org/maven2)
        at org.apache.maven.lifecycle.internal.LifecycleDependencyResolver.getDependencies(LifecycleDependencyResolver.java:210)
        at org.apache.maven.lifecycle.internal.LifecycleDependencyResolver.resolveProjectDependencies(LifecycleDependencyResolver.java:117)
        at org.apache.maven.lifecycle.internal.MojoExecutor.ensureDependenciesAreResolved(MojoExecutor.java:258)
        at org.apache.maven.lifecycle.internal.MojoExecutor.execute(MojoExecutor.java:201)
        at org.apache.maven.lifecycle.internal.MojoExecutor.execute(MojoExecutor.java:153)
        at org.apache.maven.lifecycle.internal.MojoExecutor.execute(MojoExecutor.java:145)
        at org.apache.maven.lifecycle.internal.LifecycleModuleBuilder.buildProject(LifecycleModuleBuilder.java:84)
        at org.apache.maven.lifecycle.internal.LifecycleModuleBuilder.buildProject(LifecycleModuleBuilder.java:59)
        at org.apache.maven.lifecycle.internal.LifecycleStarter.singleThreadedBuild(LifecycleStarter.java:183)
        at org.apache.maven.lifecycle.internal.LifecycleStarter.execute(LifecycleStarter.java:161)
        at org.apache.maven.DefaultMaven.doExecute(DefaultMaven.java:320)
        at org.apache.maven.DefaultMaven.execute(DefaultMaven.java:156)
        at org.jvnet.hudson.maven3.launcher.Maven3Launcher.main(Maven3Launcher.java:117)
        at sun.reflect.NativeMethodAccessorImpl.invoke0(Native Method)
        at sun.reflect.NativeMethodAccessorImpl.invoke(Unknown Source)
        at sun.reflect.DelegatingMethodAccessorImpl.invoke(Unknown Source)
        at java.lang.reflect.Method.invoke(Unknown Source)
        at org.codehaus.plexus.classworlds.launcher.Launcher.launchStandard(Launcher.java:329)
        at org.codehaus.plexus.classworlds.launcher.Launcher.launch(Launcher.java:239)
        at org.jvnet.hudson.maven3.agent.Maven3Main.launch(Maven3Main.java:181)
        at sun.reflect.NativeMethodAccessorImpl.invoke0(Native Method)
        at sun.reflect.NativeMethodAccessorImpl.invoke(Unknown Source)
        at sun.reflect.DelegatingMethodAccessorImpl.invoke(Unknown Source)
        at java.lang.reflect.Method.invoke(Unknown Source)
        at hudson.maven.Maven3Builder.call(Maven3Builder.java:139)
        at hudson.maven.Maven3Builder.call(Maven3Builder.java:70)
        at hudson.remoting.UserRequest.perform(UserRequest.java:153)
        at hudson.remoting.UserRequest.perform(UserRequest.java:50)
        at hudson.remoting.Request$2.run(Request.java:336)
        at hudson.remoting.InterceptingExecutorService$1.call(InterceptingExecutorService.java:68)
        at java.util.concurrent.FutureTask.run(Unknown Source)
        at java.util.concurrent.ThreadPoolExecutor.runWorker(Unknown Source)
        at java.util.concurrent.ThreadPoolExecutor$Worker.run(Unknown Source)
        at java.lang.Thread.run(Unknown Source)
Caused by: org.apache.maven.project.DependencyResolutionException: Could not resolve dependencies for project org.apache.maven.plugins:maven-invoker-plugin:maven-plugin:3.0.1-SNAPSHOT: Could not find artifact org.apache.maven.shared:maven-script-interpreter:jar:1.2 in central (http://repo.maven.apache.org/maven2)
        at org.apache.maven.project.DefaultProjectDependenciesResolver.resolve(DefaultProjectDependenciesResolver.java:189)
        at org.apache.maven.lifecycle.internal.LifecycleDependencyResolver.getDependencies(LifecycleDependencyResolver.java:185)
        ... 33 more
Caused by: org.sonatype.aether.resolution.DependencyResolutionException: Could not find artifact org.apache.maven.shared:maven-script-interpreter:jar:1.2 in central (http://repo.maven.apache.org/maven2)
        at org.sonatype.aether.impl.internal.DefaultRepositorySystem.resolveDependencies(DefaultRepositorySystem.java:375)
        at org.apache.maven.project.DefaultProjectDependenciesResolver.resolve(DefaultProjectDependenciesResolver.java:183)
        ... 34 more
Caused by: org.sonatype.aether.resolution.ArtifactResolutionException: Could not find artifact org.apache.maven.shared:maven-script-interpreter:jar:1.2 in central (http://repo.maven.apache.org/maven2)
        at org.sonatype.aether.impl.internal.DefaultArtifactResolver.resolve(DefaultArtifactResolver.java:538)
        at org.sonatype.aether.impl.internal.DefaultArtifactResolver.resolveArtifacts(DefaultArtifactResolver.java:216)
        at org.sonatype.aether.impl.internal.DefaultRepositorySystem.resolveDependencies(DefaultRepositorySystem.java:358)
        ... 35 more
Caused by: org.sonatype.aether.transfer.ArtifactNotFoundException: Could not find artifact org.apache.maven.shared:maven-script-interpreter:jar:1.2 in central (http://repo.maven.apache.org/maven2)
        at org.sonatype.aether.connector.wagon.WagonRepositoryConnector$4.wrap(WagonRepositoryConnector.java:947)
        at org.sonatype.aether.connector.wagon.WagonRepositoryConnector$4.wrap(WagonRepositoryConnector.java:941)
        at org.sonatype.aether.connector.wagon.WagonRepositoryConnector$GetTask.run(WagonRepositoryConnector.java:669)
        at org.sonatype.aether.util.concurrency.RunnableErrorForwarder$1.run(RunnableErrorForwarder.java:60)
        ... 3 more
[ERROR] Failed to execute goal org.codehaus.mojo:keytool-maven-plugin:1.0:genkey (init) on project maven-project-info-reports-plugin: Result of cmd.exe /X /C '""C:\Program Files\Java\jre1.8.0_121\..\bin\keytool.exe" -genkey -dname "cn=jetty, ou=jetty, L=Unknown, ST=Unknown, o=Apache, c=Unknown" -alias apache -keypass apache -keystore F:\jenkins\jenkins-slave\workspace\maven-plugins-windows\maven-project-info-reports-plugin/target/jetty.jks -storepass apache -validity 365 -keyalg RSA"' execution is: '1': The system cannot find the path specified.. -> [Help 2]
org.apache.maven.lifecycle.LifecycleExecutionException: Failed to execute goal org.codehaus.mojo:keytool-maven-plugin:1.0:genkey (init) on project maven-project-info-reports-plugin: Result of cmd.exe /X /C '""C:\Program Files\Java\jre1.8.0_121\..\bin\keytool.exe" -genkey -dname "cn=jetty, ou=jetty, L=Unknown, ST=Unknown, o=Apache, c=Unknown" -alias apache -keypass apache -keystore F:\jenkins\jenkins-slave\workspace\maven-plugins-windows\maven-project-info-reports-plugin/target/jetty.jks -storepass apache -validity 365 -keyalg RSA"' execution is: '1': The system cannot find the path specified..
        at org.apache.maven.lifecycle.internal.MojoExecutor.execute(MojoExecutor.java:217)
        at org.apache.maven.lifecycle.internal.MojoExecutor.execute(MojoExecutor.java:153)
        at org.apache.maven.lifecycle.internal.MojoExecutor.execute(MojoExecutor.java:145)
        at org.apache.maven.lifecycle.internal.LifecycleModuleBuilder.buildProject(LifecycleModuleBuilder.java:84)
        at org.apache.maven.lifecycle.internal.LifecycleModuleBuilder.buildProject(LifecycleModuleBuilder.java:59)
        at org.apache.maven.lifecycle.internal.LifecycleStarter.singleThreadedBuild(LifecycleStarter.java:183)
        at org.apache.maven.lifecycle.internal.LifecycleStarter.execute(LifecycleStarter.java:161)
        at org.apache.maven.DefaultMaven.doExecute(DefaultMaven.java:320)
        at org.apache.maven.DefaultMaven.execute(DefaultMaven.java:156)
        at org.jvnet.hudson.maven3.launcher.Maven3Launcher.main(Maven3Launcher.java:117)
        at sun.reflect.NativeMethodAccessorImpl.invoke0(Native Method)
        at sun.reflect.NativeMethodAccessorImpl.invoke(Unknown Source)
        at sun.reflect.DelegatingMethodAccessorImpl.invoke(Unknown Source)
        at java.lang.reflect.Method.invoke(Unknown Source)
        at org.codehaus.plexus.classworlds.launcher.Launcher.launchStandard(Launcher.java:329)
        at org.codehaus.plexus.classworlds.launcher.Launcher.launch(Launcher.java:239)
        at org.jvnet.hudson.maven3.agent.Maven3Main.launch(Maven3Main.java:181)
        at sun.reflect.NativeMethodAccessorImpl.invoke0(Native Method)
        at sun.reflect.NativeMethodAccessorImpl.invoke(Unknown Source)
        at sun.reflect.DelegatingMethodAccessorImpl.invoke(Unknown Source)
        at java.lang.reflect.Method.invoke(Unknown Source)
        at hudson.maven.Maven3Builder.call(Maven3Builder.java:139)
        at hudson.maven.Maven3Builder.call(Maven3Builder.java:70)
        at hudson.remoting.UserRequest.perform(UserRequest.java:153)
        at hudson.remoting.UserRequest.perform(UserRequest.java:50)
        at hudson.remoting.Request$2.run(Request.java:336)
        at hudson.remoting.InterceptingExecutorService$1.call(InterceptingExecutorService.java:68)
        at java.util.concurrent.FutureTask.run(Unknown Source)
        at java.util.concurrent.ThreadPoolExecutor.runWorker(Unknown Source)
        at java.util.concurrent.ThreadPoolExecutor$Worker.run(Unknown Source)
        at java.lang.Thread.run(Unknown Source)
Caused by: org.apache.maven.plugin.MojoExecutionException: Result of cmd.exe /X /C '""C:\Program Files\Java\jre1.8.0_121\..\bin\keytool.exe" -genkey -dname "cn=jetty, ou=jetty, L=Unknown, ST=Unknown, o=Apache, c=Unknown" -alias apache -keypass apache -keystore F:\jenkins\jenkins-slave\workspace\maven-plugins-windows\maven-project-info-reports-plugin/target/jetty.jks -storepass apache -validity 365 -keyalg RSA"' execution is: '1': The system cannot find the path specified..
        at org.codehaus.mojo.keytool.GenkeyMojo.execute(GenkeyMojo.java:207)
        at org.apache.maven.plugin.DefaultBuildPluginManager.executeMojo(DefaultBuildPluginManager.java:101)
        at org.apache.maven.lifecycle.internal.MojoExecutor.execute(MojoExecutor.java:209)
        ... 30 more
[ERROR]
[ERROR] Re-run Maven using the -X switch to enable full debug logging.
[ERROR]
[ERROR] For more information about the errors and possible solutions, please read the following articles:
[ERROR] [Help 1] http://cwiki.apache.org/confluence/display/MAVEN/DependencyResolutionException
[ERROR] [Help 2] http://cwiki.apache.org/confluence/display/MAVEN/MojoExecutionException
[ERROR]
[ERROR] After correcting the problems, you can resume the build with the command
[ERROR]   mvn <goals> -rf :maven-invoker-plugin
[JENKINS] Archiving F:\jenkins\jenkins-slave\workspace\maven-plugins-windows\maven-antrun-plugin\pom.xml to org.apache.maven.plugins/maven-antrun-plugin/3.0.0-SNAPSHOT/maven-antrun-plugin-3.0.0-SNAPSHOT.pom
[JENKINS] Archiving F:\jenkins\jenkins-slave\workspace\maven-plugins-windows\maven-antrun-plugin\target\maven-antrun-plugin-3.0.0-SNAPSHOT.jar to org.apache.maven.plugins/maven-antrun-plugin/3.0.0-SNAPSHOT/maven-antrun-plugin-3.0.0-SNAPSHOT.jar
[JENKINS] Archiving F:\jenkins\jenkins-slave\workspace\maven-plugins-windows\maven-linkcheck-plugin\pom.xml to org.apache.maven.plugins/maven-linkcheck-plugin/1.3-SNAPSHOT/maven-linkcheck-plugin-1.3-SNAPSHOT.pom
[JENKINS] Archiving F:\jenkins\jenkins-slave\workspace\maven-plugins-windows\maven-linkcheck-plugin\target\maven-linkcheck-plugin-1.3-SNAPSHOT.jar to org.apache.maven.plugins/maven-linkcheck-plugin/1.3-SNAPSHOT/maven-linkcheck-plugin-1.3-SNAPSHOT.jar
[JENKINS] Archiving F:\jenkins\jenkins-slave\workspace\maven-plugins-windows\maven-scm-publish-plugin\pom.xml to org.apache.maven.plugins/maven-scm-publish-plugin/1.2-SNAPSHOT/maven-scm-publish-plugin-1.2-SNAPSHOT.pom
[JENKINS] Archiving F:\jenkins\jenkins-slave\workspace\maven-plugins-windows\maven-scm-publish-plugin\target\maven-scm-publish-plugin-1.2-SNAPSHOT.jar to org.apache.maven.plugins/maven-scm-publish-plugin/1.2-SNAPSHOT/maven-scm-publish-plugin-1.2-SNAPSHOT.jar
[JENKINS] Archiving F:\jenkins\jenkins-slave\workspace\maven-plugins-windows\maven-acr-plugin\pom.xml to org.apache.maven.plugins/maven-acr-plugin/3.0.1-SNAPSHOT/maven-acr-plugin-3.0.1-SNAPSHOT.pom
[JENKINS] Archiving F:\jenkins\jenkins-slave\workspace\maven-plugins-windows\maven-acr-plugin\target\maven-acr-plugin-3.0.1-SNAPSHOT.jar to org.apache.maven.plugins/maven-acr-plugin/3.0.1-SNAPSHOT/maven-acr-plugin-3.0.1-SNAPSHOT.jar
[JENKINS] Archiving F:\jenkins\jenkins-slave\workspace\maven-plugins-windows\maven-install-plugin\pom.xml to org.apache.maven.plugins/maven-install-plugin/3.0.0-SNAPSHOT/maven-install-plugin-3.0.0-SNAPSHOT.pom
[JENKINS] Archiving F:\jenkins\jenkins-slave\workspace\maven-plugins-windows\maven-install-plugin\target\maven-install-plugin-3.0.0-SNAPSHOT.jar to org.apache.maven.plugins/maven-install-plugin/3.0.0-SNAPSHOT/maven-install-plugin-3.0.0-SNAPSHOT.jar
[JENKINS] Archiving F:\jenkins\jenkins-slave\workspace\maven-plugins-windows\maven-assembly-plugin\pom.xml to org.apache.maven.plugins/maven-assembly-plugin/3.1.0-SNAPSHOT/maven-assembly-plugin-3.1.0-SNAPSHOT.pom
[JENKINS] Archiving F:\jenkins\jenkins-slave\workspace\maven-plugins-windows\maven-assembly-plugin\target\maven-assembly-plugin-3.1.0-SNAPSHOT.jar to org.apache.maven.plugins/maven-assembly-plugin/3.1.0-SNAPSHOT/maven-assembly-plugin-3.1.0-SNAPSHOT.jar
[JENKINS] Archiving F:\jenkins\jenkins-slave\workspace\maven-plugins-windows\maven-docck-plugin\pom.xml to org.apache.maven.plugins/maven-docck-plugin/1.2-SNAPSHOT/maven-docck-plugin-1.2-SNAPSHOT.pom
[JENKINS] Archiving F:\jenkins\jenkins-slave\workspace\maven-plugins-windows\maven-docck-plugin\target\maven-docck-plugin-1.2-SNAPSHOT.jar to org.apache.maven.plugins/maven-docck-plugin/1.2-SNAPSHOT/maven-docck-plugin-1.2-SNAPSHOT.jar
[JENKINS] Archiving <https://builds.apache.org/job/maven-plugins-windows/ws/pom.xml> to org.apache.maven.plugins/maven-plugins-aggregator/1-SNAPSHOT/maven-plugins-aggregator-1-SNAPSHOT.pom
[JENKINS] Archiving F:\jenkins\jenkins-slave\workspace\maven-plugins-windows\maven-clean-plugin\pom.xml to org.apache.maven.plugins/maven-clean-plugin/3.0.1-SNAPSHOT/maven-clean-plugin-3.0.1-SNAPSHOT.pom
[JENKINS] Archiving F:\jenkins\jenkins-slave\workspace\maven-plugins-windows\maven-clean-plugin\target\maven-clean-plugin-3.0.1-SNAPSHOT.jar to org.apache.maven.plugins/maven-clean-plugin/3.0.1-SNAPSHOT/maven-clean-plugin-3.0.1-SNAPSHOT.jar
[JENKINS] Archiving F:\jenkins\jenkins-slave\workspace\maven-plugins-windows\maven-resources-plugin\pom.xml to org.apache.maven.plugins/maven-resources-plugin/3.0.3-SNAPSHOT/maven-resources-plugin-3.0.3-SNAPSHOT.pom
[JENKINS] Archiving F:\jenkins\jenkins-slave\workspace\maven-plugins-windows\maven-resources-plugin\target\maven-resources-plugin-3.0.3-SNAPSHOT.jar to org.apache.maven.plugins/maven-resources-plugin/3.0.3-SNAPSHOT/maven-resources-plugin-3.0.3-SNAPSHOT.jar
[JENKINS] Archiving F:\jenkins\jenkins-slave\workspace\maven-plugins-windows\maven-pmd-plugin\pom.xml to org.apache.maven.plugins/maven-pmd-plugin/3.9-SNAPSHOT/maven-pmd-plugin-3.9-SNAPSHOT.pom
[JENKINS] Archiving F:\jenkins\jenkins-slave\workspace\maven-plugins-windows\maven-pmd-plugin\target\maven-pmd-plugin-3.9-SNAPSHOT.jar to org.apache.maven.plugins/maven-pmd-plugin/3.9-SNAPSHOT/maven-pmd-plugin-3.9-SNAPSHOT.jar
[JENKINS] Archiving F:\jenkins\jenkins-slave\workspace\maven-plugins-windows\maven-shade-plugin\pom.xml to org.apache.maven.plugins/maven-shade-plugin/3.0.1-SNAPSHOT/maven-shade-plugin-3.0.1-SNAPSHOT.pom
[JENKINS] Archiving F:\jenkins\jenkins-slave\workspace\maven-plugins-windows\maven-shade-plugin\target\maven-shade-plugin-3.0.1-SNAPSHOT.jar to org.apache.maven.plugins/maven-shade-plugin/3.0.1-SNAPSHOT/maven-shade-plugin-3.0.1-SNAPSHOT.jar
[JENKINS] Archiving F:\jenkins\jenkins-slave\workspace\maven-plugins-windows\maven-toolchains-plugin\pom.xml to org.apache.maven.plugins/maven-toolchains-plugin/3.0.0-SNAPSHOT/maven-toolchains-plugin-3.0.0-SNAPSHOT.pom
[JENKINS] Archiving F:\jenkins\jenkins-slave\workspace\maven-plugins-windows\maven-toolchains-plugin\target\maven-toolchains-plugin-3.0.0-SNAPSHOT.jar to org.apache.maven.plugins/maven-toolchains-plugin/3.0.0-SNAPSHOT/maven-toolchains-plugin-3.0.0-SNAPSHOT.jar
[JENKINS] Archiving F:\jenkins\jenkins-slave\workspace\maven-plugins-windows\maven-remote-resources-plugin\pom.xml to org.apache.maven.plugins/maven-remote-resources-plugin/1.6-SNAPSHOT/maven-remote-resources-plugin-1.6-SNAPSHOT.pom
[JENKINS] Archiving F:\jenkins\jenkins-slave\workspace\maven-plugins-windows\maven-remote-resources-plugin\target\maven-remote-resources-plugin-1.6-SNAPSHOT.jar to org.apache.maven.plugins/maven-remote-resources-plugin/1.6-SNAPSHOT/maven-remote-resources-plugin-1.6-SNAPSHOT.jar
[JENKINS] Archiving F:\jenkins\jenkins-slave\workspace\maven-plugins-windows\maven-project-info-reports-plugin\pom.xml to org.apache.maven.plugins/maven-project-info-reports-plugin/2.10-SNAPSHOT/maven-project-info-reports-plugin-2.10-SNAPSHOT.pom
[JENKINS] Archiving F:\jenkins\jenkins-slave\workspace\maven-plugins-windows\maven-patch-plugin\pom.xml to org.apache.maven.plugins/maven-patch-plugin/1.3-SNAPSHOT/maven-patch-plugin-1.3-SNAPSHOT.pom
[JENKINS] Archiving F:\jenkins\jenkins-slave\workspace\maven-plugins-windows\maven-patch-plugin\target\maven-patch-plugin-1.3-SNAPSHOT.jar to org.apache.maven.plugins/maven-patch-plugin/1.3-SNAPSHOT/maven-patch-plugin-1.3-SNAPSHOT.jar
[JENKINS] Archiving F:\jenkins\jenkins-slave\workspace\maven-plugins-windows\maven-compiler-plugin\pom.xml to org.apache.maven.plugins/maven-compiler-plugin/3.6.2-SNAPSHOT/maven-compiler-plugin-3.6.2-SNAPSHOT.pom
[JENKINS] Archiving F:\jenkins\jenkins-slave\workspace\maven-plugins-windows\maven-compiler-plugin\target\maven-compiler-plugin-3.6.2-SNAPSHOT.jar to org.apache.maven.plugins/maven-compiler-plugin/3.6.2-SNAPSHOT/maven-compiler-plugin-3.6.2-SNAPSHOT.jar
[JENKINS] Archiving F:\jenkins\jenkins-slave\workspace\maven-plugins-windows\maven-stage-plugin\pom.xml to org.apache.maven.plugins/maven-stage-plugin/1.1-SNAPSHOT/maven-stage-plugin-1.1-SNAPSHOT.pom
[JENKINS] Archiving F:\jenkins\jenkins-slave\workspace\maven-plugins-windows\maven-stage-plugin\target\maven-stage-plugin-1.1-SNAPSHOT.jar to org.apache.maven.plugins/maven-stage-plugin/1.1-SNAPSHOT/maven-stage-plugin-1.1-SNAPSHOT.jar
[JENKINS] Archiving F:\jenkins\jenkins-slave\workspace\maven-plugins-windows\maven-verifier-plugin\pom.xml to org.apache.maven.plugins/maven-verifier-plugin/3.0.0-SNAPSHOT/maven-verifier-plugin-3.0.0-SNAPSHOT.pom
[JENKINS] Archiving F:\jenkins\jenkins-slave\workspace\maven-plugins-windows\maven-verifier-plugin\target\maven-verifier-plugin-3.0.0-SNAPSHOT.jar to org.apache.maven.plugins/maven-verifier-plugin/3.0.0-SNAPSHOT/maven-verifier-plugin-3.0.0-SNAPSHOT.jar
[JENKINS] Archiving F:\jenkins\jenkins-slave\workspace\maven-plugins-windows\maven-jarsigner-plugin\pom.xml to org.apache.maven.plugins/maven-jarsigner-plugin/1.5-SNAPSHOT/maven-jarsigner-plugin-1.5-SNAPSHOT.pom
[JENKINS] Archiving F:\jenkins\jenkins-slave\workspace\maven-plugins-windows\maven-jarsigner-plugin\target\maven-jarsigner-plugin-1.5-SNAPSHOT.jar to org.apache.maven.plugins/maven-jarsigner-plugin/1.5-SNAPSHOT/maven-jarsigner-plugin-1.5-SNAPSHOT.jar
[JENKINS] Archiving F:\jenkins\jenkins-slave\workspace\maven-plugins-windows\maven-ejb-plugin\pom.xml to org.apache.maven.plugins/maven-ejb-plugin/3.0.0-SNAPSHOT/maven-ejb-plugin-3.0.0-SNAPSHOT.pom
[JENKINS] Archiving F:\jenkins\jenkins-slave\workspace\maven-plugins-windows\maven-ejb-plugin\target\maven-ejb-plugin-3.0.0-SNAPSHOT.jar to org.apache.maven.plugins/maven-ejb-plugin/3.0.0-SNAPSHOT/maven-ejb-plugin-3.0.0-SNAPSHOT.jar
[JENKINS] Archiving F:\jenkins\jenkins-slave\workspace\maven-plugins-windows\maven-changelog-plugin\pom.xml to org.apache.maven.plugins/maven-changelog-plugin/2.4-SNAPSHOT/maven-changelog-plugin-2.4-SNAPSHOT.pom
[JENKINS] Archiving F:\jenkins\jenkins-slave\workspace\maven-plugins-windows\maven-changelog-plugin\target\maven-changelog-plugin-2.4-SNAPSHOT.jar to org.apache.maven.plugins/maven-changelog-plugin/2.4-SNAPSHOT/maven-changelog-plugin-2.4-SNAPSHOT.jar
[JENKINS] Archiving F:\jenkins\jenkins-slave\workspace\maven-plugins-windows\maven-help-plugin\pom.xml to org.apache.maven.plugins/maven-help-plugin/3.0.0-SNAPSHOT/maven-help-plugin-3.0.0-SNAPSHOT.pom
[JENKINS] Archiving F:\jenkins\jenkins-slave\workspace\maven-plugins-windows\maven-help-plugin\target\maven-help-plugin-3.0.0-SNAPSHOT.jar to org.apache.maven.plugins/maven-help-plugin/3.0.0-SNAPSHOT/maven-help-plugin-3.0.0-SNAPSHOT.jar
[JENKINS] Archiving F:\jenkins\jenkins-slave\workspace\maven-plugins-windows\maven-war-plugin\pom.xml to org.apache.maven.plugins/maven-war-plugin/3.1.1-SNAPSHOT/maven-war-plugin-3.1.1-SNAPSHOT.pom
[JENKINS] Archiving F:\jenkins\jenkins-slave\workspace\maven-plugins-windows\maven-war-plugin\target\maven-war-plugin-3.1.1-SNAPSHOT.jar to org.apache.maven.plugins/maven-war-plugin/3.1.1-SNAPSHOT/maven-war-plugin-3.1.1-SNAPSHOT.jar
[JENKINS] Archiving F:\jenkins\jenkins-slave\workspace\maven-plugins-windows\maven-ear-plugin\pom.xml to org.apache.maven.plugins/maven-ear-plugin/3.0.0-SNAPSHOT/maven-ear-plugin-3.0.0-SNAPSHOT.pom
[JENKINS] Archiving F:\jenkins\jenkins-slave\workspace\maven-plugins-windows\maven-ear-plugin\target\maven-ear-plugin-3.0.0-SNAPSHOT.jar to org.apache.maven.plugins/maven-ear-plugin/3.0.0-SNAPSHOT/maven-ear-plugin-3.0.0-SNAPSHOT.jar
[JENKINS] Archiving F:\jenkins\jenkins-slave\workspace\maven-plugins-windows\maven-invoker-plugin\pom.xml to org.apache.maven.plugins/maven-invoker-plugin/3.0.1-SNAPSHOT/maven-invoker-plugin-3.0.1-SNAPSHOT.pom
[JENKINS] Archiving F:\jenkins\jenkins-slave\workspace\maven-plugins-windows\maven-jdeps-plugin\pom.xml to org.apache.maven.plugins/maven-jdeps-plugin/3.0.1-SNAPSHOT/maven-jdeps-plugin-3.0.1-SNAPSHOT.pom
[JENKINS] Archiving F:\jenkins\jenkins-slave\workspace\maven-plugins-windows\maven-jdeps-plugin\target\maven-jdeps-plugin-3.0.1-SNAPSHOT.jar to org.apache.maven.plugins/maven-jdeps-plugin/3.0.1-SNAPSHOT/maven-jdeps-plugin-3.0.1-SNAPSHOT.jar
[JENKINS] Archiving F:\jenkins\jenkins-slave\workspace\maven-plugins-windows\maven-doap-plugin\pom.xml to org.apache.maven.plugins/maven-doap-plugin/1.3-SNAPSHOT/maven-doap-plugin-1.3-SNAPSHOT.pom
[JENKINS] Archiving F:\jenkins\jenkins-slave\workspace\maven-plugins-windows\maven-doap-plugin\target\maven-doap-plugin-1.3-SNAPSHOT.jar to org.apache.maven.plugins/maven-doap-plugin/1.3-SNAPSHOT/maven-doap-plugin-1.3-SNAPSHOT.jar
[JENKINS] Archiving F:\jenkins\jenkins-slave\workspace\maven-plugins-windows\maven-site-plugin\dependency-reduced-pom.xml to org.apache.maven.plugins/maven-site-plugin/3.7-SNAPSHOT/maven-site-plugin-3.7-SNAPSHOT.pom
[JENKINS] Archiving F:\jenkins\jenkins-slave\workspace\maven-plugins-windows\maven-site-plugin\target\maven-site-plugin-3.7-SNAPSHOT.jar to org.apache.maven.plugins/maven-site-plugin/3.7-SNAPSHOT/maven-site-plugin-3.7-SNAPSHOT.jar
[JENKINS] Archiving F:\jenkins\jenkins-slave\workspace\maven-plugins-windows\maven-changes-plugin\pom.xml to org.apache.maven.plugins/maven-changes-plugin/3.0.0-SNAPSHOT/maven-changes-plugin-3.0.0-SNAPSHOT.pom
[JENKINS] Archiving F:\jenkins\jenkins-slave\workspace\maven-plugins-windows\maven-changes-plugin\target\maven-changes-plugin-3.0.0-SNAPSHOT.jar to org.apache.maven.plugins/maven-changes-plugin/3.0.0-SNAPSHOT/maven-changes-plugin-3.0.0-SNAPSHOT.jar
[JENKINS] Archiving F:\jenkins\jenkins-slave\workspace\maven-plugins-windows\maven-deploy-plugin\pom.xml to org.apache.maven.plugins/maven-deploy-plugin/3.0.0-SNAPSHOT/maven-deploy-plugin-3.0.0-SNAPSHOT.pom
[JENKINS] Archiving F:\jenkins\jenkins-slave\workspace\maven-plugins-windows\maven-deploy-plugin\target\maven-deploy-plugin-3.0.0-SNAPSHOT.jar to org.apache.maven.plugins/maven-deploy-plugin/3.0.0-SNAPSHOT/maven-deploy-plugin-3.0.0-SNAPSHOT.jar
[JENKINS] Archiving F:\jenkins\jenkins-slave\workspace\maven-plugins-windows\maven-repository-plugin\pom.xml to org.apache.maven.plugins/maven-repository-plugin/2.5-SNAPSHOT/maven-repository-plugin-2.5-SNAPSHOT.pom
[JENKINS] Archiving F:\jenkins\jenkins-slave\workspace\maven-plugins-windows\maven-repository-plugin\target\maven-repository-plugin-2.5-SNAPSHOT.jar to org.apache.maven.plugins/maven-repository-plugin/2.5-SNAPSHOT/maven-repository-plugin-2.5-SNAPSHOT.jar
[JENKINS] Archiving F:\jenkins\jenkins-slave\workspace\maven-plugins-windows\maven-source-plugin\pom.xml to org.apache.maven.plugins/maven-source-plugin/3.0.2-SNAPSHOT/maven-source-plugin-3.0.2-SNAPSHOT.pom
[JENKINS] Archiving F:\jenkins\jenkins-slave\workspace\maven-plugins-windows\maven-source-plugin\target\maven-source-plugin-3.0.2-SNAPSHOT.jar to org.apache.maven.plugins/maven-source-plugin/3.0.2-SNAPSHOT/maven-source-plugin-3.0.2-SNAPSHOT.jar
[JENKINS] Archiving F:\jenkins\jenkins-slave\workspace\maven-plugins-windows\maven-pdf-plugin\pom.xml to org.apache.maven.plugins/maven-pdf-plugin/1.4-SNAPSHOT/maven-pdf-plugin-1.4-SNAPSHOT.pom
[JENKINS] Archiving F:\jenkins\jenkins-slave\workspace\maven-plugins-windows\maven-pdf-plugin\target\maven-pdf-plugin-1.4-SNAPSHOT.jar to org.apache.maven.plugins/maven-pdf-plugin/1.4-SNAPSHOT/maven-pdf-plugin-1.4-SNAPSHOT.jar
[JENKINS] Archiving F:\jenkins\jenkins-slave\workspace\maven-plugins-windows\maven-jar-plugin\pom.xml to org.apache.maven.plugins/maven-jar-plugin/3.0.3-SNAPSHOT/maven-jar-plugin-3.0.3-SNAPSHOT.pom
[JENKINS] Archiving F:\jenkins\jenkins-slave\workspace\maven-plugins-windows\maven-jar-plugin\target\maven-jar-plugin-3.0.3-SNAPSHOT.jar to org.apache.maven.plugins/maven-jar-plugin/3.0.3-SNAPSHOT/maven-jar-plugin-3.0.3-SNAPSHOT.jar
[JENKINS] Archiving F:\jenkins\jenkins-slave\workspace\maven-plugins-windows\maven-javadoc-plugin\pom.xml to org.apache.maven.plugins/maven-javadoc-plugin/3.0.0-SNAPSHOT/maven-javadoc-plugin-3.0.0-SNAPSHOT.pom
[JENKINS] Archiving F:\jenkins\jenkins-slave\workspace\maven-plugins-windows\maven-javadoc-plugin\target\maven-javadoc-plugin-3.0.0-SNAPSHOT.jar to org.apache.maven.plugins/maven-javadoc-plugin/3.0.0-SNAPSHOT/maven-javadoc-plugin-3.0.0-SNAPSHOT.jar
[Fast Archiver] Compressed 413.54 KB of artifacts by 23.2% relative to #1993
[JENKINS] Archiving F:\jenkins\jenkins-slave\workspace\maven-plugins-windows\maven-dependency-plugin\pom.xml to org.apache.maven.plugins/maven-dependency-plugin/3.0.2-SNAPSHOT/maven-dependency-plugin-3.0.2-SNAPSHOT.pom
[JENKINS] Archiving F:\jenkins\jenkins-slave\workspace\maven-plugins-windows\maven-dependency-plugin\target\maven-dependency-plugin-3.0.2-SNAPSHOT.jar to org.apache.maven.plugins/maven-dependency-plugin/3.0.2-SNAPSHOT/maven-dependency-plugin-3.0.2-SNAPSHOT.jar
[JENKINS] Archiving F:\jenkins\jenkins-slave\workspace\maven-plugins-windows\maven-rar-plugin\pom.xml to org.apache.maven.plugins/maven-rar-plugin/3.0.0-SNAPSHOT/maven-rar-plugin-3.0.0-SNAPSHOT.pom
[JENKINS] Archiving F:\jenkins\jenkins-slave\workspace\maven-plugins-windows\maven-rar-plugin\target\maven-rar-plugin-3.0.0-SNAPSHOT.jar to org.apache.maven.plugins/maven-rar-plugin/3.0.0-SNAPSHOT/maven-rar-plugin-3.0.0-SNAPSHOT.jar
[JENKINS] Archiving F:\jenkins\jenkins-slave\workspace\maven-plugins-windows\maven-checkstyle-plugin\pom.xml to org.apache.maven.plugins/maven-checkstyle-plugin/3.0.0-SNAPSHOT/maven-checkstyle-plugin-3.0.0-SNAPSHOT.pom
[JENKINS] Archiving F:\jenkins\jenkins-slave\workspace\maven-plugins-windows\maven-checkstyle-plugin\target\maven-checkstyle-plugin-3.0.0-SNAPSHOT.jar to org.apache.maven.plugins/maven-checkstyle-plugin/3.0.0-SNAPSHOT/maven-checkstyle-plugin-3.0.0-SNAPSHOT.jar
Sending e-mails to: [hidden email]
Sending e-mails to: [hidden email] [hidden email]
channel stopped
Java HotSpot(TM) 64-Bit Server VM warning: ignoring option MaxPermSize=512m; support was removed in 8.0
[WARNINGS] Skipping publisher since build result is FAILURE
Reply | Threaded
Open this post in threaded view
|  
Report Content as Inappropriate

Build failed in Jenkins: maven-plugins-windows #1995

Apache Jenkins Server-2
See <https://builds.apache.org/job/maven-plugins-windows/1995/display/redirect?page=changes>

Changes:

[olamy] [MINVOKER-223]  ensure post build script is executed only once

------------------------------------------
[...truncated 586.32 KB...]
[INFO] ------------------------------------------------------------------------
[INFO] Building Apache Maven Plugins Aggregator 1-SNAPSHOT
[INFO] ------------------------------------------------------------------------
[INFO]
[INFO] --- maven-clean-plugin:2.5:clean (default-clean) @ maven-plugins-aggregator ---
[INFO] Deleting <https://builds.apache.org/job/maven-plugins-windows/ws/target>
[INFO]
[INFO] --- maven-enforcer-plugin:1.3.1:enforce (enforce-bytecode-version) @ maven-plugins-aggregator ---
[INFO]
[INFO] --- maven-enforcer-plugin:1.3.1:enforce (ban-known-bad-maven-versions) @ maven-plugins-aggregator ---
[INFO]
[INFO] --- maven-remote-resources-plugin:1.5:process (default) @ maven-plugins-aggregator ---
[INFO]
[INFO] --- maven-site-plugin:3.3:attach-descriptor (attach-descriptor) @ maven-plugins-aggregator ---
[INFO]
[INFO] --- maven-install-plugin:2.5.1:install (default-install) @ maven-plugins-aggregator ---
[INFO] Installing <https://builds.apache.org/job/maven-plugins-windows/ws/pom.xml> to f:\jenkins\jenkins-slave\maven-repositories\0\org\apache\maven\plugins\maven-plugins-aggregator\1-SNAPSHOT\maven-plugins-aggregator-1-SNAPSHOT.pom
[INFO] ------------------------------------------------------------------------
[INFO] Reactor Summary:
[INFO]
[INFO] Apache Maven ACR Plugin ........................... SUCCESS [31.183s]
[INFO] Apache Maven AntRun Plugin ........................ SUCCESS [16.328s]
[INFO] Apache Maven Changelog Plugin ..................... SUCCESS [15.666s]
[INFO] Apache Maven Changes Plugin ....................... SUCCESS [26.641s]
[INFO] Apache Maven Clean Plugin ......................... SUCCESS [12.898s]
[INFO] Apache Maven Compiler Plugin ...................... SUCCESS [21.234s]
[INFO] Apache Maven Deploy Plugin ........................ SUCCESS [15.405s]
[INFO] Apache Maven Documentation Checker Plugin ......... SUCCESS [6.743s]
[INFO] Apache Maven EAR Plugin ........................... SUCCESS [13.104s]
[INFO] Apache Maven EJB Plugin ........................... SUCCESS [13.376s]
[INFO] Apache Maven Help Plugin .......................... SUCCESS [15.226s]
[INFO] Apache Maven Install Plugin ....................... SUCCESS [15.091s]
[INFO] Apache Maven Jarsigner Plugin ..................... SUCCESS [4.271s]
[INFO] Apache Maven Javadoc Plugin ....................... SUCCESS [2:36.953s]
[INFO] Apache Maven JDeps Plugin ......................... SUCCESS [6.703s]
[INFO] Apache Maven Linkcheck Plugin ..................... SUCCESS [5.316s]
[INFO] Apache Maven Patch Plugin ......................... SUCCESS [3.644s]
[INFO] Apache Maven PDF Plugin ........................... SUCCESS [12.851s]
[INFO] Apache Maven RAR Plugin ........................... SUCCESS [10.207s]
[INFO] Apache Maven Repository Plugin .................... SUCCESS [8.777s]
[INFO] Apache Maven Resources Plugin ..................... SUCCESS [14.421s]
[INFO] Apache Maven Site Plugin .......................... SUCCESS [29.253s]
[INFO] Apache Maven Source Plugin ........................ SUCCESS [12.033s]
[INFO] Apache Maven Stage Plugin ......................... SUCCESS [7.673s]
[INFO] Apache Maven Toolchains Plugin .................... SUCCESS [3.764s]
[INFO] Apache Maven Verifier Plugin ...................... SUCCESS [6.387s]
[INFO] Apache Maven WAR Plugin ........................... SUCCESS [24.879s]
[INFO] Apache Maven DOAP Plugin .......................... SUCCESS [12.265s]
[INFO] Apache Maven Invoker Plugin ....................... FAILURE [0.286s]
[INFO] Apache Maven JAR Plugin ........................... SUCCESS [8.993s]
[INFO] Apache Maven Assembly Plugin ...................... SUCCESS [26.635s]
[INFO] Apache Maven Checkstyle Plugin .................... SUCCESS [39.334s]
[INFO] Apache Maven PMD Plugin ........................... SUCCESS [26.247s]
[INFO] Apache Maven Project Info Reports Plugin .......... FAILURE [2.689s]
[INFO] Apache Maven Remote Resources Plugin .............. SUCCESS [11.363s]
[INFO] Apache Maven Shade Plugin ......................... SUCCESS [14.859s]
[INFO] Apache Maven SCM Publish Plugin ................... SUCCESS [6.031s]
[INFO] Apache Maven Dependency Plugin .................... SUCCESS [1:13.460s]
[INFO] Apache Maven Plugins Aggregator ................... SUCCESS [1.019s]
[INFO] ------------------------------------------------------------------------
[INFO] BUILD FAILURE
[INFO] ------------------------------------------------------------------------
[INFO] Total time: 12:24.722s
[INFO] Finished at: Mon Jul 17 07:55:24 UTC 2017
[INFO] Final Memory: 85M/667M
[INFO] ------------------------------------------------------------------------
[JENKINS] Archiving F:\jenkins\jenkins-slave\workspace\maven-plugins-windows\maven-antrun-plugin\pom.xml to org.apache.maven.plugins/maven-antrun-plugin/3.0.0-SNAPSHOT/maven-antrun-plugin-3.0.0-SNAPSHOT.pom
[JENKINS] Archiving F:\jenkins\jenkins-slave\workspace\maven-plugins-windows\maven-antrun-plugin\target\maven-antrun-plugin-3.0.0-SNAPSHOT.jar to org.apache.maven.plugins/maven-antrun-plugin/3.0.0-SNAPSHOT/maven-antrun-plugin-3.0.0-SNAPSHOT.jar
[ERROR] Failed to execute goal on project maven-invoker-plugin: Could not resolve dependencies for project org.apache.maven.plugins:maven-invoker-plugin:maven-plugin:3.0.1-SNAPSHOT: Could not find artifact org.apache.maven.shared:maven-script-interpreter:jar:1.2 in central (http://repo.maven.apache.org/maven2) -> [Help 1]
org.apache.maven.lifecycle.LifecycleExecutionException: Failed to execute goal on project maven-invoker-plugin: Could not resolve dependencies for project org.apache.maven.plugins:maven-invoker-plugin:maven-plugin:3.0.1-SNAPSHOT: Could not find artifact org.apache.maven.shared:maven-script-interpreter:jar:1.2 in central (http://repo.maven.apache.org/maven2)
        at org.apache.maven.lifecycle.internal.LifecycleDependencyResolver.getDependencies(LifecycleDependencyResolver.java:210)
        at org.apache.maven.lifecycle.internal.LifecycleDependencyResolver.resolveProjectDependencies(LifecycleDependencyResolver.java:117)
        at org.apache.maven.lifecycle.internal.MojoExecutor.ensureDependenciesAreResolved(MojoExecutor.java:258)
        at org.apache.maven.lifecycle.internal.MojoExecutor.execute(MojoExecutor.java:201)
        at org.apache.maven.lifecycle.internal.MojoExecutor.execute(MojoExecutor.java:153)
        at org.apache.maven.lifecycle.internal.MojoExecutor.execute(MojoExecutor.java:145)
        at org.apache.maven.lifecycle.internal.LifecycleModuleBuilder.buildProject(LifecycleModuleBuilder.java:84)
        at org.apache.maven.lifecycle.internal.LifecycleModuleBuilder.buildProject(LifecycleModuleBuilder.java:59)
        at org.apache.maven.lifecycle.internal.LifecycleStarter.singleThreadedBuild(LifecycleStarter.java:183)
        at org.apache.maven.lifecycle.internal.LifecycleStarter.execute(LifecycleStarter.java:161)
        at org.apache.maven.DefaultMaven.doExecute(DefaultMaven.java:320)
        at org.apache.maven.DefaultMaven.execute(DefaultMaven.java:156)
        at org.jvnet.hudson.maven3.launcher.Maven3Launcher.main(Maven3Launcher.java:117)
        at sun.reflect.NativeMethodAccessorImpl.invoke0(Native Method)
        at sun.reflect.NativeMethodAccessorImpl.invoke(Unknown Source)
        at sun.reflect.DelegatingMethodAccessorImpl.invoke(Unknown Source)
        at java.lang.reflect.Method.invoke(Unknown Source)
        at org.codehaus.plexus.classworlds.launcher.Launcher.launchStandard(Launcher.java:329)
        at org.codehaus.plexus.classworlds.launcher.Launcher.launch(Launcher.java:239)
        at org.jvnet.hudson.maven3.agent.Maven3Main.launch(Maven3Main.java:181)
        at sun.reflect.NativeMethodAccessorImpl.invoke0(Native Method)
        at sun.reflect.NativeMethodAccessorImpl.invoke(Unknown Source)
        at sun.reflect.DelegatingMethodAccessorImpl.invoke(Unknown Source)
        at java.lang.reflect.Method.invoke(Unknown Source)
        at hudson.maven.Maven3Builder.call(Maven3Builder.java:139)
        at hudson.maven.Maven3Builder.call(Maven3Builder.java:70)
        at hudson.remoting.UserRequest.perform(UserRequest.java:153)
        at hudson.remoting.UserRequest.perform(UserRequest.java:50)
        at hudson.remoting.Request$2.run(Request.java:336)
        at hudson.remoting.InterceptingExecutorService$1.call(InterceptingExecutorService.java:68)
        at java.util.concurrent.FutureTask.run(Unknown Source)
        at java.util.concurrent.ThreadPoolExecutor.runWorker(Unknown Source)
        at java.util.concurrent.ThreadPoolExecutor$Worker.run(Unknown Source)
        at java.lang.Thread.run(Unknown Source)
Caused by: org.apache.maven.project.DependencyResolutionException: Could not resolve dependencies for project org.apache.maven.plugins:maven-invoker-plugin:maven-plugin:3.0.1-SNAPSHOT: Could not find artifact org.apache.maven.shared:maven-script-interpreter:jar:1.2 in central (http://repo.maven.apache.org/maven2)
        at org.apache.maven.project.DefaultProjectDependenciesResolver.resolve(DefaultProjectDependenciesResolver.java:189)
        at org.apache.maven.lifecycle.internal.LifecycleDependencyResolver.getDependencies(LifecycleDependencyResolver.java:185)
        ... 33 more
Caused by: org.sonatype.aether.resolution.DependencyResolutionException: Could not find artifact org.apache.maven.shared:maven-script-interpreter:jar:1.2 in central (http://repo.maven.apache.org/maven2)
        at org.sonatype.aether.impl.internal.DefaultRepositorySystem.resolveDependencies(DefaultRepositorySystem.java:375)
        at org.apache.maven.project.DefaultProjectDependenciesResolver.resolve(DefaultProjectDependenciesResolver.java:183)
        ... 34 more
Caused by: org.sonatype.aether.resolution.ArtifactResolutionException: Could not find artifact org.apache.maven.shared:maven-script-interpreter:jar:1.2 in central (http://repo.maven.apache.org/maven2)
        at org.sonatype.aether.impl.internal.DefaultArtifactResolver.resolve(DefaultArtifactResolver.java:538)
        at org.sonatype.aether.impl.internal.DefaultArtifactResolver.resolveArtifacts(DefaultArtifactResolver.java:216)
        at org.sonatype.aether.impl.internal.DefaultRepositorySystem.resolveDependencies(DefaultRepositorySystem.java:358)
        ... 35 more
Caused by: org.sonatype.aether.transfer.ArtifactNotFoundException: Could not find artifact org.apache.maven.shared:maven-script-interpreter:jar:1.2 in central (http://repo.maven.apache.org/maven2)
        at org.sonatype.aether.connector.wagon.WagonRepositoryConnector$4.wrap(WagonRepositoryConnector.java:947)
        at org.sonatype.aether.connector.wagon.WagonRepositoryConnector$4.wrap(WagonRepositoryConnector.java:941)
        at org.sonatype.aether.connector.wagon.WagonRepositoryConnector$GetTask.run(WagonRepositoryConnector.java:669)
        at org.sonatype.aether.util.concurrency.RunnableErrorForwarder$1.run(RunnableErrorForwarder.java:60)
        ... 3 more
[ERROR] Failed to execute goal org.codehaus.mojo:keytool-maven-plugin:1.0:genkey (init) on project maven-project-info-reports-plugin: Result of cmd.exe /X /C '""C:\Program Files\Java\jre1.8.0_121\..\bin\keytool.exe" -genkey -dname "cn=jetty, ou=jetty, L=Unknown, ST=Unknown, o=Apache, c=Unknown" -alias apache -keypass apache -keystore F:\jenkins\jenkins-slave\workspace\maven-plugins-windows\maven-project-info-reports-plugin/target/jetty.jks -storepass apache -validity 365 -keyalg RSA"' execution is: '1': The system cannot find the path specified.. -> [Help 2]
org.apache.maven.lifecycle.LifecycleExecutionException: Failed to execute goal org.codehaus.mojo:keytool-maven-plugin:1.0:genkey (init) on project maven-project-info-reports-plugin: Result of cmd.exe /X /C '""C:\Program Files\Java\jre1.8.0_121\..\bin\keytool.exe" -genkey -dname "cn=jetty, ou=jetty, L=Unknown, ST=Unknown, o=Apache, c=Unknown" -alias apache -keypass apache -keystore F:\jenkins\jenkins-slave\workspace\maven-plugins-windows\maven-project-info-reports-plugin/target/jetty.jks -storepass apache -validity 365 -keyalg RSA"' execution is: '1': The system cannot find the path specified..
        at org.apache.maven.lifecycle.internal.MojoExecutor.execute(MojoExecutor.java:217)
        at org.apache.maven.lifecycle.internal.MojoExecutor.execute(MojoExecutor.java:153)
        at org.apache.maven.lifecycle.internal.MojoExecutor.execute(MojoExecutor.java:145)
        at org.apache.maven.lifecycle.internal.LifecycleModuleBuilder.buildProject(LifecycleModuleBuilder.java:84)
        at org.apache.maven.lifecycle.internal.LifecycleModuleBuilder.buildProject(LifecycleModuleBuilder.java:59)
        at org.apache.maven.lifecycle.internal.LifecycleStarter.singleThreadedBuild(LifecycleStarter.java:183)
        at org.apache.maven.lifecycle.internal.LifecycleStarter.execute(LifecycleStarter.java:161)
        at org.apache.maven.DefaultMaven.doExecute(DefaultMaven.java:320)
        at org.apache.maven.DefaultMaven.execute(DefaultMaven.java:156)
        at org.jvnet.hudson.maven3.launcher.Maven3Launcher.main(Maven3Launcher.java:117)
        at sun.reflect.NativeMethodAccessorImpl.invoke0(Native Method)
        at sun.reflect.NativeMethodAccessorImpl.invoke(Unknown Source)
        at sun.reflect.DelegatingMethodAccessorImpl.invoke(Unknown Source)
        at java.lang.reflect.Method.invoke(Unknown Source)
        at org.codehaus.plexus.classworlds.launcher.Launcher.launchStandard(Launcher.java:329)
        at org.codehaus.plexus.classworlds.launcher.Launcher.launch(Launcher.java:239)
        at org.jvnet.hudson.maven3.agent.Maven3Main.launch(Maven3Main.java:181)
        at sun.reflect.NativeMethodAccessorImpl.invoke0(Native Method)
        at sun.reflect.NativeMethodAccessorImpl.invoke(Unknown Source)
        at sun.reflect.DelegatingMethodAccessorImpl.invoke(Unknown Source)
        at java.lang.reflect.Method.invoke(Unknown Source)
        at hudson.maven.Maven3Builder.call(Maven3Builder.java:139)
        at hudson.maven.Maven3Builder.call(Maven3Builder.java:70)
        at hudson.remoting.UserRequest.perform(UserRequest.java:153)
        at hudson.remoting.UserRequest.perform(UserRequest.java:50)
        at hudson.remoting.Request$2.run(Request.java:336)
        at hudson.remoting.InterceptingExecutorService$1.call(InterceptingExecutorService.java:68)
        at java.util.concurrent.FutureTask.run(Unknown Source)
        at java.util.concurrent.ThreadPoolExecutor.runWorker(Unknown Source)
        at java.util.concurrent.ThreadPoolExecutor$Worker.run(Unknown Source)
        at java.lang.Thread.run(Unknown Source)
Caused by: org.apache.maven.plugin.MojoExecutionException: Result of cmd.exe /X /C '""C:\Program Files\Java\jre1.8.0_121\..\bin\keytool.exe" -genkey -dname "cn=jetty, ou=jetty, L=Unknown, ST=Unknown, o=Apache, c=Unknown" -alias apache -keypass apache -keystore F:\jenkins\jenkins-slave\workspace\maven-plugins-windows\maven-project-info-reports-plugin/target/jetty.jks -storepass apache -validity 365 -keyalg RSA"' execution is: '1': The system cannot find the path specified..
        at org.codehaus.mojo.keytool.GenkeyMojo.execute(GenkeyMojo.java:207)
        at org.apache.maven.plugin.DefaultBuildPluginManager.executeMojo(DefaultBuildPluginManager.java:101)
        at org.apache.maven.lifecycle.internal.MojoExecutor.execute(MojoExecutor.java:209)
        ... 30 more
[ERROR]
[ERROR] Re-run Maven using the -X switch to enable full debug logging.
[ERROR]
[ERROR] For more information about the errors and possible solutions, please read the following articles:
[ERROR] [Help 1] http://cwiki.apache.org/confluence/display/MAVEN/DependencyResolutionException
[ERROR] [Help 2] http://cwiki.apache.org/confluence/display/MAVEN/MojoExecutionException
[ERROR]
[ERROR] After correcting the problems, you can resume the build with the command
[ERROR]   mvn <goals> -rf :maven-invoker-plugin
[JENKINS] Archiving F:\jenkins\jenkins-slave\workspace\maven-plugins-windows\maven-linkcheck-plugin\pom.xml to org.apache.maven.plugins/maven-linkcheck-plugin/1.3-SNAPSHOT/maven-linkcheck-plugin-1.3-SNAPSHOT.pom
[JENKINS] Archiving F:\jenkins\jenkins-slave\workspace\maven-plugins-windows\maven-linkcheck-plugin\target\maven-linkcheck-plugin-1.3-SNAPSHOT.jar to org.apache.maven.plugins/maven-linkcheck-plugin/1.3-SNAPSHOT/maven-linkcheck-plugin-1.3-SNAPSHOT.jar
[JENKINS] Archiving F:\jenkins\jenkins-slave\workspace\maven-plugins-windows\maven-scm-publish-plugin\pom.xml to org.apache.maven.plugins/maven-scm-publish-plugin/1.2-SNAPSHOT/maven-scm-publish-plugin-1.2-SNAPSHOT.pom
[JENKINS] Archiving F:\jenkins\jenkins-slave\workspace\maven-plugins-windows\maven-scm-publish-plugin\target\maven-scm-publish-plugin-1.2-SNAPSHOT.jar to org.apache.maven.plugins/maven-scm-publish-plugin/1.2-SNAPSHOT/maven-scm-publish-plugin-1.2-SNAPSHOT.jar
[JENKINS] Archiving F:\jenkins\jenkins-slave\workspace\maven-plugins-windows\maven-acr-plugin\pom.xml to org.apache.maven.plugins/maven-acr-plugin/3.0.1-SNAPSHOT/maven-acr-plugin-3.0.1-SNAPSHOT.pom
[JENKINS] Archiving F:\jenkins\jenkins-slave\workspace\maven-plugins-windows\maven-acr-plugin\target\maven-acr-plugin-3.0.1-SNAPSHOT.jar to org.apache.maven.plugins/maven-acr-plugin/3.0.1-SNAPSHOT/maven-acr-plugin-3.0.1-SNAPSHOT.jar
[JENKINS] Archiving F:\jenkins\jenkins-slave\workspace\maven-plugins-windows\maven-install-plugin\pom.xml to org.apache.maven.plugins/maven-install-plugin/3.0.0-SNAPSHOT/maven-install-plugin-3.0.0-SNAPSHOT.pom
[JENKINS] Archiving F:\jenkins\jenkins-slave\workspace\maven-plugins-windows\maven-install-plugin\target\maven-install-plugin-3.0.0-SNAPSHOT.jar to org.apache.maven.plugins/maven-install-plugin/3.0.0-SNAPSHOT/maven-install-plugin-3.0.0-SNAPSHOT.jar
[JENKINS] Archiving F:\jenkins\jenkins-slave\workspace\maven-plugins-windows\maven-assembly-plugin\pom.xml to org.apache.maven.plugins/maven-assembly-plugin/3.1.0-SNAPSHOT/maven-assembly-plugin-3.1.0-SNAPSHOT.pom
[JENKINS] Archiving F:\jenkins\jenkins-slave\workspace\maven-plugins-windows\maven-assembly-plugin\target\maven-assembly-plugin-3.1.0-SNAPSHOT.jar to org.apache.maven.plugins/maven-assembly-plugin/3.1.0-SNAPSHOT/maven-assembly-plugin-3.1.0-SNAPSHOT.jar
[JENKINS] Archiving F:\jenkins\jenkins-slave\workspace\maven-plugins-windows\maven-docck-plugin\pom.xml to org.apache.maven.plugins/maven-docck-plugin/1.2-SNAPSHOT/maven-docck-plugin-1.2-SNAPSHOT.pom
[JENKINS] Archiving F:\jenkins\jenkins-slave\workspace\maven-plugins-windows\maven-docck-plugin\target\maven-docck-plugin-1.2-SNAPSHOT.jar to org.apache.maven.plugins/maven-docck-plugin/1.2-SNAPSHOT/maven-docck-plugin-1.2-SNAPSHOT.jar
[JENKINS] Archiving <https://builds.apache.org/job/maven-plugins-windows/ws/pom.xml> to org.apache.maven.plugins/maven-plugins-aggregator/1-SNAPSHOT/maven-plugins-aggregator-1-SNAPSHOT.pom
[JENKINS] Archiving F:\jenkins\jenkins-slave\workspace\maven-plugins-windows\maven-clean-plugin\pom.xml to org.apache.maven.plugins/maven-clean-plugin/3.0.1-SNAPSHOT/maven-clean-plugin-3.0.1-SNAPSHOT.pom
[JENKINS] Archiving F:\jenkins\jenkins-slave\workspace\maven-plugins-windows\maven-clean-plugin\target\maven-clean-plugin-3.0.1-SNAPSHOT.jar to org.apache.maven.plugins/maven-clean-plugin/3.0.1-SNAPSHOT/maven-clean-plugin-3.0.1-SNAPSHOT.jar
[JENKINS] Archiving F:\jenkins\jenkins-slave\workspace\maven-plugins-windows\maven-resources-plugin\pom.xml to org.apache.maven.plugins/maven-resources-plugin/3.0.3-SNAPSHOT/maven-resources-plugin-3.0.3-SNAPSHOT.pom
[JENKINS] Archiving F:\jenkins\jenkins-slave\workspace\maven-plugins-windows\maven-resources-plugin\target\maven-resources-plugin-3.0.3-SNAPSHOT.jar to org.apache.maven.plugins/maven-resources-plugin/3.0.3-SNAPSHOT/maven-resources-plugin-3.0.3-SNAPSHOT.jar
[JENKINS] Archiving F:\jenkins\jenkins-slave\workspace\maven-plugins-windows\maven-pmd-plugin\pom.xml to org.apache.maven.plugins/maven-pmd-plugin/3.9-SNAPSHOT/maven-pmd-plugin-3.9-SNAPSHOT.pom
[JENKINS] Archiving F:\jenkins\jenkins-slave\workspace\maven-plugins-windows\maven-pmd-plugin\target\maven-pmd-plugin-3.9-SNAPSHOT.jar to org.apache.maven.plugins/maven-pmd-plugin/3.9-SNAPSHOT/maven-pmd-plugin-3.9-SNAPSHOT.jar
[JENKINS] Archiving F:\jenkins\jenkins-slave\workspace\maven-plugins-windows\maven-shade-plugin\pom.xml to org.apache.maven.plugins/maven-shade-plugin/3.0.1-SNAPSHOT/maven-shade-plugin-3.0.1-SNAPSHOT.pom
[JENKINS] Archiving F:\jenkins\jenkins-slave\workspace\maven-plugins-windows\maven-shade-plugin\target\maven-shade-plugin-3.0.1-SNAPSHOT.jar to org.apache.maven.plugins/maven-shade-plugin/3.0.1-SNAPSHOT/maven-shade-plugin-3.0.1-SNAPSHOT.jar
[JENKINS] Archiving F:\jenkins\jenkins-slave\workspace\maven-plugins-windows\maven-toolchains-plugin\pom.xml to org.apache.maven.plugins/maven-toolchains-plugin/3.0.0-SNAPSHOT/maven-toolchains-plugin-3.0.0-SNAPSHOT.pom
[JENKINS] Archiving F:\jenkins\jenkins-slave\workspace\maven-plugins-windows\maven-toolchains-plugin\target\maven-toolchains-plugin-3.0.0-SNAPSHOT.jar to org.apache.maven.plugins/maven-toolchains-plugin/3.0.0-SNAPSHOT/maven-toolchains-plugin-3.0.0-SNAPSHOT.jar
[JENKINS] Archiving F:\jenkins\jenkins-slave\workspace\maven-plugins-windows\maven-remote-resources-plugin\pom.xml to org.apache.maven.plugins/maven-remote-resources-plugin/1.6-SNAPSHOT/maven-remote-resources-plugin-1.6-SNAPSHOT.pom
[JENKINS] Archiving F:\jenkins\jenkins-slave\workspace\maven-plugins-windows\maven-remote-resources-plugin\target\maven-remote-resources-plugin-1.6-SNAPSHOT.jar to org.apache.maven.plugins/maven-remote-resources-plugin/1.6-SNAPSHOT/maven-remote-resources-plugin-1.6-SNAPSHOT.jar
[JENKINS] Archiving F:\jenkins\jenkins-slave\workspace\maven-plugins-windows\maven-project-info-reports-plugin\pom.xml to org.apache.maven.plugins/maven-project-info-reports-plugin/2.10-SNAPSHOT/maven-project-info-reports-plugin-2.10-SNAPSHOT.pom
[JENKINS] Archiving F:\jenkins\jenkins-slave\workspace\maven-plugins-windows\maven-patch-plugin\pom.xml to org.apache.maven.plugins/maven-patch-plugin/1.3-SNAPSHOT/maven-patch-plugin-1.3-SNAPSHOT.pom
[JENKINS] Archiving F:\jenkins\jenkins-slave\workspace\maven-plugins-windows\maven-patch-plugin\target\maven-patch-plugin-1.3-SNAPSHOT.jar to org.apache.maven.plugins/maven-patch-plugin/1.3-SNAPSHOT/maven-patch-plugin-1.3-SNAPSHOT.jar
[JENKINS] Archiving F:\jenkins\jenkins-slave\workspace\maven-plugins-windows\maven-compiler-plugin\pom.xml to org.apache.maven.plugins/maven-compiler-plugin/3.6.2-SNAPSHOT/maven-compiler-plugin-3.6.2-SNAPSHOT.pom
[JENKINS] Archiving F:\jenkins\jenkins-slave\workspace\maven-plugins-windows\maven-compiler-plugin\target\maven-compiler-plugin-3.6.2-SNAPSHOT.jar to org.apache.maven.plugins/maven-compiler-plugin/3.6.2-SNAPSHOT/maven-compiler-plugin-3.6.2-SNAPSHOT.jar
[JENKINS] Archiving F:\jenkins\jenkins-slave\workspace\maven-plugins-windows\maven-stage-plugin\pom.xml to org.apache.maven.plugins/maven-stage-plugin/1.1-SNAPSHOT/maven-stage-plugin-1.1-SNAPSHOT.pom
[JENKINS] Archiving F:\jenkins\jenkins-slave\workspace\maven-plugins-windows\maven-stage-plugin\target\maven-stage-plugin-1.1-SNAPSHOT.jar to org.apache.maven.plugins/maven-stage-plugin/1.1-SNAPSHOT/maven-stage-plugin-1.1-SNAPSHOT.jar
[JENKINS] Archiving F:\jenkins\jenkins-slave\workspace\maven-plugins-windows\maven-verifier-plugin\pom.xml to org.apache.maven.plugins/maven-verifier-plugin/3.0.0-SNAPSHOT/maven-verifier-plugin-3.0.0-SNAPSHOT.pom
[JENKINS] Archiving F:\jenkins\jenkins-slave\workspace\maven-plugins-windows\maven-verifier-plugin\target\maven-verifier-plugin-3.0.0-SNAPSHOT.jar to org.apache.maven.plugins/maven-verifier-plugin/3.0.0-SNAPSHOT/maven-verifier-plugin-3.0.0-SNAPSHOT.jar
[JENKINS] Archiving F:\jenkins\jenkins-slave\workspace\maven-plugins-windows\maven-jarsigner-plugin\pom.xml to org.apache.maven.plugins/maven-jarsigner-plugin/1.5-SNAPSHOT/maven-jarsigner-plugin-1.5-SNAPSHOT.pom
[JENKINS] Archiving F:\jenkins\jenkins-slave\workspace\maven-plugins-windows\maven-jarsigner-plugin\target\maven-jarsigner-plugin-1.5-SNAPSHOT.jar to org.apache.maven.plugins/maven-jarsigner-plugin/1.5-SNAPSHOT/maven-jarsigner-plugin-1.5-SNAPSHOT.jar
[JENKINS] Archiving F:\jenkins\jenkins-slave\workspace\maven-plugins-windows\maven-ejb-plugin\pom.xml to org.apache.maven.plugins/maven-ejb-plugin/3.0.0-SNAPSHOT/maven-ejb-plugin-3.0.0-SNAPSHOT.pom
[JENKINS] Archiving F:\jenkins\jenkins-slave\workspace\maven-plugins-windows\maven-ejb-plugin\target\maven-ejb-plugin-3.0.0-SNAPSHOT.jar to org.apache.maven.plugins/maven-ejb-plugin/3.0.0-SNAPSHOT/maven-ejb-plugin-3.0.0-SNAPSHOT.jar
[JENKINS] Archiving F:\jenkins\jenkins-slave\workspace\maven-plugins-windows\maven-changelog-plugin\pom.xml to org.apache.maven.plugins/maven-changelog-plugin/2.4-SNAPSHOT/maven-changelog-plugin-2.4-SNAPSHOT.pom
[JENKINS] Archiving F:\jenkins\jenkins-slave\workspace\maven-plugins-windows\maven-changelog-plugin\target\maven-changelog-plugin-2.4-SNAPSHOT.jar to org.apache.maven.plugins/maven-changelog-plugin/2.4-SNAPSHOT/maven-changelog-plugin-2.4-SNAPSHOT.jar
[JENKINS] Archiving F:\jenkins\jenkins-slave\workspace\maven-plugins-windows\maven-help-plugin\pom.xml to org.apache.maven.plugins/maven-help-plugin/3.0.0-SNAPSHOT/maven-help-plugin-3.0.0-SNAPSHOT.pom
[JENKINS] Archiving F:\jenkins\jenkins-slave\workspace\maven-plugins-windows\maven-help-plugin\target\maven-help-plugin-3.0.0-SNAPSHOT.jar to org.apache.maven.plugins/maven-help-plugin/3.0.0-SNAPSHOT/maven-help-plugin-3.0.0-SNAPSHOT.jar
[JENKINS] Archiving F:\jenkins\jenkins-slave\workspace\maven-plugins-windows\maven-war-plugin\pom.xml to org.apache.maven.plugins/maven-war-plugin/3.1.1-SNAPSHOT/maven-war-plugin-3.1.1-SNAPSHOT.pom
[JENKINS] Archiving F:\jenkins\jenkins-slave\workspace\maven-plugins-windows\maven-war-plugin\target\maven-war-plugin-3.1.1-SNAPSHOT.jar to org.apache.maven.plugins/maven-war-plugin/3.1.1-SNAPSHOT/maven-war-plugin-3.1.1-SNAPSHOT.jar
[JENKINS] Archiving F:\jenkins\jenkins-slave\workspace\maven-plugins-windows\maven-ear-plugin\pom.xml to org.apache.maven.plugins/maven-ear-plugin/3.0.0-SNAPSHOT/maven-ear-plugin-3.0.0-SNAPSHOT.pom
[JENKINS] Archiving F:\jenkins\jenkins-slave\workspace\maven-plugins-windows\maven-ear-plugin\target\maven-ear-plugin-3.0.0-SNAPSHOT.jar to org.apache.maven.plugins/maven-ear-plugin/3.0.0-SNAPSHOT/maven-ear-plugin-3.0.0-SNAPSHOT.jar
[JENKINS] Archiving F:\jenkins\jenkins-slave\workspace\maven-plugins-windows\maven-invoker-plugin\pom.xml to org.apache.maven.plugins/maven-invoker-plugin/3.0.1-SNAPSHOT/maven-invoker-plugin-3.0.1-SNAPSHOT.pom
[JENKINS] Archiving F:\jenkins\jenkins-slave\workspace\maven-plugins-windows\maven-jdeps-plugin\pom.xml to org.apache.maven.plugins/maven-jdeps-plugin/3.0.1-SNAPSHOT/maven-jdeps-plugin-3.0.1-SNAPSHOT.pom
[JENKINS] Archiving F:\jenkins\jenkins-slave\workspace\maven-plugins-windows\maven-jdeps-plugin\target\maven-jdeps-plugin-3.0.1-SNAPSHOT.jar to org.apache.maven.plugins/maven-jdeps-plugin/3.0.1-SNAPSHOT/maven-jdeps-plugin-3.0.1-SNAPSHOT.jar
[JENKINS] Archiving F:\jenkins\jenkins-slave\workspace\maven-plugins-windows\maven-doap-plugin\pom.xml to org.apache.maven.plugins/maven-doap-plugin/1.3-SNAPSHOT/maven-doap-plugin-1.3-SNAPSHOT.pom
[JENKINS] Archiving F:\jenkins\jenkins-slave\workspace\maven-plugins-windows\maven-doap-plugin\target\maven-doap-plugin-1.3-SNAPSHOT.jar to org.apache.maven.plugins/maven-doap-plugin/1.3-SNAPSHOT/maven-doap-plugin-1.3-SNAPSHOT.jar
[JENKINS] Archiving F:\jenkins\jenkins-slave\workspace\maven-plugins-windows\maven-site-plugin\dependency-reduced-pom.xml to org.apache.maven.plugins/maven-site-plugin/3.7-SNAPSHOT/maven-site-plugin-3.7-SNAPSHOT.pom
[JENKINS] Archiving F:\jenkins\jenkins-slave\workspace\maven-plugins-windows\maven-site-plugin\target\maven-site-plugin-3.7-SNAPSHOT.jar to org.apache.maven.plugins/maven-site-plugin/3.7-SNAPSHOT/maven-site-plugin-3.7-SNAPSHOT.jar
[JENKINS] Archiving F:\jenkins\jenkins-slave\workspace\maven-plugins-windows\maven-changes-plugin\pom.xml to org.apache.maven.plugins/maven-changes-plugin/3.0.0-SNAPSHOT/maven-changes-plugin-3.0.0-SNAPSHOT.pom
[JENKINS] Archiving F:\jenkins\jenkins-slave\workspace\maven-plugins-windows\maven-changes-plugin\target\maven-changes-plugin-3.0.0-SNAPSHOT.jar to org.apache.maven.plugins/maven-changes-plugin/3.0.0-SNAPSHOT/maven-changes-plugin-3.0.0-SNAPSHOT.jar
[JENKINS] Archiving F:\jenkins\jenkins-slave\workspace\maven-plugins-windows\maven-deploy-plugin\pom.xml to org.apache.maven.plugins/maven-deploy-plugin/3.0.0-SNAPSHOT/maven-deploy-plugin-3.0.0-SNAPSHOT.pom
[JENKINS] Archiving F:\jenkins\jenkins-slave\workspace\maven-plugins-windows\maven-deploy-plugin\target\maven-deploy-plugin-3.0.0-SNAPSHOT.jar to org.apache.maven.plugins/maven-deploy-plugin/3.0.0-SNAPSHOT/maven-deploy-plugin-3.0.0-SNAPSHOT.jar
[JENKINS] Archiving F:\jenkins\jenkins-slave\workspace\maven-plugins-windows\maven-repository-plugin\pom.xml to org.apache.maven.plugins/maven-repository-plugin/2.5-SNAPSHOT/maven-repository-plugin-2.5-SNAPSHOT.pom
[JENKINS] Archiving F:\jenkins\jenkins-slave\workspace\maven-plugins-windows\maven-repository-plugin\target\maven-repository-plugin-2.5-SNAPSHOT.jar to org.apache.maven.plugins/maven-repository-plugin/2.5-SNAPSHOT/maven-repository-plugin-2.5-SNAPSHOT.jar
[JENKINS] Archiving F:\jenkins\jenkins-slave\workspace\maven-plugins-windows\maven-source-plugin\pom.xml to org.apache.maven.plugins/maven-source-plugin/3.0.2-SNAPSHOT/maven-source-plugin-3.0.2-SNAPSHOT.pom
[JENKINS] Archiving F:\jenkins\jenkins-slave\workspace\maven-plugins-windows\maven-source-plugin\target\maven-source-plugin-3.0.2-SNAPSHOT.jar to org.apache.maven.plugins/maven-source-plugin/3.0.2-SNAPSHOT/maven-source-plugin-3.0.2-SNAPSHOT.jar
[JENKINS] Archiving F:\jenkins\jenkins-slave\workspace\maven-plugins-windows\maven-pdf-plugin\pom.xml to org.apache.maven.plugins/maven-pdf-plugin/1.4-SNAPSHOT/maven-pdf-plugin-1.4-SNAPSHOT.pom
[JENKINS] Archiving F:\jenkins\jenkins-slave\workspace\maven-plugins-windows\maven-pdf-plugin\target\maven-pdf-plugin-1.4-SNAPSHOT.jar to org.apache.maven.plugins/maven-pdf-plugin/1.4-SNAPSHOT/maven-pdf-plugin-1.4-SNAPSHOT.jar
[JENKINS] Archiving F:\jenkins\jenkins-slave\workspace\maven-plugins-windows\maven-jar-plugin\pom.xml to org.apache.maven.plugins/maven-jar-plugin/3.0.3-SNAPSHOT/maven-jar-plugin-3.0.3-SNAPSHOT.pom
[JENKINS] Archiving F:\jenkins\jenkins-slave\workspace\maven-plugins-windows\maven-jar-plugin\target\maven-jar-plugin-3.0.3-SNAPSHOT.jar to org.apache.maven.plugins/maven-jar-plugin/3.0.3-SNAPSHOT/maven-jar-plugin-3.0.3-SNAPSHOT.jar
[JENKINS] Archiving F:\jenkins\jenkins-slave\workspace\maven-plugins-windows\maven-javadoc-plugin\pom.xml to org.apache.maven.plugins/maven-javadoc-plugin/3.0.0-SNAPSHOT/maven-javadoc-plugin-3.0.0-SNAPSHOT.pom
[JENKINS] Archiving F:\jenkins\jenkins-slave\workspace\maven-plugins-windows\maven-javadoc-plugin\target\maven-javadoc-plugin-3.0.0-SNAPSHOT.jar to org.apache.maven.plugins/maven-javadoc-plugin/3.0.0-SNAPSHOT/maven-javadoc-plugin-3.0.0-SNAPSHOT.jar
[Fast Archiver] Compressed 413.54 KB of artifacts by 38.7% relative to #1994
[JENKINS] Archiving F:\jenkins\jenkins-slave\workspace\maven-plugins-windows\maven-dependency-plugin\pom.xml to org.apache.maven.plugins/maven-dependency-plugin/3.0.2-SNAPSHOT/maven-dependency-plugin-3.0.2-SNAPSHOT.pom
[JENKINS] Archiving F:\jenkins\jenkins-slave\workspace\maven-plugins-windows\maven-dependency-plugin\target\maven-dependency-plugin-3.0.2-SNAPSHOT.jar to org.apache.maven.plugins/maven-dependency-plugin/3.0.2-SNAPSHOT/maven-dependency-plugin-3.0.2-SNAPSHOT.jar
[JENKINS] Archiving F:\jenkins\jenkins-slave\workspace\maven-plugins-windows\maven-rar-plugin\pom.xml to org.apache.maven.plugins/maven-rar-plugin/3.0.0-SNAPSHOT/maven-rar-plugin-3.0.0-SNAPSHOT.pom
[JENKINS] Archiving F:\jenkins\jenkins-slave\workspace\maven-plugins-windows\maven-rar-plugin\target\maven-rar-plugin-3.0.0-SNAPSHOT.jar to org.apache.maven.plugins/maven-rar-plugin/3.0.0-SNAPSHOT/maven-rar-plugin-3.0.0-SNAPSHOT.jar
[JENKINS] Archiving F:\jenkins\jenkins-slave\workspace\maven-plugins-windows\maven-checkstyle-plugin\pom.xml to org.apache.maven.plugins/maven-checkstyle-plugin/3.0.0-SNAPSHOT/maven-checkstyle-plugin-3.0.0-SNAPSHOT.pom
[JENKINS] Archiving F:\jenkins\jenkins-slave\workspace\maven-plugins-windows\maven-checkstyle-plugin\target\maven-checkstyle-plugin-3.0.0-SNAPSHOT.jar to org.apache.maven.plugins/maven-checkstyle-plugin/3.0.0-SNAPSHOT/maven-checkstyle-plugin-3.0.0-SNAPSHOT.jar
Sending e-mails to: [hidden email]
Sending e-mails to: [hidden email] [hidden email]
channel stopped
Java HotSpot(TM) 64-Bit Server VM warning: ignoring option MaxPermSize=512m; support was removed in 8.0
[WARNINGS] Skipping publisher since build result is FAILURE
Loading...