Build failed in Jenkins: maven-plugins-ITs-m3-windows #2035

Previous Topic Next Topic
 
classic Classic list List threaded Threaded
3 messages Options
Reply | Threaded
Open this post in threaded view
|

Build failed in Jenkins: maven-plugins-ITs-m3-windows #2035

Apache Jenkins Server-2
See <https://builds.apache.org/job/maven-plugins-ITs-m3-windows/2035/display/redirect?page=changes>

Changes:

[khmarbaise] Fixed missing copyright header.

[khmarbaise] Added serveral integration tests.
Upgraded maven-compiler-plugin to 3.7.0
Upgraded maven-invoker-plugin to 3.0.1
Enhanced maven-invoker-plugin configuration

------------------------------------------
[...truncated 3.38 MB...]
[INFO] Building: dependency-properties\pom.xml
[INFO] run script verify.bsh
[INFO] ..SUCCESS (7.1 s)
[INFO] Building: filterunpack\pom.xml
[INFO] run script verify.groovy
[INFO] ..SUCCESS (7.0 s)
[INFO] Building: get-artifact\pom.xml
[INFO] run script setup.bsh
[INFO] run script verify.bsh
[INFO] ..SUCCESS (7.4 s)
[INFO] Building: get-artifact-maven-plugin\pom.xml
[INFO] run script setup.bsh
[INFO] run script verify.bsh
[INFO] ..SUCCESS (6.9 s)
[INFO] Building: get-artifact-no-transitive\pom.xml
[INFO] run script setup.bsh
[INFO] run script verify.bsh
[INFO] ..SUCCESS (7.3 s)
[INFO] Building: get-gav\pom.xml
[INFO] run script setup.bsh
[INFO] run script verify.bsh
[INFO] ..SUCCESS (7.3 s)
[INFO] Building: go-offline\pom.xml
[INFO] ..SUCCESS (8.7 s)
[INFO] Building: list-repositories\pom.xml
[INFO] snapshot org.apache.maven.its.dependency:test:1.0-SNAPSHOT: checking for updates from apache.snapshots
[INFO] artifact org.apache.maven.its.dependency.test:1.0-SNAPSHOT: checking for updates from central
[INFO] ..SUCCESS (7.5 s)
[INFO] Building: mdep-439-analyze-java8\pom.xml
[INFO] ..SKIPPED due to JRE version
[INFO] Building: mdep-450-project-with-ancestor\pom.xml
[INFO] run script verify.groovy
[INFO] ..SUCCESS (7.2 s)
[INFO] Building: mdep-450-project-without-ancestor\pom.xml
[INFO] run script verify.groovy
[INFO] ..SUCCESS (6.8 s)
[INFO] Building: mdep-506-dependency-without-version-in-depmgt\pom.xml
[INFO] ..SUCCESS (8.8 s)
[INFO] Building: mdep-571-resolve-java9\pom.xml
[INFO] ..SKIPPED due to JRE version
[INFO] Building: mdep-572-unpack-tar-long-file\pom.xml
[INFO] run script verify.bsh
[INFO] ..SUCCESS (8.4 s)
[INFO] Building: mdep-578_display-reason-invalid-module\pom.xml
[INFO] ..SKIPPED due to JRE version
[INFO] Building: mdep-580_display-manifest-automodules\pom.xml
[INFO] ..SKIPPED due to JRE version
[INFO] Building: purge-local-repository\pom.xml
[INFO] run script setup.bsh
[INFO] artifact org.apache.maven.its.dependency.purged:1.0: checking for updates from central
[INFO] run script verify.bsh
[INFO] ..SUCCESS (7.1 s)
[INFO] Building: purge-local-repository-bad-dep\pom.xml
[INFO] snapshot org.apache.maven.its.dependency:purge-local-repository-bad-dep:1.0-SNAPSHOT: checking for updates from apache.snapshots
[INFO] artifact org.apache.maven.its.dependency.purge-local-repository-bad-dep:1.0-SNAPSHOT: checking for updates from central
[INFO] artifact org.apache.maven.its.dependency.i-do-not-exist:1.0: checking for updates from central
[INFO] run script verify.groovy
[INFO] ..SUCCESS (7.9 s)
[INFO] Building: purge-local-repository-include\pom.xml
[INFO] snapshot org.apache.maven.its.dependency:purge-local-repository-include:1.0-SNAPSHOT: checking for updates from apache.snapshots
[INFO] artifact org.apache.maven.its.dependency.purge-local-repository-include:1.0-SNAPSHOT: checking for updates from central
[INFO] run script verify.groovy
[INFO] ..SUCCESS (8.0 s)
[INFO] Building: purge-local-repository-multi-module\pom.xml
[INFO] run script setup.bsh
[INFO] snapshot org.apache.maven.its.dependency:child1:1.0-SNAPSHOT: checking for updates from apache.snapshots
[INFO] artifact org.apache.maven.its.dependency.child1:1.0-SNAPSHOT: checking for updates from central
[INFO] artifact org.apache.maven.its.dependency.purged-a:1.0: checking for updates from central
[INFO] snapshot org.apache.maven.its.dependency:child2:1.0-SNAPSHOT: checking for updates from apache.snapshots
[INFO] artifact org.apache.maven.its.dependency.child2:1.0-SNAPSHOT: checking for updates from central
[INFO] artifact org.apache.maven.its.dependency.purged-b:1.0: checking for updates from central
[INFO] run script verify.bsh
[INFO] ..SUCCESS (8.3 s)
[INFO] Building: purge-local-repository-multi-module-execution\pom.xml
[INFO] run script setup.bsh
[INFO] run script verify.bsh
[INFO] ..SUCCESS (8.5 s)
[INFO] Building: purge-local-repository-non-transitive\pom.xml
[INFO] run script verify.bsh
[INFO] ..SUCCESS (7.5 s)
[INFO] Building: purge-local-repository-reresolve\pom.xml
[INFO] run script verify.bsh
[INFO] ..SUCCESS (7.1 s)
[INFO] Building: purge-local-repository-snapshots-only\pom.xml
[INFO] run script setup.bsh
[INFO] snapshot org.apache.maven.its.dependency:snap-purged:1.0-SNAPSHOT: checking for updates from apache.snapshots
[INFO] artifact org.apache.maven.its.dependency.snap-purged:1.0-SNAPSHOT: checking for updates from central
[INFO] run script verify.bsh
[INFO] ..SUCCESS (8.1 s)
[INFO] Building: purge-local-repository-version-range\pom.xml
[INFO] artifact org.apache.maven.its.dependency:purge-local-repository: checking for updates from central
[INFO] artifact org.apache.maven.its.dependency:purge-local-repository: checking for updates from central
[INFO] run script verify.bsh
[INFO] ..SUCCESS (7.6 s)
[INFO] Building: resolve\pom.xml
[INFO] ..SUCCESS (7.5 s)
[INFO] Building: resolve-plugins\pom.xml
[INFO] ..SUCCESS (8.0 s)
[INFO] Building: resolve-plugins-exclude-reactor\pom.xml
[INFO] run script verify.groovy
[INFO] ..SUCCESS (9.3 s)
[INFO] Building: resolve-plugins-with-exclude\pom.xml
[INFO] run script verify.groovy
[INFO] ..SUCCESS (8.2 s)
[INFO] Building: sources\pom.xml
[INFO] artifact classworlds.classworlds:1.1-alpha-2: checking for updates from central
[INFO] ..SUCCESS (7.9 s)
[INFO] Building: tree\pom.xml
[INFO] run script verify.bsh
[INFO] ..SUCCESS (7.2 s)
[INFO] Building: tree-includes\pom.xml
[INFO] run script verify.bsh
[INFO] ..SUCCESS (7.3 s)
[INFO] Building: tree-multimodule\pom.xml
[INFO] snapshot org.apache.maven.its.dependency:tree-multimodule-module-a:1.0-SNAPSHOT: checking for updates from apache.snapshots
[INFO] artifact org.apache.maven.its.dependency.tree-multimodule-module-a:1.0-SNAPSHOT: checking for updates from central
[INFO] run script verify.bsh
[INFO] ..SUCCESS (8.5 s)
[INFO] Building: unpack\pom.xml
[INFO] run script verify.bsh
[INFO] ..SUCCESS (8.8 s)
[INFO] Building: unpack-cli\pom.xml
[INFO] run script verify.bsh
[INFO] ..SUCCESS (7.2 s)
[INFO] Building: unpack-custom-ear\pom.xml
[INFO] run script verify.groovy
[INFO] ..SUCCESS (7.8 s)
[INFO] Building: unpack-dependencies\pom.xml
[INFO] run script verify.groovy
[INFO] ..SUCCESS (9.7 s)
[INFO] Building: unpack-from-remote-repository\pom.xml
[INFO] run script setup.bsh
[INFO] artifact org.apache.maven.its.dependency.fake-remote-unpack:1.0: checking for updates from central
[INFO] run script verify.bsh
[INFO] ..SUCCESS (8.9 s)
[INFO] Building: used-dependencies\pom.xml
[INFO] ..SUCCESS (9.3 s)
[INFO] Building: purge-local-repository-without-pom
[INFO] run script setup.bsh
[INFO] run script verify.bsh
[INFO] ..SUCCESS (7.0 s)
[INFO]
[INFO] --- mrm-maven-plugin:1.0.0:stop (default) @ maven-dependency-plugin ---
[INFO] Stopping Mock Repository Manager on http://localhost:56575
[INFO] Mock Repository Manager http://localhost:56575 is stopped.
[INFO]
[INFO] --- maven-checkstyle-plugin:2.15:check (checkstyle-check) @ maven-dependency-plugin ---
[INFO] There is 1 error reported by Checkstyle 6.1.1 with config/maven_checks.xml ruleset.
[INFO] Ignored 1 error, 0 violation remaining.
[INFO]
[INFO] --- maven-invoker-plugin:2.0.0:verify (integration-test) @ maven-dependency-plugin ---
[INFO] -------------------------------------------------
[INFO] Build Summary:
[INFO]   Passed: 53, Failed: 0, Errors: 0, Skipped: 4
[INFO] -------------------------------------------------
[INFO]
[INFO] --- maven-install-plugin:2.5.2:install (default-install) @ maven-dependency-plugin ---
[INFO] Installing F:\jenkins\jenkins-slave\workspace\maven-plugins-ITs-m3-windows\maven-dependency-plugin\target\maven-dependency-plugin-3.0.3-SNAPSHOT.jar to C:\Users\jenkins\.m2\repository\org\apache\maven\plugins\maven-dependency-plugin\3.0.3-SNAPSHOT\maven-dependency-plugin-3.0.3-SNAPSHOT.jar
[INFO] Installing F:\jenkins\jenkins-slave\workspace\maven-plugins-ITs-m3-windows\maven-dependency-plugin\pom.xml to C:\Users\jenkins\.m2\repository\org\apache\maven\plugins\maven-dependency-plugin\3.0.3-SNAPSHOT\maven-dependency-plugin-3.0.3-SNAPSHOT.pom
[INFO]                                                                        
[INFO] ------------------------------------------------------------------------
[INFO] Building Apache Maven Plugins Aggregator 1-SNAPSHOT
[INFO] ------------------------------------------------------------------------
[INFO]
[INFO] --- maven-clean-plugin:3.0.0:clean (default-clean) @ maven-plugins-aggregator ---
[INFO]
[INFO] --- maven-enforcer-plugin:1.4.1:enforce (enforce-bytecode-version) @ maven-plugins-aggregator ---
[INFO]
[INFO] --- maven-enforcer-plugin:1.4.1:enforce (ban-known-bad-maven-versions) @ maven-plugins-aggregator ---
[INFO]
[INFO] --- apache-rat-plugin:0.11:check (rat-check) @ maven-plugins-aggregator ---
[INFO] 91 implicit excludes (use -debug for more details).
[INFO] Exclude: DEPENDENCIES
[INFO] 235 resources included (use -debug for more details)
[INFO] Rat check: Summary of files. Unapproved: 0 unknown: 0 generated: 0 approved: 211 licence.
[INFO]
[INFO] --- maven-remote-resources-plugin:1.5:process (process-resource-bundles) @ maven-plugins-aggregator ---
[INFO]
[INFO] --- maven-site-plugin:3.5.1:attach-descriptor (attach-descriptor) @ maven-plugins-aggregator ---
[INFO]
[INFO] --- maven-checkstyle-plugin:2.15:check (checkstyle-check) @ maven-plugins-aggregator ---
[INFO]
[INFO] --- maven-install-plugin:2.5.2:install (default-install) @ maven-plugins-aggregator ---
[INFO] Installing <https://builds.apache.org/job/maven-plugins-ITs-m3-windows/ws/pom.xml> to C:\Users\jenkins\.m2\repository\org\apache\maven\plugins\maven-plugins-aggregator\1-SNAPSHOT\maven-plugins-aggregator-1-SNAPSHOT.pom
[INFO] ------------------------------------------------------------------------
[INFO] Reactor Summary:
[INFO]
[INFO] Apache Maven ACR Plugin ............................ SUCCESS [ 54.437 s]
[INFO] Apache Maven AntRun Plugin ......................... SUCCESS [02:45 min]
[INFO] Apache Maven Changelog Plugin ...................... SUCCESS [01:13 min]
[INFO] Apache Maven Changes Plugin ........................ SUCCESS [01:59 min]
[INFO] Apache Maven Clean Plugin .......................... SUCCESS [ 46.672 s]
[INFO] Apache Maven Compiler Plugin ....................... SUCCESS [03:43 min]
[INFO] Apache Maven Deploy Plugin ......................... SUCCESS [03:38 min]
[INFO] Apache Maven Documentation Checker Plugin .......... SUCCESS [ 10.599 s]
[INFO] Apache Maven EAR Plugin ............................ SUCCESS [09:44 min]
[INFO] Apache Maven EJB Plugin ............................ SUCCESS [01:08 min]
[INFO] Apache Maven Help Plugin ........................... SUCCESS [03:12 min]
[INFO] Apache Maven Install Plugin ........................ SUCCESS [02:55 min]
[INFO] Apache Maven Jarsigner Plugin ...................... SUCCESS [01:14 min]
[INFO] Apache Maven JDeps Plugin .......................... SUCCESS [  3.977 s]
[INFO] Apache Maven Linkcheck Plugin ...................... SUCCESS [  6.187 s]
[INFO] Apache Maven Patch Plugin .......................... SUCCESS [ 10.080 s]
[INFO] Apache Maven PDF Plugin ............................ SUCCESS [01:58 min]
[INFO] Apache Maven RAR Plugin ............................ SUCCESS [ 20.198 s]
[INFO] Apache Maven Repository Plugin ..................... SUCCESS [ 44.720 s]
[INFO] Apache Maven Resources Plugin ...................... SUCCESS [02:17 min]
[INFO] Apache Maven Site Plugin ........................... SUCCESS [10:47 min]
[INFO] Apache Maven Source Plugin ......................... SUCCESS [01:50 min]
[INFO] Apache Maven Stage Plugin .......................... SUCCESS [  5.018 s]
[INFO] Apache Maven Toolchains Plugin ..................... SUCCESS [ 29.115 s]
[INFO] Apache Maven Verifier Plugin ....................... SUCCESS [ 19.769 s]
[INFO] Apache Maven WAR Plugin ............................ SUCCESS [03:19 min]
[INFO] Apache Maven DOAP Plugin ........................... SUCCESS [ 35.230 s]
[INFO] Apache Maven Invoker Plugin ........................ SUCCESS [11:55 min]
[INFO] Apache Maven JAR Plugin ............................ SUCCESS [03:03 min]
[INFO] Apache Maven Assembly Plugin ....................... SUCCESS [18:06 min]
[INFO] Apache Maven Checkstyle Plugin ..................... SUCCESS [07:03 min]
[INFO] Apache Maven Javadoc Plugin ........................ SUCCESS [09:33 min]
[INFO] Apache Maven PMD Plugin ............................ SUCCESS [03:51 min]
[INFO] Apache Maven JLink Plugin .......................... FAILURE [  1.190 s]
[INFO] Apache Maven JMod Plugin ........................... SUCCESS [  4.508 s]
[INFO] Apache Maven Project Info Reports Plugin ........... SUCCESS [03:38 min]
[INFO] Apache Maven Remote Resources Plugin ............... SUCCESS [01:47 min]
[INFO] Apache Maven Shade Plugin .......................... SUCCESS [07:17 min]
[INFO] Apache Maven SCM Publish Plugin .................... SUCCESS [01:32 min]
[INFO] Apache Maven Dependency Plugin ..................... SUCCESS [08:17 min]
[INFO] Apache Maven Plugins Aggregator .................... SUCCESS [ 14.794 s]
[INFO] ------------------------------------------------------------------------
[INFO] BUILD FAILURE
[INFO] ------------------------------------------------------------------------
[INFO] Total time: 02:13 h
[INFO] Finished at: 2017-11-08T20:49:29+00:00
[INFO] Final Memory: 162M/563M
[INFO] ------------------------------------------------------------------------
[WARNING] The requested profile "apache.snapshots" could not be activated because it does not exist.
[ERROR] Failed to execute goal on project maven-jlink-plugin: Could not resolve dependencies for project org.apache.maven.plugins:maven-jlink-plugin:maven-plugin:3.0.0-alpha-2-SNAPSHOT: Could not find artifact org.codehaus.plexus:plexus-java:jar:0.9.4-SNAPSHOT in apache.snapshots (https://repository.apache.org/snapshots) -> [Help 1]
[ERROR]
[ERROR] To see the full stack trace of the errors, re-run Maven with the -e switch.
[ERROR] Re-run Maven using the -X switch to enable full debug logging.
[ERROR]
[ERROR] For more information about the errors and possible solutions, please read the following articles:
[ERROR] [Help 1] http://cwiki.apache.org/confluence/display/MAVEN/DependencyResolutionException
[ERROR]
[ERROR] After correcting the problems, you can resume the build with the command
[ERROR]   mvn <goals> -rf :maven-jlink-plugin
Build step 'Invoke top-level Maven targets' marked build as failure
Deleting 1 temporary files
Recording test results
Reply | Threaded
Open this post in threaded view
|

Build failed in Jenkins: maven-plugins-ITs-m3-windows #2036

Apache Jenkins Server-2
See <https://builds.apache.org/job/maven-plugins-ITs-m3-windows/2036/display/redirect?page=changes>

Changes:

[hboutemy] [MSITE-802] improved explanations of generatedSite parameter

------------------------------------------
[...truncated 3.37 MB...]
[INFO] Building: dependency-properties\pom.xml
[INFO] run script verify.bsh
[INFO] ..SUCCESS (6.9 s)
[INFO] Building: filterunpack\pom.xml
[INFO] run script verify.groovy
[INFO] ..SUCCESS (7.0 s)
[INFO] Building: get-artifact\pom.xml
[INFO] run script setup.bsh
[INFO] run script verify.bsh
[INFO] ..SUCCESS (6.4 s)
[INFO] Building: get-artifact-maven-plugin\pom.xml
[INFO] run script setup.bsh
[INFO] run script verify.bsh
[INFO] ..SUCCESS (6.9 s)
[INFO] Building: get-artifact-no-transitive\pom.xml
[INFO] run script setup.bsh
[INFO] run script verify.bsh
[INFO] ..SUCCESS (6.7 s)
[INFO] Building: get-gav\pom.xml
[INFO] run script setup.bsh
[INFO] run script verify.bsh
[INFO] ..SUCCESS (6.8 s)
[INFO] Building: go-offline\pom.xml
[INFO] ..SUCCESS (8.1 s)
[INFO] Building: list-repositories\pom.xml
[INFO] snapshot org.apache.maven.its.dependency:test:1.0-SNAPSHOT: checking for updates from apache.snapshots
[INFO] artifact org.apache.maven.its.dependency.test:1.0-SNAPSHOT: checking for updates from central
[INFO] ..SUCCESS (6.9 s)
[INFO] Building: mdep-439-analyze-java8\pom.xml
[INFO] ..SKIPPED due to JRE version
[INFO] Building: mdep-450-project-with-ancestor\pom.xml
[INFO] run script verify.groovy
[INFO] ..SUCCESS (6.6 s)
[INFO] Building: mdep-450-project-without-ancestor\pom.xml
[INFO] run script verify.groovy
[INFO] ..SUCCESS (6.5 s)
[INFO] Building: mdep-506-dependency-without-version-in-depmgt\pom.xml
[INFO] ..SUCCESS (8.1 s)
[INFO] Building: mdep-571-resolve-java9\pom.xml
[INFO] ..SKIPPED due to JRE version
[INFO] Building: mdep-572-unpack-tar-long-file\pom.xml
[INFO] run script verify.bsh
[INFO] ..SUCCESS (8.0 s)
[INFO] Building: mdep-578_display-reason-invalid-module\pom.xml
[INFO] ..SKIPPED due to JRE version
[INFO] Building: mdep-580_display-manifest-automodules\pom.xml
[INFO] ..SKIPPED due to JRE version
[INFO] Building: purge-local-repository\pom.xml
[INFO] run script setup.bsh
[INFO] artifact org.apache.maven.its.dependency.purged:1.0: checking for updates from central
[INFO] run script verify.bsh
[INFO] ..SUCCESS (6.7 s)
[INFO] Building: purge-local-repository-bad-dep\pom.xml
[INFO] snapshot org.apache.maven.its.dependency:purge-local-repository-bad-dep:1.0-SNAPSHOT: checking for updates from apache.snapshots
[INFO] artifact org.apache.maven.its.dependency.purge-local-repository-bad-dep:1.0-SNAPSHOT: checking for updates from central
[INFO] artifact org.apache.maven.its.dependency.i-do-not-exist:1.0: checking for updates from central
[INFO] run script verify.groovy
[INFO] ..SUCCESS (7.3 s)
[INFO] Building: purge-local-repository-include\pom.xml
[INFO] snapshot org.apache.maven.its.dependency:purge-local-repository-include:1.0-SNAPSHOT: checking for updates from apache.snapshots
[INFO] artifact org.apache.maven.its.dependency.purge-local-repository-include:1.0-SNAPSHOT: checking for updates from central
[INFO] run script verify.groovy
[INFO] ..SUCCESS (7.3 s)
[INFO] Building: purge-local-repository-multi-module\pom.xml
[INFO] run script setup.bsh
[INFO] snapshot org.apache.maven.its.dependency:child1:1.0-SNAPSHOT: checking for updates from apache.snapshots
[INFO] artifact org.apache.maven.its.dependency.child1:1.0-SNAPSHOT: checking for updates from central
[INFO] artifact org.apache.maven.its.dependency.purged-a:1.0: checking for updates from central
[INFO] snapshot org.apache.maven.its.dependency:child2:1.0-SNAPSHOT: checking for updates from apache.snapshots
[INFO] artifact org.apache.maven.its.dependency.child2:1.0-SNAPSHOT: checking for updates from central
[INFO] artifact org.apache.maven.its.dependency.purged-b:1.0: checking for updates from central
[INFO] run script verify.bsh
[INFO] ..SUCCESS (7.9 s)
[INFO] Building: purge-local-repository-multi-module-execution\pom.xml
[INFO] run script setup.bsh
[INFO] run script verify.bsh
[INFO] ..SUCCESS (7.4 s)
[INFO] Building: purge-local-repository-non-transitive\pom.xml
[INFO] run script verify.bsh
[INFO] ..SUCCESS (6.6 s)
[INFO] Building: purge-local-repository-reresolve\pom.xml
[INFO] run script verify.bsh
[INFO] ..SUCCESS (6.9 s)
[INFO] Building: purge-local-repository-snapshots-only\pom.xml
[INFO] run script setup.bsh
[INFO] snapshot org.apache.maven.its.dependency:snap-purged:1.0-SNAPSHOT: checking for updates from apache.snapshots
[INFO] artifact org.apache.maven.its.dependency.snap-purged:1.0-SNAPSHOT: checking for updates from central
[INFO] run script verify.bsh
[INFO] ..SUCCESS (8.3 s)
[INFO] Building: purge-local-repository-version-range\pom.xml
[INFO] artifact org.apache.maven.its.dependency:purge-local-repository: checking for updates from central
[INFO] artifact org.apache.maven.its.dependency:purge-local-repository: checking for updates from central
[INFO] run script verify.bsh
[INFO] ..SUCCESS (6.9 s)
[INFO] Building: resolve\pom.xml
[INFO] ..SUCCESS (6.9 s)
[INFO] Building: resolve-plugins\pom.xml
[INFO] ..SUCCESS (7.5 s)
[INFO] Building: resolve-plugins-exclude-reactor\pom.xml
[INFO] run script verify.groovy
[INFO] ..SUCCESS (8.7 s)
[INFO] Building: resolve-plugins-with-exclude\pom.xml
[INFO] run script verify.groovy
[INFO] ..SUCCESS (7.7 s)
[INFO] Building: sources\pom.xml
[INFO] artifact classworlds.classworlds:1.1-alpha-2: checking for updates from central
[INFO] ..SUCCESS (6.9 s)
[INFO] Building: tree\pom.xml
[INFO] run script verify.bsh
[INFO] ..SUCCESS (6.6 s)
[INFO] Building: tree-includes\pom.xml
[INFO] run script verify.bsh
[INFO] ..SUCCESS (6.6 s)
[INFO] Building: tree-multimodule\pom.xml
[INFO] snapshot org.apache.maven.its.dependency:tree-multimodule-module-a:1.0-SNAPSHOT: checking for updates from apache.snapshots
[INFO] artifact org.apache.maven.its.dependency.tree-multimodule-module-a:1.0-SNAPSHOT: checking for updates from central
[INFO] run script verify.bsh
[INFO] ..SUCCESS (7.7 s)
[INFO] Building: unpack\pom.xml
[INFO] run script verify.bsh
[INFO] ..SUCCESS (8.5 s)
[INFO] Building: unpack-cli\pom.xml
[INFO] run script verify.bsh
[INFO] ..SUCCESS (6.5 s)
[INFO] Building: unpack-custom-ear\pom.xml
[INFO] run script verify.groovy
[INFO] ..SUCCESS (7.3 s)
[INFO] Building: unpack-dependencies\pom.xml
[INFO] run script verify.groovy
[INFO] ..SUCCESS (8.4 s)
[INFO] Building: unpack-from-remote-repository\pom.xml
[INFO] run script setup.bsh
[INFO] artifact org.apache.maven.its.dependency.fake-remote-unpack:1.0: checking for updates from central
[INFO] run script verify.bsh
[INFO] ..SUCCESS (8.4 s)
[INFO] Building: used-dependencies\pom.xml
[INFO] ..SUCCESS (8.7 s)
[INFO] Building: purge-local-repository-without-pom
[INFO] run script setup.bsh
[INFO] run script verify.bsh
[INFO] ..SUCCESS (6.6 s)
[INFO]
[INFO] --- mrm-maven-plugin:1.0.0:stop (default) @ maven-dependency-plugin ---
[INFO] Stopping Mock Repository Manager on http://localhost:58007
[INFO] Mock Repository Manager http://localhost:58007 is stopped.
[INFO]
[INFO] --- maven-checkstyle-plugin:2.15:check (checkstyle-check) @ maven-dependency-plugin ---
[INFO] There is 1 error reported by Checkstyle 6.1.1 with config/maven_checks.xml ruleset.
[INFO] Ignored 1 error, 0 violation remaining.
[INFO]
[INFO] --- maven-invoker-plugin:2.0.0:verify (integration-test) @ maven-dependency-plugin ---
[INFO] -------------------------------------------------
[INFO] Build Summary:
[INFO]   Passed: 53, Failed: 0, Errors: 0, Skipped: 4
[INFO] -------------------------------------------------
[INFO]
[INFO] --- maven-install-plugin:2.5.2:install (default-install) @ maven-dependency-plugin ---
[INFO] Installing F:\jenkins\jenkins-slave\workspace\maven-plugins-ITs-m3-windows\maven-dependency-plugin\target\maven-dependency-plugin-3.0.3-SNAPSHOT.jar to C:\Users\jenkins\.m2\repository\org\apache\maven\plugins\maven-dependency-plugin\3.0.3-SNAPSHOT\maven-dependency-plugin-3.0.3-SNAPSHOT.jar
[INFO] Installing F:\jenkins\jenkins-slave\workspace\maven-plugins-ITs-m3-windows\maven-dependency-plugin\pom.xml to C:\Users\jenkins\.m2\repository\org\apache\maven\plugins\maven-dependency-plugin\3.0.3-SNAPSHOT\maven-dependency-plugin-3.0.3-SNAPSHOT.pom
[INFO]                                                                        
[INFO] ------------------------------------------------------------------------
[INFO] Building Apache Maven Plugins Aggregator 1-SNAPSHOT
[INFO] ------------------------------------------------------------------------
[INFO]
[INFO] --- maven-clean-plugin:3.0.0:clean (default-clean) @ maven-plugins-aggregator ---
[INFO]
[INFO] --- maven-enforcer-plugin:1.4.1:enforce (enforce-bytecode-version) @ maven-plugins-aggregator ---
[INFO]
[INFO] --- maven-enforcer-plugin:1.4.1:enforce (ban-known-bad-maven-versions) @ maven-plugins-aggregator ---
[INFO]
[INFO] --- apache-rat-plugin:0.11:check (rat-check) @ maven-plugins-aggregator ---
[INFO] 91 implicit excludes (use -debug for more details).
[INFO] Exclude: DEPENDENCIES
[INFO] 235 resources included (use -debug for more details)
[INFO] Rat check: Summary of files. Unapproved: 0 unknown: 0 generated: 0 approved: 211 licence.
[INFO]
[INFO] --- maven-remote-resources-plugin:1.5:process (process-resource-bundles) @ maven-plugins-aggregator ---
[INFO]
[INFO] --- maven-site-plugin:3.5.1:attach-descriptor (attach-descriptor) @ maven-plugins-aggregator ---
[INFO]
[INFO] --- maven-checkstyle-plugin:2.15:check (checkstyle-check) @ maven-plugins-aggregator ---
[INFO]
[INFO] --- maven-install-plugin:2.5.2:install (default-install) @ maven-plugins-aggregator ---
[INFO] Installing <https://builds.apache.org/job/maven-plugins-ITs-m3-windows/ws/pom.xml> to C:\Users\jenkins\.m2\repository\org\apache\maven\plugins\maven-plugins-aggregator\1-SNAPSHOT\maven-plugins-aggregator-1-SNAPSHOT.pom
[INFO] ------------------------------------------------------------------------
[INFO] Reactor Summary:
[INFO]
[INFO] Apache Maven ACR Plugin ............................ SUCCESS [ 56.551 s]
[INFO] Apache Maven AntRun Plugin ......................... SUCCESS [02:47 min]
[INFO] Apache Maven Changelog Plugin ...................... SUCCESS [01:16 min]
[INFO] Apache Maven Changes Plugin ........................ SUCCESS [02:02 min]
[INFO] Apache Maven Clean Plugin .......................... SUCCESS [ 49.165 s]
[INFO] Apache Maven Compiler Plugin ....................... SUCCESS [04:16 min]
[INFO] Apache Maven Deploy Plugin ......................... SUCCESS [03:55 min]
[INFO] Apache Maven Documentation Checker Plugin .......... SUCCESS [ 10.827 s]
[INFO] Apache Maven EAR Plugin ............................ SUCCESS [10:11 min]
[INFO] Apache Maven EJB Plugin ............................ SUCCESS [01:13 min]
[INFO] Apache Maven Help Plugin ........................... SUCCESS [03:25 min]
[INFO] Apache Maven Install Plugin ........................ SUCCESS [03:05 min]
[INFO] Apache Maven Jarsigner Plugin ...................... SUCCESS [01:17 min]
[INFO] Apache Maven JDeps Plugin .......................... SUCCESS [  3.938 s]
[INFO] Apache Maven Linkcheck Plugin ...................... SUCCESS [  5.802 s]
[INFO] Apache Maven Patch Plugin .......................... SUCCESS [ 10.365 s]
[INFO] Apache Maven PDF Plugin ............................ SUCCESS [01:09 min]
[INFO] Apache Maven RAR Plugin ............................ SUCCESS [ 21.255 s]
[INFO] Apache Maven Repository Plugin ..................... SUCCESS [ 48.742 s]
[INFO] Apache Maven Resources Plugin ...................... SUCCESS [02:26 min]
[INFO] Apache Maven Site Plugin ........................... SUCCESS [11:20 min]
[INFO] Apache Maven Source Plugin ......................... SUCCESS [01:46 min]
[INFO] Apache Maven Stage Plugin .......................... SUCCESS [  4.330 s]
[INFO] Apache Maven Toolchains Plugin ..................... SUCCESS [ 28.255 s]
[INFO] Apache Maven Verifier Plugin ....................... SUCCESS [ 17.911 s]
[INFO] Apache Maven WAR Plugin ............................ SUCCESS [03:14 min]
[INFO] Apache Maven DOAP Plugin ........................... SUCCESS [ 36.050 s]
[INFO] Apache Maven Invoker Plugin ........................ SUCCESS [12:11 min]
[INFO] Apache Maven JAR Plugin ............................ SUCCESS [03:09 min]
[INFO] Apache Maven Assembly Plugin ....................... SUCCESS [18:59 min]
[INFO] Apache Maven Checkstyle Plugin ..................... SUCCESS [07:14 min]
[INFO] Apache Maven Javadoc Plugin ........................ SUCCESS [09:36 min]
[INFO] Apache Maven PMD Plugin ............................ SUCCESS [03:44 min]
[INFO] Apache Maven JLink Plugin .......................... FAILURE [  1.234 s]
[INFO] Apache Maven JMod Plugin ........................... SUCCESS [  4.531 s]
[INFO] Apache Maven Project Info Reports Plugin ........... SUCCESS [03:32 min]
[INFO] Apache Maven Remote Resources Plugin ............... SUCCESS [01:46 min]
[INFO] Apache Maven Shade Plugin .......................... SUCCESS [06:51 min]
[INFO] Apache Maven SCM Publish Plugin .................... SUCCESS [01:19 min]
[INFO] Apache Maven Dependency Plugin ..................... SUCCESS [07:52 min]
[INFO] Apache Maven Plugins Aggregator .................... SUCCESS [ 14.338 s]
[INFO] ------------------------------------------------------------------------
[INFO] BUILD FAILURE
[INFO] ------------------------------------------------------------------------
[INFO] Total time: 02:15 h
[INFO] Finished at: 2017-11-10T09:50:30+00:00
[INFO] Final Memory: 161M/586M
[INFO] ------------------------------------------------------------------------
[WARNING] The requested profile "apache.snapshots" could not be activated because it does not exist.
[ERROR] Failed to execute goal on project maven-jlink-plugin: Could not resolve dependencies for project org.apache.maven.plugins:maven-jlink-plugin:maven-plugin:3.0.0-alpha-2-SNAPSHOT: Could not find artifact org.codehaus.plexus:plexus-java:jar:0.9.4-SNAPSHOT in apache.snapshots (https://repository.apache.org/snapshots) -> [Help 1]
[ERROR]
[ERROR] To see the full stack trace of the errors, re-run Maven with the -e switch.
[ERROR] Re-run Maven using the -X switch to enable full debug logging.
[ERROR]
[ERROR] For more information about the errors and possible solutions, please read the following articles:
[ERROR] [Help 1] http://cwiki.apache.org/confluence/display/MAVEN/DependencyResolutionException
[ERROR]
[ERROR] After correcting the problems, you can resume the build with the command
[ERROR]   mvn <goals> -rf :maven-jlink-plugin
Build step 'Invoke top-level Maven targets' marked build as failure
Deleting 1 temporary files
Recording test results
Reply | Threaded
Open this post in threaded view
|

Jenkins build is back to normal : maven-plugins-ITs-m3-windows #2037

Apache Jenkins Server-2