Build failed in Jenkins: maven-plugins-ITs-m3-windows #2010

Previous Topic Next Topic
 
classic Classic list List threaded Threaded
2 messages Options
Reply | Threaded
Open this post in threaded view
|

Build failed in Jenkins: maven-plugins-ITs-m3-windows #2010

Apache Jenkins Server-2
See <https://builds.apache.org/job/maven-plugins-ITs-m3-windows/2010/display/redirect?page=changes>

Changes:

[hboutemy] [MPDF-48] check generated report xdoc content to avoid stupid failures

------------------------------------------
[...truncated 3.37 MB...]
[INFO] Building: analyze-report\pom.xml
[INFO] run script verify.bsh
[INFO] ..SUCCESS (11.3 s)
[INFO] Building: build-classpath\pom.xml
[INFO] run script verify.bsh
[INFO] ..SUCCESS (7.6 s)
[INFO] Building: build-classpath-output-file-and-property\pom.xml
[INFO] run script verify.bsh
[INFO] ..SUCCESS (10.8 s)
[INFO] Building: collect\pom.xml
[INFO] ..SUCCESS (8.9 s)
[INFO] Building: copy\pom.xml
[INFO] run script verify.bsh
[INFO] ..SUCCESS (8.3 s)
[INFO] Building: copy-and-unpack-with-alternate-local-repo\pom.xml
[INFO] run script verify.bsh
[INFO] ..SUCCESS (10.3 s)
[INFO] Building: copy-cli\pom.xml
[INFO] run script verify.bsh
[INFO] ..SUCCESS (7.5 s)
[INFO] Building: copy-dependencies\pom.xml
[INFO] run script verify.bsh
[INFO] ..SUCCESS (9.3 s)
[INFO] Building: copy-from-reactor\pom.xml
[INFO] run script verify.bsh
[INFO] ..SUCCESS (9.8 s)
[INFO] Building: copy-from-remote-repository\pom.xml
[INFO] run script setup.bsh
[INFO] run script verify.bsh
[INFO] ..SUCCESS (10.2 s)
[INFO] Building: dependency-properties\pom.xml
[INFO] run script verify.bsh
[INFO] ..SUCCESS (7.8 s)
[INFO] Building: filterunpack\pom.xml
[INFO] run script verify.groovy
[INFO] ..SUCCESS (7.7 s)
[INFO] Building: get-artifact\pom.xml
[INFO] run script setup.bsh
[INFO] run script verify.bsh
[INFO] ..SUCCESS (7.5 s)
[INFO] Building: get-artifact-maven-plugin\pom.xml
[INFO] run script setup.bsh
[INFO] run script verify.bsh
[INFO] ..SUCCESS (7.9 s)
[INFO] Building: get-artifact-no-transitive\pom.xml
[INFO] run script setup.bsh
[INFO] run script verify.bsh
[INFO] ..SUCCESS (7.9 s)
[INFO] Building: get-gav\pom.xml
[INFO] run script setup.bsh
[INFO] run script verify.bsh
[INFO] ..SUCCESS (7.7 s)
[INFO] Building: go-offline\pom.xml
[INFO] ..SUCCESS (10.1 s)
[INFO] Building: list-repositories\pom.xml
[INFO] ..SUCCESS (8.0 s)
[INFO] Building: mdep-439-analyze-java8\pom.xml
[INFO] ..SKIPPED due to JRE version
[INFO] Building: mdep-450-project-with-ancestor\pom.xml
[INFO] run script verify.groovy
[INFO] ..SUCCESS (7.7 s)
[INFO] Building: mdep-450-project-without-ancestor\pom.xml
[INFO] run script verify.groovy
[INFO] ..SUCCESS (7.6 s)
[INFO] Building: mdep-506-dependency-without-version-in-depmgt\pom.xml
[INFO] ..SUCCESS (8.7 s)
[INFO] Building: mdep-571-resolve-java9\pom.xml
[INFO] ..SKIPPED due to JRE version
[INFO] Building: mdep-572-unpack-tar-long-file\pom.xml
[INFO] run script verify.bsh
[INFO] ..SUCCESS (9.7 s)
[INFO] Building: mdep-578_display-reason-invalid-module\pom.xml
[INFO] ..SKIPPED due to JRE version
[INFO] Building: mdep-580_display-manifest-automodules\pom.xml
[INFO] ..SKIPPED due to JRE version
[INFO] Building: purge-local-repository\pom.xml
[INFO] run script setup.bsh
[INFO] run script verify.bsh
[INFO] ..SUCCESS (7.5 s)
[INFO] Building: purge-local-repository-bad-dep\pom.xml
[INFO] run script verify.groovy
[INFO] ..SUCCESS (8.3 s)
[INFO] Building: purge-local-repository-include\pom.xml
[INFO] run script verify.groovy
[INFO] ..SUCCESS (8.3 s)
[INFO] Building: purge-local-repository-multi-module\pom.xml
[INFO] run script setup.bsh
[INFO] run script verify.bsh
[INFO] ..SUCCESS (8.7 s)
[INFO] Building: purge-local-repository-multi-module-execution\pom.xml
[INFO] run script setup.bsh
[INFO] run script verify.bsh
[INFO] ..SUCCESS (9.4 s)
[INFO] Building: purge-local-repository-non-transitive\pom.xml
[INFO] run script verify.bsh
[INFO] ..SUCCESS (7.7 s)
[INFO] Building: purge-local-repository-reresolve\pom.xml
[INFO] run script verify.bsh
[INFO] ..SUCCESS (8.1 s)
[INFO] Building: purge-local-repository-snapshots-only\pom.xml
[INFO] run script setup.bsh
[INFO] run script verify.bsh
[INFO] ..SUCCESS (8.2 s)
[INFO] Building: purge-local-repository-version-range\pom.xml
[INFO] run script verify.bsh
[INFO] ..SUCCESS (8.1 s)
[INFO] Building: resolve\pom.xml
[INFO] ..SUCCESS (7.9 s)
[INFO] Building: resolve-plugins\pom.xml
[INFO] ..SUCCESS (8.6 s)
[INFO] Building: resolve-plugins-exclude-reactor\pom.xml
[INFO] run script verify.groovy
[INFO] ..SUCCESS (9.4 s)
[INFO] Building: resolve-plugins-with-exclude\pom.xml
[INFO] run script verify.groovy
[INFO] ..SUCCESS (8.0 s)
[INFO] Building: sources\pom.xml
[INFO] ..SUCCESS (8.6 s)
[INFO] Building: tree\pom.xml
[INFO] run script verify.bsh
[INFO] ..SUCCESS (7.5 s)
[INFO] Building: tree-includes\pom.xml
[INFO] run script verify.bsh
[INFO] ..SUCCESS (8.1 s)
[INFO] Building: tree-multimodule\pom.xml
[INFO] run script verify.bsh
[INFO] ..SUCCESS (8.6 s)
[INFO] Building: unpack\pom.xml
[INFO] run script verify.bsh
[INFO] ..SUCCESS (9.9 s)
[INFO] Building: unpack-cli\pom.xml
[INFO] run script verify.bsh
[INFO] ..SUCCESS (7.8 s)
[INFO] Building: unpack-custom-ear\pom.xml
[INFO] run script verify.groovy
[INFO] ..SUCCESS (8.5 s)
[INFO] Building: unpack-dependencies\pom.xml
[INFO] run script verify.groovy
[INFO] ..SUCCESS (9.9 s)
[INFO] Building: unpack-from-remote-repository\pom.xml
[INFO] run script setup.bsh
[INFO] run script verify.bsh
[INFO] ..SUCCESS (9.8 s)
[INFO] Building: used-dependencies\pom.xml
[INFO] ..SUCCESS (9.9 s)
[INFO] Building: purge-local-repository-without-pom
[INFO] run script setup.bsh
[INFO] run script verify.bsh
[INFO] ..SUCCESS (7.1 s)
[INFO]
[INFO] --- mrm-maven-plugin:1.0.0:stop (default) @ maven-dependency-plugin ---
[INFO] Stopping Mock Repository Manager on http://localhost:52519
[INFO] Mock Repository Manager http://localhost:52519 is stopped.
[INFO]
[INFO] --- maven-checkstyle-plugin:2.15:check (checkstyle-check) @ maven-dependency-plugin ---
[INFO] There is 1 error reported by Checkstyle 6.1.1 with config/maven_checks.xml ruleset.
[INFO] Ignored 1 error, 0 violation remaining.
[INFO]
[INFO] --- maven-invoker-plugin:2.0.0:verify (integration-test) @ maven-dependency-plugin ---
[INFO] -------------------------------------------------
[INFO] Build Summary:
[INFO]   Passed: 53, Failed: 0, Errors: 0, Skipped: 4
[INFO] -------------------------------------------------
[INFO]
[INFO] --- maven-install-plugin:2.5.2:install (default-install) @ maven-dependency-plugin ---
[INFO] Installing F:\jenkins\jenkins-slave\workspace\maven-plugins-ITs-m3-windows\maven-dependency-plugin\target\maven-dependency-plugin-3.0.3-SNAPSHOT.jar to C:\Users\jenkins\.m2\repository\org\apache\maven\plugins\maven-dependency-plugin\3.0.3-SNAPSHOT\maven-dependency-plugin-3.0.3-SNAPSHOT.jar
[INFO] Installing F:\jenkins\jenkins-slave\workspace\maven-plugins-ITs-m3-windows\maven-dependency-plugin\pom.xml to C:\Users\jenkins\.m2\repository\org\apache\maven\plugins\maven-dependency-plugin\3.0.3-SNAPSHOT\maven-dependency-plugin-3.0.3-SNAPSHOT.pom
[INFO]                                                                        
[INFO] ------------------------------------------------------------------------
[INFO] Building Apache Maven Plugins Aggregator 1-SNAPSHOT
[INFO] ------------------------------------------------------------------------
[INFO]
[INFO] --- maven-clean-plugin:2.5:clean (default-clean) @ maven-plugins-aggregator ---
[INFO]
[INFO] --- maven-enforcer-plugin:1.3.1:enforce (enforce-bytecode-version) @ maven-plugins-aggregator ---
[INFO]
[INFO] --- maven-enforcer-plugin:1.3.1:enforce (ban-known-bad-maven-versions) @ maven-plugins-aggregator ---
[INFO]
[INFO] --- maven-remote-resources-plugin:1.5:process (default) @ maven-plugins-aggregator ---
[INFO]
[INFO] --- maven-site-plugin:3.3:attach-descriptor (attach-descriptor) @ maven-plugins-aggregator ---
[INFO]
[INFO] --- maven-install-plugin:2.5.1:install (default-install) @ maven-plugins-aggregator ---
[INFO] Installing <https://builds.apache.org/job/maven-plugins-ITs-m3-windows/ws/pom.xml> to C:\Users\jenkins\.m2\repository\org\apache\maven\plugins\maven-plugins-aggregator\1-SNAPSHOT\maven-plugins-aggregator-1-SNAPSHOT.pom
[INFO] ------------------------------------------------------------------------
[INFO] Reactor Summary:
[INFO]
[INFO] Apache Maven ACR Plugin ............................ SUCCESS [ 45.907 s]
[INFO] Apache Maven AntRun Plugin ......................... SUCCESS [02:42 min]
[INFO] Apache Maven Changelog Plugin ...................... SUCCESS [01:16 min]
[INFO] Apache Maven Changes Plugin ........................ SUCCESS [02:10 min]
[INFO] Apache Maven Clean Plugin .......................... SUCCESS [ 51.886 s]
[INFO] Apache Maven Compiler Plugin ....................... SUCCESS [04:14 min]
[INFO] Apache Maven Deploy Plugin ......................... SUCCESS [04:09 min]
[INFO] Apache Maven Documentation Checker Plugin .......... SUCCESS [ 12.423 s]
[INFO] Apache Maven EAR Plugin ............................ SUCCESS [12:04 min]
[INFO] Apache Maven EJB Plugin ............................ SUCCESS [01:23 min]
[INFO] Apache Maven Help Plugin ........................... SUCCESS [03:51 min]
[INFO] Apache Maven Install Plugin ........................ SUCCESS [03:37 min]
[INFO] Apache Maven Jarsigner Plugin ...................... SUCCESS [01:29 min]
[INFO] Apache Maven JDeps Plugin .......................... SUCCESS [  4.339 s]
[INFO] Apache Maven Linkcheck Plugin ...................... SUCCESS [  6.011 s]
[INFO] Apache Maven Patch Plugin .......................... SUCCESS [ 11.966 s]
[INFO] Apache Maven PDF Plugin ............................ FAILURE [ 59.551 s]
[INFO] Apache Maven RAR Plugin ............................ SUCCESS [ 24.235 s]
[INFO] Apache Maven Repository Plugin ..................... SUCCESS [ 52.320 s]
[INFO] Apache Maven Resources Plugin ...................... SUCCESS [02:41 min]
[INFO] Apache Maven Site Plugin ........................... SUCCESS [13:05 min]
[INFO] Apache Maven Source Plugin ......................... SUCCESS [02:05 min]
[INFO] Apache Maven Stage Plugin .......................... SUCCESS [  4.326 s]
[INFO] Apache Maven Toolchains Plugin ..................... SUCCESS [ 32.902 s]
[INFO] Apache Maven Verifier Plugin ....................... SUCCESS [ 20.627 s]
[INFO] Apache Maven WAR Plugin ............................ SUCCESS [03:44 min]
[INFO] Apache Maven DOAP Plugin ........................... SUCCESS [ 42.558 s]
[INFO] Apache Maven Invoker Plugin ........................ SUCCESS [14:38 min]
[INFO] Apache Maven JAR Plugin ............................ SUCCESS [03:43 min]
[INFO] Apache Maven Assembly Plugin ....................... SUCCESS [22:04 min]
[INFO] Apache Maven Checkstyle Plugin ..................... SUCCESS [07:48 min]
[INFO] Apache Maven Javadoc Plugin ........................ SUCCESS [09:39 min]
[INFO] Apache Maven PMD Plugin ............................ SUCCESS [04:13 min]
[INFO] Apache Maven JLink Plugin .......................... SUCCESS [  7.934 s]
[INFO] Apache Maven JMod Plugin ........................... SUCCESS [  5.008 s]
[INFO] Apache Maven Project Info Reports Plugin ........... SUCCESS [04:13 min]
[INFO] Apache Maven Remote Resources Plugin ............... SUCCESS [02:02 min]
[INFO] Apache Maven Shade Plugin .......................... SUCCESS [08:15 min]
[INFO] Apache Maven SCM Publish Plugin .................... SUCCESS [01:29 min]
[INFO] Apache Maven Dependency Plugin ..................... SUCCESS [09:08 min]
[INFO] Apache Maven Plugins Aggregator .................... SUCCESS [  1.142 s]
[INFO] ------------------------------------------------------------------------
[INFO] BUILD FAILURE
[INFO] ------------------------------------------------------------------------
[INFO] Total time: 02:32 h
[INFO] Finished at: 2017-10-08T22:31:09+00:00
[INFO] Final Memory: 160M/579M
[INFO] ------------------------------------------------------------------------
[WARNING] The requested profile "apache.snapshots" could not be activated because it does not exist.
[ERROR] Failed to execute goal org.apache.maven.plugins:maven-checkstyle-plugin:2.15:check (checkstyle-check) on project maven-pdf-plugin: You have 1 Checkstyle violation. -> [Help 1]
[ERROR]
[ERROR] To see the full stack trace of the errors, re-run Maven with the -e switch.
[ERROR] Re-run Maven using the -X switch to enable full debug logging.
[ERROR]
[ERROR] For more information about the errors and possible solutions, please read the following articles:
[ERROR] [Help 1] http://cwiki.apache.org/confluence/display/MAVEN/MojoFailureException
[ERROR]
[ERROR] After correcting the problems, you can resume the build with the command
[ERROR]   mvn <goals> -rf :maven-pdf-plugin
Build step 'Invoke top-level Maven targets' marked build as failure
Deleting 1 temporary files
Recording test results
Reply | Threaded
Open this post in threaded view
|

Jenkins build is back to normal : maven-plugins-ITs-m3-windows #2011

Apache Jenkins Server-2