Build failed in Jenkins: maven-plugins-ITs-m3-windows #1995

Previous Topic Next Topic
 
classic Classic list List threaded Threaded
13 messages Options
Reply | Threaded
Open this post in threaded view
|

Build failed in Jenkins: maven-plugins-ITs-m3-windows #1995

Apache Jenkins Server-2
See <https://builds.apache.org/job/maven-plugins-ITs-m3-windows/1995/display/redirect?page=changes>

Changes:

[khmarbaise] [MEAR-171] Full customization of FileNameMapping is needed
 o Implemented full file name mapping by using
   maven-mapping shared component.
 o Made integration tests more reliable.
 o Changed all integration tests cause the default for the file name
   mapping is defined as:
   @{groupId}@-@{artifactId}@-@{version}@@{dashClassifier?}@.@{extension}@
 o Introduced a new parameter outputFileNameMapping which
   can be used to change the mapping based on the maven-mapping
   component.

------------------------------------------
[...truncated 3.37 MB...]
[INFO] Building: copy-from-reactor\pom.xml
[INFO] run script verify.bsh
[INFO] ..SUCCESS (8.1 s)
[INFO] Building: copy-from-remote-repository\pom.xml
[INFO] run script setup.bsh
[INFO] artifact org.apache.maven.its.dependency.fake-remote-copy:1.0: checking for updates from central
[INFO] run script verify.bsh
[INFO] ..SUCCESS (8.5 s)
[INFO] Building: dependency-properties\pom.xml
[INFO] run script verify.bsh
[INFO] ..SUCCESS (7.6 s)
[INFO] Building: filterunpack\pom.xml
[INFO] run script verify.groovy
[INFO] ..SUCCESS (7.3 s)
[INFO] Building: get-artifact\pom.xml
[INFO] run script setup.bsh
[INFO] run script verify.bsh
[INFO] ..SUCCESS (6.7 s)
[INFO] Building: get-artifact-maven-plugin\pom.xml
[INFO] run script setup.bsh
[INFO] run script verify.bsh
[INFO] ..SUCCESS (7.4 s)
[INFO] Building: get-artifact-no-transitive\pom.xml
[INFO] run script setup.bsh
[INFO] run script verify.bsh
[INFO] ..SUCCESS (7.0 s)
[INFO] Building: get-gav\pom.xml
[INFO] run script setup.bsh
[INFO] run script verify.bsh
[INFO] ..SUCCESS (6.8 s)
[INFO] Building: go-offline\pom.xml
[INFO] ..SUCCESS (8.3 s)
[INFO] Building: list-repositories\pom.xml
[INFO] snapshot org.apache.maven.its.dependency:test:1.0-SNAPSHOT: checking for updates from apache.snapshots
[INFO] artifact org.apache.maven.its.dependency.test:1.0-SNAPSHOT: checking for updates from central
[INFO] ..SUCCESS (7.1 s)
[INFO] Building: mdep-439-analyze-java8\pom.xml
[INFO] ..SKIPPED due to JRE version
[INFO] Building: mdep-450-project-with-ancestor\pom.xml
[INFO] run script verify.groovy
[INFO] ..SUCCESS (6.7 s)
[INFO] Building: mdep-450-project-without-ancestor\pom.xml
[INFO] run script verify.groovy
[INFO] ..SUCCESS (6.7 s)
[INFO] Building: mdep-506-dependency-without-version-in-depmgt\pom.xml
[INFO] ..SUCCESS (7.8 s)
[INFO] Building: mdep-571-resolve-java9\pom.xml
[INFO] ..SKIPPED due to JRE version
[INFO] Building: mdep-572-unpack-tar-long-file\pom.xml
[INFO] run script verify.bsh
[INFO] ..SUCCESS (8.9 s)
[INFO] Building: mdep-578_display-reason-invalid-module\pom.xml
[INFO] ..SKIPPED due to JRE version
[INFO] Building: mdep-580_display-manifest-automodules\pom.xml
[INFO] ..SKIPPED due to JRE version
[INFO] Building: purge-local-repository\pom.xml
[INFO] run script setup.bsh
[INFO] artifact org.apache.maven.its.dependency.purged:1.0: checking for updates from central
[INFO] run script verify.bsh
[INFO] ..SUCCESS (7.5 s)
[INFO] Building: purge-local-repository-bad-dep\pom.xml
[INFO] snapshot org.apache.maven.its.dependency:purge-local-repository-bad-dep:1.0-SNAPSHOT: checking for updates from apache.snapshots
[INFO] artifact org.apache.maven.its.dependency.purge-local-repository-bad-dep:1.0-SNAPSHOT: checking for updates from central
[INFO] artifact org.apache.maven.its.dependency.i-do-not-exist:1.0: checking for updates from central
[INFO] run script verify.groovy
[INFO] ..SUCCESS (8.0 s)
[INFO] Building: purge-local-repository-include\pom.xml
[INFO] snapshot org.apache.maven.its.dependency:purge-local-repository-include:1.0-SNAPSHOT: checking for updates from apache.snapshots
[INFO] artifact org.apache.maven.its.dependency.purge-local-repository-include:1.0-SNAPSHOT: checking for updates from central
[INFO] run script verify.groovy
[INFO] ..SUCCESS (6.9 s)
[INFO] Building: purge-local-repository-multi-module\pom.xml
[INFO] run script setup.bsh
[INFO] snapshot org.apache.maven.its.dependency:child1:1.0-SNAPSHOT: checking for updates from apache.snapshots
[INFO] artifact org.apache.maven.its.dependency.child1:1.0-SNAPSHOT: checking for updates from central
[INFO] artifact org.apache.maven.its.dependency.purged-a:1.0: checking for updates from central
[INFO] snapshot org.apache.maven.its.dependency:child2:1.0-SNAPSHOT: checking for updates from apache.snapshots
[INFO] artifact org.apache.maven.its.dependency.child2:1.0-SNAPSHOT: checking for updates from central
[INFO] artifact org.apache.maven.its.dependency.purged-b:1.0: checking for updates from central
[INFO] run script verify.bsh
[INFO] ..SUCCESS (8.3 s)
[INFO] Building: purge-local-repository-multi-module-execution\pom.xml
[INFO] run script setup.bsh
[INFO] run script verify.bsh
[INFO] ..SUCCESS (8.3 s)
[INFO] Building: purge-local-repository-non-transitive\pom.xml
[INFO] run script verify.bsh
[INFO] ..SUCCESS (7.8 s)
[INFO] Building: purge-local-repository-reresolve\pom.xml
[INFO] run script verify.bsh
[INFO] ..SUCCESS (7.7 s)
[INFO] Building: purge-local-repository-snapshots-only\pom.xml
[INFO] run script setup.bsh
[INFO] snapshot org.apache.maven.its.dependency:snap-purged:1.0-SNAPSHOT: checking for updates from apache.snapshots
[INFO] artifact org.apache.maven.its.dependency.snap-purged:1.0-SNAPSHOT: checking for updates from central
[INFO] run script verify.bsh
[INFO] ..SUCCESS (8.1 s)
[INFO] Building: purge-local-repository-version-range\pom.xml
[INFO] artifact org.apache.maven.its.dependency:purge-local-repository: checking for updates from central
[INFO] artifact org.apache.maven.its.dependency:purge-local-repository: checking for updates from central
[INFO] run script verify.bsh
[INFO] ..SUCCESS (7.2 s)
[INFO] Building: resolve\pom.xml
[INFO] ..SUCCESS (6.9 s)
[INFO] Building: resolve-plugins\pom.xml
[INFO] ..SUCCESS (8.4 s)
[INFO] Building: resolve-plugins-exclude-reactor\pom.xml
[INFO] run script verify.groovy
[INFO] ..SUCCESS (10.8 s)
[INFO] Building: resolve-plugins-with-exclude\pom.xml
[INFO] run script verify.groovy
[INFO] ..SUCCESS (8.0 s)
[INFO] Building: sources\pom.xml
[INFO] artifact classworlds.classworlds:1.1-alpha-2: checking for updates from central
[INFO] ..SUCCESS (8.1 s)
[INFO] Building: tree\pom.xml
[INFO] run script verify.bsh
[INFO] ..SUCCESS (7.8 s)
[INFO] Building: tree-includes\pom.xml
[INFO] run script verify.bsh
[INFO] ..SUCCESS (7.8 s)
[INFO] Building: tree-multimodule\pom.xml
[INFO] snapshot org.apache.maven.its.dependency:tree-multimodule-module-a:1.0-SNAPSHOT: checking for updates from apache.snapshots
[INFO] artifact org.apache.maven.its.dependency.tree-multimodule-module-a:1.0-SNAPSHOT: checking for updates from central
[INFO] run script verify.bsh
[INFO] ..SUCCESS (9.0 s)
[INFO] Building: unpack\pom.xml
[INFO] run script verify.bsh
[INFO] ..SUCCESS (9.3 s)
[INFO] Building: unpack-cli\pom.xml
[INFO] run script verify.bsh
[INFO] ..SUCCESS (7.8 s)
[INFO] Building: unpack-custom-ear\pom.xml
[INFO] run script verify.groovy
[INFO] ..SUCCESS (8.1 s)
[INFO] Building: unpack-dependencies\pom.xml
[INFO] run script verify.groovy
[INFO] ..SUCCESS (10.8 s)
[INFO] Building: unpack-from-remote-repository\pom.xml
[INFO] run script setup.bsh
[INFO] artifact org.apache.maven.its.dependency.fake-remote-unpack:1.0: checking for updates from central
[INFO] run script verify.bsh
[INFO] ..SUCCESS (9.7 s)
[INFO] Building: used-dependencies\pom.xml
[INFO] ..SUCCESS (9.7 s)
[INFO] Building: purge-local-repository-without-pom
[INFO] run script setup.bsh
[INFO] run script verify.bsh
[INFO] ..SUCCESS (7.7 s)
[INFO]
[INFO] --- mrm-maven-plugin:1.0.0:stop (default) @ maven-dependency-plugin ---
[INFO] Stopping Mock Repository Manager on http://localhost:64223
[INFO] Mock Repository Manager http://localhost:64223 is stopped.
[INFO]
[INFO] --- maven-checkstyle-plugin:2.15:check (checkstyle-check) @ maven-dependency-plugin ---
[INFO] There is 1 error reported by Checkstyle 6.1.1 with config/maven_checks.xml ruleset.
[INFO] Ignored 1 error, 0 violation remaining.
[INFO]
[INFO] --- maven-invoker-plugin:2.0.0:verify (integration-test) @ maven-dependency-plugin ---
[INFO] -------------------------------------------------
[INFO] Build Summary:
[INFO]   Passed: 53, Failed: 0, Errors: 0, Skipped: 4
[INFO] -------------------------------------------------
[INFO]
[INFO] --- maven-install-plugin:2.5.2:install (default-install) @ maven-dependency-plugin ---
[INFO] Installing F:\jenkins\jenkins-slave\workspace\maven-plugins-ITs-m3-windows\maven-dependency-plugin\target\maven-dependency-plugin-3.0.3-SNAPSHOT.jar to C:\Users\jenkins\.m2\repository\org\apache\maven\plugins\maven-dependency-plugin\3.0.3-SNAPSHOT\maven-dependency-plugin-3.0.3-SNAPSHOT.jar
[INFO] Installing F:\jenkins\jenkins-slave\workspace\maven-plugins-ITs-m3-windows\maven-dependency-plugin\pom.xml to C:\Users\jenkins\.m2\repository\org\apache\maven\plugins\maven-dependency-plugin\3.0.3-SNAPSHOT\maven-dependency-plugin-3.0.3-SNAPSHOT.pom
[INFO]                                                                        
[INFO] ------------------------------------------------------------------------
[INFO] Building Apache Maven Plugins Aggregator 1-SNAPSHOT
[INFO] ------------------------------------------------------------------------
[INFO]
[INFO] --- maven-clean-plugin:2.5:clean (default-clean) @ maven-plugins-aggregator ---
[INFO]
[INFO] --- maven-enforcer-plugin:1.3.1:enforce (enforce-bytecode-version) @ maven-plugins-aggregator ---
[INFO]
[INFO] --- maven-enforcer-plugin:1.3.1:enforce (ban-known-bad-maven-versions) @ maven-plugins-aggregator ---
[INFO]
[INFO] --- maven-remote-resources-plugin:1.5:process (default) @ maven-plugins-aggregator ---
[INFO]
[INFO] --- maven-site-plugin:3.3:attach-descriptor (attach-descriptor) @ maven-plugins-aggregator ---
[INFO]
[INFO] --- maven-install-plugin:2.5.1:install (default-install) @ maven-plugins-aggregator ---
[INFO] Installing <https://builds.apache.org/job/maven-plugins-ITs-m3-windows/ws/pom.xml> to C:\Users\jenkins\.m2\repository\org\apache\maven\plugins\maven-plugins-aggregator\1-SNAPSHOT\maven-plugins-aggregator-1-SNAPSHOT.pom
[INFO] ------------------------------------------------------------------------
[INFO] Reactor Summary:
[INFO]
[INFO] Apache Maven ACR Plugin ............................ SUCCESS [ 52.981 s]
[INFO] Apache Maven AntRun Plugin ......................... SUCCESS [02:53 min]
[INFO] Apache Maven Changelog Plugin ...................... SUCCESS [01:20 min]
[INFO] Apache Maven Changes Plugin ........................ SUCCESS [02:13 min]
[INFO] Apache Maven Clean Plugin .......................... SUCCESS [ 52.875 s]
[INFO] Apache Maven Compiler Plugin ....................... SUCCESS [04:12 min]
[INFO] Apache Maven Deploy Plugin ......................... SUCCESS [03:54 min]
[INFO] Apache Maven Documentation Checker Plugin .......... SUCCESS [ 10.600 s]
[INFO] Apache Maven EAR Plugin ............................ FAILURE [10:37 min]
[INFO] Apache Maven EJB Plugin ............................ SUCCESS [01:17 min]
[INFO] Apache Maven Help Plugin ........................... SUCCESS [03:44 min]
[INFO] Apache Maven Install Plugin ........................ SUCCESS [03:16 min]
[INFO] Apache Maven Jarsigner Plugin ...................... SUCCESS [01:23 min]
[INFO] Apache Maven JDeps Plugin .......................... SUCCESS [  4.250 s]
[INFO] Apache Maven Linkcheck Plugin ...................... SUCCESS [  7.329 s]
[INFO] Apache Maven Patch Plugin .......................... SUCCESS [ 12.943 s]
[INFO] Apache Maven PDF Plugin ............................ SUCCESS [ 47.117 s]
[INFO] Apache Maven RAR Plugin ............................ SUCCESS [ 21.793 s]
[INFO] Apache Maven Repository Plugin ..................... SUCCESS [ 47.870 s]
[INFO] Apache Maven Resources Plugin ...................... SUCCESS [02:36 min]
[INFO] Apache Maven Site Plugin ........................... SUCCESS [12:10 min]
[INFO] Apache Maven Source Plugin ......................... SUCCESS [02:00 min]
[INFO] Apache Maven Stage Plugin .......................... SUCCESS [  4.609 s]
[INFO] Apache Maven Toolchains Plugin ..................... SUCCESS [ 29.144 s]
[INFO] Apache Maven Verifier Plugin ....................... SUCCESS [ 18.312 s]
[INFO] Apache Maven WAR Plugin ............................ SUCCESS [03:41 min]
[INFO] Apache Maven DOAP Plugin ........................... SUCCESS [ 38.558 s]
[INFO] Apache Maven Invoker Plugin ........................ SUCCESS [13:23 min]
[INFO] Apache Maven JAR Plugin ............................ SUCCESS [03:20 min]
[INFO] Apache Maven Assembly Plugin ....................... SUCCESS [19:23 min]
[INFO] Apache Maven Checkstyle Plugin ..................... SUCCESS [08:00 min]
[INFO] Apache Maven Javadoc Plugin ........................ SUCCESS [10:42 min]
[INFO] Apache Maven PMD Plugin ............................ SUCCESS [04:04 min]
[INFO] Apache Maven JLink Plugin .......................... SUCCESS [  7.132 s]
[INFO] Apache Maven JMod Plugin ........................... SUCCESS [  3.961 s]
[INFO] Apache Maven Project Info Reports Plugin ........... SUCCESS [03:48 min]
[INFO] Apache Maven Remote Resources Plugin ............... SUCCESS [01:47 min]
[INFO] Apache Maven Shade Plugin .......................... SUCCESS [07:20 min]
[INFO] Apache Maven SCM Publish Plugin .................... SUCCESS [01:26 min]
[INFO] Apache Maven Dependency Plugin ..................... SUCCESS [08:26 min]
[INFO] Apache Maven Plugins Aggregator .................... SUCCESS [  1.073 s]
[INFO] ------------------------------------------------------------------------
[INFO] BUILD FAILURE
[INFO] ------------------------------------------------------------------------
[INFO] Total time: 02:23 h
[INFO] Finished at: 2017-09-13T23:56:38+00:00
[INFO] Final Memory: 161M/598M
[INFO] ------------------------------------------------------------------------
[WARNING] The requested profile "apache.snapshots" could not be activated because it does not exist.
[ERROR] Failed to execute goal org.apache.maven.plugins:maven-invoker-plugin:2.0.0:verify (integration-test) on project maven-ear-plugin: 1 build failed. See console output above for details. -> [Help 1]
[ERROR]
[ERROR] To see the full stack trace of the errors, re-run Maven with the -e switch.
[ERROR] Re-run Maven using the -X switch to enable full debug logging.
[ERROR]
[ERROR] For more information about the errors and possible solutions, please read the following articles:
[ERROR] [Help 1] http://cwiki.apache.org/confluence/display/MAVEN/MojoFailureException
[ERROR]
[ERROR] After correcting the problems, you can resume the build with the command
[ERROR]   mvn <goals> -rf :maven-ear-plugin
Build step 'Invoke top-level Maven targets' marked build as failure
Deleting 1 temporary files
Recording test results
Reply | Threaded
Open this post in threaded view
|

Build failed in Jenkins: maven-plugins-ITs-m3-windows #1996

Apache Jenkins Server-2
See <https://builds.apache.org/job/maven-plugins-ITs-m3-windows/1996/display/redirect?page=changes>

Changes:

[khmarbaise] Get the IT's working.
 o the moduleName is only used to name the jmod file
   in target directory.
 o Fixed handling of getPlatformSeparatedList()

[khmarbaise] Added handling of classpath/modulepath.
Currently the IT's are failing.

------------------------------------------
[...truncated 1.70 MB...]
AU        maven-war-plugin\src\it\MWAR-129\src\main\webapp\param.jsp
AU        maven-war-plugin\src\it\MWAR-129\src\main\webapp\index.jsp
A         maven-war-plugin\src\it\MWAR-129\src\main\webapp\WEB-INF
AU        maven-war-plugin\src\it\MWAR-129\src\main\webapp\WEB-INF\web.xml
AU        maven-war-plugin\src\it\MWAR-129\invoker.properties
AU        maven-war-plugin\src\it\MWAR-129\pom.xml
AU        maven-war-plugin\src\it\MWAR-129\verify.bsh
A         maven-war-plugin\src\it\MWAR-139
A         maven-war-plugin\src\it\MWAR-139\src
A         maven-war-plugin\src\it\MWAR-139\src\main
A         maven-war-plugin\src\it\MWAR-139\src\main\webresources
AU        maven-war-plugin\src\it\MWAR-139\src\main\webresources\filterme.xml
A         maven-war-plugin\src\it\MWAR-139\src\main\webapp
A         maven-war-plugin\src\it\MWAR-139\src\main\webapp\WEB-INF
AU        maven-war-plugin\src\it\MWAR-139\src\main\webapp\WEB-INF\web.xml
AU        maven-war-plugin\src\it\MWAR-139\pom.xml
AU        maven-war-plugin\src\it\MWAR-139\verify.bsh
A         maven-war-plugin\src\it\MWAR-167
A         maven-war-plugin\src\it\MWAR-167\src
A         maven-war-plugin\src\it\MWAR-167\src\main
A         maven-war-plugin\src\it\MWAR-167\src\main\webapp
A         maven-war-plugin\src\it\MWAR-167\src\main\resources
A         maven-war-plugin\src\it\MWAR-167\src\main\resources\MANIFEST.MF
A         maven-war-plugin\src\it\MWAR-167\invoker.properties
A         maven-war-plugin\src\it\MWAR-167\pom.xml
A         maven-war-plugin\src\it\MWAR-167\verify.bsh
A         maven-war-plugin\src\it\web-resources-filtering-delimiter
A         maven-war-plugin\src\it\web-resources-filtering-delimiter\parent
A         maven-war-plugin\src\it\web-resources-filtering-delimiter\parent\pom.xml
A         maven-war-plugin\src\it\web-resources-filtering-delimiter\pom.xml
A         maven-war-plugin\src\it\web-resources-filtering-delimiter\web
A         maven-war-plugin\src\it\web-resources-filtering-delimiter\web\src
A         maven-war-plugin\src\it\web-resources-filtering-delimiter\web\src\main
A         maven-war-plugin\src\it\web-resources-filtering-delimiter\web\src\main\webapp
AU        maven-war-plugin\src\it\web-resources-filtering-delimiter\web\src\main\webapp\index.jsp
A         maven-war-plugin\src\it\web-resources-filtering-delimiter\web\src\main\webapp\WEB-INF
A         maven-war-plugin\src\it\web-resources-filtering-delimiter\web\src\main\webapp\WEB-INF\web.xml
A         maven-war-plugin\src\it\web-resources-filtering-delimiter\web\src\main\webresources
A         maven-war-plugin\src\it\web-resources-filtering-delimiter\web\src\main\webresources\WEB-INF
A         maven-war-plugin\src\it\web-resources-filtering-delimiter\web\src\main\webresources\WEB-INF\classes
A         maven-war-plugin\src\it\web-resources-filtering-delimiter\web\src\main\webresources\WEB-INF\classes\my.properties
A         maven-war-plugin\src\it\web-resources-filtering-delimiter\web\src\main\webresources\WEB-INF\jetty-env.xml
A         maven-war-plugin\src\it\web-resources-filtering-delimiter\web\src\main\resources
A         maven-war-plugin\src\it\web-resources-filtering-delimiter\web\pom.xml
A         maven-war-plugin\src\it\web-resources-filtering-delimiter\verify.bsh
A         maven-war-plugin\src\it\simple-war-project
A         maven-war-plugin\src\it\simple-war-project\src
A         maven-war-plugin\src\it\simple-war-project\src\main
A         maven-war-plugin\src\it\simple-war-project\src\main\webapp
A         maven-war-plugin\src\it\simple-war-project\src\main\webapp\WEB-INF
AU        maven-war-plugin\src\it\simple-war-project\src\main\webapp\WEB-INF\web.xml
AU        maven-war-plugin\src\it\simple-war-project\src\main\webapp\index.jsp
AU        maven-war-plugin\src\it\simple-war-project\invoker.properties
AU        maven-war-plugin\src\it\simple-war-project\pom.xml
AU        maven-war-plugin\src\it\simple-war-project\verify.bsh
A         maven-war-plugin\src\it\default
AU        maven-war-plugin\src\it\default\pom.xml
AU        maven-war-plugin\src\it\default\verify.bsh
A         maven-war-plugin\src\it\default\src
A         maven-war-plugin\src\it\default\src\main
A         maven-war-plugin\src\it\default\src\main\webapp
A         maven-war-plugin\src\it\default\src\main\webapp\WEB-INF
AU        maven-war-plugin\src\it\default\src\main\webapp\WEB-INF\web.xml
AU        maven-war-plugin\src\it\default\src\main\webapp\index.html
A         maven-war-plugin\src\it\default\src\main\java
A         maven-war-plugin\src\it\default\src\main\java\org
A         maven-war-plugin\src\it\default\src\main\java\org\apache
A         maven-war-plugin\src\it\default\src\main\java\org\apache\maven
A         maven-war-plugin\src\it\default\src\main\java\org\apache\maven\it0016
AU        maven-war-plugin\src\it\default\src\main\java\org\apache\maven\it0016\Person.java
A         maven-war-plugin\src\it\simple-war-no-webxml
AU        maven-war-plugin\src\it\simple-war-no-webxml\invoker.properties
AU        maven-war-plugin\src\it\simple-war-no-webxml\pom.xml
AU        maven-war-plugin\src\it\simple-war-no-webxml\verify.bsh
A         maven-war-plugin\src\it\simple-war-no-webxml\src
A         maven-war-plugin\src\it\simple-war-no-webxml\src\main
A         maven-war-plugin\src\it\simple-war-no-webxml\src\main\webapp
AU        maven-war-plugin\src\it\simple-war-no-webxml\src\main\webapp\index.jsp
A         maven-war-plugin\src\it\overlay-keeps-contextxml
A         maven-war-plugin\src\it\overlay-keeps-contextxml\war2-result
A         maven-war-plugin\src\it\overlay-keeps-contextxml\war2-result\src
A         maven-war-plugin\src\it\overlay-keeps-contextxml\war2-result\src\main
A         maven-war-plugin\src\it\overlay-keeps-contextxml\war2-result\src\main\webapp
A         maven-war-plugin\src\it\overlay-keeps-contextxml\war2-result\src\main\webapp\WEB-INF
A         maven-war-plugin\src\it\overlay-keeps-contextxml\war2-result\src\main\webapp\WEB-INF\web.xml
A         maven-war-plugin\src\it\overlay-keeps-contextxml\war2-result\pom.xml
A         maven-war-plugin\src\it\overlay-keeps-contextxml\invoker.properties
A         maven-war-plugin\src\it\overlay-keeps-contextxml\pom.xml
A         maven-war-plugin\src\it\overlay-keeps-contextxml\verify.bsh
A         maven-war-plugin\src\it\overlay-keeps-contextxml\war1-with-contextxml
A         maven-war-plugin\src\it\overlay-keeps-contextxml\war1-with-contextxml\src
A         maven-war-plugin\src\it\overlay-keeps-contextxml\war1-with-contextxml\src\main
A         maven-war-plugin\src\it\overlay-keeps-contextxml\war1-with-contextxml\src\main\webapp
A         maven-war-plugin\src\it\overlay-keeps-contextxml\war1-with-contextxml\src\main\webapp\META-INF
A         maven-war-plugin\src\it\overlay-keeps-contextxml\war1-with-contextxml\src\main\webapp\META-INF\context.xml
A         maven-war-plugin\src\it\overlay-keeps-contextxml\war1-with-contextxml\src\main\webapp\WEB-INF
A         maven-war-plugin\src\it\overlay-keeps-contextxml\war1-with-contextxml\src\main\webapp\WEB-INF\web.xml
A         maven-war-plugin\src\it\overlay-keeps-contextxml\war1-with-contextxml\pom.xml
A         maven-war-plugin\src\it\overlay-excludes
AU        maven-war-plugin\src\it\overlay-excludes\verify.bsh
A         maven-war-plugin\src\it\overlay-excludes\war-exclude-overlay
AU        maven-war-plugin\src\it\overlay-excludes\war-exclude-overlay\pom.xml
A         maven-war-plugin\src\it\overlay-excludes\war-exclude-overlay\src
A         maven-war-plugin\src\it\overlay-excludes\war-exclude-overlay\src\main
A         maven-war-plugin\src\it\overlay-excludes\war-exclude-overlay\src\main\webapp
A         maven-war-plugin\src\it\overlay-excludes\war-exclude-overlay\src\main\webapp\WEB-INF
AU        maven-war-plugin\src\it\overlay-excludes\war-exclude-overlay\src\main\webapp\WEB-INF\web.xml
AU        maven-war-plugin\src\it\overlay-excludes\invoker.properties
A         maven-war-plugin\src\it\overlay-excludes\war-overlay
A         maven-war-plugin\src\it\overlay-excludes\war-overlay\src
A         maven-war-plugin\src\it\overlay-excludes\war-overlay\src\main
A         maven-war-plugin\src\it\overlay-excludes\war-overlay\src\main\webapp
A         maven-war-plugin\src\it\overlay-excludes\war-overlay\src\main\webapp\lib
A         maven-war-plugin\src\it\overlay-excludes\war-overlay\src\main\webapp\lib\js
A         maven-war-plugin\src\it\overlay-excludes\war-overlay\src\main\webapp\lib\js\something
AU        maven-war-plugin\src\it\overlay-excludes\war-overlay\src\main\webapp\lib\js\something\else.js
A         maven-war-plugin\src\it\overlay-excludes\war-overlay\src\main\webapp\WEB-INF
AU        maven-war-plugin\src\it\overlay-excludes\war-overlay\src\main\webapp\WEB-INF\web.xml
AU        maven-war-plugin\src\it\overlay-excludes\war-overlay\pom.xml
AU        maven-war-plugin\src\it\overlay-excludes\pom.xml
A         maven-war-plugin\src\it\MWAR-62
AU        maven-war-plugin\src\it\MWAR-62\pom.xml
AU        maven-war-plugin\src\it\MWAR-62\verify.bsh
A         maven-war-plugin\src\it\MWAR-62\src
A         maven-war-plugin\src\it\MWAR-62\src\main
A         maven-war-plugin\src\it\MWAR-62\src\main\webapp
AU        maven-war-plugin\src\it\MWAR-62\src\main\webapp\dev.properties
AU        maven-war-plugin\src\it\MWAR-62\src\main\webapp\test.properties
AU        maven-war-plugin\src\it\MWAR-62\src\main\webapp\web.xml
AU        maven-war-plugin\src\it\MWAR-62\invoker.properties
A         maven-war-plugin\src\it\MWAR-396_servlet30
AU        maven-war-plugin\src\it\MWAR-396_servlet30\pom.xml
AU        maven-war-plugin\src\it\MWAR-396_servlet30\verify.bsh
AU        maven-war-plugin\src\it\settings.xml
A         maven-war-plugin\src\it\MWAR-96
A         maven-war-plugin\src\it\MWAR-96\src
A         maven-war-plugin\src\it\MWAR-96\src\main
A         maven-war-plugin\src\it\MWAR-96\src\main\filters
AU        maven-war-plugin\src\it\MWAR-96\src\main\filters\filter.properties
A         maven-war-plugin\src\it\MWAR-96\src\main\webapp
AU        maven-war-plugin\src\it\MWAR-96\src\main\webapp\index.jsp
A         maven-war-plugin\src\it\MWAR-96\src\main\webapp\WEB-INF
AU        maven-war-plugin\src\it\MWAR-96\src\main\webapp\WEB-INF\web.xml
AU        maven-war-plugin\src\it\MWAR-96\pom.xml
AU        maven-war-plugin\src\it\MWAR-96\verify.bsh
A         maven-war-plugin\src\test
A         maven-war-plugin\src\test\resources
A         maven-war-plugin\src\test\resources\unit
A         maven-war-plugin\src\test\resources\unit\warziptest
AU        maven-war-plugin\src\test\resources\unit\warziptest\war-with-zip.xml
AU        maven-war-plugin\src\test\resources\unit\warziptest\foobar.zip
A         maven-war-plugin\src\test\resources\unit\sample_wars
AU        maven-war-plugin\src\test\resources\unit\sample_wars\simple.war
AU        maven-war-plugin\src\test\resources\unit\sample_wars\include-exclude.war
AU        maven-war-plugin\src\test\resources\unit\sample_wars\sample.par
AU        maven-war-plugin\src\test\resources\unit\sample_wars\simple.xar
AU        maven-war-plugin\src\test\resources\unit\sample_wars\simple.jar
AU        maven-war-plugin\src\test\resources\unit\sample_wars\simple-updated.war
AU        maven-war-plugin\src\test\resources\unit\sample_wars\simple.mar
AU        maven-war-plugin\src\test\resources\unit\sample_wars\ejbclient.jar
AU        maven-war-plugin\src\test\resources\unit\sample_wars\ejb.jar
AU        maven-war-plugin\src\test\resources\unit\sample_wars\javax.servlet-api-3.0.1.jar
AU        maven-war-plugin\src\test\resources\unit\sample_wars\simple.aar
AU        maven-war-plugin\src\test\resources\unit\sample_wars\tld.jar
A         maven-war-plugin\src\test\resources\unit\warmojotest
AU        maven-war-plugin\src\test\resources\unit\warmojotest\not-primary-artifact.xml
AU        maven-war-plugin\src\test\resources\unit\warmojotest\plugin-config-primary-artifact.xml
A         maven-war-plugin\src\test\resources\unit\waroverlays
AU        maven-war-plugin\src\test\resources\unit\waroverlays\default.xml
A         maven-war-plugin\src\test\resources\unit\warexplodedinplacemojo
AU        maven-war-plugin\src\test\resources\unit\warexplodedinplacemojo\plugin-config.xml
A         maven-war-plugin\src\test\resources\unit\warexplodedmojo
AU        maven-war-plugin\src\test\resources\unit\warexplodedmojo\plugin-config.xml
A         maven-war-plugin\src\test\resources\unit\dependencies
AU        maven-war-plugin\src\test\resources\unit\dependencies\default.xml
A         maven-war-plugin\src\test\resources\overlays
A         maven-war-plugin\src\test\resources\overlays\overlay-one
AU        maven-war-plugin\src\test\resources\overlays\overlay-one\index.jsp
AU        maven-war-plugin\src\test\resources\overlays\overlay-one\login.jsp
A         maven-war-plugin\src\test\resources\overlays\overlay-one\WEB-INF
AU        maven-war-plugin\src\test\resources\overlays\overlay-one\WEB-INF\web.xml
A         maven-war-plugin\src\test\resources\overlays\overlay-two
AU        maven-war-plugin\src\test\resources\overlays\overlay-two\index.jsp
AU        maven-war-plugin\src\test\resources\overlays\overlay-two\admin.jsp
A         maven-war-plugin\src\test\resources\overlays\overlay-two\WEB-INF
AU        maven-war-plugin\src\test\resources\overlays\overlay-two\WEB-INF\web.xml
A         maven-war-plugin\src\test\java
A         maven-war-plugin\src\test\java\org
A         maven-war-plugin\src\test\java\org\apache
A         maven-war-plugin\src\test\java\org\apache\maven
A         maven-war-plugin\src\test\java\org\apache\maven\plugins
A         maven-war-plugin\src\test\java\org\apache\maven\plugins\war
AU        maven-war-plugin\src\test\java\org\apache\maven\plugins\war\WarInPlaceMojoTest.java
AU        maven-war-plugin\src\test\java\org\apache\maven\plugins\war\WarZipTest.java
A         maven-war-plugin\src\test\java\org\apache\maven\plugins\war\stub
AU        maven-war-plugin\src\test\java\org\apache\maven\plugins\war\stub\ZipArtifactStub.java
AU        maven-war-plugin\src\test\java\org\apache\maven\plugins\war\stub\AarArtifactStub.java
AU        maven-war-plugin\src\test\java\org\apache\maven\plugins\war\stub\AbstractArtifactStub.java
AU        maven-war-plugin\src\test\java\org\apache\maven\plugins\war\stub\MavenZipProject.java
AU        maven-war-plugin\src\test\java\org\apache\maven\plugins\war\stub\MavenProject4CopyConstructor.java
AU        maven-war-plugin\src\test\java\org\apache\maven\plugins\war\stub\IncludeExcludeWarArtifactStub.java
AU        maven-war-plugin\src\test\java\org\apache\maven\plugins\war\stub\ResourceStub.java
AU        maven-war-plugin\src\test\java\org\apache\maven\plugins\war\stub\JarArtifactStub.java
AU        maven-war-plugin\src\test\java\org\apache\maven\plugins\war\stub\WarOverlayStub.java
AU        maven-war-plugin\src\test\java\org\apache\maven\plugins\war\stub\MarArtifactStub.java
AU        maven-war-plugin\src\test\java\org\apache\maven\plugins\war\stub\MavenProjectArtifactsStub.java
AU        maven-war-plugin\src\test\java\org\apache\maven\plugins\war\stub\MavenProjectBasicStub.java
AU        maven-war-plugin\src\test\java\org\apache\maven\plugins\war\stub\ModelStub.java
AU        maven-war-plugin\src\test\java\org\apache\maven\plugins\war\stub\PARArtifactStub.java
AU        maven-war-plugin\src\test\java\org\apache\maven\plugins\war\stub\WarArtifact4CCStub.java
AU        maven-war-plugin\src\test\java\org\apache\maven\plugins\war\stub\TLDArtifactStub.java
AU        maven-war-plugin\src\test\java\org\apache\maven\plugins\war\stub\ProjectHelperStub.java
AU        maven-war-plugin\src\test\java\org\apache\maven\plugins\war\stub\WarArtifactStub.java
AU        maven-war-plugin\src\test\java\org\apache\maven\plugins\war\stub\XarArtifactStub.java
AU        maven-war-plugin\src\test\java\org\apache\maven\plugins\war\stub\EJBClientArtifactStub.java
AU        maven-war-plugin\src\test\java\org\apache\maven\plugins\war\stub\EJBArtifactStub.java
AU        maven-war-plugin\src\test\java\org\apache\maven\plugins\war\stub\EJBArtifactStubWithClassifier.java
A         maven-war-plugin\src\test\java\org\apache\maven\plugins\war\util
AU        maven-war-plugin\src\test\java\org\apache\maven\plugins\war\util\PathSetTest.java
AU        maven-war-plugin\src\test\java\org\apache\maven\plugins\war\util\WarUtilsTest.java
AU        maven-war-plugin\src\test\java\org\apache\maven\plugins\war\util\WebappStructureTest.java
AU        maven-war-plugin\src\test\java\org\apache\maven\plugins\war\WarMojoTest.java
AU        maven-war-plugin\src\test\java\org\apache\maven\plugins\war\WarOverlaysTest.java
A         maven-war-plugin\src\test\java\org\apache\maven\plugins\war\overlay
AU        maven-war-plugin\src\test\java\org\apache\maven\plugins\war\overlay\OverlayManagerTest.java
AU        maven-war-plugin\src\test\java\org\apache\maven\plugins\war\AbstractWarMojoTest.java
AU        maven-war-plugin\src\test\java\org\apache\maven\plugins\war\WarExplodedMojoTest.java
AU        maven-war-plugin\src\test\java\org\apache\maven\plugins\war\WarDependenciesAnalysisTest.java
AU        maven-war-plugin\src\test\java\org\apache\maven\plugins\war\AbstractWarExplodedMojoTest.java
AU        maven-war-plugin\src\test\java\org\apache\maven\plugins\war\WarExplodedMojoFilteringTest.java
AU        maven-war-plugin\deploySite.sh
AU        maven-war-plugin\pom.xml
AU        pom.xml
 U        .
At revision 1808565

[maven-plugins-ITs-m3-windows] $ cmd.exe /C "F:\jenkins\tools\maven\apache-maven-3.3.9\bin\mvn.cmd clean install -Prun-its -U -B -V -fae -Papache.snapshots -s $TMP_SETTINGS && exit %%ERRORLEVEL%%"
Apache Maven 3.3.9 (bb52d8502b132ec0a5a3f4c09453c07478323dc5; 2015-11-10T16:41:47+00:00)
Maven home: F:\jenkins\tools\maven\apache-maven-3.3.9
Java version: 1.7.0_79, vendor: Oracle Corporation
Java home: F:\hudson\tools\java\jdk1.7.0_79-unlimited-security\jre
Default locale: en_US, platform encoding: Cp1252
OS name: "windows server 2012 r2", version: "6.3", arch: "amd64", family: "windows"
[ERROR] Error executing Maven.
[ERROR] The specified user settings file does not exist: <https://builds.apache.org/job/maven-plugins-ITs-m3-windows/ws/$TMP_SETTINGS>
Build step 'Invoke top-level Maven targets' marked build as failure
Recording test results
ERROR: Step ‘Publish JUnit test result report’ failed: No test report files were found. Configuration error?

Reply | Threaded
Open this post in threaded view
|

Build failed in Jenkins: maven-plugins-ITs-m3-windows #1997

Apache Jenkins Server-2
See <https://builds.apache.org/job/maven-plugins-ITs-m3-windows/1997/display/redirect?page=changes>

Changes:

[khmarbaise] o Changed moduleName into outputFileName to prevent confusions.
o Checking existence of jmod file for describe/list goal.

------------------------------------------
[...truncated 1.69 MB...]
A         maven-shade-plugin\src\it\xml-transformer-ignores-dtd
A         maven-shade-plugin\src\it\xml-transformer-ignores-dtd\src
A         maven-shade-plugin\src\it\xml-transformer-ignores-dtd\src\main
A         maven-shade-plugin\src\it\xml-transformer-ignores-dtd\src\main\resources
AU        maven-shade-plugin\src\it\xml-transformer-ignores-dtd\src\main\resources\test.xml
AU        maven-shade-plugin\src\it\xml-transformer-ignores-dtd\pom.xml
AU        maven-shade-plugin\src\it\xml-transformer-ignores-dtd\verify.bsh
A         maven-shade-plugin\src\it\reloc-class-from-string-pool
AU        maven-shade-plugin\src\it\reloc-class-from-string-pool\pom.xml
A         maven-shade-plugin\src\it\reloc-class-from-string-pool\src
A         maven-shade-plugin\src\it\reloc-class-from-string-pool\src\main
A         maven-shade-plugin\src\it\reloc-class-from-string-pool\src\main\java
A         maven-shade-plugin\src\it\reloc-class-from-string-pool\src\main\java\relocated
AU        maven-shade-plugin\src\it\reloc-class-from-string-pool\src\main\java\relocated\RelocatedClass.java
AU        maven-shade-plugin\src\it\reloc-class-from-string-pool\src\main\java\Main.java
A         maven-shade-plugin\src\it\finalNameBuild-attached
A         maven-shade-plugin\src\it\finalNameBuild-attached\src
A         maven-shade-plugin\src\it\finalNameBuild-attached\src\main
A         maven-shade-plugin\src\it\finalNameBuild-attached\src\main\resources
A         maven-shade-plugin\src\it\finalNameBuild-attached\src\main\resources\META-INF
AU        maven-shade-plugin\src\it\finalNameBuild-attached\src\main\resources\META-INF\ejb-jar.xml
AU        maven-shade-plugin\src\it\finalNameBuild-attached\pom.xml
AU        maven-shade-plugin\src\it\finalNameBuild-attached\setup.bsh
AU        maven-shade-plugin\src\it\finalNameBuild-attached\verify.bsh
A         maven-shade-plugin\src\it\reloc-abs-resource-path
A         maven-shade-plugin\src\it\reloc-abs-resource-path\src
A         maven-shade-plugin\src\it\reloc-abs-resource-path\src\main
A         maven-shade-plugin\src\it\reloc-abs-resource-path\src\main\java
AU        maven-shade-plugin\src\it\reloc-abs-resource-path\src\main\java\Main.java
A         maven-shade-plugin\src\it\reloc-abs-resource-path\src\main\resources
A         maven-shade-plugin\src\it\reloc-abs-resource-path\src\main\resources\org
A         maven-shade-plugin\src\it\reloc-abs-resource-path\src\main\resources\org\apache
A         maven-shade-plugin\src\it\reloc-abs-resource-path\src\main\resources\org\apache\maven
A         maven-shade-plugin\src\it\reloc-abs-resource-path\src\main\resources\org\apache\maven\from
AU        maven-shade-plugin\src\it\reloc-abs-resource-path\src\main\resources\org\apache\maven\from\test.properties
AU        maven-shade-plugin\src\it\reloc-abs-resource-path\pom.xml
A         maven-shade-plugin\src\it\setup-parent
A         maven-shade-plugin\src\it\setup-parent\pom.xml
A         maven-shade-plugin\src\it\mini-jar-malformed-dependencies
A         maven-shade-plugin\src\it\mini-jar-malformed-dependencies\pom.xml
A         maven-shade-plugin\src\it\dep-reduced-pom-use-base-version
A         maven-shade-plugin\src\it\dep-reduced-pom-use-base-version\repo
A         maven-shade-plugin\src\it\dep-reduced-pom-use-base-version\repo\org
A         maven-shade-plugin\src\it\dep-reduced-pom-use-base-version\repo\org\apache
A         maven-shade-plugin\src\it\dep-reduced-pom-use-base-version\repo\org\apache\maven
A         maven-shade-plugin\src\it\dep-reduced-pom-use-base-version\repo\org\apache\maven\its
A         maven-shade-plugin\src\it\dep-reduced-pom-use-base-version\repo\org\apache\maven\its\shade
A         maven-shade-plugin\src\it\dep-reduced-pom-use-base-version\repo\org\apache\maven\its\shade\drp
A         maven-shade-plugin\src\it\dep-reduced-pom-use-base-version\repo\org\apache\maven\its\shade\drp\a
A         maven-shade-plugin\src\it\dep-reduced-pom-use-base-version\repo\org\apache\maven\its\shade\drp\a\0.1-SNAPSHOT
A         maven-shade-plugin\src\it\dep-reduced-pom-use-base-version\repo\org\apache\maven\its\shade\drp\a\0.1-SNAPSHOT\_maven.repositories
AU        maven-shade-plugin\src\it\dep-reduced-pom-use-base-version\repo\org\apache\maven\its\shade\drp\a\0.1-SNAPSHOT\maven-metadata.xml
AU        maven-shade-plugin\src\it\dep-reduced-pom-use-base-version\repo\org\apache\maven\its\shade\drp\a\0.1-SNAPSHOT\a-0.1-20130115.024354-82.pom
A         maven-shade-plugin\src\it\dep-reduced-pom-use-base-version\repo\org\apache\maven\its\shade\drp\a\0.1-SNAPSHOT\a-0.1-20130115.024354-82.jar
AU        maven-shade-plugin\src\it\dep-reduced-pom-use-base-version\verify.groovy
AU        maven-shade-plugin\src\it\dep-reduced-pom-use-base-version\pom.xml
A         maven-shade-plugin\src\it\attach-after-lifecycle-fork
AU        maven-shade-plugin\src\it\attach-after-lifecycle-fork\pom.xml
AU        maven-shade-plugin\src\it\attach-after-lifecycle-fork\setup.bsh
AU        maven-shade-plugin\src\it\attach-after-lifecycle-fork\verify.bsh
A         maven-shade-plugin\src\it\MSHADE-258_module_relocation
A         maven-shade-plugin\src\it\MSHADE-258_module_relocation\verify.groovy
A         maven-shade-plugin\src\it\MSHADE-258_module_relocation\pom.xml
A         maven-shade-plugin\src\it\dep-reduced-pom-with-local-parent
A         maven-shade-plugin\src\it\dep-reduced-pom-with-local-parent\child
AU        maven-shade-plugin\src\it\dep-reduced-pom-with-local-parent\child\pom.xml
AU        maven-shade-plugin\src\it\dep-reduced-pom-with-local-parent\invoker.properties
AU        maven-shade-plugin\src\it\dep-reduced-pom-with-local-parent\pom.xml
A         maven-shade-plugin\src\test
A         maven-shade-plugin\src\test\jars
AU        maven-shade-plugin\src\test\jars\test-project-1.0-SNAPSHOT.jar
AU        maven-shade-plugin\src\test\jars\plexus-utils-1.4.1.jar
AU        maven-shade-plugin\src\test\jars\test-artifact-1.0-SNAPSHOT.jar
A         maven-shade-plugin\src\test\java
A         maven-shade-plugin\src\test\java\org
A         maven-shade-plugin\src\test\java\org\apache
A         maven-shade-plugin\src\test\java\org\apache\maven
A         maven-shade-plugin\src\test\java\org\apache\maven\plugins
A         maven-shade-plugin\src\test\java\org\apache\maven\plugins\shade
A         maven-shade-plugin\src\test\java\org\apache\maven\plugins\shade\resource
AU        maven-shade-plugin\src\test\java\org\apache\maven\plugins\shade\resource\ApacheLicenseResourceTransformerTest.java
AU        maven-shade-plugin\src\test\java\org\apache\maven\plugins\shade\resource\GroovyResourceTransformerTest.java
AU        maven-shade-plugin\src\test\java\org\apache\maven\plugins\shade\resource\ComponentsXmlResourceTransformerTest.java
AU        maven-shade-plugin\src\test\java\org\apache\maven\plugins\shade\resource\ApacheNoticeResourceTransformerParameterTests.java
AU        maven-shade-plugin\src\test\java\org\apache\maven\plugins\shade\resource\AppendingTransformerTest.java
AU        maven-shade-plugin\src\test\java\org\apache\maven\plugins\shade\resource\XmlAppendingTransformerTest.java
A         maven-shade-plugin\src\test\java\org\apache\maven\plugins\shade\resource\ResourceBundleAppendingTransformerTest.java
AU        maven-shade-plugin\src\test\java\org\apache\maven\plugins\shade\resource\ServiceResourceTransformerTest.java
AU        maven-shade-plugin\src\test\java\org\apache\maven\plugins\shade\resource\ApacheNoticeResourceTransformerTest.java
AU        maven-shade-plugin\src\test\java\org\apache\maven\plugins\shade\DefaultShaderTest.java
A         maven-shade-plugin\src\test\java\org\apache\maven\plugins\shade\relocation
AU        maven-shade-plugin\src\test\java\org\apache\maven\plugins\shade\relocation\SimpleRelocatorTest.java
AU        maven-shade-plugin\src\test\java\org\apache\maven\plugins\shade\relocation\SimpleRelocatorParameterTest.java
AU        maven-shade-plugin\src\test\java\org\apache\maven\plugins\shade\MockShader.java
A         maven-shade-plugin\src\test\java\org\apache\maven\plugins\shade\mojo
AU        maven-shade-plugin\src\test\java\org\apache\maven\plugins\shade\mojo\ShadeMojoTest.java
AU        maven-shade-plugin\src\test\java\org\apache\maven\plugins\shade\mojo\ArtifactIdTest.java
AU        maven-shade-plugin\src\test\java\org\apache\maven\plugins\shade\mojo\RelativizePathTest.java
AU        maven-shade-plugin\src\test\java\org\apache\maven\plugins\shade\mojo\ArtifactSelectorTest.java
A         maven-shade-plugin\src\test\java\org\apache\maven\plugins\shade\filter
A         maven-shade-plugin\src\test\java\org\apache\maven\plugins\shade\filter\MinijarFilterTest.java
AU        maven-shade-plugin\src\test\java\org\apache\maven\plugins\shade\filter\SimpleFilterTest.java
A         maven-shade-plugin\src\test\projects
A         maven-shade-plugin\src\test\projects\shaded-project
AU        maven-shade-plugin\src\test\projects\shaded-project\pom.xml
A         maven-shade-plugin\src\test\projects\no-relocation-project
AU        maven-shade-plugin\src\test\projects\no-relocation-project\pom.xml
A         maven-shade-plugin\src\test\projects\test-project
AU        maven-shade-plugin\src\test\projects\test-project\pom.xml
A         maven-shade-plugin\src\test\projects\test-project\src
A         maven-shade-plugin\src\test\projects\test-project\src\test
A         maven-shade-plugin\src\test\projects\test-project\src\test\java
A         maven-shade-plugin\src\test\projects\test-project\src\test\java\org
A         maven-shade-plugin\src\test\projects\test-project\src\test\java\org\apache
A         maven-shade-plugin\src\test\projects\test-project\src\test\java\org\apache\maven
A         maven-shade-plugin\src\test\projects\test-project\src\test\java\org\apache\maven\plugins
A         maven-shade-plugin\src\test\projects\test-project\src\test\java\org\apache\maven\plugins\shade
AU        maven-shade-plugin\src\test\projects\test-project\src\test\java\org\apache\maven\plugins\shade\AppTest.java
A         maven-shade-plugin\src\test\projects\test-project\src\main
A         maven-shade-plugin\src\test\projects\test-project\src\main\resources
A         maven-shade-plugin\src\test\projects\test-project\src\main\resources\META-INF
A         maven-shade-plugin\src\test\projects\test-project\src\main\resources\META-INF\plexus
AU        maven-shade-plugin\src\test\projects\test-project\src\main\resources\META-INF\plexus\components.xml
A         maven-shade-plugin\src\test\projects\test-project\src\main\java
A         maven-shade-plugin\src\test\projects\test-project\src\main\java\org
A         maven-shade-plugin\src\test\projects\test-project\src\main\java\org\apache
A         maven-shade-plugin\src\test\projects\test-project\src\main\java\org\apache\maven
A         maven-shade-plugin\src\test\projects\test-project\src\main\java\org\apache\maven\plugins
A         maven-shade-plugin\src\test\projects\test-project\src\main\java\org\apache\maven\plugins\shade
AU        maven-shade-plugin\src\test\projects\test-project\src\main\java\org\apache\maven\plugins\shade\App.java
A         maven-shade-plugin\src\test\projects\shaded-renamed-project
AU        maven-shade-plugin\src\test\projects\shaded-renamed-project\pom.xml
A         maven-shade-plugin\src\test\projects\shaded-attached-project
AU        maven-shade-plugin\src\test\projects\shaded-attached-project\pom.xml
AU        maven-shade-plugin\src\test\projects\pom.xml
A         maven-shade-plugin\src\test\projects\test-artifact
AU        maven-shade-plugin\src\test\projects\test-artifact\pom.xml
A         maven-shade-plugin\src\test\projects\test-artifact\src
A         maven-shade-plugin\src\test\projects\test-artifact\src\main
A         maven-shade-plugin\src\test\projects\test-artifact\src\main\java
A         maven-shade-plugin\src\test\projects\test-artifact\src\main\java\org
A         maven-shade-plugin\src\test\projects\test-artifact\src\main\java\org\apache
A         maven-shade-plugin\src\test\projects\test-artifact\src\main\java\org\apache\maven
A         maven-shade-plugin\src\test\projects\test-artifact\src\main\java\org\apache\maven\plugins
A         maven-shade-plugin\src\test\projects\test-artifact\src\main\java\org\apache\maven\plugins\shade
AU        maven-shade-plugin\src\test\projects\test-artifact\src\main\java\org\apache\maven\plugins\shade\Lib.java
A         maven-shade-plugin\src\test\projects\default-config-project
AU        maven-shade-plugin\src\test\projects\default-config-project\pom.xml
A         maven-shade-plugin\src\test\resources
AU        maven-shade-plugin\src\test\resources\components-1.xml
AU        maven-shade-plugin\src\test\resources\components-2.xml
AU        maven-shade-plugin\src\test\resources\components-expected.xml
A         maven-shade-plugin\src\main
A         maven-shade-plugin\src\main\java
A         maven-shade-plugin\src\main\java\org
A         maven-shade-plugin\src\main\java\org\apache
A         maven-shade-plugin\src\main\java\org\apache\maven
A         maven-shade-plugin\src\main\java\org\apache\maven\plugins
A         maven-shade-plugin\src\main\java\org\apache\maven\plugins\shade
AU        maven-shade-plugin\src\main\java\org\apache\maven\plugins\shade\DefaultShader.java
A         maven-shade-plugin\src\main\java\org\apache\maven\plugins\shade\pom
A         maven-shade-plugin\src\main\java\org\apache\maven\plugins\shade\pom\Counter.java
AU        maven-shade-plugin\src\main\java\org\apache\maven\plugins\shade\pom\PomWriter.java
AU        maven-shade-plugin\src\main\java\org\apache\maven\plugins\shade\pom\MavenJDOMWriter.java
AU        maven-shade-plugin\src\main\java\org\apache\maven\plugins\shade\ShadingResult.java
AU        maven-shade-plugin\src\main\java\org\apache\maven\plugins\shade\ShadeRequest.java
A         maven-shade-plugin\src\main\java\org\apache\maven\plugins\shade\relocation
AU        maven-shade-plugin\src\main\java\org\apache\maven\plugins\shade\relocation\SimpleRelocator.java
AU        maven-shade-plugin\src\main\java\org\apache\maven\plugins\shade\relocation\Relocator.java
A         maven-shade-plugin\src\main\java\org\apache\maven\plugins\shade\mojo
AU        maven-shade-plugin\src\main\java\org\apache\maven\plugins\shade\mojo\ArtifactSet.java
AU        maven-shade-plugin\src\main\java\org\apache\maven\plugins\shade\mojo\ShadeMojo.java
AU        maven-shade-plugin\src\main\java\org\apache\maven\plugins\shade\mojo\ArtifactId.java
AU        maven-shade-plugin\src\main\java\org\apache\maven\plugins\shade\mojo\PackageRelocation.java
AU        maven-shade-plugin\src\main\java\org\apache\maven\plugins\shade\mojo\RelativizePath.java
AU        maven-shade-plugin\src\main\java\org\apache\maven\plugins\shade\mojo\ArtifactSelector.java
AU        maven-shade-plugin\src\main\java\org\apache\maven\plugins\shade\mojo\ArchiveFilter.java
A         maven-shade-plugin\src\main\java\org\apache\maven\plugins\shade\filter
AU        maven-shade-plugin\src\main\java\org\apache\maven\plugins\shade\filter\Filter.java
AU        maven-shade-plugin\src\main\java\org\apache\maven\plugins\shade\filter\MinijarFilter.java
AU        maven-shade-plugin\src\main\java\org\apache\maven\plugins\shade\filter\SimpleFilter.java
AU        maven-shade-plugin\src\main\java\org\apache\maven\plugins\shade\Shader.java
A         maven-shade-plugin\src\main\java\org\apache\maven\plugins\shade\resource
AU        maven-shade-plugin\src\main\java\org\apache\maven\plugins\shade\resource\ApacheNoticeResourceTransformer.java
AU        maven-shade-plugin\src\main\java\org\apache\maven\plugins\shade\resource\IncludeResourceTransformer.java
AU        maven-shade-plugin\src\main\java\org\apache\maven\plugins\shade\resource\ServicesResourceTransformer.java
AU        maven-shade-plugin\src\main\java\org\apache\maven\plugins\shade\resource\ApacheLicenseResourceTransformer.java
AU        maven-shade-plugin\src\main\java\org\apache\maven\plugins\shade\resource\GroovyResourceTransformer.java
AU        maven-shade-plugin\src\main\java\org\apache\maven\plugins\shade\resource\ComponentsXmlResourceTransformer.java
AU        maven-shade-plugin\src\main\java\org\apache\maven\plugins\shade\resource\ManifestResourceTransformer.java
AU        maven-shade-plugin\src\main\java\org\apache\maven\plugins\shade\resource\DontIncludeResourceTransformer.java
AU        maven-shade-plugin\src\main\java\org\apache\maven\plugins\shade\resource\AppendingTransformer.java
AU        maven-shade-plugin\src\main\java\org\apache\maven\plugins\shade\resource\XmlAppendingTransformer.java
A         maven-shade-plugin\src\main\java\org\apache\maven\plugins\shade\resource\PluginXmlResourceTransformer.java
A         maven-shade-plugin\src\main\java\org\apache\maven\plugins\shade\resource\ResourceBundleAppendingTransformer.java
AU        maven-shade-plugin\src\main\java\org\apache\maven\plugins\shade\resource\ResourceTransformer.java
A         maven-shade-plugin\src\site
A         maven-shade-plugin\src\site\resources
A         maven-shade-plugin\src\site\resources\download.cgi
A         maven-shade-plugin\src\site\xdoc
A         maven-shade-plugin\src\site\xdoc\download.xml.vm
A         maven-shade-plugin\src\site\fml
A         maven-shade-plugin\src\site\fml\faq.fml
AU        maven-shade-plugin\src\site\site.xml
A         maven-shade-plugin\src\site\apt
A         maven-shade-plugin\src\site\apt\examples
AU        maven-shade-plugin\src\site\apt\examples\includes-excludes.apt.vm
AU        maven-shade-plugin\src\site\apt\examples\class-relocation.apt.vm
AU        maven-shade-plugin\src\site\apt\examples\attached-artifact.apt.vm
AU        maven-shade-plugin\src\site\apt\examples\resource-transformers.apt.vm
AU        maven-shade-plugin\src\site\apt\examples\executable-jar.apt.vm
AU        maven-shade-plugin\src\site\apt\examples\use-shader-other-impl.apt.vm
AU        maven-shade-plugin\src\site\apt\usage.apt.vm
AU        maven-shade-plugin\src\site\apt\index.apt.vm
A         maven-shade-plugin\rel-path-test-files
A         maven-shade-plugin\rel-path-test-files\a
A         maven-shade-plugin\rel-path-test-files\a\b1
A         maven-shade-plugin\rel-path-test-files\a\b1\c
A         maven-shade-plugin\rel-path-test-files\a\b1\c\d
A         maven-shade-plugin\rel-path-test-files\a\b1\pom
A         maven-shade-plugin\rel-path-test-files\a\pom
A         maven-shade-plugin\rel-path-test-files\a\b
A         maven-shade-plugin\rel-path-test-files\a\b\c
A         maven-shade-plugin\rel-path-test-files\a\b\c\pom
A         maven-shade-plugin\rel-path-test-files\a\b\c\d
A         maven-shade-plugin\rel-path-test-files\a\b\c\d\pom
A         maven-shade-plugin\rel-path-test-files\a\b\c\d1
A         maven-shade-plugin\rel-path-test-files\a\b\c\d1\pom
A         maven-shade-plugin\rel-path-test-files\a\b\c1
A         maven-shade-plugin\rel-path-test-files\a\b\c1\d
A         maven-shade-plugin\rel-path-test-files\a\b\c1\pom
A         maven-shade-plugin\rel-path-test-files\a\b\pom
AU        maven-shade-plugin\pom.xml
 U        .
At revision 1808566

[maven-plugins-ITs-m3-windows] $ cmd.exe /C "F:\jenkins\tools\maven\apache-maven-3.3.9\bin\mvn.cmd clean install -Prun-its -U -B -V -fae -Papache.snapshots -s $TMP_SETTINGS && exit %%ERRORLEVEL%%"
Apache Maven 3.3.9 (bb52d8502b132ec0a5a3f4c09453c07478323dc5; 2015-11-10T16:41:47+00:00)
Maven home: F:\jenkins\tools\maven\apache-maven-3.3.9
Java version: 1.7.0_79, vendor: Oracle Corporation
Java home: F:\hudson\tools\java\jdk1.7.0_79-unlimited-security\jre
Default locale: en_US, platform encoding: Cp1252
OS name: "windows server 2012 r2", version: "6.3", arch: "amd64", family: "windows"
[ERROR] Error executing Maven.
[ERROR] The specified user settings file does not exist: <https://builds.apache.org/job/maven-plugins-ITs-m3-windows/ws/$TMP_SETTINGS>
Build step 'Invoke top-level Maven targets' marked build as failure
Recording test results
ERROR: Step ‘Publish JUnit test result report’ failed: No test report files were found. Configuration error?

Reply | Threaded
Open this post in threaded view
|

Build failed in Jenkins: maven-plugins-ITs-m3-windows #1998

Apache Jenkins Server-2
See <https://builds.apache.org/job/maven-plugins-ITs-m3-windows/1998/display/redirect?page=changes>

Changes:

[khmarbaise] Go back to 3.0.0-alpha-1-SNAPSHOT

[khmarbaise] o Added IT for describe and list goal.
o Reformatted groovy code.

[khmarbaise] [MJAR-237] Navigation link "Creating an Executable JAR File" is wrong.
 o Fixed two links

------------------------------------------
[...truncated 1.70 MB...]
A         maven-resources-plugin\src\it\user-filters\src
A         maven-resources-plugin\src\it\user-filters\src\main
A         maven-resources-plugin\src\it\user-filters\src\main\resources
AU        maven-resources-plugin\src\it\user-filters\src\main\resources\unfiltered.properties
A         maven-resources-plugin\src\it\user-filters\src\main\filtered
AU        maven-resources-plugin\src\it\user-filters\src\main\filtered\filtered.properties
AU        maven-resources-plugin\src\it\user-filters\invoker.properties
AU        maven-resources-plugin\src\it\user-filters\verify.groovy
AU        maven-resources-plugin\src\it\user-filters\pom.xml
AU        maven-resources-plugin\src\it\user-filters\test.properties
A         maven-resources-plugin\src\it\includeEmptyDirs
AU        maven-resources-plugin\src\it\includeEmptyDirs\verify.bsh
A         maven-resources-plugin\src\it\includeEmptyDirs\src
A         maven-resources-plugin\src\it\includeEmptyDirs\src\main
A         maven-resources-plugin\src\it\includeEmptyDirs\src\main\filters
AU        maven-resources-plugin\src\it\includeEmptyDirs\src\main\filters\my.filter
A         maven-resources-plugin\src\it\includeEmptyDirs\src\main\resources
AU        maven-resources-plugin\src\it\includeEmptyDirs\src\main\resources\SomeResource.txt
A         maven-resources-plugin\src\it\includeEmptyDirs\src\main\resources\empty-dir
A         maven-resources-plugin\src\it\includeEmptyDirs\src\main\resources\empty-dir\.gitattributes
A         maven-resources-plugin\src\it\includeEmptyDirs\src\main\resources\empty-dir-child
A         maven-resources-plugin\src\it\includeEmptyDirs\src\main\resources\empty-dir-child\child
A         maven-resources-plugin\src\it\includeEmptyDirs\src\main\resources\empty-dir-child\child\.gitattributes
AU        maven-resources-plugin\src\it\includeEmptyDirs\pom.xml
A         maven-resources-plugin\src\it\include-git-ignore
A         maven-resources-plugin\src\it\include-git-ignore\src
A         maven-resources-plugin\src\it\include-git-ignore\src\main
A         maven-resources-plugin\src\it\include-git-ignore\src\main\resources
A         maven-resources-plugin\src\it\include-git-ignore\pom.xml
A         maven-resources-plugin\src\it\include-git-ignore\setup.bsh
A         maven-resources-plugin\src\it\include-git-ignore\verify.bsh
A         maven-resources-plugin\src\it\filter
A         maven-resources-plugin\src\it\filter\src
A         maven-resources-plugin\src\it\filter\src\main
A         maven-resources-plugin\src\it\filter\src\main\filters
AU        maven-resources-plugin\src\it\filter\src\main\filters\filter3.properties
AU        maven-resources-plugin\src\it\filter\src\main\filters\my.filter
AU        maven-resources-plugin\src\it\filter\src\main\filters\filter2.properties
A         maven-resources-plugin\src\it\filter\src\main\resources
AU        maven-resources-plugin\src\it\filter\src\main\resources\SomeResource.txt
AU        maven-resources-plugin\src\it\filter\pom.xml
AU        maven-resources-plugin\src\it\filter\verify.bsh
A         maven-resources-plugin\src\it\filter-filenames
A         maven-resources-plugin\src\it\filter-filenames\src
A         maven-resources-plugin\src\it\filter-filenames\src\main
A         maven-resources-plugin\src\it\filter-filenames\src\main\resources
A         maven-resources-plugin\src\it\filter-filenames\src\main\resources\${project.version}.txt
A         maven-resources-plugin\src\it\filter-filenames\src\main\resources\${project.artifactId}.txt
A         maven-resources-plugin\src\it\filter-filenames\verify.groovy
A         maven-resources-plugin\src\it\filter-filenames\pom.xml
A         maven-resources-plugin\src\it\MRESOURCES-110
A         maven-resources-plugin\src\it\MRESOURCES-110\src
A         maven-resources-plugin\src\it\MRESOURCES-110\src\main
A         maven-resources-plugin\src\it\MRESOURCES-110\src\main\resources
AU        maven-resources-plugin\src\it\MRESOURCES-110\src\main\resources\mresources-110.xml
AU        maven-resources-plugin\src\it\MRESOURCES-110\verify.groovy
AU        maven-resources-plugin\src\it\MRESOURCES-110\pom.xml
A         maven-resources-plugin\src\it\MRESOURCES-99
A         maven-resources-plugin\src\it\MRESOURCES-99\src
A         maven-resources-plugin\src\it\MRESOURCES-99\src\main
A         maven-resources-plugin\src\it\MRESOURCES-99\src\main\resources
A         maven-resources-plugin\src\it\MRESOURCES-99\src\main\resources\SomeResource.txt
A         maven-resources-plugin\src\it\MRESOURCES-99\verify.groovy
A         maven-resources-plugin\src\it\MRESOURCES-99\pom.xml
A         maven-resources-plugin\src\it\custom-delimiter
A         maven-resources-plugin\src\it\custom-delimiter\src
A         maven-resources-plugin\src\it\custom-delimiter\src\main
A         maven-resources-plugin\src\it\custom-delimiter\src\main\filters
AU        maven-resources-plugin\src\it\custom-delimiter\src\main\filters\filter2.properties
AU        maven-resources-plugin\src\it\custom-delimiter\src\main\filters\my.filter
A         maven-resources-plugin\src\it\custom-delimiter\src\main\resources
AU        maven-resources-plugin\src\it\custom-delimiter\src\main\resources\SomeResource.txt
AU        maven-resources-plugin\src\it\custom-delimiter\pom.xml
AU        maven-resources-plugin\src\it\custom-delimiter\verify.bsh
A         maven-resources-plugin\src\it\MRESOURCES-131
A         maven-resources-plugin\src\it\MRESOURCES-131\src
A         maven-resources-plugin\src\it\MRESOURCES-131\src\test
A         maven-resources-plugin\src\it\MRESOURCES-131\src\test\resources
AU        maven-resources-plugin\src\it\MRESOURCES-131\src\test\resources\skipped.txt
A         maven-resources-plugin\src\it\MRESOURCES-131\src\test\java
A         maven-resources-plugin\src\it\MRESOURCES-131\src\test\java\org
A         maven-resources-plugin\src\it\MRESOURCES-131\src\test\java\org\apache
A         maven-resources-plugin\src\it\MRESOURCES-131\src\test\java\org\apache\maven
A         maven-resources-plugin\src\it\MRESOURCES-131\src\test\java\org\apache\maven\plugins
A         maven-resources-plugin\src\it\MRESOURCES-131\src\test\java\org\apache\maven\plugins\resources
A         maven-resources-plugin\src\it\MRESOURCES-131\src\test\java\org\apache\maven\plugins\resources\it
AU        maven-resources-plugin\src\it\MRESOURCES-131\src\test\java\org\apache\maven\plugins\resources\it\AppTest.java
A         maven-resources-plugin\src\it\MRESOURCES-131\src\main
A         maven-resources-plugin\src\it\MRESOURCES-131\src\main\java
A         maven-resources-plugin\src\it\MRESOURCES-131\src\main\java\org
A         maven-resources-plugin\src\it\MRESOURCES-131\src\main\java\org\apache
A         maven-resources-plugin\src\it\MRESOURCES-131\src\main\java\org\apache\maven
A         maven-resources-plugin\src\it\MRESOURCES-131\src\main\java\org\apache\maven\plugins
A         maven-resources-plugin\src\it\MRESOURCES-131\src\main\java\org\apache\maven\plugins\resources
A         maven-resources-plugin\src\it\MRESOURCES-131\src\main\java\org\apache\maven\plugins\resources\it
AU        maven-resources-plugin\src\it\MRESOURCES-131\src\main\java\org\apache\maven\plugins\resources\it\App.java
AU        maven-resources-plugin\src\it\MRESOURCES-131\verify.groovy
AU        maven-resources-plugin\src\it\MRESOURCES-131\pom.xml
A         maven-resources-plugin\src\it\MRESOURCES-104
A         maven-resources-plugin\src\it\MRESOURCES-104\src
A         maven-resources-plugin\src\it\MRESOURCES-104\src\main
A         maven-resources-plugin\src\it\MRESOURCES-104\src\main\resources
AU        maven-resources-plugin\src\it\MRESOURCES-104\src\main\resources\test.properties
AU        maven-resources-plugin\src\it\MRESOURCES-104\verify.groovy
AU        maven-resources-plugin\src\it\MRESOURCES-104\pom.xml
A         maven-resources-plugin\src\it\MRESOURCES-231
A         maven-resources-plugin\src\it\MRESOURCES-231\src
A         maven-resources-plugin\src\it\MRESOURCES-231\src\main
A         maven-resources-plugin\src\it\MRESOURCES-231\src\main\resources
AU        maven-resources-plugin\src\it\MRESOURCES-231\src\main\resources\test.txt
A         maven-resources-plugin\src\it\MRESOURCES-231\verify.groovy
AU        maven-resources-plugin\src\it\MRESOURCES-231\pom.xml
A         maven-resources-plugin\src\it\MRESOURCES-105
AU        maven-resources-plugin\src\it\MRESOURCES-105\pom.xml
AU        maven-resources-plugin\src\it\MRESOURCES-105\my.properties
A         maven-resources-plugin\src\it\MRESOURCES-105\src
A         maven-resources-plugin\src\it\MRESOURCES-105\src\main
A         maven-resources-plugin\src\it\MRESOURCES-105\src\main\resources
AU        maven-resources-plugin\src\it\MRESOURCES-105\src\main\resources\test.properties
A         maven-resources-plugin\src\it\MRESOURCES-106
AU        maven-resources-plugin\src\it\MRESOURCES-106\pom.xml
AU        maven-resources-plugin\src\it\MRESOURCES-106\verify.bsh
A         maven-resources-plugin\src\it\MRESOURCES-106\src
A         maven-resources-plugin\src\it\MRESOURCES-106\src\main
A         maven-resources-plugin\src\it\MRESOURCES-106\src\main\resources
AU        maven-resources-plugin\src\it\MRESOURCES-106\src\main\resources\file.txt
AU        maven-resources-plugin\src\it\MRESOURCES-106\src\main\resources\filter.properties
A         maven-resources-plugin\src\it\copy-resources-it
A         maven-resources-plugin\src\it\copy-resources-it\src
A         maven-resources-plugin\src\it\copy-resources-it\src\non-packaged-resources
AU        maven-resources-plugin\src\it\copy-resources-it\src\non-packaged-resources\configuration.properties
AU        maven-resources-plugin\src\it\copy-resources-it\pom.xml
AU        maven-resources-plugin\src\it\copy-resources-it\verify.bsh
AU        maven-resources-plugin\src\it\settings.xml
A         maven-resources-plugin\src\it\MRESOURCES-166
A         maven-resources-plugin\src\it\MRESOURCES-166\src
A         maven-resources-plugin\src\it\MRESOURCES-166\src\main
A         maven-resources-plugin\src\it\MRESOURCES-166\src\main\resources
AU        maven-resources-plugin\src\it\MRESOURCES-166\src\main\resources\resource.txt
AU        maven-resources-plugin\src\it\MRESOURCES-166\verify.groovy
AU        maven-resources-plugin\src\it\MRESOURCES-166\pom.xml
A         maven-resources-plugin\src\it\skip-yes
A         maven-resources-plugin\src\it\skip-yes\src
A         maven-resources-plugin\src\it\skip-yes\src\main
A         maven-resources-plugin\src\it\skip-yes\src\main\resources
A         maven-resources-plugin\src\it\skip-yes\src\main\resources\test-resource.txt
A         maven-resources-plugin\src\it\skip-yes\verify.groovy
A         maven-resources-plugin\src\it\skip-yes\pom.xml
A         maven-resources-plugin\src\it\MRESOURCES-20
AU        maven-resources-plugin\src\it\MRESOURCES-20\verify.bsh
A         maven-resources-plugin\src\it\MRESOURCES-20\src
A         maven-resources-plugin\src\it\MRESOURCES-20\src\main
A         maven-resources-plugin\src\it\MRESOURCES-20\src\main\resources
AU        maven-resources-plugin\src\it\MRESOURCES-20\src\main\resources\resource.txt
AU        maven-resources-plugin\src\it\MRESOURCES-20\pom.xml
A         maven-resources-plugin\src\test
A         maven-resources-plugin\src\test\resources
A         maven-resources-plugin\src\test\resources\unit
A         maven-resources-plugin\src\test\resources\unit\resources-test
AU        maven-resources-plugin\src\test\resources\unit\resources-test\plugin-config.xml
AU        maven-resources-plugin\src\test\resources\unit\resources-test\plugin-config-relative-path.xml
AU        maven-resources-plugin\src\test\resources\unit\resources-test\validation.properties
AU        maven-resources-plugin\src\test\resources\unit\resources-test\plugin-config-absolute-path.xml
A         maven-resources-plugin\src\test\resources\unit\propertiesutils-test
AU        maven-resources-plugin\src\test\resources\unit\propertiesutils-test\advance_validation.properties
AU        maven-resources-plugin\src\test\resources\unit\propertiesutils-test\basic_validation.properties
AU        maven-resources-plugin\src\test\resources\unit\propertiesutils-test\enhanced_validation.properties
AU        maven-resources-plugin\src\test\resources\unit\propertiesutils-test\advance.properties
AU        maven-resources-plugin\src\test\resources\unit\propertiesutils-test\basic.properties
AU        maven-resources-plugin\src\test\resources\unit\propertiesutils-test\enhanced.properties
A         maven-resources-plugin\src\test\resources\unit\reflectionproperties-test
AU        maven-resources-plugin\src\test\resources\unit\reflectionproperties-test\plugin-config.xml
AU        maven-resources-plugin\src\test\resources\unit\reflectionproperties-test\validation.properties
AU        maven-resources-plugin\src\test\resources\unit\reflectionproperties-test\validation_escapebackslashinpath.properties
A         maven-resources-plugin\src\test\unit-files
A         maven-resources-plugin\src\test\unit-files\copy-resources-test
A         maven-resources-plugin\src\test\unit-files\copy-resources-test\filter-files
AU        maven-resources-plugin\src\test\unit-files\copy-resources-test\filter-files\filter.txt
A         maven-resources-plugin\src\test\unit-files\copy-resources-test\filtered-files
A         maven-resources-plugin\src\test\unit-files\copy-resources-test\no-filter
AU        maven-resources-plugin\src\test\unit-files\copy-resources-test\no-filter\config.properties
A         maven-resources-plugin\src\test\java
A         maven-resources-plugin\src\test\java\org
A         maven-resources-plugin\src\test\java\org\apache
A         maven-resources-plugin\src\test\java\org\apache\maven
A         maven-resources-plugin\src\test\java\org\apache\maven\plugins
A         maven-resources-plugin\src\test\java\org\apache\maven\plugins\resources
A         maven-resources-plugin\src\test\java\org\apache\maven\plugins\resources\PropertyUtilsExceptionTest.java
AU        maven-resources-plugin\src\test\java\org\apache\maven\plugins\resources\BasicPropertyUtilsTest.java
A         maven-resources-plugin\src\test\java\org\apache\maven\plugins\resources\filters
AU        maven-resources-plugin\src\test\java\org\apache\maven\plugins\resources\filters\ItFilter.java
AU        maven-resources-plugin\src\test\java\org\apache\maven\plugins\resources\AbstractPropertyUtilsTest.java
AU        maven-resources-plugin\src\test\java\org\apache\maven\plugins\resources\CopyResourcesMojoTest.java
AU        maven-resources-plugin\src\test\java\org\apache\maven\plugins\resources\TestResourcesTest.java
A         maven-resources-plugin\src\test\java\org\apache\maven\plugins\resources\stub
AU        maven-resources-plugin\src\test\java\org\apache\maven\plugins\resources\stub\MavenProjectBasicStub.java
AU        maven-resources-plugin\src\test\java\org\apache\maven\plugins\resources\stub\MavenProjectResourcesStub.java
AU        maven-resources-plugin\src\test\java\org\apache\maven\plugins\resources\stub\MavenProjectBuildStub.java
AU        maven-resources-plugin\src\test\java\org\apache\maven\plugins\resources\ResourcesMojoTest.java
A         maven-resources-plugin\src\main
A         maven-resources-plugin\src\main\java
A         maven-resources-plugin\src\main\java\org
A         maven-resources-plugin\src\main\java\org\apache
A         maven-resources-plugin\src\main\java\org\apache\maven
A         maven-resources-plugin\src\main\java\org\apache\maven\plugins
A         maven-resources-plugin\src\main\java\org\apache\maven\plugins\resources
AU        maven-resources-plugin\src\main\java\org\apache\maven\plugins\resources\Resource.java
AU        maven-resources-plugin\src\main\java\org\apache\maven\plugins\resources\CopyResourcesMojo.java
A         maven-resources-plugin\src\main\java\org\apache\maven\plugins\resources\MavenBuildTimestamp.java
AU        maven-resources-plugin\src\main\java\org\apache\maven\plugins\resources\ResourcesMojo.java
AU        maven-resources-plugin\src\main\java\org\apache\maven\plugins\resources\TestResourcesMojo.java
A         maven-resources-plugin\src\site
AU        maven-resources-plugin\src\site\site.xml
A         maven-resources-plugin\src\site\apt
AU        maven-resources-plugin\src\site\apt\usage.apt.vm
AU        maven-resources-plugin\src\site\apt\index.apt.vm
A         maven-resources-plugin\src\site\apt\examples
AU        maven-resources-plugin\src\site\apt\examples\binaries-filtering.apt.vm
AU        maven-resources-plugin\src\site\apt\examples\escape-filtering.apt.vm
AU        maven-resources-plugin\src\site\apt\examples\copy-resources.apt.vm
AU        maven-resources-plugin\src\site\apt\examples\filter.apt
AU        maven-resources-plugin\src\site\apt\examples\custom-resource-filters.apt.vm
AU        maven-resources-plugin\src\site\apt\examples\encoding.apt.vm
AU        maven-resources-plugin\src\site\apt\examples\resource-directory.apt
AU        maven-resources-plugin\src\site\apt\examples\include-exclude.apt
A         maven-resources-plugin\src\site\resources
A         maven-resources-plugin\src\site\resources\download.cgi
A         maven-resources-plugin\src\site\xdoc
A         maven-resources-plugin\src\site\xdoc\download.xml.vm
A         maven-resources-plugin\src\site\fml
AU        maven-resources-plugin\src\site\fml\faq.fml
AU        maven-resources-plugin\deploySite.sh
AU        maven-resources-plugin\pom.xml
 U        .
At revision 1808573

[maven-plugins-ITs-m3-windows] $ cmd.exe /C "F:\jenkins\tools\maven\apache-maven-3.3.9\bin\mvn.cmd clean install -Prun-its -U -B -V -fae -Papache.snapshots -s $TMP_SETTINGS && exit %%ERRORLEVEL%%"
Apache Maven 3.3.9 (bb52d8502b132ec0a5a3f4c09453c07478323dc5; 2015-11-10T16:41:47+00:00)
Maven home: F:\jenkins\tools\maven\apache-maven-3.3.9
Java version: 1.7.0_79, vendor: Oracle Corporation
Java home: F:\hudson\tools\java\jdk1.7.0_79-unlimited-security\jre
Default locale: en_US, platform encoding: Cp1252
OS name: "windows server 2012 r2", version: "6.3", arch: "amd64", family: "windows"
[ERROR] Error executing Maven.
[ERROR] The specified user settings file does not exist: <https://builds.apache.org/job/maven-plugins-ITs-m3-windows/ws/$TMP_SETTINGS>
Build step 'Invoke top-level Maven targets' marked build as failure
Recording test results
ERROR: Step ‘Publish JUnit test result report’ failed: No test report files were found. Configuration error?

Reply | Threaded
Open this post in threaded view
|

Build failed in Jenkins: maven-plugins-ITs-m3-windows #1999

Apache Jenkins Server-2
See <https://builds.apache.org/job/maven-plugins-ITs-m3-windows/1999/display/redirect?page=changes>

Changes:

[khmarbaise] [maven-release-plugin] prepare for next development iteration

[khmarbaise] [maven-release-plugin] prepare release maven-jmod-plugin-3.0.0-alpha-1

[khmarbaise] Fixing site generation failure during
release.

[khmarbaise] Undone release steps based on site generation failure.

[khmarbaise] [maven-release-plugin] prepare for next development iteration

[khmarbaise] [maven-release-plugin] prepare release maven-jmod-plugin-3.0.0-alpha-1

------------------------------------------
[...truncated 1.70 MB...]
A         maven-war-plugin\src\it\MWAR-143\war-common\src\main\webapp\WEB-INF
AU        maven-war-plugin\src\it\MWAR-143\war-common\src\main\webapp\WEB-INF\web.xml
AU        maven-war-plugin\src\it\MWAR-143\war-common\pom.xml
A         maven-war-plugin\src\it\MWAR-350
A         maven-war-plugin\src\it\MWAR-350\pom.xml
A         maven-war-plugin\src\it\MWAR-350\verify.bsh
A         maven-war-plugin\src\it\MWAR-350\src
A         maven-war-plugin\src\it\MWAR-350\src\main
A         maven-war-plugin\src\it\MWAR-350\src\main\webapp
A         maven-war-plugin\src\it\MWAR-350\src\main\webapp\WEB-INF
A         maven-war-plugin\src\it\MWAR-350\src\main\webapp\WEB-INF\web.xml
A         maven-war-plugin\src\it\MWAR-350\src\main\webapp\index.html
A         maven-war-plugin\src\it\MWAR-350\src\main\java
A         maven-war-plugin\src\it\MWAR-350\src\main\java\org
A         maven-war-plugin\src\it\MWAR-350\src\main\java\org\apache
A         maven-war-plugin\src\it\MWAR-350\src\main\java\org\apache\maven
A         maven-war-plugin\src\it\MWAR-350\src\main\java\org\apache\maven\it0016
A         maven-war-plugin\src\it\MWAR-350\src\main\java\org\apache\maven\it0016\Person.java
A         maven-war-plugin\src\it\MWAR-404
A         maven-war-plugin\src\it\MWAR-404\src
A         maven-war-plugin\src\it\MWAR-404\src\main
A         maven-war-plugin\src\it\MWAR-404\src\main\java
A         maven-war-plugin\src\it\MWAR-404\src\main\java\org
A         maven-war-plugin\src\it\MWAR-404\src\main\java\org\apache
A         maven-war-plugin\src\it\MWAR-404\src\main\java\org\apache\mwar404
A         maven-war-plugin\src\it\MWAR-404\src\main\java\org\apache\mwar404\Foo.java
A         maven-war-plugin\src\it\MWAR-404\src\main\webapp
A         maven-war-plugin\src\it\MWAR-404\src\main\webapp\jsp
A         maven-war-plugin\src\it\MWAR-404\src\main\webapp\jsp\foo.jsp
A         maven-war-plugin\src\it\MWAR-404\src\main\webapp\index.jsp
A         maven-war-plugin\src\it\MWAR-404\src\main\webapp\WEB-INF
A         maven-war-plugin\src\it\MWAR-404\src\main\webapp\WEB-INF\geronimo-web.xml
A         maven-war-plugin\src\it\MWAR-404\src\main\webapp\WEB-INF\web.xml
A         maven-war-plugin\src\it\MWAR-404\verify.groovy
A         maven-war-plugin\src\it\MWAR-404\pom.xml
A         maven-war-plugin\src\it\MWAR-306
A         maven-war-plugin\src\it\MWAR-306\src
A         maven-war-plugin\src\it\MWAR-306\src\main
A         maven-war-plugin\src\it\MWAR-306\src\main\webapp
A         maven-war-plugin\src\it\MWAR-306\src\main\webapp\index.html
A         maven-war-plugin\src\it\MWAR-306\verify.groovy
A         maven-war-plugin\src\it\MWAR-306\pom.xml
A         maven-war-plugin\src\it\manifest-content
A         maven-war-plugin\src\it\manifest-content\src
A         maven-war-plugin\src\it\manifest-content\src\main
A         maven-war-plugin\src\it\manifest-content\src\main\webapp
AU        maven-war-plugin\src\it\manifest-content\src\main\webapp\index.jsp
AU        maven-war-plugin\src\it\manifest-content\pom.xml
AU        maven-war-plugin\src\it\manifest-content\verify.bsh
A         maven-war-plugin\src\it\MWAR-128
AU        maven-war-plugin\src\it\MWAR-128\verify.groovy
AU        maven-war-plugin\src\it\MWAR-128\pom.xml
AU        maven-war-plugin\src\it\MWAR-128\prebuild.groovy
A         maven-war-plugin\src\it\MWAR-128\src
A         maven-war-plugin\src\it\MWAR-128\src\main
A         maven-war-plugin\src\it\MWAR-128\src\main\webapp
A         maven-war-plugin\src\it\MWAR-128\src\main\webapp\WEB-INF
AU        maven-war-plugin\src\it\MWAR-128\src\main\webapp\WEB-INF\web.xml
A         maven-war-plugin\src\it\MWAR-128\src\main\webapp\WEB-INF\logs
A         maven-war-plugin\src\it\MWAR-326
A         maven-war-plugin\src\it\MWAR-326\invoker.properties
AU        maven-war-plugin\src\it\MWAR-326\pom.xml
A         maven-war-plugin\src\it\MWAR-326\verify.bsh
A         maven-war-plugin\src\it\MWAR-326\src
A         maven-war-plugin\src\it\MWAR-326\src\main
A         maven-war-plugin\src\it\MWAR-326\src\main\java
AU        maven-war-plugin\src\it\MWAR-326\src\main\java\A.java
A         maven-war-plugin\src\it\MWAR-129
A         maven-war-plugin\src\it\MWAR-129\src
A         maven-war-plugin\src\it\MWAR-129\src\main
A         maven-war-plugin\src\it\MWAR-129\src\main\resources
A         maven-war-plugin\src\it\MWAR-129\src\main\webapp
AU        maven-war-plugin\src\it\MWAR-129\src\main\webapp\index.jsp
A         maven-war-plugin\src\it\MWAR-129\src\main\webapp\WEB-INF
AU        maven-war-plugin\src\it\MWAR-129\src\main\webapp\WEB-INF\web.xml
AU        maven-war-plugin\src\it\MWAR-129\src\main\webapp\param.jsp
AU        maven-war-plugin\src\it\MWAR-129\invoker.properties
AU        maven-war-plugin\src\it\MWAR-129\pom.xml
AU        maven-war-plugin\src\it\MWAR-129\verify.bsh
A         maven-war-plugin\src\it\MWAR-139
AU        maven-war-plugin\src\it\MWAR-139\verify.bsh
A         maven-war-plugin\src\it\MWAR-139\src
A         maven-war-plugin\src\it\MWAR-139\src\main
A         maven-war-plugin\src\it\MWAR-139\src\main\webapp
A         maven-war-plugin\src\it\MWAR-139\src\main\webapp\WEB-INF
AU        maven-war-plugin\src\it\MWAR-139\src\main\webapp\WEB-INF\web.xml
A         maven-war-plugin\src\it\MWAR-139\src\main\webresources
AU        maven-war-plugin\src\it\MWAR-139\src\main\webresources\filterme.xml
AU        maven-war-plugin\src\it\MWAR-139\pom.xml
A         maven-war-plugin\src\test
A         maven-war-plugin\src\test\resources
A         maven-war-plugin\src\test\resources\overlays
A         maven-war-plugin\src\test\resources\overlays\overlay-one
AU        maven-war-plugin\src\test\resources\overlays\overlay-one\index.jsp
AU        maven-war-plugin\src\test\resources\overlays\overlay-one\login.jsp
A         maven-war-plugin\src\test\resources\overlays\overlay-one\WEB-INF
AU        maven-war-plugin\src\test\resources\overlays\overlay-one\WEB-INF\web.xml
A         maven-war-plugin\src\test\resources\overlays\overlay-two
A         maven-war-plugin\src\test\resources\overlays\overlay-two\WEB-INF
AU        maven-war-plugin\src\test\resources\overlays\overlay-two\WEB-INF\web.xml
AU        maven-war-plugin\src\test\resources\overlays\overlay-two\index.jsp
AU        maven-war-plugin\src\test\resources\overlays\overlay-two\admin.jsp
A         maven-war-plugin\src\test\resources\unit
A         maven-war-plugin\src\test\resources\unit\warziptest
AU        maven-war-plugin\src\test\resources\unit\warziptest\foobar.zip
AU        maven-war-plugin\src\test\resources\unit\warziptest\war-with-zip.xml
A         maven-war-plugin\src\test\resources\unit\sample_wars
AU        maven-war-plugin\src\test\resources\unit\sample_wars\tld.jar
AU        maven-war-plugin\src\test\resources\unit\sample_wars\simple.war
AU        maven-war-plugin\src\test\resources\unit\sample_wars\include-exclude.war
AU        maven-war-plugin\src\test\resources\unit\sample_wars\sample.par
AU        maven-war-plugin\src\test\resources\unit\sample_wars\simple.xar
AU        maven-war-plugin\src\test\resources\unit\sample_wars\simple.jar
AU        maven-war-plugin\src\test\resources\unit\sample_wars\simple-updated.war
AU        maven-war-plugin\src\test\resources\unit\sample_wars\simple.mar
AU        maven-war-plugin\src\test\resources\unit\sample_wars\ejbclient.jar
AU        maven-war-plugin\src\test\resources\unit\sample_wars\ejb.jar
AU        maven-war-plugin\src\test\resources\unit\sample_wars\javax.servlet-api-3.0.1.jar
AU        maven-war-plugin\src\test\resources\unit\sample_wars\simple.aar
A         maven-war-plugin\src\test\resources\unit\warmojotest
AU        maven-war-plugin\src\test\resources\unit\warmojotest\not-primary-artifact.xml
AU        maven-war-plugin\src\test\resources\unit\warmojotest\plugin-config-primary-artifact.xml
A         maven-war-plugin\src\test\resources\unit\waroverlays
AU        maven-war-plugin\src\test\resources\unit\waroverlays\default.xml
A         maven-war-plugin\src\test\resources\unit\warexplodedinplacemojo
AU        maven-war-plugin\src\test\resources\unit\warexplodedinplacemojo\plugin-config.xml
A         maven-war-plugin\src\test\resources\unit\warexplodedmojo
AU        maven-war-plugin\src\test\resources\unit\warexplodedmojo\plugin-config.xml
A         maven-war-plugin\src\test\resources\unit\dependencies
AU        maven-war-plugin\src\test\resources\unit\dependencies\default.xml
A         maven-war-plugin\src\test\java
A         maven-war-plugin\src\test\java\org
A         maven-war-plugin\src\test\java\org\apache
A         maven-war-plugin\src\test\java\org\apache\maven
A         maven-war-plugin\src\test\java\org\apache\maven\plugins
A         maven-war-plugin\src\test\java\org\apache\maven\plugins\war
AU        maven-war-plugin\src\test\java\org\apache\maven\plugins\war\WarExplodedMojoTest.java
AU        maven-war-plugin\src\test\java\org\apache\maven\plugins\war\WarDependenciesAnalysisTest.java
AU        maven-war-plugin\src\test\java\org\apache\maven\plugins\war\AbstractWarExplodedMojoTest.java
AU        maven-war-plugin\src\test\java\org\apache\maven\plugins\war\WarExplodedMojoFilteringTest.java
AU        maven-war-plugin\src\test\java\org\apache\maven\plugins\war\WarInPlaceMojoTest.java
AU        maven-war-plugin\src\test\java\org\apache\maven\plugins\war\WarZipTest.java
A         maven-war-plugin\src\test\java\org\apache\maven\plugins\war\stub
AU        maven-war-plugin\src\test\java\org\apache\maven\plugins\war\stub\EJBClientArtifactStub.java
AU        maven-war-plugin\src\test\java\org\apache\maven\plugins\war\stub\EJBArtifactStub.java
AU        maven-war-plugin\src\test\java\org\apache\maven\plugins\war\stub\EJBArtifactStubWithClassifier.java
AU        maven-war-plugin\src\test\java\org\apache\maven\plugins\war\stub\ZipArtifactStub.java
AU        maven-war-plugin\src\test\java\org\apache\maven\plugins\war\stub\AarArtifactStub.java
AU        maven-war-plugin\src\test\java\org\apache\maven\plugins\war\stub\AbstractArtifactStub.java
AU        maven-war-plugin\src\test\java\org\apache\maven\plugins\war\stub\MavenZipProject.java
AU        maven-war-plugin\src\test\java\org\apache\maven\plugins\war\stub\MavenProject4CopyConstructor.java
AU        maven-war-plugin\src\test\java\org\apache\maven\plugins\war\stub\IncludeExcludeWarArtifactStub.java
AU        maven-war-plugin\src\test\java\org\apache\maven\plugins\war\stub\ResourceStub.java
AU        maven-war-plugin\src\test\java\org\apache\maven\plugins\war\stub\JarArtifactStub.java
AU        maven-war-plugin\src\test\java\org\apache\maven\plugins\war\stub\WarOverlayStub.java
AU        maven-war-plugin\src\test\java\org\apache\maven\plugins\war\stub\MarArtifactStub.java
AU        maven-war-plugin\src\test\java\org\apache\maven\plugins\war\stub\MavenProjectArtifactsStub.java
AU        maven-war-plugin\src\test\java\org\apache\maven\plugins\war\stub\MavenProjectBasicStub.java
AU        maven-war-plugin\src\test\java\org\apache\maven\plugins\war\stub\PARArtifactStub.java
AU        maven-war-plugin\src\test\java\org\apache\maven\plugins\war\stub\ModelStub.java
AU        maven-war-plugin\src\test\java\org\apache\maven\plugins\war\stub\TLDArtifactStub.java
AU        maven-war-plugin\src\test\java\org\apache\maven\plugins\war\stub\WarArtifact4CCStub.java
AU        maven-war-plugin\src\test\java\org\apache\maven\plugins\war\stub\ProjectHelperStub.java
AU        maven-war-plugin\src\test\java\org\apache\maven\plugins\war\stub\WarArtifactStub.java
AU        maven-war-plugin\src\test\java\org\apache\maven\plugins\war\stub\XarArtifactStub.java
A         maven-war-plugin\src\test\java\org\apache\maven\plugins\war\util
AU        maven-war-plugin\src\test\java\org\apache\maven\plugins\war\util\PathSetTest.java
AU        maven-war-plugin\src\test\java\org\apache\maven\plugins\war\util\WarUtilsTest.java
AU        maven-war-plugin\src\test\java\org\apache\maven\plugins\war\util\WebappStructureTest.java
AU        maven-war-plugin\src\test\java\org\apache\maven\plugins\war\WarMojoTest.java
AU        maven-war-plugin\src\test\java\org\apache\maven\plugins\war\WarOverlaysTest.java
A         maven-war-plugin\src\test\java\org\apache\maven\plugins\war\overlay
AU        maven-war-plugin\src\test\java\org\apache\maven\plugins\war\overlay\OverlayManagerTest.java
AU        maven-war-plugin\src\test\java\org\apache\maven\plugins\war\AbstractWarMojoTest.java
A         maven-war-plugin\src\main
A         maven-war-plugin\src\main\java
A         maven-war-plugin\src\main\java\org
A         maven-war-plugin\src\main\java\org\apache
A         maven-war-plugin\src\main\java\org\apache\maven
A         maven-war-plugin\src\main\java\org\apache\maven\plugins
A         maven-war-plugin\src\main\java\org\apache\maven\plugins\war
A         maven-war-plugin\src\main\java\org\apache\maven\plugins\war\util
AU        maven-war-plugin\src\main\java\org\apache\maven\plugins\war\util\WebappStructure.java
AU        maven-war-plugin\src\main\java\org\apache\maven\plugins\war\util\PathSet.java
AU        maven-war-plugin\src\main\java\org\apache\maven\plugins\war\util\WebappStructureSerializer.java
AU        maven-war-plugin\src\main\java\org\apache\maven\plugins\war\util\DependencyInfo.java
AU        maven-war-plugin\src\main\java\org\apache\maven\plugins\war\util\WarUtils.java
AU        maven-war-plugin\src\main\java\org\apache\maven\plugins\war\util\ClassesPackager.java
AU        maven-war-plugin\src\main\java\org\apache\maven\plugins\war\WarMojo.java
AU        maven-war-plugin\src\main\java\org\apache\maven\plugins\war\Overlay.java
A         maven-war-plugin\src\main\java\org\apache\maven\plugins\war\overlay
AU        maven-war-plugin\src\main\java\org\apache\maven\plugins\war\overlay\OverlayManager.java
AU        maven-war-plugin\src\main\java\org\apache\maven\plugins\war\overlay\InvalidOverlayConfigurationException.java
AU        maven-war-plugin\src\main\java\org\apache\maven\plugins\war\overlay\DefaultOverlay.java
AU        maven-war-plugin\src\main\java\org\apache\maven\plugins\war\AbstractWarMojo.java
AU        maven-war-plugin\src\main\java\org\apache\maven\plugins\war\WarExplodedMojo.java
A         maven-war-plugin\src\main\java\org\apache\maven\plugins\war\packaging
AU        maven-war-plugin\src\main\java\org\apache\maven\plugins\war\packaging\AbstractWarPackagingTask.java
AU        maven-war-plugin\src\main\java\org\apache\maven\plugins\war\packaging\ClassesPackagingTask.java
AU        maven-war-plugin\src\main\java\org\apache\maven\plugins\war\packaging\WarPostPackagingTask.java
AU        maven-war-plugin\src\main\java\org\apache\maven\plugins\war\packaging\ArtifactsPackagingTask.java
AU        maven-war-plugin\src\main\java\org\apache\maven\plugins\war\packaging\WarProjectPackagingTask.java
AU        maven-war-plugin\src\main\java\org\apache\maven\plugins\war\packaging\OverlayPackagingTask.java
AU        maven-war-plugin\src\main\java\org\apache\maven\plugins\war\packaging\SaveWebappStructurePostPackagingTask.java
AU        maven-war-plugin\src\main\java\org\apache\maven\plugins\war\packaging\WarPackagingTask.java
AU        maven-war-plugin\src\main\java\org\apache\maven\plugins\war\packaging\DependenciesAnalysisPackagingTask.java
A         maven-war-plugin\src\main\java\org\apache\maven\plugins\war\packaging\CopyUserManifestTask.java
AU        maven-war-plugin\src\main\java\org\apache\maven\plugins\war\packaging\WarPackagingContext.java
AU        maven-war-plugin\src\main\java\org\apache\maven\plugins\war\WarInPlaceMojo.java
A         maven-war-plugin\src\main\resources-filtered
A         maven-war-plugin\src\main\resources-filtered\META-INF
A         maven-war-plugin\src\main\resources-filtered\META-INF\plexus
A         maven-war-plugin\src\main\resources-filtered\META-INF\plexus\components.xml
A         maven-war-plugin\src\site
A         maven-war-plugin\src\site\resources
A         maven-war-plugin\src\site\resources\download.cgi
A         maven-war-plugin\src\site\xdoc
A         maven-war-plugin\src\site\xdoc\download.xml.vm
A         maven-war-plugin\src\site\fml
AU        maven-war-plugin\src\site\fml\faq.fml.vm
AU        maven-war-plugin\src\site\site.xml
A         maven-war-plugin\src\site\apt
AU        maven-war-plugin\src\site\apt\overlays.apt.vm
AU        maven-war-plugin\src\site\apt\usage.apt.vm
AU        maven-war-plugin\src\site\apt\index.apt.vm
A         maven-war-plugin\src\site\apt\examples
AU        maven-war-plugin\src\site\apt\examples\including-excluding-files-from-war.apt.vm
AU        maven-war-plugin\src\site\apt\examples\file-name-mapping.apt
AU        maven-war-plugin\src\site\apt\examples\skinny-wars.apt.vm
AU        maven-war-plugin\src\site\apt\examples\rapid-testing-jetty6-plugin.apt
AU        maven-war-plugin\src\site\apt\examples\war-manifest-guide.apt.vm
AU        maven-war-plugin\src\site\apt\examples\adding-filtering-webresources.apt.vm
AU        pom.xml
 U        .
At revision 1808583

[maven-plugins-ITs-m3-windows] $ cmd.exe /C "F:\jenkins\tools\maven\apache-maven-3.3.9\bin\mvn.cmd clean install -Prun-its -U -B -V -fae -Papache.snapshots -s $TMP_SETTINGS && exit %%ERRORLEVEL%%"
Apache Maven 3.3.9 (bb52d8502b132ec0a5a3f4c09453c07478323dc5; 2015-11-10T16:41:47+00:00)
Maven home: F:\jenkins\tools\maven\apache-maven-3.3.9
Java version: 1.7.0_79, vendor: Oracle Corporation
Java home: F:\hudson\tools\java\jdk1.7.0_79-unlimited-security\jre
Default locale: en_US, platform encoding: Cp1252
OS name: "windows server 2012 r2", version: "6.3", arch: "amd64", family: "windows"
[ERROR] Error executing Maven.
[ERROR] The specified user settings file does not exist: <https://builds.apache.org/job/maven-plugins-ITs-m3-windows/ws/$TMP_SETTINGS>
Build step 'Invoke top-level Maven targets' marked build as failure
Recording test results
ERROR: Step ‘Publish JUnit test result report’ failed: No test report files were found. Configuration error?

Reply | Threaded
Open this post in threaded view
|

Build failed in Jenkins: maven-plugins-ITs-m3-windows #2000

Apache Jenkins Server-2
See <https://builds.apache.org/job/maven-plugins-ITs-m3-windows/2000/display/redirect?page=changes>

Changes:

[khmarbaise] Back to 3.0.0-alpha-1 based on CANCELED VOTE.

[khmarbaise] [MJMOD-5] Usage of moduleName in describe/list goal / classpath usage in create goal
 o in describe/list goal change the moduleName into jmodFile using
   a default or can be given explicit by a property.
   Added IT's for direct call of the goals describe/list.
 o Removed the parameter classPath from the goal create. The command line
   will got the information from pathElements instead.

------------------------------------------
[...truncated 3.37 MB...]
[INFO] Building: copy-from-reactor\pom.xml
[INFO] run script verify.bsh
[INFO] ..SUCCESS (8.2 s)
[INFO] Building: copy-from-remote-repository\pom.xml
[INFO] run script setup.bsh
[INFO] artifact org.apache.maven.its.dependency.fake-remote-copy:1.0: checking for updates from central
[INFO] run script verify.bsh
[INFO] ..SUCCESS (8.6 s)
[INFO] Building: dependency-properties\pom.xml
[INFO] run script verify.bsh
[INFO] ..SUCCESS (7.5 s)
[INFO] Building: filterunpack\pom.xml
[INFO] run script verify.groovy
[INFO] ..SUCCESS (7.1 s)
[INFO] Building: get-artifact\pom.xml
[INFO] run script setup.bsh
[INFO] run script verify.bsh
[INFO] ..SUCCESS (6.8 s)
[INFO] Building: get-artifact-maven-plugin\pom.xml
[INFO] run script setup.bsh
[INFO] run script verify.bsh
[INFO] ..SUCCESS (6.6 s)
[INFO] Building: get-artifact-no-transitive\pom.xml
[INFO] run script setup.bsh
[INFO] run script verify.bsh
[INFO] ..SUCCESS (6.8 s)
[INFO] Building: get-gav\pom.xml
[INFO] run script setup.bsh
[INFO] run script verify.bsh
[INFO] ..SUCCESS (6.5 s)
[INFO] Building: go-offline\pom.xml
[INFO] ..SUCCESS (8.0 s)
[INFO] Building: list-repositories\pom.xml
[INFO] snapshot org.apache.maven.its.dependency:test:1.0-SNAPSHOT: checking for updates from apache.snapshots
[INFO] artifact org.apache.maven.its.dependency.test:1.0-SNAPSHOT: checking for updates from central
[INFO] ..SUCCESS (7.1 s)
[INFO] Building: mdep-439-analyze-java8\pom.xml
[INFO] ..SKIPPED due to JRE version
[INFO] Building: mdep-450-project-with-ancestor\pom.xml
[INFO] run script verify.groovy
[INFO] ..SUCCESS (6.5 s)
[INFO] Building: mdep-450-project-without-ancestor\pom.xml
[INFO] run script verify.groovy
[INFO] ..SUCCESS (6.7 s)
[INFO] Building: mdep-506-dependency-without-version-in-depmgt\pom.xml
[INFO] ..SUCCESS (7.6 s)
[INFO] Building: mdep-571-resolve-java9\pom.xml
[INFO] ..SKIPPED due to JRE version
[INFO] Building: mdep-572-unpack-tar-long-file\pom.xml
[INFO] run script verify.bsh
[INFO] ..SUCCESS (8.1 s)
[INFO] Building: mdep-578_display-reason-invalid-module\pom.xml
[INFO] ..SKIPPED due to JRE version
[INFO] Building: mdep-580_display-manifest-automodules\pom.xml
[INFO] ..SKIPPED due to JRE version
[INFO] Building: purge-local-repository\pom.xml
[INFO] run script setup.bsh
[INFO] artifact org.apache.maven.its.dependency.purged:1.0: checking for updates from central
[INFO] run script verify.bsh
[INFO] ..SUCCESS (6.9 s)
[INFO] Building: purge-local-repository-bad-dep\pom.xml
[INFO] snapshot org.apache.maven.its.dependency:purge-local-repository-bad-dep:1.0-SNAPSHOT: checking for updates from apache.snapshots
[INFO] artifact org.apache.maven.its.dependency.purge-local-repository-bad-dep:1.0-SNAPSHOT: checking for updates from central
[INFO] artifact org.apache.maven.its.dependency.i-do-not-exist:1.0: checking for updates from central
[INFO] run script verify.groovy
[INFO] ..SUCCESS (7.3 s)
[INFO] Building: purge-local-repository-include\pom.xml
[INFO] snapshot org.apache.maven.its.dependency:purge-local-repository-include:1.0-SNAPSHOT: checking for updates from apache.snapshots
[INFO] artifact org.apache.maven.its.dependency.purge-local-repository-include:1.0-SNAPSHOT: checking for updates from central
[INFO] run script verify.groovy
[INFO] ..SUCCESS (7.2 s)
[INFO] Building: purge-local-repository-multi-module\pom.xml
[INFO] run script setup.bsh
[INFO] snapshot org.apache.maven.its.dependency:child1:1.0-SNAPSHOT: checking for updates from apache.snapshots
[INFO] artifact org.apache.maven.its.dependency.child1:1.0-SNAPSHOT: checking for updates from central
[INFO] artifact org.apache.maven.its.dependency.purged-a:1.0: checking for updates from central
[INFO] snapshot org.apache.maven.its.dependency:child2:1.0-SNAPSHOT: checking for updates from apache.snapshots
[INFO] artifact org.apache.maven.its.dependency.child2:1.0-SNAPSHOT: checking for updates from central
[INFO] artifact org.apache.maven.its.dependency.purged-b:1.0: checking for updates from central
[INFO] run script verify.bsh
[INFO] ..SUCCESS (7.6 s)
[INFO] Building: purge-local-repository-multi-module-execution\pom.xml
[INFO] run script setup.bsh
[INFO] run script verify.bsh
[INFO] ..SUCCESS (7.7 s)
[INFO] Building: purge-local-repository-non-transitive\pom.xml
[INFO] run script verify.bsh
[INFO] ..SUCCESS (6.7 s)
[INFO] Building: purge-local-repository-reresolve\pom.xml
[INFO] run script verify.bsh
[INFO] ..SUCCESS (6.9 s)
[INFO] Building: purge-local-repository-snapshots-only\pom.xml
[INFO] run script setup.bsh
[INFO] snapshot org.apache.maven.its.dependency:snap-purged:1.0-SNAPSHOT: checking for updates from apache.snapshots
[INFO] artifact org.apache.maven.its.dependency.snap-purged:1.0-SNAPSHOT: checking for updates from central
[INFO] run script verify.bsh
[INFO] ..SUCCESS (7.9 s)
[INFO] Building: purge-local-repository-version-range\pom.xml
[INFO] artifact org.apache.maven.its.dependency:purge-local-repository: checking for updates from central
[INFO] artifact org.apache.maven.its.dependency:purge-local-repository: checking for updates from central
[INFO] run script verify.bsh
[INFO] ..SUCCESS (7.0 s)
[INFO] Building: resolve\pom.xml
[INFO] ..SUCCESS (6.8 s)
[INFO] Building: resolve-plugins\pom.xml
[INFO] ..SUCCESS (7.6 s)
[INFO] Building: resolve-plugins-exclude-reactor\pom.xml
[INFO] run script verify.groovy
[INFO] ..SUCCESS (8.6 s)
[INFO] Building: resolve-plugins-with-exclude\pom.xml
[INFO] run script verify.groovy
[INFO] ..SUCCESS (7.7 s)
[INFO] Building: sources\pom.xml
[INFO] artifact classworlds.classworlds:1.1-alpha-2: checking for updates from central
[INFO] ..SUCCESS (7.4 s)
[INFO] Building: tree\pom.xml
[INFO] run script verify.bsh
[INFO] ..SUCCESS (6.7 s)
[INFO] Building: tree-includes\pom.xml
[INFO] run script verify.bsh
[INFO] ..SUCCESS (6.9 s)
[INFO] Building: tree-multimodule\pom.xml
[INFO] snapshot org.apache.maven.its.dependency:tree-multimodule-module-a:1.0-SNAPSHOT: checking for updates from apache.snapshots
[INFO] artifact org.apache.maven.its.dependency.tree-multimodule-module-a:1.0-SNAPSHOT: checking for updates from central
[INFO] run script verify.bsh
[INFO] ..SUCCESS (8.0 s)
[INFO] Building: unpack\pom.xml
[INFO] run script verify.bsh
[INFO] ..SUCCESS (8.2 s)
[INFO] Building: unpack-cli\pom.xml
[INFO] run script verify.bsh
[INFO] ..SUCCESS (6.7 s)
[INFO] Building: unpack-custom-ear\pom.xml
[INFO] run script verify.groovy
[INFO] ..SUCCESS (7.1 s)
[INFO] Building: unpack-dependencies\pom.xml
[INFO] run script verify.groovy
[INFO] ..SUCCESS (8.6 s)
[INFO] Building: unpack-from-remote-repository\pom.xml
[INFO] run script setup.bsh
[INFO] artifact org.apache.maven.its.dependency.fake-remote-unpack:1.0: checking for updates from central
[INFO] run script verify.bsh
[INFO] ..SUCCESS (8.5 s)
[INFO] Building: used-dependencies\pom.xml
[INFO] ..SUCCESS (9.1 s)
[INFO] Building: purge-local-repository-without-pom
[INFO] run script setup.bsh
[INFO] run script verify.bsh
[INFO] ..SUCCESS (6.8 s)
[INFO]
[INFO] --- mrm-maven-plugin:1.0.0:stop (default) @ maven-dependency-plugin ---
[INFO] Stopping Mock Repository Manager on http://localhost:61019
[INFO] Mock Repository Manager http://localhost:61019 is stopped.
[INFO]
[INFO] --- maven-checkstyle-plugin:2.15:check (checkstyle-check) @ maven-dependency-plugin ---
[INFO] There is 1 error reported by Checkstyle 6.1.1 with config/maven_checks.xml ruleset.
[INFO] Ignored 1 error, 0 violation remaining.
[INFO]
[INFO] --- maven-invoker-plugin:2.0.0:verify (integration-test) @ maven-dependency-plugin ---
[INFO] -------------------------------------------------
[INFO] Build Summary:
[INFO]   Passed: 53, Failed: 0, Errors: 0, Skipped: 4
[INFO] -------------------------------------------------
[INFO]
[INFO] --- maven-install-plugin:2.5.2:install (default-install) @ maven-dependency-plugin ---
[INFO] Installing F:\jenkins\jenkins-slave\workspace\maven-plugins-ITs-m3-windows\maven-dependency-plugin\target\maven-dependency-plugin-3.0.3-SNAPSHOT.jar to C:\Users\jenkins\.m2\repository\org\apache\maven\plugins\maven-dependency-plugin\3.0.3-SNAPSHOT\maven-dependency-plugin-3.0.3-SNAPSHOT.jar
[INFO] Installing F:\jenkins\jenkins-slave\workspace\maven-plugins-ITs-m3-windows\maven-dependency-plugin\pom.xml to C:\Users\jenkins\.m2\repository\org\apache\maven\plugins\maven-dependency-plugin\3.0.3-SNAPSHOT\maven-dependency-plugin-3.0.3-SNAPSHOT.pom
[INFO]                                                                        
[INFO] ------------------------------------------------------------------------
[INFO] Building Apache Maven Plugins Aggregator 1-SNAPSHOT
[INFO] ------------------------------------------------------------------------
[INFO]
[INFO] --- maven-clean-plugin:2.5:clean (default-clean) @ maven-plugins-aggregator ---
[INFO]
[INFO] --- maven-enforcer-plugin:1.3.1:enforce (enforce-bytecode-version) @ maven-plugins-aggregator ---
[INFO]
[INFO] --- maven-enforcer-plugin:1.3.1:enforce (ban-known-bad-maven-versions) @ maven-plugins-aggregator ---
[INFO]
[INFO] --- maven-remote-resources-plugin:1.5:process (default) @ maven-plugins-aggregator ---
[INFO]
[INFO] --- maven-site-plugin:3.3:attach-descriptor (attach-descriptor) @ maven-plugins-aggregator ---
[INFO]
[INFO] --- maven-install-plugin:2.5.1:install (default-install) @ maven-plugins-aggregator ---
[INFO] Installing <https://builds.apache.org/job/maven-plugins-ITs-m3-windows/ws/pom.xml> to C:\Users\jenkins\.m2\repository\org\apache\maven\plugins\maven-plugins-aggregator\1-SNAPSHOT\maven-plugins-aggregator-1-SNAPSHOT.pom
[INFO] ------------------------------------------------------------------------
[INFO] Reactor Summary:
[INFO]
[INFO] Apache Maven ACR Plugin ............................ SUCCESS [01:00 min]
[INFO] Apache Maven AntRun Plugin ......................... SUCCESS [02:51 min]
[INFO] Apache Maven Changelog Plugin ...................... SUCCESS [01:21 min]
[INFO] Apache Maven Changes Plugin ........................ SUCCESS [02:05 min]
[INFO] Apache Maven Clean Plugin .......................... SUCCESS [ 49.532 s]
[INFO] Apache Maven Compiler Plugin ....................... SUCCESS [03:58 min]
[INFO] Apache Maven Deploy Plugin ......................... SUCCESS [03:40 min]
[INFO] Apache Maven Documentation Checker Plugin .......... SUCCESS [ 10.817 s]
[INFO] Apache Maven EAR Plugin ............................ FAILURE [10:17 min]
[INFO] Apache Maven EJB Plugin ............................ SUCCESS [01:14 min]
[INFO] Apache Maven Help Plugin ........................... SUCCESS [03:43 min]
[INFO] Apache Maven Install Plugin ........................ SUCCESS [03:44 min]
[INFO] Apache Maven Jarsigner Plugin ...................... SUCCESS [01:30 min]
[INFO] Apache Maven JDeps Plugin .......................... SUCCESS [  6.742 s]
[INFO] Apache Maven Linkcheck Plugin ...................... SUCCESS [  7.966 s]
[INFO] Apache Maven Patch Plugin .......................... SUCCESS [ 12.878 s]
[INFO] Apache Maven PDF Plugin ............................ SUCCESS [ 52.950 s]
[INFO] Apache Maven RAR Plugin ............................ SUCCESS [ 26.892 s]
[INFO] Apache Maven Repository Plugin ..................... SUCCESS [ 55.416 s]
[INFO] Apache Maven Resources Plugin ...................... SUCCESS [02:49 min]
[INFO] Apache Maven Site Plugin ........................... SUCCESS [12:58 min]
[INFO] Apache Maven Source Plugin ......................... SUCCESS [02:13 min]
[INFO] Apache Maven Stage Plugin .......................... SUCCESS [  5.824 s]
[INFO] Apache Maven Toolchains Plugin ..................... SUCCESS [ 32.773 s]
[INFO] Apache Maven Verifier Plugin ....................... SUCCESS [ 19.636 s]
[INFO] Apache Maven WAR Plugin ............................ SUCCESS [03:25 min]
[INFO] Apache Maven DOAP Plugin ........................... SUCCESS [ 34.757 s]
[INFO] Apache Maven Invoker Plugin ........................ SUCCESS [12:02 min]
[INFO] Apache Maven JAR Plugin ............................ SUCCESS [03:08 min]
[INFO] Apache Maven Assembly Plugin ....................... SUCCESS [18:55 min]
[INFO] Apache Maven Checkstyle Plugin ..................... SUCCESS [07:14 min]
[INFO] Apache Maven Javadoc Plugin ........................ SUCCESS [09:14 min]
[INFO] Apache Maven PMD Plugin ............................ SUCCESS [03:44 min]
[INFO] Apache Maven JLink Plugin .......................... SUCCESS [  6.812 s]
[INFO] Apache Maven JMod Plugin ........................... SUCCESS [  4.057 s]
[INFO] Apache Maven Project Info Reports Plugin ........... SUCCESS [03:31 min]
[INFO] Apache Maven Remote Resources Plugin ............... SUCCESS [01:42 min]
[INFO] Apache Maven Shade Plugin .......................... SUCCESS [06:55 min]
[INFO] Apache Maven SCM Publish Plugin .................... SUCCESS [01:14 min]
[INFO] Apache Maven Dependency Plugin ..................... SUCCESS [07:52 min]
[INFO] Apache Maven Plugins Aggregator .................... SUCCESS [  1.030 s]
[INFO] ------------------------------------------------------------------------
[INFO] BUILD FAILURE
[INFO] ------------------------------------------------------------------------
[INFO] Total time: 02:18 h
[INFO] Finished at: 2017-09-17T13:50:13+00:00
[INFO] Final Memory: 160M/580M
[INFO] ------------------------------------------------------------------------
[WARNING] The requested profile "apache.snapshots" could not be activated because it does not exist.
[ERROR] Failed to execute goal org.apache.maven.plugins:maven-invoker-plugin:2.0.0:verify (integration-test) on project maven-ear-plugin: 1 build failed. See console output above for details. -> [Help 1]
[ERROR]
[ERROR] To see the full stack trace of the errors, re-run Maven with the -e switch.
[ERROR] Re-run Maven using the -X switch to enable full debug logging.
[ERROR]
[ERROR] For more information about the errors and possible solutions, please read the following articles:
[ERROR] [Help 1] http://cwiki.apache.org/confluence/display/MAVEN/MojoFailureException
[ERROR]
[ERROR] After correcting the problems, you can resume the build with the command
[ERROR]   mvn <goals> -rf :maven-ear-plugin
Build step 'Invoke top-level Maven targets' marked build as failure
Deleting 1 temporary files
Recording test results
Reply | Threaded
Open this post in threaded view
|

Build failed in Jenkins: maven-plugins-ITs-m3-windows #2001

Apache Jenkins Server-2
See <https://builds.apache.org/job/maven-plugins-ITs-m3-windows/2001/display/redirect?page=changes>

Changes:

[khmarbaise] [maven-release-plugin] prepare for next development iteration

[khmarbaise] [maven-release-plugin] prepare release maven-jmod-plugin-3.0.0-alpha-1

------------------------------------------
[...truncated 3.37 MB...]
[INFO] Building: analyze-report\pom.xml
[INFO] run script verify.bsh
[INFO] ..SUCCESS (9.9 s)
[INFO] Building: build-classpath\pom.xml
[INFO] run script verify.bsh
[INFO] ..SUCCESS (7.1 s)
[INFO] Building: build-classpath-output-file-and-property\pom.xml
[INFO] run script verify.bsh
[INFO] ..SUCCESS (9.5 s)
[INFO] Building: collect\pom.xml
[INFO] ..SUCCESS (6.8 s)
[INFO] Building: copy\pom.xml
[INFO] run script verify.bsh
[INFO] ..SUCCESS (6.7 s)
[INFO] Building: copy-and-unpack-with-alternate-local-repo\pom.xml
[INFO] run script verify.bsh
[INFO] ..SUCCESS (8.6 s)
[INFO] Building: copy-cli\pom.xml
[INFO] run script verify.bsh
[INFO] ..SUCCESS (6.7 s)
[INFO] Building: copy-dependencies\pom.xml
[INFO] run script verify.bsh
[INFO] ..SUCCESS (7.7 s)
[INFO] Building: copy-from-reactor\pom.xml
[INFO] run script verify.bsh
[INFO] ..SUCCESS (8.2 s)
[INFO] Building: copy-from-remote-repository\pom.xml
[INFO] run script setup.bsh
[INFO] run script verify.bsh
[INFO] ..SUCCESS (8.6 s)
[INFO] Building: dependency-properties\pom.xml
[INFO] run script verify.bsh
[INFO] ..SUCCESS (6.9 s)
[INFO] Building: filterunpack\pom.xml
[INFO] run script verify.groovy
[INFO] ..SUCCESS (6.7 s)
[INFO] Building: get-artifact\pom.xml
[INFO] run script setup.bsh
[INFO] run script verify.bsh
[INFO] ..SUCCESS (6.7 s)
[INFO] Building: get-artifact-maven-plugin\pom.xml
[INFO] run script setup.bsh
[INFO] run script verify.bsh
[INFO] ..SUCCESS (6.8 s)
[INFO] Building: get-artifact-no-transitive\pom.xml
[INFO] run script setup.bsh
[INFO] run script verify.bsh
[INFO] ..SUCCESS (6.7 s)
[INFO] Building: get-gav\pom.xml
[INFO] run script setup.bsh
[INFO] run script verify.bsh
[INFO] ..SUCCESS (6.6 s)
[INFO] Building: go-offline\pom.xml
[INFO] ..SUCCESS (8.8 s)
[INFO] Building: list-repositories\pom.xml
[INFO] ..SUCCESS (6.9 s)
[INFO] Building: mdep-439-analyze-java8\pom.xml
[INFO] ..SKIPPED due to JRE version
[INFO] Building: mdep-450-project-with-ancestor\pom.xml
[INFO] run script verify.groovy
[INFO] ..SUCCESS (6.6 s)
[INFO] Building: mdep-450-project-without-ancestor\pom.xml
[INFO] run script verify.groovy
[INFO] ..SUCCESS (6.6 s)
[INFO] Building: mdep-506-dependency-without-version-in-depmgt\pom.xml
[INFO] ..SUCCESS (7.8 s)
[INFO] Building: mdep-571-resolve-java9\pom.xml
[INFO] ..SKIPPED due to JRE version
[INFO] Building: mdep-572-unpack-tar-long-file\pom.xml
[INFO] run script verify.bsh
[INFO] ..SUCCESS (8.1 s)
[INFO] Building: mdep-578_display-reason-invalid-module\pom.xml
[INFO] ..SKIPPED due to JRE version
[INFO] Building: mdep-580_display-manifest-automodules\pom.xml
[INFO] ..SKIPPED due to JRE version
[INFO] Building: purge-local-repository\pom.xml
[INFO] run script setup.bsh
[INFO] run script verify.bsh
[INFO] ..SUCCESS (6.8 s)
[INFO] Building: purge-local-repository-bad-dep\pom.xml
[INFO] run script verify.groovy
[INFO] ..SUCCESS (7.0 s)
[INFO] Building: purge-local-repository-include\pom.xml
[INFO] run script verify.groovy
[INFO] ..SUCCESS (6.7 s)
[INFO] Building: purge-local-repository-multi-module\pom.xml
[INFO] run script setup.bsh
[INFO] run script verify.bsh
[INFO] ..SUCCESS (7.0 s)
[INFO] Building: purge-local-repository-multi-module-execution\pom.xml
[INFO] run script setup.bsh
[INFO] run script verify.bsh
[INFO] ..SUCCESS (7.9 s)
[INFO] Building: purge-local-repository-non-transitive\pom.xml
[INFO] run script verify.bsh
[INFO] ..SUCCESS (6.9 s)
[INFO] Building: purge-local-repository-reresolve\pom.xml
[INFO] run script verify.bsh
[INFO] ..SUCCESS (6.9 s)
[INFO] Building: purge-local-repository-snapshots-only\pom.xml
[INFO] run script setup.bsh
[INFO] run script verify.bsh
[INFO] ..SUCCESS (7.5 s)
[INFO] Building: purge-local-repository-version-range\pom.xml
[INFO] run script verify.bsh
[INFO] ..SUCCESS (6.9 s)
[INFO] Building: resolve\pom.xml
[INFO] ..SUCCESS (6.8 s)
[INFO] Building: resolve-plugins\pom.xml
[INFO] ..SUCCESS (7.6 s)
[INFO] Building: resolve-plugins-exclude-reactor\pom.xml
[INFO] run script verify.groovy
[INFO] ..SUCCESS (8.4 s)
[INFO] Building: resolve-plugins-with-exclude\pom.xml
[INFO] run script verify.groovy
[INFO] ..SUCCESS (7.5 s)
[INFO] Building: sources\pom.xml
[INFO] ..SUCCESS (7.0 s)
[INFO] Building: tree\pom.xml
[INFO] run script verify.bsh
[INFO] ..SUCCESS (6.8 s)
[INFO] Building: tree-includes\pom.xml
[INFO] run script verify.bsh
[INFO] ..SUCCESS (6.7 s)
[INFO] Building: tree-multimodule\pom.xml
[INFO] run script verify.bsh
[INFO] ..SUCCESS (7.3 s)
[INFO] Building: unpack\pom.xml
[INFO] run script verify.bsh
[INFO] ..SUCCESS (8.1 s)
[INFO] Building: unpack-cli\pom.xml
[INFO] run script verify.bsh
[INFO] ..SUCCESS (6.8 s)
[INFO] Building: unpack-custom-ear\pom.xml
[INFO] run script verify.groovy
[INFO] ..SUCCESS (7.4 s)
[INFO] Building: unpack-dependencies\pom.xml
[INFO] run script verify.groovy
[INFO] ..SUCCESS (8.6 s)
[INFO] Building: unpack-from-remote-repository\pom.xml
[INFO] run script setup.bsh
[INFO] run script verify.bsh
[INFO] ..SUCCESS (8.1 s)
[INFO] Building: used-dependencies\pom.xml
[INFO] ..SUCCESS (8.6 s)
[INFO] Building: purge-local-repository-without-pom
[INFO] run script setup.bsh
[INFO] run script verify.bsh
[INFO] ..SUCCESS (6.7 s)
[INFO]
[INFO] --- mrm-maven-plugin:1.0.0:stop (default) @ maven-dependency-plugin ---
[INFO] Stopping Mock Repository Manager on http://localhost:64637
[INFO] Mock Repository Manager http://localhost:64637 is stopped.
[INFO]
[INFO] --- maven-checkstyle-plugin:2.15:check (checkstyle-check) @ maven-dependency-plugin ---
[INFO] There is 1 error reported by Checkstyle 6.1.1 with config/maven_checks.xml ruleset.
[INFO] Ignored 1 error, 0 violation remaining.
[INFO]
[INFO] --- maven-invoker-plugin:2.0.0:verify (integration-test) @ maven-dependency-plugin ---
[INFO] -------------------------------------------------
[INFO] Build Summary:
[INFO]   Passed: 53, Failed: 0, Errors: 0, Skipped: 4
[INFO] -------------------------------------------------
[INFO]
[INFO] --- maven-install-plugin:2.5.2:install (default-install) @ maven-dependency-plugin ---
[INFO] Installing F:\jenkins\jenkins-slave\workspace\maven-plugins-ITs-m3-windows\maven-dependency-plugin\target\maven-dependency-plugin-3.0.3-SNAPSHOT.jar to C:\Users\jenkins\.m2\repository\org\apache\maven\plugins\maven-dependency-plugin\3.0.3-SNAPSHOT\maven-dependency-plugin-3.0.3-SNAPSHOT.jar
[INFO] Installing F:\jenkins\jenkins-slave\workspace\maven-plugins-ITs-m3-windows\maven-dependency-plugin\pom.xml to C:\Users\jenkins\.m2\repository\org\apache\maven\plugins\maven-dependency-plugin\3.0.3-SNAPSHOT\maven-dependency-plugin-3.0.3-SNAPSHOT.pom
[INFO]                                                                        
[INFO] ------------------------------------------------------------------------
[INFO] Building Apache Maven Plugins Aggregator 1-SNAPSHOT
[INFO] ------------------------------------------------------------------------
[INFO]
[INFO] --- maven-clean-plugin:2.5:clean (default-clean) @ maven-plugins-aggregator ---
[INFO]
[INFO] --- maven-enforcer-plugin:1.3.1:enforce (enforce-bytecode-version) @ maven-plugins-aggregator ---
[INFO]
[INFO] --- maven-enforcer-plugin:1.3.1:enforce (ban-known-bad-maven-versions) @ maven-plugins-aggregator ---
[INFO]
[INFO] --- maven-remote-resources-plugin:1.5:process (default) @ maven-plugins-aggregator ---
[INFO]
[INFO] --- maven-site-plugin:3.3:attach-descriptor (attach-descriptor) @ maven-plugins-aggregator ---
[INFO]
[INFO] --- maven-install-plugin:2.5.1:install (default-install) @ maven-plugins-aggregator ---
[INFO] Installing <https://builds.apache.org/job/maven-plugins-ITs-m3-windows/ws/pom.xml> to C:\Users\jenkins\.m2\repository\org\apache\maven\plugins\maven-plugins-aggregator\1-SNAPSHOT\maven-plugins-aggregator-1-SNAPSHOT.pom
[INFO] ------------------------------------------------------------------------
[INFO] Reactor Summary:
[INFO]
[INFO] Apache Maven ACR Plugin ............................ SUCCESS [ 45.599 s]
[INFO] Apache Maven AntRun Plugin ......................... SUCCESS [02:40 min]
[INFO] Apache Maven Changelog Plugin ...................... SUCCESS [01:14 min]
[INFO] Apache Maven Changes Plugin ........................ SUCCESS [02:06 min]
[INFO] Apache Maven Clean Plugin .......................... SUCCESS [ 51.541 s]
[INFO] Apache Maven Compiler Plugin ....................... SUCCESS [03:57 min]
[INFO] Apache Maven Deploy Plugin ......................... SUCCESS [03:35 min]
[INFO] Apache Maven Documentation Checker Plugin .......... SUCCESS [  9.826 s]
[INFO] Apache Maven EAR Plugin ............................ FAILURE [10:39 min]
[INFO] Apache Maven EJB Plugin ............................ SUCCESS [01:16 min]
[INFO] Apache Maven Help Plugin ........................... SUCCESS [03:21 min]
[INFO] Apache Maven Install Plugin ........................ SUCCESS [03:06 min]
[INFO] Apache Maven Jarsigner Plugin ...................... SUCCESS [01:18 min]
[INFO] Apache Maven JDeps Plugin .......................... SUCCESS [  4.080 s]
[INFO] Apache Maven Linkcheck Plugin ...................... SUCCESS [  5.135 s]
[INFO] Apache Maven Patch Plugin .......................... SUCCESS [ 10.822 s]
[INFO] Apache Maven PDF Plugin ............................ SUCCESS [ 42.250 s]
[INFO] Apache Maven RAR Plugin ............................ SUCCESS [ 21.396 s]
[INFO] Apache Maven Repository Plugin ..................... SUCCESS [ 45.746 s]
[INFO] Apache Maven Resources Plugin ...................... SUCCESS [02:24 min]
[INFO] Apache Maven Site Plugin ........................... SUCCESS [11:18 min]
[INFO] Apache Maven Source Plugin ......................... SUCCESS [01:46 min]
[INFO] Apache Maven Stage Plugin .......................... SUCCESS [  4.067 s]
[INFO] Apache Maven Toolchains Plugin ..................... SUCCESS [ 26.754 s]
[INFO] Apache Maven Verifier Plugin ....................... SUCCESS [ 16.943 s]
[INFO] Apache Maven WAR Plugin ............................ SUCCESS [03:19 min]
[INFO] Apache Maven DOAP Plugin ........................... SUCCESS [ 35.056 s]
[INFO] Apache Maven Invoker Plugin ........................ SUCCESS [12:12 min]
[INFO] Apache Maven JAR Plugin ............................ SUCCESS [03:14 min]
[INFO] Apache Maven Assembly Plugin ....................... SUCCESS [19:14 min]
[INFO] Apache Maven Checkstyle Plugin ..................... SUCCESS [07:16 min]
[INFO] Apache Maven Javadoc Plugin ........................ SUCCESS [09:18 min]
[INFO] Apache Maven PMD Plugin ............................ SUCCESS [03:45 min]
[INFO] Apache Maven JLink Plugin .......................... SUCCESS [  6.630 s]
[INFO] Apache Maven JMod Plugin ........................... SUCCESS [  4.716 s]
[INFO] Apache Maven Project Info Reports Plugin ........... SUCCESS [03:32 min]
[INFO] Apache Maven Remote Resources Plugin ............... SUCCESS [01:44 min]
[INFO] Apache Maven Shade Plugin .......................... SUCCESS [07:04 min]
[INFO] Apache Maven SCM Publish Plugin .................... SUCCESS [01:17 min]
[INFO] Apache Maven Dependency Plugin ..................... SUCCESS [07:50 min]
[INFO] Apache Maven Plugins Aggregator .................... SUCCESS [  0.993 s]
[INFO] ------------------------------------------------------------------------
[INFO] BUILD FAILURE
[INFO] ------------------------------------------------------------------------
[INFO] Total time: 02:14 h
[INFO] Finished at: 2017-09-17T16:08:35+00:00
[INFO] Final Memory: 161M/531M
[INFO] ------------------------------------------------------------------------
[WARNING] The requested profile "apache.snapshots" could not be activated because it does not exist.
[ERROR] Failed to execute goal org.apache.maven.plugins:maven-invoker-plugin:2.0.0:verify (integration-test) on project maven-ear-plugin: 1 build failed. See console output above for details. -> [Help 1]
[ERROR]
[ERROR] To see the full stack trace of the errors, re-run Maven with the -e switch.
[ERROR] Re-run Maven using the -X switch to enable full debug logging.
[ERROR]
[ERROR] For more information about the errors and possible solutions, please read the following articles:
[ERROR] [Help 1] http://cwiki.apache.org/confluence/display/MAVEN/MojoFailureException
[ERROR]
[ERROR] After correcting the problems, you can resume the build with the command
[ERROR]   mvn <goals> -rf :maven-ear-plugin
Build step 'Invoke top-level Maven targets' marked build as failure
Deleting 1 temporary files
Recording test results
Reply | Threaded
Open this post in threaded view
|

Build failed in Jenkins: maven-plugins-ITs-m3-windows #2002

Apache Jenkins Server-2
See <https://builds.apache.org/job/maven-plugins-ITs-m3-windows/2002/display/redirect?page=changes>

Changes:

[khmarbaise] [MJLINK-5] Parameter 'compression' is wrong. It is 'compress'
 o Changed the wrong parameter for commandline from compression
   into the correct on compress. Change the name of the parameter
   accordingly.

------------------------------------------
[...truncated 3.37 MB...]
[INFO] Building: copy-from-reactor\pom.xml
[INFO] run script verify.bsh
[INFO] ..SUCCESS (8.1 s)
[INFO] Building: copy-from-remote-repository\pom.xml
[INFO] run script setup.bsh
[INFO] artifact org.apache.maven.its.dependency.fake-remote-copy:1.0: checking for updates from central
[INFO] run script verify.bsh
[INFO] ..SUCCESS (8.1 s)
[INFO] Building: dependency-properties\pom.xml
[INFO] run script verify.bsh
[INFO] ..SUCCESS (7.1 s)
[INFO] Building: filterunpack\pom.xml
[INFO] run script verify.groovy
[INFO] ..SUCCESS (7.7 s)
[INFO] Building: get-artifact\pom.xml
[INFO] run script setup.bsh
[INFO] run script verify.bsh
[INFO] ..SUCCESS (6.8 s)
[INFO] Building: get-artifact-maven-plugin\pom.xml
[INFO] run script setup.bsh
[INFO] run script verify.bsh
[INFO] ..SUCCESS (7.2 s)
[INFO] Building: get-artifact-no-transitive\pom.xml
[INFO] run script setup.bsh
[INFO] run script verify.bsh
[INFO] ..SUCCESS (6.9 s)
[INFO] Building: get-gav\pom.xml
[INFO] run script setup.bsh
[INFO] run script verify.bsh
[INFO] ..SUCCESS (6.7 s)
[INFO] Building: go-offline\pom.xml
[INFO] ..SUCCESS (8.7 s)
[INFO] Building: list-repositories\pom.xml
[INFO] snapshot org.apache.maven.its.dependency:test:1.0-SNAPSHOT: checking for updates from apache.snapshots
[INFO] artifact org.apache.maven.its.dependency.test:1.0-SNAPSHOT: checking for updates from central
[INFO] ..SUCCESS (7.3 s)
[INFO] Building: mdep-439-analyze-java8\pom.xml
[INFO] ..SKIPPED due to JRE version
[INFO] Building: mdep-450-project-with-ancestor\pom.xml
[INFO] run script verify.groovy
[INFO] ..SUCCESS (7.3 s)
[INFO] Building: mdep-450-project-without-ancestor\pom.xml
[INFO] run script verify.groovy
[INFO] ..SUCCESS (7.4 s)
[INFO] Building: mdep-506-dependency-without-version-in-depmgt\pom.xml
[INFO] ..SUCCESS (8.7 s)
[INFO] Building: mdep-571-resolve-java9\pom.xml
[INFO] ..SKIPPED due to JRE version
[INFO] Building: mdep-572-unpack-tar-long-file\pom.xml
[INFO] run script verify.bsh
[INFO] ..SUCCESS (8.1 s)
[INFO] Building: mdep-578_display-reason-invalid-module\pom.xml
[INFO] ..SKIPPED due to JRE version
[INFO] Building: mdep-580_display-manifest-automodules\pom.xml
[INFO] ..SKIPPED due to JRE version
[INFO] Building: purge-local-repository\pom.xml
[INFO] run script setup.bsh
[INFO] artifact org.apache.maven.its.dependency.purged:1.0: checking for updates from central
[INFO] run script verify.bsh
[INFO] ..SUCCESS (7.4 s)
[INFO] Building: purge-local-repository-bad-dep\pom.xml
[INFO] snapshot org.apache.maven.its.dependency:purge-local-repository-bad-dep:1.0-SNAPSHOT: checking for updates from apache.snapshots
[INFO] artifact org.apache.maven.its.dependency.purge-local-repository-bad-dep:1.0-SNAPSHOT: checking for updates from central
[INFO] artifact org.apache.maven.its.dependency.i-do-not-exist:1.0: checking for updates from central
[INFO] run script verify.groovy
[INFO] ..SUCCESS (7.2 s)
[INFO] Building: purge-local-repository-include\pom.xml
[INFO] snapshot org.apache.maven.its.dependency:purge-local-repository-include:1.0-SNAPSHOT: checking for updates from apache.snapshots
[INFO] artifact org.apache.maven.its.dependency.purge-local-repository-include:1.0-SNAPSHOT: checking for updates from central
[INFO] run script verify.groovy
[INFO] ..SUCCESS (7.5 s)
[INFO] Building: purge-local-repository-multi-module\pom.xml
[INFO] run script setup.bsh
[INFO] snapshot org.apache.maven.its.dependency:child1:1.0-SNAPSHOT: checking for updates from apache.snapshots
[INFO] artifact org.apache.maven.its.dependency.child1:1.0-SNAPSHOT: checking for updates from central
[INFO] artifact org.apache.maven.its.dependency.purged-a:1.0: checking for updates from central
[INFO] snapshot org.apache.maven.its.dependency:child2:1.0-SNAPSHOT: checking for updates from apache.snapshots
[INFO] artifact org.apache.maven.its.dependency.child2:1.0-SNAPSHOT: checking for updates from central
[INFO] artifact org.apache.maven.its.dependency.purged-b:1.0: checking for updates from central
[INFO] run script verify.bsh
[INFO] ..SUCCESS (7.7 s)
[INFO] Building: purge-local-repository-multi-module-execution\pom.xml
[INFO] run script setup.bsh
[INFO] run script verify.bsh
[INFO] ..SUCCESS (8.4 s)
[INFO] Building: purge-local-repository-non-transitive\pom.xml
[INFO] run script verify.bsh
[INFO] ..SUCCESS (6.9 s)
[INFO] Building: purge-local-repository-reresolve\pom.xml
[INFO] run script verify.bsh
[INFO] ..SUCCESS (7.5 s)
[INFO] Building: purge-local-repository-snapshots-only\pom.xml
[INFO] run script setup.bsh
[INFO] snapshot org.apache.maven.its.dependency:snap-purged:1.0-SNAPSHOT: checking for updates from apache.snapshots
[INFO] artifact org.apache.maven.its.dependency.snap-purged:1.0-SNAPSHOT: checking for updates from central
[INFO] run script verify.bsh
[INFO] ..SUCCESS (7.8 s)
[INFO] Building: purge-local-repository-version-range\pom.xml
[INFO] artifact org.apache.maven.its.dependency:purge-local-repository: checking for updates from central
[INFO] artifact org.apache.maven.its.dependency:purge-local-repository: checking for updates from central
[INFO] run script verify.bsh
[INFO] ..SUCCESS (7.0 s)
[INFO] Building: resolve\pom.xml
[INFO] ..SUCCESS (6.9 s)
[INFO] Building: resolve-plugins\pom.xml
[INFO] ..SUCCESS (7.6 s)
[INFO] Building: resolve-plugins-exclude-reactor\pom.xml
[INFO] run script verify.groovy
[INFO] ..SUCCESS (8.4 s)
[INFO] Building: resolve-plugins-with-exclude\pom.xml
[INFO] run script verify.groovy
[INFO] ..SUCCESS (7.4 s)
[INFO] Building: sources\pom.xml
[INFO] artifact classworlds.classworlds:1.1-alpha-2: checking for updates from central
[INFO] ..SUCCESS (7.5 s)
[INFO] Building: tree\pom.xml
[INFO] run script verify.bsh
[INFO] ..SUCCESS (6.8 s)
[INFO] Building: tree-includes\pom.xml
[INFO] run script verify.bsh
[INFO] ..SUCCESS (7.2 s)
[INFO] Building: tree-multimodule\pom.xml
[INFO] snapshot org.apache.maven.its.dependency:tree-multimodule-module-a:1.0-SNAPSHOT: checking for updates from apache.snapshots
[INFO] artifact org.apache.maven.its.dependency.tree-multimodule-module-a:1.0-SNAPSHOT: checking for updates from central
[INFO] run script verify.bsh
[INFO] ..SUCCESS (8.2 s)
[INFO] Building: unpack\pom.xml
[INFO] run script verify.bsh
[INFO] ..SUCCESS (8.7 s)
[INFO] Building: unpack-cli\pom.xml
[INFO] run script verify.bsh
[INFO] ..SUCCESS (7.3 s)
[INFO] Building: unpack-custom-ear\pom.xml
[INFO] run script verify.groovy
[INFO] ..SUCCESS (7.1 s)
[INFO] Building: unpack-dependencies\pom.xml
[INFO] run script verify.groovy
[INFO] ..SUCCESS (8.7 s)
[INFO] Building: unpack-from-remote-repository\pom.xml
[INFO] run script setup.bsh
[INFO] artifact org.apache.maven.its.dependency.fake-remote-unpack:1.0: checking for updates from central
[INFO] run script verify.bsh
[INFO] ..SUCCESS (8.8 s)
[INFO] Building: used-dependencies\pom.xml
[INFO] ..SUCCESS (8.4 s)
[INFO] Building: purge-local-repository-without-pom
[INFO] run script setup.bsh
[INFO] run script verify.bsh
[INFO] ..SUCCESS (7.1 s)
[INFO]
[INFO] --- mrm-maven-plugin:1.0.0:stop (default) @ maven-dependency-plugin ---
[INFO] Stopping Mock Repository Manager on http://localhost:59574
[INFO] Mock Repository Manager http://localhost:59574 is stopped.
[INFO]
[INFO] --- maven-checkstyle-plugin:2.15:check (checkstyle-check) @ maven-dependency-plugin ---
[INFO] There is 1 error reported by Checkstyle 6.1.1 with config/maven_checks.xml ruleset.
[INFO] Ignored 1 error, 0 violation remaining.
[INFO]
[INFO] --- maven-invoker-plugin:2.0.0:verify (integration-test) @ maven-dependency-plugin ---
[INFO] -------------------------------------------------
[INFO] Build Summary:
[INFO]   Passed: 53, Failed: 0, Errors: 0, Skipped: 4
[INFO] -------------------------------------------------
[INFO]
[INFO] --- maven-install-plugin:2.5.2:install (default-install) @ maven-dependency-plugin ---
[INFO] Installing F:\jenkins\jenkins-slave\workspace\maven-plugins-ITs-m3-windows\maven-dependency-plugin\target\maven-dependency-plugin-3.0.3-SNAPSHOT.jar to C:\Users\jenkins\.m2\repository\org\apache\maven\plugins\maven-dependency-plugin\3.0.3-SNAPSHOT\maven-dependency-plugin-3.0.3-SNAPSHOT.jar
[INFO] Installing F:\jenkins\jenkins-slave\workspace\maven-plugins-ITs-m3-windows\maven-dependency-plugin\pom.xml to C:\Users\jenkins\.m2\repository\org\apache\maven\plugins\maven-dependency-plugin\3.0.3-SNAPSHOT\maven-dependency-plugin-3.0.3-SNAPSHOT.pom
[INFO]                                                                        
[INFO] ------------------------------------------------------------------------
[INFO] Building Apache Maven Plugins Aggregator 1-SNAPSHOT
[INFO] ------------------------------------------------------------------------
[INFO]
[INFO] --- maven-clean-plugin:2.5:clean (default-clean) @ maven-plugins-aggregator ---
[INFO]
[INFO] --- maven-enforcer-plugin:1.3.1:enforce (enforce-bytecode-version) @ maven-plugins-aggregator ---
[INFO]
[INFO] --- maven-enforcer-plugin:1.3.1:enforce (ban-known-bad-maven-versions) @ maven-plugins-aggregator ---
[INFO]
[INFO] --- maven-remote-resources-plugin:1.5:process (default) @ maven-plugins-aggregator ---
[INFO]
[INFO] --- maven-site-plugin:3.3:attach-descriptor (attach-descriptor) @ maven-plugins-aggregator ---
[INFO]
[INFO] --- maven-install-plugin:2.5.1:install (default-install) @ maven-plugins-aggregator ---
[INFO] Installing <https://builds.apache.org/job/maven-plugins-ITs-m3-windows/ws/pom.xml> to C:\Users\jenkins\.m2\repository\org\apache\maven\plugins\maven-plugins-aggregator\1-SNAPSHOT\maven-plugins-aggregator-1-SNAPSHOT.pom
[INFO] ------------------------------------------------------------------------
[INFO] Reactor Summary:
[INFO]
[INFO] Apache Maven ACR Plugin ............................ SUCCESS [ 50.733 s]
[INFO] Apache Maven AntRun Plugin ......................... SUCCESS [02:48 min]
[INFO] Apache Maven Changelog Plugin ...................... SUCCESS [01:18 min]
[INFO] Apache Maven Changes Plugin ........................ SUCCESS [02:04 min]
[INFO] Apache Maven Clean Plugin .......................... SUCCESS [ 50.966 s]
[INFO] Apache Maven Compiler Plugin ....................... SUCCESS [03:57 min]
[INFO] Apache Maven Deploy Plugin ......................... SUCCESS [03:39 min]
[INFO] Apache Maven Documentation Checker Plugin .......... SUCCESS [  9.899 s]
[INFO] Apache Maven EAR Plugin ............................ FAILURE [10:13 min]
[INFO] Apache Maven EJB Plugin ............................ SUCCESS [01:15 min]
[INFO] Apache Maven Help Plugin ........................... SUCCESS [03:22 min]
[INFO] Apache Maven Install Plugin ........................ SUCCESS [03:06 min]
[INFO] Apache Maven Jarsigner Plugin ...................... SUCCESS [01:16 min]
[INFO] Apache Maven JDeps Plugin .......................... SUCCESS [  3.793 s]
[INFO] Apache Maven Linkcheck Plugin ...................... SUCCESS [  5.662 s]
[INFO] Apache Maven Patch Plugin .......................... SUCCESS [ 10.772 s]
[INFO] Apache Maven PDF Plugin ............................ SUCCESS [ 41.510 s]
[INFO] Apache Maven RAR Plugin ............................ SUCCESS [ 21.149 s]
[INFO] Apache Maven Repository Plugin ..................... SUCCESS [ 45.627 s]
[INFO] Apache Maven Resources Plugin ...................... SUCCESS [02:27 min]
[INFO] Apache Maven Site Plugin ........................... SUCCESS [13:05 min]
[INFO] Apache Maven Source Plugin ......................... SUCCESS [02:05 min]
[INFO] Apache Maven Stage Plugin .......................... SUCCESS [  5.014 s]
[INFO] Apache Maven Toolchains Plugin ..................... SUCCESS [ 30.787 s]
[INFO] Apache Maven Verifier Plugin ....................... SUCCESS [ 18.797 s]
[INFO] Apache Maven WAR Plugin ............................ SUCCESS [03:51 min]
[INFO] Apache Maven DOAP Plugin ........................... SUCCESS [ 38.997 s]
[INFO] Apache Maven Invoker Plugin ........................ SUCCESS [13:48 min]
[INFO] Apache Maven JAR Plugin ............................ SUCCESS [03:32 min]
[INFO] Apache Maven Assembly Plugin ....................... SUCCESS [19:43 min]
[INFO] Apache Maven Checkstyle Plugin ..................... SUCCESS [07:41 min]
[INFO] Apache Maven Javadoc Plugin ........................ SUCCESS [09:28 min]
[INFO] Apache Maven PMD Plugin ............................ SUCCESS [03:45 min]
[INFO] Apache Maven JLink Plugin .......................... SUCCESS [  7.185 s]
[INFO] Apache Maven JMod Plugin ........................... SUCCESS [  4.213 s]
[INFO] Apache Maven Project Info Reports Plugin ........... SUCCESS [04:55 min]
[INFO] Apache Maven Remote Resources Plugin ............... SUCCESS [01:42 min]
[INFO] Apache Maven Shade Plugin .......................... SUCCESS [06:58 min]
[INFO] Apache Maven SCM Publish Plugin .................... SUCCESS [01:24 min]
[INFO] Apache Maven Dependency Plugin ..................... SUCCESS [08:24 min]
[INFO] Apache Maven Plugins Aggregator .................... SUCCESS [  0.932 s]
[INFO] ------------------------------------------------------------------------
[INFO] BUILD FAILURE
[INFO] ------------------------------------------------------------------------
[INFO] Total time: 02:21 h
[INFO] Finished at: 2017-09-18T19:55:32+00:00
[INFO] Final Memory: 161M/525M
[INFO] ------------------------------------------------------------------------
[WARNING] The requested profile "apache.snapshots" could not be activated because it does not exist.
[ERROR] Failed to execute goal org.apache.maven.plugins:maven-invoker-plugin:2.0.0:verify (integration-test) on project maven-ear-plugin: 1 build failed. See console output above for details. -> [Help 1]
[ERROR]
[ERROR] To see the full stack trace of the errors, re-run Maven with the -e switch.
[ERROR] Re-run Maven using the -X switch to enable full debug logging.
[ERROR]
[ERROR] For more information about the errors and possible solutions, please read the following articles:
[ERROR] [Help 1] http://cwiki.apache.org/confluence/display/MAVEN/MojoFailureException
[ERROR]
[ERROR] After correcting the problems, you can resume the build with the command
[ERROR]   mvn <goals> -rf :maven-ear-plugin
Build step 'Invoke top-level Maven targets' marked build as failure
Deleting 1 temporary files
Recording test results
Reply | Threaded
Open this post in threaded view
|

Build failed in Jenkins: maven-plugins-ITs-m3-windows #2003

Apache Jenkins Server-2
See <https://builds.apache.org/job/maven-plugins-ITs-m3-windows/2003/display/redirect?page=changes>

Changes:

[Michael Osipov] [MWAR-407] Binary files are modified during web.xml filtering; revert MWAR-404

This is a regression caused by MWAR-404 and therefore needs to be reverted for now.

------------------------------------------
[...truncated 3.38 MB...]
[INFO] Building: copy-from-reactor\pom.xml
[INFO] run script verify.bsh
[INFO] ..SUCCESS (9.4 s)
[INFO] Building: copy-from-remote-repository\pom.xml
[INFO] run script setup.bsh
[INFO] artifact org.apache.maven.its.dependency.fake-remote-copy:1.0: checking for updates from central
[INFO] run script verify.bsh
[INFO] ..SUCCESS (9.0 s)
[INFO] Building: dependency-properties\pom.xml
[INFO] run script verify.bsh
[INFO] ..SUCCESS (8.8 s)
[INFO] Building: filterunpack\pom.xml
[INFO] run script verify.groovy
[INFO] ..SUCCESS (7.3 s)
[INFO] Building: get-artifact\pom.xml
[INFO] run script setup.bsh
[INFO] run script verify.bsh
[INFO] ..SUCCESS (7.4 s)
[INFO] Building: get-artifact-maven-plugin\pom.xml
[INFO] run script setup.bsh
[INFO] run script verify.bsh
[INFO] ..SUCCESS (7.1 s)
[INFO] Building: get-artifact-no-transitive\pom.xml
[INFO] run script setup.bsh
[INFO] run script verify.bsh
[INFO] ..SUCCESS (6.7 s)
[INFO] Building: get-gav\pom.xml
[INFO] run script setup.bsh
[INFO] run script verify.bsh
[INFO] ..SUCCESS (6.6 s)
[INFO] Building: go-offline\pom.xml
[INFO] ..SUCCESS (8.2 s)
[INFO] Building: list-repositories\pom.xml
[INFO] snapshot org.apache.maven.its.dependency:test:1.0-SNAPSHOT: checking for updates from apache.snapshots
[INFO] artifact org.apache.maven.its.dependency.test:1.0-SNAPSHOT: checking for updates from central
[INFO] ..SUCCESS (9.2 s)
[INFO] Building: mdep-439-analyze-java8\pom.xml
[INFO] ..SKIPPED due to JRE version
[INFO] Building: mdep-450-project-with-ancestor\pom.xml
[INFO] run script verify.groovy
[INFO] ..SUCCESS (8.4 s)
[INFO] Building: mdep-450-project-without-ancestor\pom.xml
[INFO] run script verify.groovy
[INFO] ..SUCCESS (8.8 s)
[INFO] Building: mdep-506-dependency-without-version-in-depmgt\pom.xml
[INFO] ..SUCCESS (7.6 s)
[INFO] Building: mdep-571-resolve-java9\pom.xml
[INFO] ..SKIPPED due to JRE version
[INFO] Building: mdep-572-unpack-tar-long-file\pom.xml
[INFO] run script verify.bsh
[INFO] ..SUCCESS (8.8 s)
[INFO] Building: mdep-578_display-reason-invalid-module\pom.xml
[INFO] ..SKIPPED due to JRE version
[INFO] Building: mdep-580_display-manifest-automodules\pom.xml
[INFO] ..SKIPPED due to JRE version
[INFO] Building: purge-local-repository\pom.xml
[INFO] run script setup.bsh
[INFO] artifact org.apache.maven.its.dependency.purged:1.0: checking for updates from central
[INFO] run script verify.bsh
[INFO] ..SUCCESS (7.7 s)
[INFO] Building: purge-local-repository-bad-dep\pom.xml
[INFO] snapshot org.apache.maven.its.dependency:purge-local-repository-bad-dep:1.0-SNAPSHOT: checking for updates from apache.snapshots
[INFO] artifact org.apache.maven.its.dependency.purge-local-repository-bad-dep:1.0-SNAPSHOT: checking for updates from central
[INFO] artifact org.apache.maven.its.dependency.i-do-not-exist:1.0: checking for updates from central
[INFO] run script verify.groovy
[INFO] ..SUCCESS (9.3 s)
[INFO] Building: purge-local-repository-include\pom.xml
[INFO] snapshot org.apache.maven.its.dependency:purge-local-repository-include:1.0-SNAPSHOT: checking for updates from apache.snapshots
[INFO] artifact org.apache.maven.its.dependency.purge-local-repository-include:1.0-SNAPSHOT: checking for updates from central
[INFO] run script verify.groovy
[INFO] ..SUCCESS (8.6 s)
[INFO] Building: purge-local-repository-multi-module\pom.xml
[INFO] run script setup.bsh
[INFO] snapshot org.apache.maven.its.dependency:child1:1.0-SNAPSHOT: checking for updates from apache.snapshots
[INFO] artifact org.apache.maven.its.dependency.child1:1.0-SNAPSHOT: checking for updates from central
[INFO] artifact org.apache.maven.its.dependency.purged-a:1.0: checking for updates from central
[INFO] snapshot org.apache.maven.its.dependency:child2:1.0-SNAPSHOT: checking for updates from apache.snapshots
[INFO] artifact org.apache.maven.its.dependency.child2:1.0-SNAPSHOT: checking for updates from central
[INFO] artifact org.apache.maven.its.dependency.purged-b:1.0: checking for updates from central
[INFO] run script verify.bsh
[INFO] ..SUCCESS (8.7 s)
[INFO] Building: purge-local-repository-multi-module-execution\pom.xml
[INFO] run script setup.bsh
[INFO] run script verify.bsh
[INFO] ..SUCCESS (8.4 s)
[INFO] Building: purge-local-repository-non-transitive\pom.xml
[INFO] run script verify.bsh
[INFO] ..SUCCESS (6.8 s)
[INFO] Building: purge-local-repository-reresolve\pom.xml
[INFO] run script verify.bsh
[INFO] ..SUCCESS (6.8 s)
[INFO] Building: purge-local-repository-snapshots-only\pom.xml
[INFO] run script setup.bsh
[INFO] snapshot org.apache.maven.its.dependency:snap-purged:1.0-SNAPSHOT: checking for updates from apache.snapshots
[INFO] artifact org.apache.maven.its.dependency.snap-purged:1.0-SNAPSHOT: checking for updates from central
[INFO] run script verify.bsh
[INFO] ..SUCCESS (8.0 s)
[INFO] Building: purge-local-repository-version-range\pom.xml
[INFO] artifact org.apache.maven.its.dependency:purge-local-repository: checking for updates from central
[INFO] artifact org.apache.maven.its.dependency:purge-local-repository: checking for updates from central
[INFO] run script verify.bsh
[INFO] ..SUCCESS (7.0 s)
[INFO] Building: resolve\pom.xml
[INFO] ..SUCCESS (6.7 s)
[INFO] Building: resolve-plugins\pom.xml
[INFO] ..SUCCESS (9.1 s)
[INFO] Building: resolve-plugins-exclude-reactor\pom.xml
[INFO] run script verify.groovy
[INFO] ..SUCCESS (8.5 s)
[INFO] Building: resolve-plugins-with-exclude\pom.xml
[INFO] run script verify.groovy
[INFO] ..SUCCESS (7.6 s)
[INFO] Building: sources\pom.xml
[INFO] artifact classworlds.classworlds:1.1-alpha-2: checking for updates from central
[INFO] ..SUCCESS (7.3 s)
[INFO] Building: tree\pom.xml
[INFO] run script verify.bsh
[INFO] ..SUCCESS (6.9 s)
[INFO] Building: tree-includes\pom.xml
[INFO] run script verify.bsh
[INFO] ..SUCCESS (6.7 s)
[INFO] Building: tree-multimodule\pom.xml
[INFO] snapshot org.apache.maven.its.dependency:tree-multimodule-module-a:1.0-SNAPSHOT: checking for updates from apache.snapshots
[INFO] artifact org.apache.maven.its.dependency.tree-multimodule-module-a:1.0-SNAPSHOT: checking for updates from central
[INFO] run script verify.bsh
[INFO] ..SUCCESS (7.5 s)
[INFO] Building: unpack\pom.xml
[INFO] run script verify.bsh
[INFO] ..SUCCESS (8.1 s)
[INFO] Building: unpack-cli\pom.xml
[INFO] run script verify.bsh
[INFO] ..SUCCESS (6.9 s)
[INFO] Building: unpack-custom-ear\pom.xml
[INFO] run script verify.groovy
[INFO] ..SUCCESS (7.0 s)
[INFO] Building: unpack-dependencies\pom.xml
[INFO] run script verify.groovy
[INFO] ..SUCCESS (8.6 s)
[INFO] Building: unpack-from-remote-repository\pom.xml
[INFO] run script setup.bsh
[INFO] artifact org.apache.maven.its.dependency.fake-remote-unpack:1.0: checking for updates from central
[INFO] run script verify.bsh
[INFO] ..SUCCESS (12.3 s)
[INFO] Building: used-dependencies\pom.xml
[INFO] ..SUCCESS (11.7 s)
[INFO] Building: purge-local-repository-without-pom
[INFO] run script setup.bsh
[INFO] run script verify.bsh
[INFO] ..SUCCESS (6.4 s)
[INFO]
[INFO] --- mrm-maven-plugin:1.0.0:stop (default) @ maven-dependency-plugin ---
[INFO] Stopping Mock Repository Manager on http://localhost:63543
[INFO] Mock Repository Manager http://localhost:63543 is stopped.
[INFO]
[INFO] --- maven-checkstyle-plugin:2.15:check (checkstyle-check) @ maven-dependency-plugin ---
[INFO] There is 1 error reported by Checkstyle 6.1.1 with config/maven_checks.xml ruleset.
[INFO] Ignored 1 error, 0 violation remaining.
[INFO]
[INFO] --- maven-invoker-plugin:2.0.0:verify (integration-test) @ maven-dependency-plugin ---
[INFO] -------------------------------------------------
[INFO] Build Summary:
[INFO]   Passed: 53, Failed: 0, Errors: 0, Skipped: 4
[INFO] -------------------------------------------------
[INFO]
[INFO] --- maven-install-plugin:2.5.2:install (default-install) @ maven-dependency-plugin ---
[INFO] Installing F:\jenkins\jenkins-slave\workspace\maven-plugins-ITs-m3-windows\maven-dependency-plugin\target\maven-dependency-plugin-3.0.3-SNAPSHOT.jar to C:\Users\jenkins\.m2\repository\org\apache\maven\plugins\maven-dependency-plugin\3.0.3-SNAPSHOT\maven-dependency-plugin-3.0.3-SNAPSHOT.jar
[INFO] Installing F:\jenkins\jenkins-slave\workspace\maven-plugins-ITs-m3-windows\maven-dependency-plugin\pom.xml to C:\Users\jenkins\.m2\repository\org\apache\maven\plugins\maven-dependency-plugin\3.0.3-SNAPSHOT\maven-dependency-plugin-3.0.3-SNAPSHOT.pom
[INFO]                                                                        
[INFO] ------------------------------------------------------------------------
[INFO] Building Apache Maven Plugins Aggregator 1-SNAPSHOT
[INFO] ------------------------------------------------------------------------
[INFO]
[INFO] --- maven-clean-plugin:2.5:clean (default-clean) @ maven-plugins-aggregator ---
[INFO]
[INFO] --- maven-enforcer-plugin:1.3.1:enforce (enforce-bytecode-version) @ maven-plugins-aggregator ---
[INFO]
[INFO] --- maven-enforcer-plugin:1.3.1:enforce (ban-known-bad-maven-versions) @ maven-plugins-aggregator ---
[INFO]
[INFO] --- maven-remote-resources-plugin:1.5:process (default) @ maven-plugins-aggregator ---
[INFO]
[INFO] --- maven-site-plugin:3.3:attach-descriptor (attach-descriptor) @ maven-plugins-aggregator ---
[INFO]
[INFO] --- maven-install-plugin:2.5.1:install (default-install) @ maven-plugins-aggregator ---
[INFO] Installing <https://builds.apache.org/job/maven-plugins-ITs-m3-windows/ws/pom.xml> to C:\Users\jenkins\.m2\repository\org\apache\maven\plugins\maven-plugins-aggregator\1-SNAPSHOT\maven-plugins-aggregator-1-SNAPSHOT.pom
[INFO] ------------------------------------------------------------------------
[INFO] Reactor Summary:
[INFO]
[INFO] Apache Maven ACR Plugin ............................ SUCCESS [ 55.596 s]
[INFO] Apache Maven AntRun Plugin ......................... SUCCESS [02:51 min]
[INFO] Apache Maven Changelog Plugin ...................... SUCCESS [01:25 min]
[INFO] Apache Maven Changes Plugin ........................ SUCCESS [02:17 min]
[INFO] Apache Maven Clean Plugin .......................... SUCCESS [ 53.085 s]
[INFO] Apache Maven Compiler Plugin ....................... SUCCESS [04:00 min]
[INFO] Apache Maven Deploy Plugin ......................... SUCCESS [03:46 min]
[INFO] Apache Maven Documentation Checker Plugin .......... SUCCESS [ 13.087 s]
[INFO] Apache Maven EAR Plugin ............................ FAILURE [10:09 min]
[INFO] Apache Maven EJB Plugin ............................ SUCCESS [01:12 min]
[INFO] Apache Maven Help Plugin ........................... SUCCESS [03:24 min]
[INFO] Apache Maven Install Plugin ........................ SUCCESS [03:05 min]
[INFO] Apache Maven Jarsigner Plugin ...................... SUCCESS [01:16 min]
[INFO] Apache Maven JDeps Plugin .......................... SUCCESS [  3.758 s]
[INFO] Apache Maven Linkcheck Plugin ...................... SUCCESS [  6.568 s]
[INFO] Apache Maven Patch Plugin .......................... SUCCESS [ 10.546 s]
[INFO] Apache Maven PDF Plugin ............................ SUCCESS [01:13 min]
[INFO] Apache Maven RAR Plugin ............................ SUCCESS [ 21.053 s]
[INFO] Apache Maven Repository Plugin ..................... SUCCESS [ 45.309 s]
[INFO] Apache Maven Resources Plugin ...................... SUCCESS [02:24 min]
[INFO] Apache Maven Site Plugin ........................... SUCCESS [11:38 min]
[INFO] Apache Maven Source Plugin ......................... SUCCESS [01:45 min]
[INFO] Apache Maven Stage Plugin .......................... SUCCESS [  4.275 s]
[INFO] Apache Maven Toolchains Plugin ..................... SUCCESS [ 27.939 s]
[INFO] Apache Maven Verifier Plugin ....................... SUCCESS [ 18.065 s]
[INFO] Apache Maven WAR Plugin ............................ SUCCESS [03:11 min]
[INFO] Apache Maven DOAP Plugin ........................... SUCCESS [ 35.564 s]
[INFO] Apache Maven Invoker Plugin ........................ SUCCESS [12:09 min]
[INFO] Apache Maven JAR Plugin ............................ SUCCESS [03:11 min]
[INFO] Apache Maven Assembly Plugin ....................... SUCCESS [20:04 min]
[INFO] Apache Maven Checkstyle Plugin ..................... SUCCESS [08:20 min]
[INFO] Apache Maven Javadoc Plugin ........................ SUCCESS [10:16 min]
[INFO] Apache Maven PMD Plugin ............................ SUCCESS [04:20 min]
[INFO] Apache Maven JLink Plugin .......................... SUCCESS [  8.696 s]
[INFO] Apache Maven JMod Plugin ........................... SUCCESS [  4.386 s]
[INFO] Apache Maven Project Info Reports Plugin ........... SUCCESS [03:54 min]
[INFO] Apache Maven Remote Resources Plugin ............... SUCCESS [01:54 min]
[INFO] Apache Maven Shade Plugin .......................... SUCCESS [07:56 min]
[INFO] Apache Maven SCM Publish Plugin .................... SUCCESS [01:32 min]
[INFO] Apache Maven Dependency Plugin ..................... SUCCESS [08:46 min]
[INFO] Apache Maven Plugins Aggregator .................... SUCCESS [  0.955 s]
[INFO] ------------------------------------------------------------------------
[INFO] BUILD FAILURE
[INFO] ------------------------------------------------------------------------
[INFO] Total time: 02:21 h
[INFO] Finished at: 2017-09-27T00:56:21+00:00
[INFO] Final Memory: 161M/619M
[INFO] ------------------------------------------------------------------------
[WARNING] The requested profile "apache.snapshots" could not be activated because it does not exist.
[ERROR] Failed to execute goal org.apache.maven.plugins:maven-invoker-plugin:2.0.0:verify (integration-test) on project maven-ear-plugin: 1 build failed. See console output above for details. -> [Help 1]
[ERROR]
[ERROR] To see the full stack trace of the errors, re-run Maven with the -e switch.
[ERROR] Re-run Maven using the -X switch to enable full debug logging.
[ERROR]
[ERROR] For more information about the errors and possible solutions, please read the following articles:
[ERROR] [Help 1] http://cwiki.apache.org/confluence/display/MAVEN/MojoFailureException
[ERROR]
[ERROR] After correcting the problems, you can resume the build with the command
[ERROR]   mvn <goals> -rf :maven-ear-plugin
Build step 'Invoke top-level Maven targets' marked build as failure
Deleting 1 temporary files
Recording test results
Reply | Threaded
Open this post in threaded view
|

Build failed in Jenkins: maven-plugins-ITs-m3-windows #2004

Apache Jenkins Server-2
See <https://builds.apache.org/job/maven-plugins-ITs-m3-windows/2004/display/redirect?page=changes>

Changes:

[khmarbaise] [maven-release-plugin] prepare for next development iteration

[khmarbaise] [maven-release-plugin] prepare release maven-war-plugin-3.2.0

------------------------------------------
[...truncated 3.37 MB...]
[INFO] Building: copy-from-reactor\pom.xml
[INFO] run script verify.bsh
[INFO] ..SUCCESS (8.2 s)
[INFO] Building: copy-from-remote-repository\pom.xml
[INFO] run script setup.bsh
[INFO] artifact org.apache.maven.its.dependency.fake-remote-copy:1.0: checking for updates from central
[INFO] run script verify.bsh
[INFO] ..SUCCESS (8.5 s)
[INFO] Building: dependency-properties\pom.xml
[INFO] run script verify.bsh
[INFO] ..SUCCESS (7.0 s)
[INFO] Building: filterunpack\pom.xml
[INFO] run script verify.groovy
[INFO] ..SUCCESS (7.0 s)
[INFO] Building: get-artifact\pom.xml
[INFO] run script setup.bsh
[INFO] run script verify.bsh
[INFO] ..SUCCESS (6.6 s)
[INFO] Building: get-artifact-maven-plugin\pom.xml
[INFO] run script setup.bsh
[INFO] run script verify.bsh
[INFO] ..SUCCESS (6.8 s)
[INFO] Building: get-artifact-no-transitive\pom.xml
[INFO] run script setup.bsh
[INFO] run script verify.bsh
[INFO] ..SUCCESS (6.9 s)
[INFO] Building: get-gav\pom.xml
[INFO] run script setup.bsh
[INFO] run script verify.bsh
[INFO] ..SUCCESS (6.8 s)
[INFO] Building: go-offline\pom.xml
[INFO] ..SUCCESS (8.5 s)
[INFO] Building: list-repositories\pom.xml
[INFO] snapshot org.apache.maven.its.dependency:test:1.0-SNAPSHOT: checking for updates from apache.snapshots
[INFO] artifact org.apache.maven.its.dependency.test:1.0-SNAPSHOT: checking for updates from central
[INFO] ..SUCCESS (7.1 s)
[INFO] Building: mdep-439-analyze-java8\pom.xml
[INFO] ..SKIPPED due to JRE version
[INFO] Building: mdep-450-project-with-ancestor\pom.xml
[INFO] run script verify.groovy
[INFO] ..SUCCESS (6.7 s)
[INFO] Building: mdep-450-project-without-ancestor\pom.xml
[INFO] run script verify.groovy
[INFO] ..SUCCESS (6.6 s)
[INFO] Building: mdep-506-dependency-without-version-in-depmgt\pom.xml
[INFO] ..SUCCESS (7.9 s)
[INFO] Building: mdep-571-resolve-java9\pom.xml
[INFO] ..SKIPPED due to JRE version
[INFO] Building: mdep-572-unpack-tar-long-file\pom.xml
[INFO] run script verify.bsh
[INFO] ..SUCCESS (8.1 s)
[INFO] Building: mdep-578_display-reason-invalid-module\pom.xml
[INFO] ..SKIPPED due to JRE version
[INFO] Building: mdep-580_display-manifest-automodules\pom.xml
[INFO] ..SKIPPED due to JRE version
[INFO] Building: purge-local-repository\pom.xml
[INFO] run script setup.bsh
[INFO] artifact org.apache.maven.its.dependency.purged:1.0: checking for updates from central
[INFO] run script verify.bsh
[INFO] ..SUCCESS (6.8 s)
[INFO] Building: purge-local-repository-bad-dep\pom.xml
[INFO] snapshot org.apache.maven.its.dependency:purge-local-repository-bad-dep:1.0-SNAPSHOT: checking for updates from apache.snapshots
[INFO] artifact org.apache.maven.its.dependency.purge-local-repository-bad-dep:1.0-SNAPSHOT: checking for updates from central
[INFO] artifact org.apache.maven.its.dependency.i-do-not-exist:1.0: checking for updates from central
[INFO] run script verify.groovy
[INFO] ..SUCCESS (7.1 s)
[INFO] Building: purge-local-repository-include\pom.xml
[INFO] snapshot org.apache.maven.its.dependency:purge-local-repository-include:1.0-SNAPSHOT: checking for updates from apache.snapshots
[INFO] artifact org.apache.maven.its.dependency.purge-local-repository-include:1.0-SNAPSHOT: checking for updates from central
[INFO] run script verify.groovy
[INFO] ..SUCCESS (6.9 s)
[INFO] Building: purge-local-repository-multi-module\pom.xml
[INFO] run script setup.bsh
[INFO] snapshot org.apache.maven.its.dependency:child1:1.0-SNAPSHOT: checking for updates from apache.snapshots
[INFO] artifact org.apache.maven.its.dependency.child1:1.0-SNAPSHOT: checking for updates from central
[INFO] artifact org.apache.maven.its.dependency.purged-a:1.0: checking for updates from central
[INFO] snapshot org.apache.maven.its.dependency:child2:1.0-SNAPSHOT: checking for updates from apache.snapshots
[INFO] artifact org.apache.maven.its.dependency.child2:1.0-SNAPSHOT: checking for updates from central
[INFO] artifact org.apache.maven.its.dependency.purged-b:1.0: checking for updates from central
[INFO] run script verify.bsh
[INFO] ..SUCCESS (7.6 s)
[INFO] Building: purge-local-repository-multi-module-execution\pom.xml
[INFO] run script setup.bsh
[INFO] run script verify.bsh
[INFO] ..SUCCESS (7.7 s)
[INFO] Building: purge-local-repository-non-transitive\pom.xml
[INFO] run script verify.bsh
[INFO] ..SUCCESS (6.9 s)
[INFO] Building: purge-local-repository-reresolve\pom.xml
[INFO] run script verify.bsh
[INFO] ..SUCCESS (7.0 s)
[INFO] Building: purge-local-repository-snapshots-only\pom.xml
[INFO] run script setup.bsh
[INFO] snapshot org.apache.maven.its.dependency:snap-purged:1.0-SNAPSHOT: checking for updates from apache.snapshots
[INFO] artifact org.apache.maven.its.dependency.snap-purged:1.0-SNAPSHOT: checking for updates from central
[INFO] run script verify.bsh
[INFO] ..SUCCESS (7.8 s)
[INFO] Building: purge-local-repository-version-range\pom.xml
[INFO] artifact org.apache.maven.its.dependency:purge-local-repository: checking for updates from central
[INFO] artifact org.apache.maven.its.dependency:purge-local-repository: checking for updates from central
[INFO] run script verify.bsh
[INFO] ..SUCCESS (7.2 s)
[INFO] Building: resolve\pom.xml
[INFO] ..SUCCESS (6.7 s)
[INFO] Building: resolve-plugins\pom.xml
[INFO] ..SUCCESS (7.5 s)
[INFO] Building: resolve-plugins-exclude-reactor\pom.xml
[INFO] run script verify.groovy
[INFO] ..SUCCESS (8.8 s)
[INFO] Building: resolve-plugins-with-exclude\pom.xml
[INFO] run script verify.groovy
[INFO] ..SUCCESS (7.8 s)
[INFO] Building: sources\pom.xml
[INFO] artifact classworlds.classworlds:1.1-alpha-2: checking for updates from central
[INFO] ..SUCCESS (7.4 s)
[INFO] Building: tree\pom.xml
[INFO] run script verify.bsh
[INFO] ..SUCCESS (6.9 s)
[INFO] Building: tree-includes\pom.xml
[INFO] run script verify.bsh
[INFO] ..SUCCESS (7.0 s)
[INFO] Building: tree-multimodule\pom.xml
[INFO] snapshot org.apache.maven.its.dependency:tree-multimodule-module-a:1.0-SNAPSHOT: checking for updates from apache.snapshots
[INFO] artifact org.apache.maven.its.dependency.tree-multimodule-module-a:1.0-SNAPSHOT: checking for updates from central
[INFO] run script verify.bsh
[INFO] ..SUCCESS (8.1 s)
[INFO] Building: unpack\pom.xml
[INFO] run script verify.bsh
[INFO] ..SUCCESS (8.3 s)
[INFO] Building: unpack-cli\pom.xml
[INFO] run script verify.bsh
[INFO] ..SUCCESS (6.9 s)
[INFO] Building: unpack-custom-ear\pom.xml
[INFO] run script verify.groovy
[INFO] ..SUCCESS (7.2 s)
[INFO] Building: unpack-dependencies\pom.xml
[INFO] run script verify.groovy
[INFO] ..SUCCESS (8.6 s)
[INFO] Building: unpack-from-remote-repository\pom.xml
[INFO] run script setup.bsh
[INFO] artifact org.apache.maven.its.dependency.fake-remote-unpack:1.0: checking for updates from central
[INFO] run script verify.bsh
[INFO] ..SUCCESS (8.4 s)
[INFO] Building: used-dependencies\pom.xml
[INFO] ..SUCCESS (8.9 s)
[INFO] Building: purge-local-repository-without-pom
[INFO] run script setup.bsh
[INFO] run script verify.bsh
[INFO] ..SUCCESS (6.9 s)
[INFO]
[INFO] --- mrm-maven-plugin:1.0.0:stop (default) @ maven-dependency-plugin ---
[INFO] Stopping Mock Repository Manager on http://localhost:50774
[INFO] Mock Repository Manager http://localhost:50774 is stopped.
[INFO]
[INFO] --- maven-checkstyle-plugin:2.15:check (checkstyle-check) @ maven-dependency-plugin ---
[INFO] There is 1 error reported by Checkstyle 6.1.1 with config/maven_checks.xml ruleset.
[INFO] Ignored 1 error, 0 violation remaining.
[INFO]
[INFO] --- maven-invoker-plugin:2.0.0:verify (integration-test) @ maven-dependency-plugin ---
[INFO] -------------------------------------------------
[INFO] Build Summary:
[INFO]   Passed: 53, Failed: 0, Errors: 0, Skipped: 4
[INFO] -------------------------------------------------
[INFO]
[INFO] --- maven-install-plugin:2.5.2:install (default-install) @ maven-dependency-plugin ---
[INFO] Installing F:\jenkins\jenkins-slave\workspace\maven-plugins-ITs-m3-windows\maven-dependency-plugin\target\maven-dependency-plugin-3.0.3-SNAPSHOT.jar to C:\Users\jenkins\.m2\repository\org\apache\maven\plugins\maven-dependency-plugin\3.0.3-SNAPSHOT\maven-dependency-plugin-3.0.3-SNAPSHOT.jar
[INFO] Installing F:\jenkins\jenkins-slave\workspace\maven-plugins-ITs-m3-windows\maven-dependency-plugin\pom.xml to C:\Users\jenkins\.m2\repository\org\apache\maven\plugins\maven-dependency-plugin\3.0.3-SNAPSHOT\maven-dependency-plugin-3.0.3-SNAPSHOT.pom
[INFO]                                                                        
[INFO] ------------------------------------------------------------------------
[INFO] Building Apache Maven Plugins Aggregator 1-SNAPSHOT
[INFO] ------------------------------------------------------------------------
[INFO]
[INFO] --- maven-clean-plugin:2.5:clean (default-clean) @ maven-plugins-aggregator ---
[INFO]
[INFO] --- maven-enforcer-plugin:1.3.1:enforce (enforce-bytecode-version) @ maven-plugins-aggregator ---
[INFO]
[INFO] --- maven-enforcer-plugin:1.3.1:enforce (ban-known-bad-maven-versions) @ maven-plugins-aggregator ---
[INFO]
[INFO] --- maven-remote-resources-plugin:1.5:process (default) @ maven-plugins-aggregator ---
[INFO]
[INFO] --- maven-site-plugin:3.3:attach-descriptor (attach-descriptor) @ maven-plugins-aggregator ---
[INFO]
[INFO] --- maven-install-plugin:2.5.1:install (default-install) @ maven-plugins-aggregator ---
[INFO] Installing <https://builds.apache.org/job/maven-plugins-ITs-m3-windows/ws/pom.xml> to C:\Users\jenkins\.m2\repository\org\apache\maven\plugins\maven-plugins-aggregator\1-SNAPSHOT\maven-plugins-aggregator-1-SNAPSHOT.pom
[INFO] ------------------------------------------------------------------------
[INFO] Reactor Summary:
[INFO]
[INFO] Apache Maven ACR Plugin ............................ SUCCESS [ 56.331 s]
[INFO] Apache Maven AntRun Plugin ......................... SUCCESS [02:53 min]
[INFO] Apache Maven Changelog Plugin ...................... SUCCESS [01:14 min]
[INFO] Apache Maven Changes Plugin ........................ SUCCESS [02:06 min]
[INFO] Apache Maven Clean Plugin .......................... SUCCESS [ 50.960 s]
[INFO] Apache Maven Compiler Plugin ....................... SUCCESS [03:59 min]
[INFO] Apache Maven Deploy Plugin ......................... SUCCESS [03:39 min]
[INFO] Apache Maven Documentation Checker Plugin .......... SUCCESS [  9.663 s]
[INFO] Apache Maven EAR Plugin ............................ FAILURE [10:14 min]
[INFO] Apache Maven EJB Plugin ............................ SUCCESS [01:13 min]
[INFO] Apache Maven Help Plugin ........................... SUCCESS [03:24 min]
[INFO] Apache Maven Install Plugin ........................ SUCCESS [03:06 min]
[INFO] Apache Maven Jarsigner Plugin ...................... SUCCESS [01:20 min]
[INFO] Apache Maven JDeps Plugin .......................... SUCCESS [  3.935 s]
[INFO] Apache Maven Linkcheck Plugin ...................... SUCCESS [  5.856 s]
[INFO] Apache Maven Patch Plugin .......................... SUCCESS [ 10.546 s]
[INFO] Apache Maven PDF Plugin ............................ SUCCESS [ 43.731 s]
[INFO] Apache Maven RAR Plugin ............................ SUCCESS [ 21.016 s]
[INFO] Apache Maven Repository Plugin ..................... SUCCESS [ 46.971 s]
[INFO] Apache Maven Resources Plugin ...................... SUCCESS [02:26 min]
[INFO] Apache Maven Site Plugin ........................... SUCCESS [11:34 min]
[INFO] Apache Maven Source Plugin ......................... SUCCESS [01:46 min]
[INFO] Apache Maven Stage Plugin .......................... SUCCESS [  4.262 s]
[INFO] Apache Maven Toolchains Plugin ..................... SUCCESS [ 27.378 s]
[INFO] Apache Maven Verifier Plugin ....................... SUCCESS [ 17.637 s]
[INFO] Apache Maven WAR Plugin ............................ SUCCESS [03:13 min]
[INFO] Apache Maven DOAP Plugin ........................... SUCCESS [ 35.912 s]
[INFO] Apache Maven Invoker Plugin ........................ SUCCESS [12:05 min]
[INFO] Apache Maven JAR Plugin ............................ SUCCESS [03:10 min]
[INFO] Apache Maven Assembly Plugin ....................... SUCCESS [19:55 min]
[INFO] Apache Maven Checkstyle Plugin ..................... SUCCESS [08:37 min]
[INFO] Apache Maven Javadoc Plugin ........................ SUCCESS [10:47 min]
[INFO] Apache Maven PMD Plugin ............................ SUCCESS [04:42 min]
[INFO] Apache Maven JLink Plugin .......................... SUCCESS [  7.265 s]
[INFO] Apache Maven JMod Plugin ........................... SUCCESS [  4.302 s]
[INFO] Apache Maven Project Info Reports Plugin ........... SUCCESS [04:14 min]
[INFO] Apache Maven Remote Resources Plugin ............... SUCCESS [01:54 min]
[INFO] Apache Maven Shade Plugin .......................... SUCCESS [07:51 min]
[INFO] Apache Maven SCM Publish Plugin .................... SUCCESS [01:14 min]
[INFO] Apache Maven Dependency Plugin ..................... SUCCESS [07:56 min]
[INFO] Apache Maven Plugins Aggregator .................... SUCCESS [  1.012 s]
[INFO] ------------------------------------------------------------------------
[INFO] BUILD FAILURE
[INFO] ------------------------------------------------------------------------
[INFO] Total time: 02:20 h
[INFO] Finished at: 2017-09-30T18:55:17+00:00
[INFO] Final Memory: 160M/582M
[INFO] ------------------------------------------------------------------------
[WARNING] The requested profile "apache.snapshots" could not be activated because it does not exist.
[ERROR] Failed to execute goal org.apache.maven.plugins:maven-invoker-plugin:2.0.0:verify (integration-test) on project maven-ear-plugin: 1 build failed. See console output above for details. -> [Help 1]
[ERROR]
[ERROR] To see the full stack trace of the errors, re-run Maven with the -e switch.
[ERROR] Re-run Maven using the -X switch to enable full debug logging.
[ERROR]
[ERROR] For more information about the errors and possible solutions, please read the following articles:
[ERROR] [Help 1] http://cwiki.apache.org/confluence/display/MAVEN/MojoFailureException
[ERROR]
[ERROR] After correcting the problems, you can resume the build with the command
[ERROR]   mvn <goals> -rf :maven-ear-plugin
Build step 'Invoke top-level Maven targets' marked build as failure
Deleting 1 temporary files
Recording test results
Reply | Threaded
Open this post in threaded view
|

Build failed in Jenkins: maven-plugins-ITs-m3-windows #2005

Apache Jenkins Server-2
See <https://builds.apache.org/job/maven-plugins-ITs-m3-windows/2005/display/redirect?page=changes>

Changes:

[hboutemy] [MSITE-797] simplify stacktrace in case of report plugin execution failure

------------------------------------------
[...truncated 3.38 MB...]
[INFO] Building: copy-from-reactor\pom.xml
[INFO] run script verify.bsh
[INFO] ..SUCCESS (7.8 s)
[INFO] Building: copy-from-remote-repository\pom.xml
[INFO] run script setup.bsh
[INFO] artifact org.apache.maven.its.dependency.fake-remote-copy:1.0: checking for updates from central
[INFO] run script verify.bsh
[INFO] ..SUCCESS (8.1 s)
[INFO] Building: dependency-properties\pom.xml
[INFO] run script verify.bsh
[INFO] ..SUCCESS (6.6 s)
[INFO] Building: filterunpack\pom.xml
[INFO] run script verify.groovy
[INFO] ..SUCCESS (6.5 s)
[INFO] Building: get-artifact\pom.xml
[INFO] run script setup.bsh
[INFO] run script verify.bsh
[INFO] ..SUCCESS (6.5 s)
[INFO] Building: get-artifact-maven-plugin\pom.xml
[INFO] run script setup.bsh
[INFO] run script verify.bsh
[INFO] ..SUCCESS (6.4 s)
[INFO] Building: get-artifact-no-transitive\pom.xml
[INFO] run script setup.bsh
[INFO] run script verify.bsh
[INFO] ..SUCCESS (6.5 s)
[INFO] Building: get-gav\pom.xml
[INFO] run script setup.bsh
[INFO] run script verify.bsh
[INFO] ..SUCCESS (6.3 s)
[INFO] Building: go-offline\pom.xml
[INFO] ..SUCCESS (8.4 s)
[INFO] Building: list-repositories\pom.xml
[INFO] snapshot org.apache.maven.its.dependency:test:1.0-SNAPSHOT: checking for updates from apache.snapshots
[INFO] artifact org.apache.maven.its.dependency.test:1.0-SNAPSHOT: checking for updates from central
[INFO] ..SUCCESS (6.7 s)
[INFO] Building: mdep-439-analyze-java8\pom.xml
[INFO] ..SKIPPED due to JRE version
[INFO] Building: mdep-450-project-with-ancestor\pom.xml
[INFO] run script verify.groovy
[INFO] ..SUCCESS (6.7 s)
[INFO] Building: mdep-450-project-without-ancestor\pom.xml
[INFO] run script verify.groovy
[INFO] ..SUCCESS (6.3 s)
[INFO] Building: mdep-506-dependency-without-version-in-depmgt\pom.xml
[INFO] ..SUCCESS (7.6 s)
[INFO] Building: mdep-571-resolve-java9\pom.xml
[INFO] ..SKIPPED due to JRE version
[INFO] Building: mdep-572-unpack-tar-long-file\pom.xml
[INFO] run script verify.bsh
[INFO] ..SUCCESS (7.8 s)
[INFO] Building: mdep-578_display-reason-invalid-module\pom.xml
[INFO] ..SKIPPED due to JRE version
[INFO] Building: mdep-580_display-manifest-automodules\pom.xml
[INFO] ..SKIPPED due to JRE version
[INFO] Building: purge-local-repository\pom.xml
[INFO] run script setup.bsh
[INFO] artifact org.apache.maven.its.dependency.purged:1.0: checking for updates from central
[INFO] run script verify.bsh
[INFO] ..SUCCESS (6.6 s)
[INFO] Building: purge-local-repository-bad-dep\pom.xml
[INFO] snapshot org.apache.maven.its.dependency:purge-local-repository-bad-dep:1.0-SNAPSHOT: checking for updates from apache.snapshots
[INFO] artifact org.apache.maven.its.dependency.purge-local-repository-bad-dep:1.0-SNAPSHOT: checking for updates from central
[INFO] artifact org.apache.maven.its.dependency.i-do-not-exist:1.0: checking for updates from central
[INFO] run script verify.groovy
[INFO] ..SUCCESS (7.0 s)
[INFO] Building: purge-local-repository-include\pom.xml
[INFO] snapshot org.apache.maven.its.dependency:purge-local-repository-include:1.0-SNAPSHOT: checking for updates from apache.snapshots
[INFO] artifact org.apache.maven.its.dependency.purge-local-repository-include:1.0-SNAPSHOT: checking for updates from central
[INFO] run script verify.groovy
[INFO] ..SUCCESS (6.8 s)
[INFO] Building: purge-local-repository-multi-module\pom.xml
[INFO] run script setup.bsh
[INFO] snapshot org.apache.maven.its.dependency:child1:1.0-SNAPSHOT: checking for updates from apache.snapshots
[INFO] artifact org.apache.maven.its.dependency.child1:1.0-SNAPSHOT: checking for updates from central
[INFO] artifact org.apache.maven.its.dependency.purged-a:1.0: checking for updates from central
[INFO] snapshot org.apache.maven.its.dependency:child2:1.0-SNAPSHOT: checking for updates from apache.snapshots
[INFO] artifact org.apache.maven.its.dependency.child2:1.0-SNAPSHOT: checking for updates from central
[INFO] artifact org.apache.maven.its.dependency.purged-b:1.0: checking for updates from central
[INFO] run script verify.bsh
[INFO] ..SUCCESS (7.4 s)
[INFO] Building: purge-local-repository-multi-module-execution\pom.xml
[INFO] run script setup.bsh
[INFO] run script verify.bsh
[INFO] ..SUCCESS (7.4 s)
[INFO] Building: purge-local-repository-non-transitive\pom.xml
[INFO] run script verify.bsh
[INFO] ..SUCCESS (6.6 s)
[INFO] Building: purge-local-repository-reresolve\pom.xml
[INFO] run script verify.bsh
[INFO] ..SUCCESS (6.7 s)
[INFO] Building: purge-local-repository-snapshots-only\pom.xml
[INFO] run script setup.bsh
[INFO] snapshot org.apache.maven.its.dependency:snap-purged:1.0-SNAPSHOT: checking for updates from apache.snapshots
[INFO] artifact org.apache.maven.its.dependency.snap-purged:1.0-SNAPSHOT: checking for updates from central
[INFO] run script verify.bsh
[INFO] ..SUCCESS (7.4 s)
[INFO] Building: purge-local-repository-version-range\pom.xml
[INFO] artifact org.apache.maven.its.dependency:purge-local-repository: checking for updates from central
[INFO] artifact org.apache.maven.its.dependency:purge-local-repository: checking for updates from central
[INFO] run script verify.bsh
[INFO] ..SUCCESS (6.8 s)
[INFO] Building: resolve\pom.xml
[INFO] ..SUCCESS (6.5 s)
[INFO] Building: resolve-plugins\pom.xml
[INFO] ..SUCCESS (7.4 s)
[INFO] Building: resolve-plugins-exclude-reactor\pom.xml
[INFO] run script verify.groovy
[INFO] ..SUCCESS (8.3 s)
[INFO] Building: resolve-plugins-with-exclude\pom.xml
[INFO] run script verify.groovy
[INFO] ..SUCCESS (7.3 s)
[INFO] Building: sources\pom.xml
[INFO] artifact classworlds.classworlds:1.1-alpha-2: checking for updates from central
[INFO] ..SUCCESS (6.9 s)
[INFO] Building: tree\pom.xml
[INFO] run script verify.bsh
[INFO] ..SUCCESS (6.4 s)
[INFO] Building: tree-includes\pom.xml
[INFO] run script verify.bsh
[INFO] ..SUCCESS (6.6 s)
[INFO] Building: tree-multimodule\pom.xml
[INFO] snapshot org.apache.maven.its.dependency:tree-multimodule-module-a:1.0-SNAPSHOT: checking for updates from apache.snapshots
[INFO] artifact org.apache.maven.its.dependency.tree-multimodule-module-a:1.0-SNAPSHOT: checking for updates from central
[INFO] run script verify.bsh
[INFO] ..SUCCESS (7.7 s)
[INFO] Building: unpack\pom.xml
[INFO] run script verify.bsh
[INFO] ..SUCCESS (7.9 s)
[INFO] Building: unpack-cli\pom.xml
[INFO] run script verify.bsh
[INFO] ..SUCCESS (6.5 s)
[INFO] Building: unpack-custom-ear\pom.xml
[INFO] run script verify.groovy
[INFO] ..SUCCESS (7.0 s)
[INFO] Building: unpack-dependencies\pom.xml
[INFO] run script verify.groovy
[INFO] ..SUCCESS (8.3 s)
[INFO] Building: unpack-from-remote-repository\pom.xml
[INFO] run script setup.bsh
[INFO] artifact org.apache.maven.its.dependency.fake-remote-unpack:1.0: checking for updates from central
[INFO] run script verify.bsh
[INFO] ..SUCCESS (8.0 s)
[INFO] Building: used-dependencies\pom.xml
[INFO] ..SUCCESS (8.2 s)
[INFO] Building: purge-local-repository-without-pom
[INFO] run script setup.bsh
[INFO] run script verify.bsh
[INFO] ..SUCCESS (6.5 s)
[INFO]
[INFO] --- mrm-maven-plugin:1.0.0:stop (default) @ maven-dependency-plugin ---
[INFO] Stopping Mock Repository Manager on http://localhost:52307
[INFO] Mock Repository Manager http://localhost:52307 is stopped.
[INFO]
[INFO] --- maven-checkstyle-plugin:2.15:check (checkstyle-check) @ maven-dependency-plugin ---
[INFO] There is 1 error reported by Checkstyle 6.1.1 with config/maven_checks.xml ruleset.
[INFO] Ignored 1 error, 0 violation remaining.
[INFO]
[INFO] --- maven-invoker-plugin:2.0.0:verify (integration-test) @ maven-dependency-plugin ---
[INFO] -------------------------------------------------
[INFO] Build Summary:
[INFO]   Passed: 53, Failed: 0, Errors: 0, Skipped: 4
[INFO] -------------------------------------------------
[INFO]
[INFO] --- maven-install-plugin:2.5.2:install (default-install) @ maven-dependency-plugin ---
[INFO] Installing F:\jenkins\jenkins-slave\workspace\maven-plugins-ITs-m3-windows\maven-dependency-plugin\target\maven-dependency-plugin-3.0.3-SNAPSHOT.jar to C:\Users\jenkins\.m2\repository\org\apache\maven\plugins\maven-dependency-plugin\3.0.3-SNAPSHOT\maven-dependency-plugin-3.0.3-SNAPSHOT.jar
[INFO] Installing F:\jenkins\jenkins-slave\workspace\maven-plugins-ITs-m3-windows\maven-dependency-plugin\pom.xml to C:\Users\jenkins\.m2\repository\org\apache\maven\plugins\maven-dependency-plugin\3.0.3-SNAPSHOT\maven-dependency-plugin-3.0.3-SNAPSHOT.pom
[INFO]                                                                        
[INFO] ------------------------------------------------------------------------
[INFO] Building Apache Maven Plugins Aggregator 1-SNAPSHOT
[INFO] ------------------------------------------------------------------------
[INFO]
[INFO] --- maven-clean-plugin:2.5:clean (default-clean) @ maven-plugins-aggregator ---
[INFO]
[INFO] --- maven-enforcer-plugin:1.3.1:enforce (enforce-bytecode-version) @ maven-plugins-aggregator ---
[INFO]
[INFO] --- maven-enforcer-plugin:1.3.1:enforce (ban-known-bad-maven-versions) @ maven-plugins-aggregator ---
[INFO]
[INFO] --- maven-remote-resources-plugin:1.5:process (default) @ maven-plugins-aggregator ---
[INFO]
[INFO] --- maven-site-plugin:3.3:attach-descriptor (attach-descriptor) @ maven-plugins-aggregator ---
[INFO]
[INFO] --- maven-install-plugin:2.5.1:install (default-install) @ maven-plugins-aggregator ---
[INFO] Installing <https://builds.apache.org/job/maven-plugins-ITs-m3-windows/ws/pom.xml> to C:\Users\jenkins\.m2\repository\org\apache\maven\plugins\maven-plugins-aggregator\1-SNAPSHOT\maven-plugins-aggregator-1-SNAPSHOT.pom
[INFO] ------------------------------------------------------------------------
[INFO] Reactor Summary:
[INFO]
[INFO] Apache Maven ACR Plugin ............................ SUCCESS [ 48.533 s]
[INFO] Apache Maven AntRun Plugin ......................... SUCCESS [02:50 min]
[INFO] Apache Maven Changelog Plugin ...................... SUCCESS [01:18 min]
[INFO] Apache Maven Changes Plugin ........................ SUCCESS [02:13 min]
[INFO] Apache Maven Clean Plugin .......................... SUCCESS [ 51.741 s]
[INFO] Apache Maven Compiler Plugin ....................... SUCCESS [04:36 min]
[INFO] Apache Maven Deploy Plugin ......................... SUCCESS [04:15 min]
[INFO] Apache Maven Documentation Checker Plugin .......... SUCCESS [ 11.663 s]
[INFO] Apache Maven EAR Plugin ............................ FAILURE [11:29 min]
[INFO] Apache Maven EJB Plugin ............................ SUCCESS [01:31 min]
[INFO] Apache Maven Help Plugin ........................... SUCCESS [04:03 min]
[INFO] Apache Maven Install Plugin ........................ SUCCESS [03:29 min]
[INFO] Apache Maven Jarsigner Plugin ...................... SUCCESS [01:27 min]
[INFO] Apache Maven JDeps Plugin .......................... SUCCESS [  4.268 s]
[INFO] Apache Maven Linkcheck Plugin ...................... SUCCESS [  5.661 s]
[INFO] Apache Maven Patch Plugin .......................... SUCCESS [ 12.166 s]
[INFO] Apache Maven PDF Plugin ............................ SUCCESS [01:37 min]
[INFO] Apache Maven RAR Plugin ............................ SUCCESS [ 25.450 s]
[INFO] Apache Maven Repository Plugin ..................... SUCCESS [ 54.560 s]
[INFO] Apache Maven Resources Plugin ...................... SUCCESS [02:44 min]
[INFO] Apache Maven Site Plugin ........................... SUCCESS [12:18 min]
[INFO] Apache Maven Source Plugin ......................... SUCCESS [01:44 min]
[INFO] Apache Maven Stage Plugin .......................... SUCCESS [  4.201 s]
[INFO] Apache Maven Toolchains Plugin ..................... SUCCESS [ 26.051 s]
[INFO] Apache Maven Verifier Plugin ....................... SUCCESS [ 16.643 s]
[INFO] Apache Maven WAR Plugin ............................ SUCCESS [03:09 min]
[INFO] Apache Maven DOAP Plugin ........................... SUCCESS [ 33.359 s]
[INFO] Apache Maven Invoker Plugin ........................ SUCCESS [11:54 min]
[INFO] Apache Maven JAR Plugin ............................ SUCCESS [03:08 min]
[INFO] Apache Maven Assembly Plugin ....................... SUCCESS [18:41 min]
[INFO] Apache Maven Checkstyle Plugin ..................... SUCCESS [07:10 min]
[INFO] Apache Maven Javadoc Plugin ........................ SUCCESS [09:06 min]
[INFO] Apache Maven PMD Plugin ............................ SUCCESS [03:37 min]
[INFO] Apache Maven JLink Plugin .......................... SUCCESS [  7.625 s]
[INFO] Apache Maven JMod Plugin ........................... SUCCESS [  4.891 s]
[INFO] Apache Maven Project Info Reports Plugin ........... SUCCESS [03:32 min]
[INFO] Apache Maven Remote Resources Plugin ............... SUCCESS [01:44 min]
[INFO] Apache Maven Shade Plugin .......................... SUCCESS [06:54 min]
[INFO] Apache Maven SCM Publish Plugin .................... SUCCESS [01:18 min]
[INFO] Apache Maven Dependency Plugin ..................... SUCCESS [07:42 min]
[INFO] Apache Maven Plugins Aggregator .................... SUCCESS [  1.016 s]
[INFO] ------------------------------------------------------------------------
[INFO] BUILD FAILURE
[INFO] ------------------------------------------------------------------------
[INFO] Total time: 02:18 h
[INFO] Finished at: 2017-10-01T08:52:03+00:00
[INFO] Final Memory: 162M/493M
[INFO] ------------------------------------------------------------------------
[WARNING] The requested profile "apache.snapshots" could not be activated because it does not exist.
[ERROR] Failed to execute goal org.apache.maven.plugins:maven-invoker-plugin:2.0.0:verify (integration-test) on project maven-ear-plugin: 1 build failed. See console output above for details. -> [Help 1]
[ERROR]
[ERROR] To see the full stack trace of the errors, re-run Maven with the -e switch.
[ERROR] Re-run Maven using the -X switch to enable full debug logging.
[ERROR]
[ERROR] For more information about the errors and possible solutions, please read the following articles:
[ERROR] [Help 1] http://cwiki.apache.org/confluence/display/MAVEN/MojoFailureException
[ERROR]
[ERROR] After correcting the problems, you can resume the build with the command
[ERROR]   mvn <goals> -rf :maven-ear-plugin
Build step 'Invoke top-level Maven targets' marked build as failure
Deleting 1 temporary files
Recording test results
Reply | Threaded
Open this post in threaded view
|

Build failed in Jenkins: maven-plugins-ITs-m3-windows #2006

Apache Jenkins Server-2
See <https://builds.apache.org/job/maven-plugins-ITs-m3-windows/2006/display/redirect?page=changes>

Changes:

[hboutemy] [MPDF-48] Make PDF plugin run reports when used with Maven 3
Submitted by: Sébastien Garelle

------------------------------------------
[...truncated 3.37 MB...]
[INFO] Building: copy-from-reactor\pom.xml
[INFO] run script verify.bsh
[INFO] ..SUCCESS (8.3 s)
[INFO] Building: copy-from-remote-repository\pom.xml
[INFO] run script setup.bsh
[INFO] artifact org.apache.maven.its.dependency.fake-remote-copy:1.0: checking for updates from central
[INFO] run script verify.bsh
[INFO] ..SUCCESS (8.6 s)
[INFO] Building: dependency-properties\pom.xml
[INFO] run script verify.bsh
[INFO] ..SUCCESS (6.9 s)
[INFO] Building: filterunpack\pom.xml
[INFO] run script verify.groovy
[INFO] ..SUCCESS (6.9 s)
[INFO] Building: get-artifact\pom.xml
[INFO] run script setup.bsh
[INFO] run script verify.bsh
[INFO] ..SUCCESS (6.7 s)
[INFO] Building: get-artifact-maven-plugin\pom.xml
[INFO] run script setup.bsh
[INFO] run script verify.bsh
[INFO] ..SUCCESS (6.8 s)
[INFO] Building: get-artifact-no-transitive\pom.xml
[INFO] run script setup.bsh
[INFO] run script verify.bsh
[INFO] ..SUCCESS (6.6 s)
[INFO] Building: get-gav\pom.xml
[INFO] run script setup.bsh
[INFO] run script verify.bsh
[INFO] ..SUCCESS (7.0 s)
[INFO] Building: go-offline\pom.xml
[INFO] ..SUCCESS (8.4 s)
[INFO] Building: list-repositories\pom.xml
[INFO] snapshot org.apache.maven.its.dependency:test:1.0-SNAPSHOT: checking for updates from apache.snapshots
[INFO] artifact org.apache.maven.its.dependency.test:1.0-SNAPSHOT: checking for updates from central
[INFO] ..SUCCESS (6.9 s)
[INFO] Building: mdep-439-analyze-java8\pom.xml
[INFO] ..SKIPPED due to JRE version
[INFO] Building: mdep-450-project-with-ancestor\pom.xml
[INFO] run script verify.groovy
[INFO] ..SUCCESS (6.8 s)
[INFO] Building: mdep-450-project-without-ancestor\pom.xml
[INFO] run script verify.groovy
[INFO] ..SUCCESS (6.8 s)
[INFO] Building: mdep-506-dependency-without-version-in-depmgt\pom.xml
[INFO] ..SUCCESS (7.8 s)
[INFO] Building: mdep-571-resolve-java9\pom.xml
[INFO] ..SKIPPED due to JRE version
[INFO] Building: mdep-572-unpack-tar-long-file\pom.xml
[INFO] run script verify.bsh
[INFO] ..SUCCESS (8.2 s)
[INFO] Building: mdep-578_display-reason-invalid-module\pom.xml
[INFO] ..SKIPPED due to JRE version
[INFO] Building: mdep-580_display-manifest-automodules\pom.xml
[INFO] ..SKIPPED due to JRE version
[INFO] Building: purge-local-repository\pom.xml
[INFO] run script setup.bsh
[INFO] artifact org.apache.maven.its.dependency.purged:1.0: checking for updates from central
[INFO] run script verify.bsh
[INFO] ..SUCCESS (6.9 s)
[INFO] Building: purge-local-repository-bad-dep\pom.xml
[INFO] snapshot org.apache.maven.its.dependency:purge-local-repository-bad-dep:1.0-SNAPSHOT: checking for updates from apache.snapshots
[INFO] artifact org.apache.maven.its.dependency.purge-local-repository-bad-dep:1.0-SNAPSHOT: checking for updates from central
[INFO] artifact org.apache.maven.its.dependency.i-do-not-exist:1.0: checking for updates from central
[INFO] run script verify.groovy
[INFO] ..SUCCESS (7.6 s)
[INFO] Building: purge-local-repository-include\pom.xml
[INFO] snapshot org.apache.maven.its.dependency:purge-local-repository-include:1.0-SNAPSHOT: checking for updates from apache.snapshots
[INFO] artifact org.apache.maven.its.dependency.purge-local-repository-include:1.0-SNAPSHOT: checking for updates from central
[INFO] run script verify.groovy
[INFO] ..SUCCESS (7.0 s)
[INFO] Building: purge-local-repository-multi-module\pom.xml
[INFO] run script setup.bsh
[INFO] snapshot org.apache.maven.its.dependency:child1:1.0-SNAPSHOT: checking for updates from apache.snapshots
[INFO] artifact org.apache.maven.its.dependency.child1:1.0-SNAPSHOT: checking for updates from central
[INFO] artifact org.apache.maven.its.dependency.purged-a:1.0: checking for updates from central
[INFO] snapshot org.apache.maven.its.dependency:child2:1.0-SNAPSHOT: checking for updates from apache.snapshots
[INFO] artifact org.apache.maven.its.dependency.child2:1.0-SNAPSHOT: checking for updates from central
[INFO] artifact org.apache.maven.its.dependency.purged-b:1.0: checking for updates from central
[INFO] run script verify.bsh
[INFO] ..SUCCESS (7.4 s)
[INFO] Building: purge-local-repository-multi-module-execution\pom.xml
[INFO] run script setup.bsh
[INFO] run script verify.bsh
[INFO] ..SUCCESS (7.7 s)
[INFO] Building: purge-local-repository-non-transitive\pom.xml
[INFO] run script verify.bsh
[INFO] ..SUCCESS (6.9 s)
[INFO] Building: purge-local-repository-reresolve\pom.xml
[INFO] run script verify.bsh
[INFO] ..SUCCESS (6.8 s)
[INFO] Building: purge-local-repository-snapshots-only\pom.xml
[INFO] run script setup.bsh
[INFO] snapshot org.apache.maven.its.dependency:snap-purged:1.0-SNAPSHOT: checking for updates from apache.snapshots
[INFO] artifact org.apache.maven.its.dependency.snap-purged:1.0-SNAPSHOT: checking for updates from central
[INFO] run script verify.bsh
[INFO] ..SUCCESS (7.8 s)
[INFO] Building: purge-local-repository-version-range\pom.xml
[INFO] artifact org.apache.maven.its.dependency:purge-local-repository: checking for updates from central
[INFO] artifact org.apache.maven.its.dependency:purge-local-repository: checking for updates from central
[INFO] run script verify.bsh
[INFO] ..SUCCESS (6.8 s)
[INFO] Building: resolve\pom.xml
[INFO] ..SUCCESS (6.9 s)
[INFO] Building: resolve-plugins\pom.xml
[INFO] ..SUCCESS (7.6 s)
[INFO] Building: resolve-plugins-exclude-reactor\pom.xml
[INFO] run script verify.groovy
[INFO] ..SUCCESS (8.4 s)
[INFO] Building: resolve-plugins-with-exclude\pom.xml
[INFO] run script verify.groovy
[INFO] ..SUCCESS (7.6 s)
[INFO] Building: sources\pom.xml
[INFO] artifact classworlds.classworlds:1.1-alpha-2: checking for updates from central
[INFO] ..SUCCESS (7.1 s)
[INFO] Building: tree\pom.xml
[INFO] run script verify.bsh
[INFO] ..SUCCESS (6.7 s)
[INFO] Building: tree-includes\pom.xml
[INFO] run script verify.bsh
[INFO] ..SUCCESS (6.7 s)
[INFO] Building: tree-multimodule\pom.xml
[INFO] snapshot org.apache.maven.its.dependency:tree-multimodule-module-a:1.0-SNAPSHOT: checking for updates from apache.snapshots
[INFO] artifact org.apache.maven.its.dependency.tree-multimodule-module-a:1.0-SNAPSHOT: checking for updates from central
[INFO] run script verify.bsh
[INFO] ..SUCCESS (7.8 s)
[INFO] Building: unpack\pom.xml
[INFO] run script verify.bsh
[INFO] ..SUCCESS (8.1 s)
[INFO] Building: unpack-cli\pom.xml
[INFO] run script verify.bsh
[INFO] ..SUCCESS (6.6 s)
[INFO] Building: unpack-custom-ear\pom.xml
[INFO] run script verify.groovy
[INFO] ..SUCCESS (7.2 s)
[INFO] Building: unpack-dependencies\pom.xml
[INFO] run script verify.groovy
[INFO] ..SUCCESS (8.4 s)
[INFO] Building: unpack-from-remote-repository\pom.xml
[INFO] run script setup.bsh
[INFO] artifact org.apache.maven.its.dependency.fake-remote-unpack:1.0: checking for updates from central
[INFO] run script verify.bsh
[INFO] ..SUCCESS (8.5 s)
[INFO] Building: used-dependencies\pom.xml
[INFO] ..SUCCESS (8.8 s)
[INFO] Building: purge-local-repository-without-pom
[INFO] run script setup.bsh
[INFO] run script verify.bsh
[INFO] ..SUCCESS (6.6 s)
[INFO]
[INFO] --- mrm-maven-plugin:1.0.0:stop (default) @ maven-dependency-plugin ---
[INFO] Stopping Mock Repository Manager on http://localhost:60022
[INFO] Mock Repository Manager http://localhost:60022 is stopped.
[INFO]
[INFO] --- maven-checkstyle-plugin:2.15:check (checkstyle-check) @ maven-dependency-plugin ---
[INFO] There is 1 error reported by Checkstyle 6.1.1 with config/maven_checks.xml ruleset.
[INFO] Ignored 1 error, 0 violation remaining.
[INFO]
[INFO] --- maven-invoker-plugin:2.0.0:verify (integration-test) @ maven-dependency-plugin ---
[INFO] -------------------------------------------------
[INFO] Build Summary:
[INFO]   Passed: 53, Failed: 0, Errors: 0, Skipped: 4
[INFO] -------------------------------------------------
[INFO]
[INFO] --- maven-install-plugin:2.5.2:install (default-install) @ maven-dependency-plugin ---
[INFO] Installing F:\jenkins\jenkins-slave\workspace\maven-plugins-ITs-m3-windows\maven-dependency-plugin\target\maven-dependency-plugin-3.0.3-SNAPSHOT.jar to C:\Users\jenkins\.m2\repository\org\apache\maven\plugins\maven-dependency-plugin\3.0.3-SNAPSHOT\maven-dependency-plugin-3.0.3-SNAPSHOT.jar
[INFO] Installing F:\jenkins\jenkins-slave\workspace\maven-plugins-ITs-m3-windows\maven-dependency-plugin\pom.xml to C:\Users\jenkins\.m2\repository\org\apache\maven\plugins\maven-dependency-plugin\3.0.3-SNAPSHOT\maven-dependency-plugin-3.0.3-SNAPSHOT.pom
[INFO]                                                                        
[INFO] ------------------------------------------------------------------------
[INFO] Building Apache Maven Plugins Aggregator 1-SNAPSHOT
[INFO] ------------------------------------------------------------------------
[INFO]
[INFO] --- maven-clean-plugin:2.5:clean (default-clean) @ maven-plugins-aggregator ---
[INFO]
[INFO] --- maven-enforcer-plugin:1.3.1:enforce (enforce-bytecode-version) @ maven-plugins-aggregator ---
[INFO]
[INFO] --- maven-enforcer-plugin:1.3.1:enforce (ban-known-bad-maven-versions) @ maven-plugins-aggregator ---
[INFO]
[INFO] --- maven-remote-resources-plugin:1.5:process (default) @ maven-plugins-aggregator ---
[INFO]
[INFO] --- maven-site-plugin:3.3:attach-descriptor (attach-descriptor) @ maven-plugins-aggregator ---
[INFO]
[INFO] --- maven-install-plugin:2.5.1:install (default-install) @ maven-plugins-aggregator ---
[INFO] Installing <https://builds.apache.org/job/maven-plugins-ITs-m3-windows/ws/pom.xml> to C:\Users\jenkins\.m2\repository\org\apache\maven\plugins\maven-plugins-aggregator\1-SNAPSHOT\maven-plugins-aggregator-1-SNAPSHOT.pom
[INFO] ------------------------------------------------------------------------
[INFO] Reactor Summary:
[INFO]
[INFO] Apache Maven ACR Plugin ............................ SUCCESS [ 55.248 s]
[INFO] Apache Maven AntRun Plugin ......................... SUCCESS [02:52 min]
[INFO] Apache Maven Changelog Plugin ...................... SUCCESS [01:18 min]
[INFO] Apache Maven Changes Plugin ........................ SUCCESS [02:06 min]
[INFO] Apache Maven Clean Plugin .......................... SUCCESS [ 50.494 s]
[INFO] Apache Maven Compiler Plugin ....................... SUCCESS [03:58 min]
[INFO] Apache Maven Deploy Plugin ......................... SUCCESS [03:39 min]
[INFO] Apache Maven Documentation Checker Plugin .......... SUCCESS [  9.646 s]
[INFO] Apache Maven EAR Plugin ............................ FAILURE [10:09 min]
[INFO] Apache Maven EJB Plugin ............................ SUCCESS [01:14 min]
[INFO] Apache Maven Help Plugin ........................... SUCCESS [03:26 min]
[INFO] Apache Maven Install Plugin ........................ SUCCESS [03:08 min]
[INFO] Apache Maven Jarsigner Plugin ...................... SUCCESS [01:19 min]
[INFO] Apache Maven JDeps Plugin .......................... SUCCESS [  3.871 s]
[INFO] Apache Maven Linkcheck Plugin ...................... SUCCESS [  5.555 s]
[INFO] Apache Maven Patch Plugin .......................... SUCCESS [ 10.974 s]
[INFO] Apache Maven PDF Plugin ............................ SUCCESS [ 52.222 s]
[INFO] Apache Maven RAR Plugin ............................ SUCCESS [ 22.908 s]
[INFO] Apache Maven Repository Plugin ..................... SUCCESS [ 47.557 s]
[INFO] Apache Maven Resources Plugin ...................... SUCCESS [02:26 min]
[INFO] Apache Maven Site Plugin ........................... SUCCESS [11:37 min]
[INFO] Apache Maven Source Plugin ......................... SUCCESS [01:47 min]
[INFO] Apache Maven Stage Plugin .......................... SUCCESS [  4.139 s]
[INFO] Apache Maven Toolchains Plugin ..................... SUCCESS [ 28.421 s]
[INFO] Apache Maven Verifier Plugin ....................... SUCCESS [ 17.211 s]
[INFO] Apache Maven WAR Plugin ............................ SUCCESS [03:14 min]
[INFO] Apache Maven DOAP Plugin ........................... SUCCESS [ 36.559 s]
[INFO] Apache Maven Invoker Plugin ........................ SUCCESS [12:14 min]
[INFO] Apache Maven JAR Plugin ............................ SUCCESS [03:13 min]
[INFO] Apache Maven Assembly Plugin ....................... SUCCESS [20:34 min]
[INFO] Apache Maven Checkstyle Plugin ..................... SUCCESS [08:36 min]
[INFO] Apache Maven Javadoc Plugin ........................ SUCCESS [11:01 min]
[INFO] Apache Maven PMD Plugin ............................ SUCCESS [04:49 min]
[INFO] Apache Maven JLink Plugin .......................... SUCCESS [  8.173 s]
[INFO] Apache Maven JMod Plugin ........................... SUCCESS [  6.922 s]
[INFO] Apache Maven Project Info Reports Plugin ........... SUCCESS [04:09 min]
[INFO] Apache Maven Remote Resources Plugin ............... SUCCESS [02:08 min]
[INFO] Apache Maven Shade Plugin .......................... SUCCESS [07:30 min]
[INFO] Apache Maven SCM Publish Plugin .................... SUCCESS [01:18 min]
[INFO] Apache Maven Dependency Plugin ..................... SUCCESS [07:53 min]
[INFO] Apache Maven Plugins Aggregator .................... SUCCESS [  1.216 s]
[INFO] ------------------------------------------------------------------------
[INFO] BUILD FAILURE
[INFO] ------------------------------------------------------------------------
[INFO] Total time: 02:21 h
[INFO] Finished at: 2017-10-05T00:56:18+00:00
[INFO] Final Memory: 157M/572M
[INFO] ------------------------------------------------------------------------
[WARNING] The requested profile "apache.snapshots" could not be activated because it does not exist.
[ERROR] Failed to execute goal org.apache.maven.plugins:maven-invoker-plugin:2.0.0:verify (integration-test) on project maven-ear-plugin: 1 build failed. See console output above for details. -> [Help 1]
[ERROR]
[ERROR] To see the full stack trace of the errors, re-run Maven with the -e switch.
[ERROR] Re-run Maven using the -X switch to enable full debug logging.
[ERROR]
[ERROR] For more information about the errors and possible solutions, please read the following articles:
[ERROR] [Help 1] http://cwiki.apache.org/confluence/display/MAVEN/MojoFailureException
[ERROR]
[ERROR] After correcting the problems, you can resume the build with the command
[ERROR]   mvn <goals> -rf :maven-ear-plugin
Build step 'Invoke top-level Maven targets' marked build as failure
Deleting 1 temporary files
Recording test results
Reply | Threaded
Open this post in threaded view
|

Jenkins build is back to normal : maven-plugins-ITs-m3-windows #2007

Apache Jenkins Server-2