Build failed in Jenkins: maven-plugins-ITs-m3-windows #1987

Previous Topic Next Topic
 
classic Classic list List threaded Threaded
7 messages Options
Reply | Threaded
Open this post in threaded view
|

Build failed in Jenkins: maven-plugins-ITs-m3-windows #1987

Apache Jenkins Server-2
See <https://builds.apache.org/job/maven-plugins-ITs-m3-windows/1987/display/redirect?page=changes>

Changes:

[khmarbaise] Added exclusion for README.md

[khmarbaise] Added first integration test.

[khmarbaise] [MJLINK-1] Upgrade several plugins to get a working site generation
 o Upgraded maven-invoker-plugin, maven-site-plugin
   maven-javadoc-plugin also in reporting sections.

------------------------------------------
[...truncated 3.37 MB...]
[INFO] Building: analyze-report\pom.xml
[INFO] run script verify.bsh
[INFO] ..SUCCESS (7.6 s)
[INFO] Building: build-classpath\pom.xml
[INFO] run script verify.bsh
[INFO] ..SUCCESS (5.6 s)
[INFO] Building: build-classpath-output-file-and-property\pom.xml
[INFO] run script verify.bsh
[INFO] ..SUCCESS (7.3 s)
[INFO] Building: collect\pom.xml
[INFO] ..SUCCESS (5.3 s)
[INFO] Building: copy\pom.xml
[INFO] run script verify.bsh
[INFO] ..SUCCESS (5.4 s)
[INFO] Building: copy-and-unpack-with-alternate-local-repo\pom.xml
[INFO] run script verify.bsh
[INFO] ..SUCCESS (6.8 s)
[INFO] Building: copy-cli\pom.xml
[INFO] run script verify.bsh
[INFO] ..SUCCESS (5.6 s)
[INFO] Building: copy-dependencies\pom.xml
[INFO] run script verify.bsh
[INFO] ..SUCCESS (6.0 s)
[INFO] Building: copy-from-reactor\pom.xml
[INFO] run script verify.bsh
[INFO] ..SUCCESS (6.5 s)
[INFO] Building: copy-from-remote-repository\pom.xml
[INFO] run script setup.bsh
[INFO] run script verify.bsh
[INFO] ..SUCCESS (6.7 s)
[INFO] Building: dependency-properties\pom.xml
[INFO] run script verify.bsh
[INFO] ..SUCCESS (5.5 s)
[INFO] Building: filterunpack\pom.xml
[INFO] run script verify.groovy
[INFO] ..SUCCESS (5.7 s)
[INFO] Building: get-artifact\pom.xml
[INFO] run script setup.bsh
[INFO] run script verify.bsh
[INFO] ..SUCCESS (5.3 s)
[INFO] Building: get-artifact-maven-plugin\pom.xml
[INFO] run script setup.bsh
[INFO] run script verify.bsh
[INFO] ..SUCCESS (5.4 s)
[INFO] Building: get-artifact-no-transitive\pom.xml
[INFO] run script setup.bsh
[INFO] run script verify.bsh
[INFO] ..SUCCESS (5.4 s)
[INFO] Building: get-gav\pom.xml
[INFO] run script setup.bsh
[INFO] run script verify.bsh
[INFO] ..SUCCESS (5.3 s)
[INFO] Building: go-offline\pom.xml
[INFO] ..SUCCESS (6.8 s)
[INFO] Building: list-repositories\pom.xml
[INFO] ..SUCCESS (5.5 s)
[INFO] Building: mdep-439-analyze-java8\pom.xml
[INFO] ..SKIPPED due to JRE version
[INFO] Building: mdep-450-project-with-ancestor\pom.xml
[INFO] run script verify.groovy
[INFO] ..SUCCESS (5.3 s)
[INFO] Building: mdep-450-project-without-ancestor\pom.xml
[INFO] run script verify.groovy
[INFO] ..SUCCESS (5.2 s)
[INFO] Building: mdep-506-dependency-without-version-in-depmgt\pom.xml
[INFO] ..SUCCESS (6.4 s)
[INFO] Building: mdep-571-resolve-java9\pom.xml
[INFO] ..SKIPPED due to JRE version
[INFO] Building: mdep-572-unpack-tar-long-file\pom.xml
[INFO] run script verify.bsh
[INFO] ..SUCCESS (6.5 s)
[INFO] Building: mdep-578_display-reason-invalid-module\pom.xml
[INFO] ..SKIPPED due to JRE version
[INFO] Building: mdep-580_display-manifest-automodules\pom.xml
[INFO] ..SKIPPED due to JRE version
[INFO] Building: purge-local-repository\pom.xml
[INFO] run script setup.bsh
[INFO] run script verify.bsh
[INFO] ..SUCCESS (5.5 s)
[INFO] Building: purge-local-repository-bad-dep\pom.xml
[INFO] run script verify.groovy
[INFO] ..SUCCESS (5.4 s)
[INFO] Building: purge-local-repository-include\pom.xml
[INFO] run script verify.groovy
[INFO] ..SUCCESS (5.5 s)
[INFO] Building: purge-local-repository-multi-module\pom.xml
[INFO] run script setup.bsh
[INFO] run script verify.bsh
[INFO] ..SUCCESS (5.6 s)
[INFO] Building: purge-local-repository-multi-module-execution\pom.xml
[INFO] run script setup.bsh
[INFO] run script verify.bsh
[INFO] ..SUCCESS (6.3 s)
[INFO] Building: purge-local-repository-non-transitive\pom.xml
[INFO] run script verify.bsh
[INFO] ..SUCCESS (5.5 s)
[INFO] Building: purge-local-repository-reresolve\pom.xml
[INFO] run script verify.bsh
[INFO] ..SUCCESS (5.4 s)
[INFO] Building: purge-local-repository-snapshots-only\pom.xml
[INFO] run script setup.bsh
[INFO] run script verify.bsh
[INFO] ..SUCCESS (5.9 s)
[INFO] Building: purge-local-repository-version-range\pom.xml
[INFO] run script verify.bsh
[INFO] ..SUCCESS (5.6 s)
[INFO] Building: resolve\pom.xml
[INFO] ..SUCCESS (5.3 s)
[INFO] Building: resolve-plugins\pom.xml
[INFO] ..SUCCESS (6.2 s)
[INFO] Building: resolve-plugins-exclude-reactor\pom.xml
[INFO] run script verify.groovy
[INFO] ..SUCCESS (6.7 s)
[INFO] Building: resolve-plugins-with-exclude\pom.xml
[INFO] run script verify.groovy
[INFO] ..SUCCESS (5.9 s)
[INFO] Building: sources\pom.xml
[INFO] ..SUCCESS (5.6 s)
[INFO] Building: tree\pom.xml
[INFO] run script verify.bsh
[INFO] ..SUCCESS (5.4 s)
[INFO] Building: tree-includes\pom.xml
[INFO] run script verify.bsh
[INFO] ..SUCCESS (5.3 s)
[INFO] Building: tree-multimodule\pom.xml
[INFO] run script verify.bsh
[INFO] ..SUCCESS (6.2 s)
[INFO] Building: unpack\pom.xml
[INFO] run script verify.bsh
[INFO] ..SUCCESS (6.6 s)
[INFO] Building: unpack-cli\pom.xml
[INFO] run script verify.bsh
[INFO] ..SUCCESS (5.5 s)
[INFO] Building: unpack-custom-ear\pom.xml
[INFO] run script verify.groovy
[INFO] ..SUCCESS (5.8 s)
[INFO] Building: unpack-dependencies\pom.xml
[INFO] run script verify.groovy
[INFO] ..SUCCESS (7.1 s)
[INFO] Building: unpack-from-remote-repository\pom.xml
[INFO] run script setup.bsh
[INFO] run script verify.bsh
[INFO] ..SUCCESS (6.8 s)
[INFO] Building: used-dependencies\pom.xml
[INFO] ..SUCCESS (7.0 s)
[INFO] Building: purge-local-repository-without-pom
[INFO] run script setup.bsh
[INFO] run script verify.bsh
[INFO] ..SUCCESS (5.4 s)
[INFO]
[INFO] --- mrm-maven-plugin:1.0.0:stop (default) @ maven-dependency-plugin ---
[INFO] Stopping Mock Repository Manager on http://localhost:64068
[INFO] Mock Repository Manager http://localhost:64068 is stopped.
[INFO]
[INFO] --- maven-checkstyle-plugin:2.15:check (checkstyle-check) @ maven-dependency-plugin ---
[INFO] There is 1 error reported by Checkstyle 6.1.1 with config/maven_checks.xml ruleset.
[INFO] Ignored 1 error, 0 violation remaining.
[INFO]
[INFO] --- maven-invoker-plugin:2.0.0:verify (integration-test) @ maven-dependency-plugin ---
[INFO] -------------------------------------------------
[INFO] Build Summary:
[INFO]   Passed: 53, Failed: 0, Errors: 0, Skipped: 4
[INFO] -------------------------------------------------
[INFO]
[INFO] --- maven-install-plugin:2.5.2:install (default-install) @ maven-dependency-plugin ---
[INFO] Installing F:\jenkins\jenkins-slave\workspace\maven-plugins-ITs-m3-windows\maven-dependency-plugin\target\maven-dependency-plugin-3.0.2-SNAPSHOT.jar to C:\Users\jenkins\.m2\repository\org\apache\maven\plugins\maven-dependency-plugin\3.0.2-SNAPSHOT\maven-dependency-plugin-3.0.2-SNAPSHOT.jar
[INFO] Installing F:\jenkins\jenkins-slave\workspace\maven-plugins-ITs-m3-windows\maven-dependency-plugin\pom.xml to C:\Users\jenkins\.m2\repository\org\apache\maven\plugins\maven-dependency-plugin\3.0.2-SNAPSHOT\maven-dependency-plugin-3.0.2-SNAPSHOT.pom
[INFO]                                                                        
[INFO] ------------------------------------------------------------------------
[INFO] Building Apache Maven Plugins Aggregator 1-SNAPSHOT
[INFO] ------------------------------------------------------------------------
[INFO]
[INFO] --- maven-clean-plugin:2.5:clean (default-clean) @ maven-plugins-aggregator ---
[INFO]
[INFO] --- maven-enforcer-plugin:1.3.1:enforce (enforce-bytecode-version) @ maven-plugins-aggregator ---
[INFO]
[INFO] --- maven-enforcer-plugin:1.3.1:enforce (ban-known-bad-maven-versions) @ maven-plugins-aggregator ---
[INFO]
[INFO] --- maven-remote-resources-plugin:1.5:process (default) @ maven-plugins-aggregator ---
[INFO]
[INFO] --- maven-site-plugin:3.3:attach-descriptor (attach-descriptor) @ maven-plugins-aggregator ---
[INFO]
[INFO] --- maven-install-plugin:2.5.1:install (default-install) @ maven-plugins-aggregator ---
[INFO] Installing <https://builds.apache.org/job/maven-plugins-ITs-m3-windows/ws/pom.xml> to C:\Users\jenkins\.m2\repository\org\apache\maven\plugins\maven-plugins-aggregator\1-SNAPSHOT\maven-plugins-aggregator-1-SNAPSHOT.pom
[INFO] ------------------------------------------------------------------------
[INFO] Reactor Summary:
[INFO]
[INFO] Apache Maven ACR Plugin ............................ SUCCESS [ 43.704 s]
[INFO] Apache Maven AntRun Plugin ......................... SUCCESS [02:20 min]
[INFO] Apache Maven Changelog Plugin ...................... SUCCESS [01:07 min]
[INFO] Apache Maven Changes Plugin ........................ SUCCESS [01:50 min]
[INFO] Apache Maven Clean Plugin .......................... SUCCESS [ 45.846 s]
[INFO] Apache Maven Compiler Plugin ....................... SUCCESS [03:19 min]
[INFO] Apache Maven Deploy Plugin ......................... SUCCESS [02:52 min]
[INFO] Apache Maven Documentation Checker Plugin .......... SUCCESS [  8.078 s]
[INFO] Apache Maven EAR Plugin ............................ SUCCESS [08:10 min]
[INFO] Apache Maven EJB Plugin ............................ SUCCESS [ 58.328 s]
[INFO] Apache Maven Help Plugin ........................... SUCCESS [02:42 min]
[INFO] Apache Maven Install Plugin ........................ SUCCESS [02:29 min]
[INFO] Apache Maven Jarsigner Plugin ...................... SUCCESS [01:12 min]
[INFO] Apache Maven JDeps Plugin .......................... SUCCESS [  4.081 s]
[INFO] Apache Maven Linkcheck Plugin ...................... SUCCESS [  6.516 s]
[INFO] Apache Maven Patch Plugin .......................... SUCCESS [ 10.684 s]
[INFO] Apache Maven PDF Plugin ............................ SUCCESS [ 43.451 s]
[INFO] Apache Maven RAR Plugin ............................ SUCCESS [ 19.392 s]
[INFO] Apache Maven Repository Plugin ..................... SUCCESS [ 45.737 s]
[INFO] Apache Maven Resources Plugin ...................... SUCCESS [02:18 min]
[INFO] Apache Maven Site Plugin ........................... SUCCESS [09:19 min]
[INFO] Apache Maven Source Plugin ......................... SUCCESS [01:25 min]
[INFO] Apache Maven Stage Plugin .......................... SUCCESS [  3.348 s]
[INFO] Apache Maven Toolchains Plugin ..................... SUCCESS [ 22.625 s]
[INFO] Apache Maven Verifier Plugin ....................... SUCCESS [ 14.174 s]
[INFO] Apache Maven WAR Plugin ............................ SUCCESS [02:38 min]
[INFO] Apache Maven DOAP Plugin ........................... SUCCESS [ 28.008 s]
[INFO] Apache Maven Invoker Plugin ........................ SUCCESS [09:47 min]
[INFO] Apache Maven JAR Plugin ............................ SUCCESS [02:31 min]
[INFO] Apache Maven Assembly Plugin ....................... SUCCESS [15:27 min]
[INFO] Apache Maven Checkstyle Plugin ..................... SUCCESS [05:38 min]
[INFO] Apache Maven Javadoc Plugin ........................ SUCCESS [07:22 min]
[INFO] Apache Maven PMD Plugin ............................ SUCCESS [02:59 min]
[INFO] Apache Maven JLink Plugin .......................... SUCCESS [  5.496 s]
[INFO] Apache Maven JMod Plugin ........................... FAILURE [  8.626 s]
[INFO] Apache Maven Project Info Reports Plugin ........... SUCCESS [03:00 min]
[INFO] Apache Maven Remote Resources Plugin ............... SUCCESS [01:22 min]
[INFO] Apache Maven Shade Plugin .......................... SUCCESS [05:35 min]
[INFO] Apache Maven SCM Publish Plugin .................... SUCCESS [01:02 min]
[INFO] Apache Maven Dependency Plugin ..................... SUCCESS [06:19 min]
[INFO] Apache Maven Plugins Aggregator .................... SUCCESS [  0.787 s]
[INFO] ------------------------------------------------------------------------
[INFO] BUILD FAILURE
[INFO] ------------------------------------------------------------------------
[INFO] Total time: 01:49 h
[INFO] Finished at: 2017-09-06T23:56:25+00:00
[INFO] Final Memory: 160M/553M
[INFO] ------------------------------------------------------------------------
[WARNING] The requested profile "apache.snapshots" could not be activated because it does not exist.
[ERROR] Failed to execute goal org.apache.maven.plugins:maven-invoker-plugin:3.0.1:verify (integration-test) on project maven-jmod-plugin: 1 build failed. See console output above for details. -> [Help 1]
[ERROR]
[ERROR] To see the full stack trace of the errors, re-run Maven with the -e switch.
[ERROR] Re-run Maven using the -X switch to enable full debug logging.
[ERROR]
[ERROR] For more information about the errors and possible solutions, please read the following articles:
[ERROR] [Help 1] http://cwiki.apache.org/confluence/display/MAVEN/MojoFailureException
[ERROR]
[ERROR] After correcting the problems, you can resume the build with the command
[ERROR]   mvn <goals> -rf :maven-jmod-plugin
Build step 'Invoke top-level Maven targets' marked build as failure
Deleting 1 temporary files
Recording test results
Reply | Threaded
Open this post in threaded view
|

Build failed in Jenkins: maven-plugins-ITs-m3-windows #1988

Apache Jenkins Server-2
See <https://builds.apache.org/job/maven-plugins-ITs-m3-windows/1988/display/redirect?page=changes>

Changes:

[khmarbaise] o ease apache-rat by adding appropriate copyright headers.

[khmarbaise] o Added integation test profile
o Fixed some doc issues.

[khmarbaise] Improved integration test README.md
Added several integration tests for different kind of configurations.

------------------------------------------
[...truncated 3.38 MB...]
[INFO] Building: copy-from-reactor\pom.xml
[INFO] run script verify.bsh
[INFO] ..SUCCESS (8.1 s)
[INFO] Building: copy-from-remote-repository\pom.xml
[INFO] run script setup.bsh
[INFO] artifact org.apache.maven.its.dependency.fake-remote-copy:1.0: checking for updates from central
[INFO] run script verify.bsh
[INFO] ..SUCCESS (8.3 s)
[INFO] Building: dependency-properties\pom.xml
[INFO] run script verify.bsh
[INFO] ..SUCCESS (6.9 s)
[INFO] Building: filterunpack\pom.xml
[INFO] run script verify.groovy
[INFO] ..SUCCESS (6.8 s)
[INFO] Building: get-artifact\pom.xml
[INFO] run script setup.bsh
[INFO] run script verify.bsh
[INFO] ..SUCCESS (6.7 s)
[INFO] Building: get-artifact-maven-plugin\pom.xml
[INFO] run script setup.bsh
[INFO] run script verify.bsh
[INFO] ..SUCCESS (6.8 s)
[INFO] Building: get-artifact-no-transitive\pom.xml
[INFO] run script setup.bsh
[INFO] run script verify.bsh
[INFO] ..SUCCESS (6.6 s)
[INFO] Building: get-gav\pom.xml
[INFO] run script setup.bsh
[INFO] run script verify.bsh
[INFO] ..SUCCESS (7.0 s)
[INFO] Building: go-offline\pom.xml
[INFO] ..SUCCESS (9.1 s)
[INFO] Building: list-repositories\pom.xml
[INFO] snapshot org.apache.maven.its.dependency:test:1.0-SNAPSHOT: checking for updates from apache.snapshots
[INFO] artifact org.apache.maven.its.dependency.test:1.0-SNAPSHOT: checking for updates from central
[INFO] ..SUCCESS (7.1 s)
[INFO] Building: mdep-439-analyze-java8\pom.xml
[INFO] ..SKIPPED due to JRE version
[INFO] Building: mdep-450-project-with-ancestor\pom.xml
[INFO] run script verify.groovy
[INFO] ..SUCCESS (6.7 s)
[INFO] Building: mdep-450-project-without-ancestor\pom.xml
[INFO] run script verify.groovy
[INFO] ..SUCCESS (6.4 s)
[INFO] Building: mdep-506-dependency-without-version-in-depmgt\pom.xml
[INFO] ..SUCCESS (7.8 s)
[INFO] Building: mdep-571-resolve-java9\pom.xml
[INFO] ..SKIPPED due to JRE version
[INFO] Building: mdep-572-unpack-tar-long-file\pom.xml
[INFO] run script verify.bsh
[INFO] ..SUCCESS (8.3 s)
[INFO] Building: mdep-578_display-reason-invalid-module\pom.xml
[INFO] ..SKIPPED due to JRE version
[INFO] Building: mdep-580_display-manifest-automodules\pom.xml
[INFO] ..SKIPPED due to JRE version
[INFO] Building: purge-local-repository\pom.xml
[INFO] run script setup.bsh
[INFO] artifact org.apache.maven.its.dependency.purged:1.0: checking for updates from central
[INFO] run script verify.bsh
[INFO] ..SUCCESS (7.4 s)
[INFO] Building: purge-local-repository-bad-dep\pom.xml
[INFO] snapshot org.apache.maven.its.dependency:purge-local-repository-bad-dep:1.0-SNAPSHOT: checking for updates from apache.snapshots
[INFO] artifact org.apache.maven.its.dependency.purge-local-repository-bad-dep:1.0-SNAPSHOT: checking for updates from central
[INFO] artifact org.apache.maven.its.dependency.i-do-not-exist:1.0: checking for updates from central
[INFO] run script verify.groovy
[INFO] ..SUCCESS (7.5 s)
[INFO] Building: purge-local-repository-include\pom.xml
[INFO] snapshot org.apache.maven.its.dependency:purge-local-repository-include:1.0-SNAPSHOT: checking for updates from apache.snapshots
[INFO] artifact org.apache.maven.its.dependency.purge-local-repository-include:1.0-SNAPSHOT: checking for updates from central
[INFO] run script verify.groovy
[INFO] ..SUCCESS (7.4 s)
[INFO] Building: purge-local-repository-multi-module\pom.xml
[INFO] run script setup.bsh
[INFO] snapshot org.apache.maven.its.dependency:child1:1.0-SNAPSHOT: checking for updates from apache.snapshots
[INFO] artifact org.apache.maven.its.dependency.child1:1.0-SNAPSHOT: checking for updates from central
[INFO] artifact org.apache.maven.its.dependency.purged-a:1.0: checking for updates from central
[INFO] snapshot org.apache.maven.its.dependency:child2:1.0-SNAPSHOT: checking for updates from apache.snapshots
[INFO] artifact org.apache.maven.its.dependency.child2:1.0-SNAPSHOT: checking for updates from central
[INFO] artifact org.apache.maven.its.dependency.purged-b:1.0: checking for updates from central
[INFO] run script verify.bsh
[INFO] ..SUCCESS (7.6 s)
[INFO] Building: purge-local-repository-multi-module-execution\pom.xml
[INFO] run script setup.bsh
[INFO] run script verify.bsh
[INFO] ..SUCCESS (8.1 s)
[INFO] Building: purge-local-repository-non-transitive\pom.xml
[INFO] run script verify.bsh
[INFO] ..SUCCESS (6.7 s)
[INFO] Building: purge-local-repository-reresolve\pom.xml
[INFO] run script verify.bsh
[INFO] ..SUCCESS (6.9 s)
[INFO] Building: purge-local-repository-snapshots-only\pom.xml
[INFO] run script setup.bsh
[INFO] snapshot org.apache.maven.its.dependency:snap-purged:1.0-SNAPSHOT: checking for updates from apache.snapshots
[INFO] artifact org.apache.maven.its.dependency.snap-purged:1.0-SNAPSHOT: checking for updates from central
[INFO] run script verify.bsh
[INFO] ..SUCCESS (7.7 s)
[INFO] Building: purge-local-repository-version-range\pom.xml
[INFO] artifact org.apache.maven.its.dependency:purge-local-repository: checking for updates from central
[INFO] artifact org.apache.maven.its.dependency:purge-local-repository: checking for updates from central
[INFO] run script verify.bsh
[INFO] ..SUCCESS (7.1 s)
[INFO] Building: resolve\pom.xml
[INFO] ..SUCCESS (6.9 s)
[INFO] Building: resolve-plugins\pom.xml
[INFO] ..SUCCESS (7.9 s)
[INFO] Building: resolve-plugins-exclude-reactor\pom.xml
[INFO] run script verify.groovy
[INFO] ..SUCCESS (9.0 s)
[INFO] Building: resolve-plugins-with-exclude\pom.xml
[INFO] run script verify.groovy
[INFO] ..SUCCESS (8.0 s)
[INFO] Building: sources\pom.xml
[INFO] artifact classworlds.classworlds:1.1-alpha-2: checking for updates from central
[INFO] ..SUCCESS (7.6 s)
[INFO] Building: tree\pom.xml
[INFO] run script verify.bsh
[INFO] ..SUCCESS (7.4 s)
[INFO] Building: tree-includes\pom.xml
[INFO] run script verify.bsh
[INFO] ..SUCCESS (7.1 s)
[INFO] Building: tree-multimodule\pom.xml
[INFO] snapshot org.apache.maven.its.dependency:tree-multimodule-module-a:1.0-SNAPSHOT: checking for updates from apache.snapshots
[INFO] artifact org.apache.maven.its.dependency.tree-multimodule-module-a:1.0-SNAPSHOT: checking for updates from central
[INFO] run script verify.bsh
[INFO] ..SUCCESS (8.1 s)
[INFO] Building: unpack\pom.xml
[INFO] run script verify.bsh
[INFO] ..SUCCESS (8.2 s)
[INFO] Building: unpack-cli\pom.xml
[INFO] run script verify.bsh
[INFO] ..SUCCESS (7.0 s)
[INFO] Building: unpack-custom-ear\pom.xml
[INFO] run script verify.groovy
[INFO] ..SUCCESS (7.4 s)
[INFO] Building: unpack-dependencies\pom.xml
[INFO] run script verify.groovy
[INFO] ..SUCCESS (9.0 s)
[INFO] Building: unpack-from-remote-repository\pom.xml
[INFO] run script setup.bsh
[INFO] artifact org.apache.maven.its.dependency.fake-remote-unpack:1.0: checking for updates from central
[INFO] run script verify.bsh
[INFO] ..SUCCESS (8.4 s)
[INFO] Building: used-dependencies\pom.xml
[INFO] ..SUCCESS (8.4 s)
[INFO] Building: purge-local-repository-without-pom
[INFO] run script setup.bsh
[INFO] run script verify.bsh
[INFO] ..SUCCESS (6.6 s)
[INFO]
[INFO] --- mrm-maven-plugin:1.0.0:stop (default) @ maven-dependency-plugin ---
[INFO] Stopping Mock Repository Manager on http://localhost:50122
[INFO] Mock Repository Manager http://localhost:50122 is stopped.
[INFO]
[INFO] --- maven-checkstyle-plugin:2.15:check (checkstyle-check) @ maven-dependency-plugin ---
[INFO] There is 1 error reported by Checkstyle 6.1.1 with config/maven_checks.xml ruleset.
[INFO] Ignored 1 error, 0 violation remaining.
[INFO]
[INFO] --- maven-invoker-plugin:2.0.0:verify (integration-test) @ maven-dependency-plugin ---
[INFO] -------------------------------------------------
[INFO] Build Summary:
[INFO]   Passed: 53, Failed: 0, Errors: 0, Skipped: 4
[INFO] -------------------------------------------------
[INFO]
[INFO] --- maven-install-plugin:2.5.2:install (default-install) @ maven-dependency-plugin ---
[INFO] Installing F:\jenkins\jenkins-slave\workspace\maven-plugins-ITs-m3-windows\maven-dependency-plugin\target\maven-dependency-plugin-3.0.2-SNAPSHOT.jar to C:\Users\jenkins\.m2\repository\org\apache\maven\plugins\maven-dependency-plugin\3.0.2-SNAPSHOT\maven-dependency-plugin-3.0.2-SNAPSHOT.jar
[INFO] Installing F:\jenkins\jenkins-slave\workspace\maven-plugins-ITs-m3-windows\maven-dependency-plugin\pom.xml to C:\Users\jenkins\.m2\repository\org\apache\maven\plugins\maven-dependency-plugin\3.0.2-SNAPSHOT\maven-dependency-plugin-3.0.2-SNAPSHOT.pom
[INFO]                                                                        
[INFO] ------------------------------------------------------------------------
[INFO] Building Apache Maven Plugins Aggregator 1-SNAPSHOT
[INFO] ------------------------------------------------------------------------
[INFO]
[INFO] --- maven-clean-plugin:2.5:clean (default-clean) @ maven-plugins-aggregator ---
[INFO]
[INFO] --- maven-enforcer-plugin:1.3.1:enforce (enforce-bytecode-version) @ maven-plugins-aggregator ---
[INFO]
[INFO] --- maven-enforcer-plugin:1.3.1:enforce (ban-known-bad-maven-versions) @ maven-plugins-aggregator ---
[INFO]
[INFO] --- maven-remote-resources-plugin:1.5:process (default) @ maven-plugins-aggregator ---
[INFO]
[INFO] --- maven-site-plugin:3.3:attach-descriptor (attach-descriptor) @ maven-plugins-aggregator ---
[INFO]
[INFO] --- maven-install-plugin:2.5.1:install (default-install) @ maven-plugins-aggregator ---
[INFO] Installing <https://builds.apache.org/job/maven-plugins-ITs-m3-windows/ws/pom.xml> to C:\Users\jenkins\.m2\repository\org\apache\maven\plugins\maven-plugins-aggregator\1-SNAPSHOT\maven-plugins-aggregator-1-SNAPSHOT.pom
[INFO] ------------------------------------------------------------------------
[INFO] Reactor Summary:
[INFO]
[INFO] Apache Maven ACR Plugin ............................ SUCCESS [ 50.580 s]
[INFO] Apache Maven AntRun Plugin ......................... SUCCESS [02:53 min]
[INFO] Apache Maven Changelog Plugin ...................... SUCCESS [01:19 min]
[INFO] Apache Maven Changes Plugin ........................ SUCCESS [02:07 min]
[INFO] Apache Maven Clean Plugin .......................... SUCCESS [ 50.128 s]
[INFO] Apache Maven Compiler Plugin ....................... SUCCESS [03:58 min]
[INFO] Apache Maven Deploy Plugin ......................... SUCCESS [03:40 min]
[INFO] Apache Maven Documentation Checker Plugin .......... SUCCESS [  9.951 s]
[INFO] Apache Maven EAR Plugin ............................ SUCCESS [10:22 min]
[INFO] Apache Maven EJB Plugin ............................ SUCCESS [01:15 min]
[INFO] Apache Maven Help Plugin ........................... SUCCESS [03:27 min]
[INFO] Apache Maven Install Plugin ........................ SUCCESS [03:05 min]
[INFO] Apache Maven Jarsigner Plugin ...................... SUCCESS [01:18 min]
[INFO] Apache Maven JDeps Plugin .......................... SUCCESS [  3.992 s]
[INFO] Apache Maven Linkcheck Plugin ...................... SUCCESS [  5.002 s]
[INFO] Apache Maven Patch Plugin .......................... SUCCESS [ 10.666 s]
[INFO] Apache Maven PDF Plugin ............................ SUCCESS [ 42.656 s]
[INFO] Apache Maven RAR Plugin ............................ SUCCESS [ 21.326 s]
[INFO] Apache Maven Repository Plugin ..................... SUCCESS [ 45.819 s]
[INFO] Apache Maven Resources Plugin ...................... SUCCESS [02:27 min]
[INFO] Apache Maven Site Plugin ........................... SUCCESS [12:34 min]
[INFO] Apache Maven Source Plugin ......................... SUCCESS [01:52 min]
[INFO] Apache Maven Stage Plugin .......................... SUCCESS [  3.998 s]
[INFO] Apache Maven Toolchains Plugin ..................... SUCCESS [ 26.781 s]
[INFO] Apache Maven Verifier Plugin ....................... SUCCESS [ 17.824 s]
[INFO] Apache Maven WAR Plugin ............................ SUCCESS [03:19 min]
[INFO] Apache Maven DOAP Plugin ........................... SUCCESS [ 36.281 s]
[INFO] Apache Maven Invoker Plugin ........................ SUCCESS [12:17 min]
[INFO] Apache Maven JAR Plugin ............................ SUCCESS [03:10 min]
[INFO] Apache Maven Assembly Plugin ....................... SUCCESS [19:20 min]
[INFO] Apache Maven Checkstyle Plugin ..................... SUCCESS [07:52 min]
[INFO] Apache Maven Javadoc Plugin ........................ SUCCESS [09:39 min]
[INFO] Apache Maven PMD Plugin ............................ SUCCESS [03:46 min]
[INFO] Apache Maven JLink Plugin .......................... SUCCESS [  6.809 s]
[INFO] Apache Maven JMod Plugin ........................... FAILURE [01:11 min]
[INFO] Apache Maven Project Info Reports Plugin ........... SUCCESS [03:33 min]
[INFO] Apache Maven Remote Resources Plugin ............... SUCCESS [01:46 min]
[INFO] Apache Maven Shade Plugin .......................... SUCCESS [06:57 min]
[INFO] Apache Maven SCM Publish Plugin .................... SUCCESS [01:16 min]
[INFO] Apache Maven Dependency Plugin ..................... SUCCESS [07:59 min]
[INFO] Apache Maven Plugins Aggregator .................... SUCCESS [  0.918 s]
[INFO] ------------------------------------------------------------------------
[INFO] BUILD FAILURE
[INFO] ------------------------------------------------------------------------
[INFO] Total time: 02:18 h
[INFO] Finished at: 2017-09-07T21:51:49+00:00
[INFO] Final Memory: 162M/552M
[INFO] ------------------------------------------------------------------------
[WARNING] The requested profile "apache.snapshots" could not be activated because it does not exist.
[ERROR] Failed to execute goal org.apache.maven.plugins:maven-invoker-plugin:3.0.1:verify (integration-test) on project maven-jmod-plugin: 11 builds failed. See console output above for details. -> [Help 1]
[ERROR]
[ERROR] To see the full stack trace of the errors, re-run Maven with the -e switch.
[ERROR] Re-run Maven using the -X switch to enable full debug logging.
[ERROR]
[ERROR] For more information about the errors and possible solutions, please read the following articles:
[ERROR] [Help 1] http://cwiki.apache.org/confluence/display/MAVEN/MojoFailureException
[ERROR]
[ERROR] After correcting the problems, you can resume the build with the command
[ERROR]   mvn <goals> -rf :maven-jmod-plugin
Build step 'Invoke top-level Maven targets' marked build as failure
Deleting 1 temporary files
Recording test results
Reply | Threaded
Open this post in threaded view
|

Build failed in Jenkins: maven-plugins-ITs-m3-windows #1989

Apache Jenkins Server-2
See <https://builds.apache.org/job/maven-plugins-ITs-m3-windows/1989/display/redirect?page=changes>

Changes:

[khmarbaise] Commented out test which actually does not work.

[khmarbaise] Improved docs

[khmarbaise] Improved docs
Added TODO

------------------------------------------
[...truncated 3.38 MB...]
[INFO] Building: copy-from-reactor\pom.xml
[INFO] run script verify.bsh
[INFO] ..SUCCESS (8.1 s)
[INFO] Building: copy-from-remote-repository\pom.xml
[INFO] run script setup.bsh
[INFO] artifact org.apache.maven.its.dependency.fake-remote-copy:1.0: checking for updates from central
[INFO] run script verify.bsh
[INFO] ..SUCCESS (8.4 s)
[INFO] Building: dependency-properties\pom.xml
[INFO] run script verify.bsh
[INFO] ..SUCCESS (6.8 s)
[INFO] Building: filterunpack\pom.xml
[INFO] run script verify.groovy
[INFO] ..SUCCESS (6.8 s)
[INFO] Building: get-artifact\pom.xml
[INFO] run script setup.bsh
[INFO] run script verify.bsh
[INFO] ..SUCCESS (6.8 s)
[INFO] Building: get-artifact-maven-plugin\pom.xml
[INFO] run script setup.bsh
[INFO] run script verify.bsh
[INFO] ..SUCCESS (6.9 s)
[INFO] Building: get-artifact-no-transitive\pom.xml
[INFO] run script setup.bsh
[INFO] run script verify.bsh
[INFO] ..SUCCESS (6.6 s)
[INFO] Building: get-gav\pom.xml
[INFO] run script setup.bsh
[INFO] run script verify.bsh
[INFO] ..SUCCESS (6.8 s)
[INFO] Building: go-offline\pom.xml
[INFO] ..SUCCESS (8.2 s)
[INFO] Building: list-repositories\pom.xml
[INFO] snapshot org.apache.maven.its.dependency:test:1.0-SNAPSHOT: checking for updates from apache.snapshots
[INFO] artifact org.apache.maven.its.dependency.test:1.0-SNAPSHOT: checking for updates from central
[INFO] ..SUCCESS (7.3 s)
[INFO] Building: mdep-439-analyze-java8\pom.xml
[INFO] ..SKIPPED due to JRE version
[INFO] Building: mdep-450-project-with-ancestor\pom.xml
[INFO] run script verify.groovy
[INFO] ..SUCCESS (6.5 s)
[INFO] Building: mdep-450-project-without-ancestor\pom.xml
[INFO] run script verify.groovy
[INFO] ..SUCCESS (6.5 s)
[INFO] Building: mdep-506-dependency-without-version-in-depmgt\pom.xml
[INFO] ..SUCCESS (7.6 s)
[INFO] Building: mdep-571-resolve-java9\pom.xml
[INFO] ..SKIPPED due to JRE version
[INFO] Building: mdep-572-unpack-tar-long-file\pom.xml
[INFO] run script verify.bsh
[INFO] ..SUCCESS (8.6 s)
[INFO] Building: mdep-578_display-reason-invalid-module\pom.xml
[INFO] ..SKIPPED due to JRE version
[INFO] Building: mdep-580_display-manifest-automodules\pom.xml
[INFO] ..SKIPPED due to JRE version
[INFO] Building: purge-local-repository\pom.xml
[INFO] run script setup.bsh
[INFO] artifact org.apache.maven.its.dependency.purged:1.0: checking for updates from central
[INFO] run script verify.bsh
[INFO] ..SUCCESS (7.1 s)
[INFO] Building: purge-local-repository-bad-dep\pom.xml
[INFO] snapshot org.apache.maven.its.dependency:purge-local-repository-bad-dep:1.0-SNAPSHOT: checking for updates from apache.snapshots
[INFO] artifact org.apache.maven.its.dependency.purge-local-repository-bad-dep:1.0-SNAPSHOT: checking for updates from central
[INFO] artifact org.apache.maven.its.dependency.i-do-not-exist:1.0: checking for updates from central
[INFO] run script verify.groovy
[INFO] ..SUCCESS (7.6 s)
[INFO] Building: purge-local-repository-include\pom.xml
[INFO] snapshot org.apache.maven.its.dependency:purge-local-repository-include:1.0-SNAPSHOT: checking for updates from apache.snapshots
[INFO] artifact org.apache.maven.its.dependency.purge-local-repository-include:1.0-SNAPSHOT: checking for updates from central
[INFO] run script verify.groovy
[INFO] ..SUCCESS (7.1 s)
[INFO] Building: purge-local-repository-multi-module\pom.xml
[INFO] run script setup.bsh
[INFO] snapshot org.apache.maven.its.dependency:child1:1.0-SNAPSHOT: checking for updates from apache.snapshots
[INFO] artifact org.apache.maven.its.dependency.child1:1.0-SNAPSHOT: checking for updates from central
[INFO] artifact org.apache.maven.its.dependency.purged-a:1.0: checking for updates from central
[INFO] snapshot org.apache.maven.its.dependency:child2:1.0-SNAPSHOT: checking for updates from apache.snapshots
[INFO] artifact org.apache.maven.its.dependency.child2:1.0-SNAPSHOT: checking for updates from central
[INFO] artifact org.apache.maven.its.dependency.purged-b:1.0: checking for updates from central
[INFO] run script verify.bsh
[INFO] ..SUCCESS (7.7 s)
[INFO] Building: purge-local-repository-multi-module-execution\pom.xml
[INFO] run script setup.bsh
[INFO] run script verify.bsh
[INFO] ..SUCCESS (7.8 s)
[INFO] Building: purge-local-repository-non-transitive\pom.xml
[INFO] run script verify.bsh
[INFO] ..SUCCESS (6.7 s)
[INFO] Building: purge-local-repository-reresolve\pom.xml
[INFO] run script verify.bsh
[INFO] ..SUCCESS (7.0 s)
[INFO] Building: purge-local-repository-snapshots-only\pom.xml
[INFO] run script setup.bsh
[INFO] snapshot org.apache.maven.its.dependency:snap-purged:1.0-SNAPSHOT: checking for updates from apache.snapshots
[INFO] artifact org.apache.maven.its.dependency.snap-purged:1.0-SNAPSHOT: checking for updates from central
[INFO] run script verify.bsh
[INFO] ..SUCCESS (7.8 s)
[INFO] Building: purge-local-repository-version-range\pom.xml
[INFO] artifact org.apache.maven.its.dependency:purge-local-repository: checking for updates from central
[INFO] artifact org.apache.maven.its.dependency:purge-local-repository: checking for updates from central
[INFO] run script verify.bsh
[INFO] ..SUCCESS (6.9 s)
[INFO] Building: resolve\pom.xml
[INFO] ..SUCCESS (6.5 s)
[INFO] Building: resolve-plugins\pom.xml
[INFO] ..SUCCESS (7.5 s)
[INFO] Building: resolve-plugins-exclude-reactor\pom.xml
[INFO] run script verify.groovy
[INFO] ..SUCCESS (8.4 s)
[INFO] Building: resolve-plugins-with-exclude\pom.xml
[INFO] run script verify.groovy
[INFO] ..SUCCESS (7.4 s)
[INFO] Building: sources\pom.xml
[INFO] artifact classworlds.classworlds:1.1-alpha-2: checking for updates from central
[INFO] ..SUCCESS (7.0 s)
[INFO] Building: tree\pom.xml
[INFO] run script verify.bsh
[INFO] ..SUCCESS (6.7 s)
[INFO] Building: tree-includes\pom.xml
[INFO] run script verify.bsh
[INFO] ..SUCCESS (6.8 s)
[INFO] Building: tree-multimodule\pom.xml
[INFO] snapshot org.apache.maven.its.dependency:tree-multimodule-module-a:1.0-SNAPSHOT: checking for updates from apache.snapshots
[INFO] artifact org.apache.maven.its.dependency.tree-multimodule-module-a:1.0-SNAPSHOT: checking for updates from central
[INFO] run script verify.bsh
[INFO] ..SUCCESS (7.8 s)
[INFO] Building: unpack\pom.xml
[INFO] run script verify.bsh
[INFO] ..SUCCESS (8.2 s)
[INFO] Building: unpack-cli\pom.xml
[INFO] run script verify.bsh
[INFO] ..SUCCESS (6.9 s)
[INFO] Building: unpack-custom-ear\pom.xml
[INFO] run script verify.groovy
[INFO] ..SUCCESS (7.3 s)
[INFO] Building: unpack-dependencies\pom.xml
[INFO] run script verify.groovy
[INFO] ..SUCCESS (8.7 s)
[INFO] Building: unpack-from-remote-repository\pom.xml
[INFO] run script setup.bsh
[INFO] artifact org.apache.maven.its.dependency.fake-remote-unpack:1.0: checking for updates from central
[INFO] run script verify.bsh
[INFO] ..SUCCESS (8.4 s)
[INFO] Building: used-dependencies\pom.xml
[INFO] ..SUCCESS (8.7 s)
[INFO] Building: purge-local-repository-without-pom
[INFO] run script setup.bsh
[INFO] run script verify.bsh
[INFO] ..SUCCESS (6.7 s)
[INFO]
[INFO] --- mrm-maven-plugin:1.0.0:stop (default) @ maven-dependency-plugin ---
[INFO] Stopping Mock Repository Manager on http://localhost:65168
[INFO] Mock Repository Manager http://localhost:65168 is stopped.
[INFO]
[INFO] --- maven-checkstyle-plugin:2.15:check (checkstyle-check) @ maven-dependency-plugin ---
[INFO] There is 1 error reported by Checkstyle 6.1.1 with config/maven_checks.xml ruleset.
[INFO] Ignored 1 error, 0 violation remaining.
[INFO]
[INFO] --- maven-invoker-plugin:2.0.0:verify (integration-test) @ maven-dependency-plugin ---
[INFO] -------------------------------------------------
[INFO] Build Summary:
[INFO]   Passed: 53, Failed: 0, Errors: 0, Skipped: 4
[INFO] -------------------------------------------------
[INFO]
[INFO] --- maven-install-plugin:2.5.2:install (default-install) @ maven-dependency-plugin ---
[INFO] Installing F:\jenkins\jenkins-slave\workspace\maven-plugins-ITs-m3-windows\maven-dependency-plugin\target\maven-dependency-plugin-3.0.2-SNAPSHOT.jar to C:\Users\jenkins\.m2\repository\org\apache\maven\plugins\maven-dependency-plugin\3.0.2-SNAPSHOT\maven-dependency-plugin-3.0.2-SNAPSHOT.jar
[INFO] Installing F:\jenkins\jenkins-slave\workspace\maven-plugins-ITs-m3-windows\maven-dependency-plugin\pom.xml to C:\Users\jenkins\.m2\repository\org\apache\maven\plugins\maven-dependency-plugin\3.0.2-SNAPSHOT\maven-dependency-plugin-3.0.2-SNAPSHOT.pom
[INFO]                                                                        
[INFO] ------------------------------------------------------------------------
[INFO] Building Apache Maven Plugins Aggregator 1-SNAPSHOT
[INFO] ------------------------------------------------------------------------
[INFO]
[INFO] --- maven-clean-plugin:2.5:clean (default-clean) @ maven-plugins-aggregator ---
[INFO]
[INFO] --- maven-enforcer-plugin:1.3.1:enforce (enforce-bytecode-version) @ maven-plugins-aggregator ---
[INFO]
[INFO] --- maven-enforcer-plugin:1.3.1:enforce (ban-known-bad-maven-versions) @ maven-plugins-aggregator ---
[INFO]
[INFO] --- maven-remote-resources-plugin:1.5:process (default) @ maven-plugins-aggregator ---
[INFO]
[INFO] --- maven-site-plugin:3.3:attach-descriptor (attach-descriptor) @ maven-plugins-aggregator ---
[INFO]
[INFO] --- maven-install-plugin:2.5.1:install (default-install) @ maven-plugins-aggregator ---
[INFO] Installing <https://builds.apache.org/job/maven-plugins-ITs-m3-windows/ws/pom.xml> to C:\Users\jenkins\.m2\repository\org\apache\maven\plugins\maven-plugins-aggregator\1-SNAPSHOT\maven-plugins-aggregator-1-SNAPSHOT.pom
[INFO] ------------------------------------------------------------------------
[INFO] Reactor Summary:
[INFO]
[INFO] Apache Maven ACR Plugin ............................ SUCCESS [ 49.022 s]
[INFO] Apache Maven AntRun Plugin ......................... SUCCESS [02:48 min]
[INFO] Apache Maven Changelog Plugin ...................... SUCCESS [01:19 min]
[INFO] Apache Maven Changes Plugin ........................ SUCCESS [02:11 min]
[INFO] Apache Maven Clean Plugin .......................... SUCCESS [ 50.552 s]
[INFO] Apache Maven Compiler Plugin ....................... SUCCESS [03:57 min]
[INFO] Apache Maven Deploy Plugin ......................... SUCCESS [03:36 min]
[INFO] Apache Maven Documentation Checker Plugin .......... SUCCESS [ 10.631 s]
[INFO] Apache Maven EAR Plugin ............................ SUCCESS [10:09 min]
[INFO] Apache Maven EJB Plugin ............................ SUCCESS [01:13 min]
[INFO] Apache Maven Help Plugin ........................... SUCCESS [03:25 min]
[INFO] Apache Maven Install Plugin ........................ SUCCESS [03:09 min]
[INFO] Apache Maven Jarsigner Plugin ...................... SUCCESS [01:18 min]
[INFO] Apache Maven JDeps Plugin .......................... SUCCESS [  4.115 s]
[INFO] Apache Maven Linkcheck Plugin ...................... SUCCESS [  5.135 s]
[INFO] Apache Maven Patch Plugin .......................... SUCCESS [ 10.620 s]
[INFO] Apache Maven PDF Plugin ............................ SUCCESS [ 44.162 s]
[INFO] Apache Maven RAR Plugin ............................ SUCCESS [ 21.979 s]
[INFO] Apache Maven Repository Plugin ..................... SUCCESS [ 47.156 s]
[INFO] Apache Maven Resources Plugin ...................... SUCCESS [02:27 min]
[INFO] Apache Maven Site Plugin ........................... SUCCESS [11:29 min]
[INFO] Apache Maven Source Plugin ......................... SUCCESS [01:49 min]
[INFO] Apache Maven Stage Plugin .......................... SUCCESS [  4.555 s]
[INFO] Apache Maven Toolchains Plugin ..................... SUCCESS [ 27.247 s]
[INFO] Apache Maven Verifier Plugin ....................... SUCCESS [ 18.199 s]
[INFO] Apache Maven WAR Plugin ............................ SUCCESS [03:24 min]
[INFO] Apache Maven DOAP Plugin ........................... SUCCESS [ 36.309 s]
[INFO] Apache Maven Invoker Plugin ........................ SUCCESS [12:03 min]
[INFO] Apache Maven JAR Plugin ............................ SUCCESS [03:10 min]
[INFO] Apache Maven Assembly Plugin ....................... SUCCESS [19:11 min]
[INFO] Apache Maven Checkstyle Plugin ..................... SUCCESS [07:20 min]
[INFO] Apache Maven Javadoc Plugin ........................ SUCCESS [09:24 min]
[INFO] Apache Maven PMD Plugin ............................ SUCCESS [03:45 min]
[INFO] Apache Maven JLink Plugin .......................... SUCCESS [  7.180 s]
[INFO] Apache Maven JMod Plugin ........................... FAILURE [01:09 min]
[INFO] Apache Maven Project Info Reports Plugin ........... SUCCESS [03:32 min]
[INFO] Apache Maven Remote Resources Plugin ............... SUCCESS [01:44 min]
[INFO] Apache Maven Shade Plugin .......................... SUCCESS [06:59 min]
[INFO] Apache Maven SCM Publish Plugin .................... SUCCESS [01:17 min]
[INFO] Apache Maven Dependency Plugin ..................... SUCCESS [07:55 min]
[INFO] Apache Maven Plugins Aggregator .................... SUCCESS [  1.007 s]
[INFO] ------------------------------------------------------------------------
[INFO] BUILD FAILURE
[INFO] ------------------------------------------------------------------------
[INFO] Total time: 02:15 h
[INFO] Finished at: 2017-09-08T22:49:15+00:00
[INFO] Final Memory: 162M/541M
[INFO] ------------------------------------------------------------------------
[WARNING] The requested profile "apache.snapshots" could not be activated because it does not exist.
[ERROR] Failed to execute goal org.apache.maven.plugins:maven-invoker-plugin:3.0.1:verify (integration-test) on project maven-jmod-plugin: 11 builds failed. See console output above for details. -> [Help 1]
[ERROR]
[ERROR] To see the full stack trace of the errors, re-run Maven with the -e switch.
[ERROR] Re-run Maven using the -X switch to enable full debug logging.
[ERROR]
[ERROR] For more information about the errors and possible solutions, please read the following articles:
[ERROR] [Help 1] http://cwiki.apache.org/confluence/display/MAVEN/MojoFailureException
[ERROR]
[ERROR] After correcting the problems, you can resume the build with the command
[ERROR]   mvn <goals> -rf :maven-jmod-plugin
Build step 'Invoke top-level Maven targets' marked build as failure
Deleting 1 temporary files
Recording test results
Reply | Threaded
Open this post in threaded view
|

Build failed in Jenkins: maven-plugins-ITs-m3-windows #1990

Apache Jenkins Server-2
See <https://builds.apache.org/job/maven-plugins-ITs-m3-windows/1990/display/redirect?page=changes>

Changes:

[khmarbaise] [MDEP-581] Downgrade maven-artifact-transfer to release version instead of SNAPSHOT

------------------------------------------
[...truncated 3.38 MB...]
[INFO] Building: copy-from-reactor\pom.xml
[INFO] run script verify.bsh
[INFO] ..SUCCESS (8.3 s)
[INFO] Building: copy-from-remote-repository\pom.xml
[INFO] run script setup.bsh
[INFO] artifact org.apache.maven.its.dependency.fake-remote-copy:1.0: checking for updates from central
[INFO] run script verify.bsh
[INFO] ..SUCCESS (8.3 s)
[INFO] Building: dependency-properties\pom.xml
[INFO] run script verify.bsh
[INFO] ..SUCCESS (6.8 s)
[INFO] Building: filterunpack\pom.xml
[INFO] run script verify.groovy
[INFO] ..SUCCESS (6.9 s)
[INFO] Building: get-artifact\pom.xml
[INFO] run script setup.bsh
[INFO] run script verify.bsh
[INFO] ..SUCCESS (6.7 s)
[INFO] Building: get-artifact-maven-plugin\pom.xml
[INFO] run script setup.bsh
[INFO] run script verify.bsh
[INFO] ..SUCCESS (6.6 s)
[INFO] Building: get-artifact-no-transitive\pom.xml
[INFO] run script setup.bsh
[INFO] run script verify.bsh
[INFO] ..SUCCESS (6.8 s)
[INFO] Building: get-gav\pom.xml
[INFO] run script setup.bsh
[INFO] run script verify.bsh
[INFO] ..SUCCESS (6.9 s)
[INFO] Building: go-offline\pom.xml
[INFO] ..SUCCESS (8.4 s)
[INFO] Building: list-repositories\pom.xml
[INFO] snapshot org.apache.maven.its.dependency:test:1.0-SNAPSHOT: checking for updates from apache.snapshots
[INFO] artifact org.apache.maven.its.dependency.test:1.0-SNAPSHOT: checking for updates from central
[INFO] ..SUCCESS (7.1 s)
[INFO] Building: mdep-439-analyze-java8\pom.xml
[INFO] ..SKIPPED due to JRE version
[INFO] Building: mdep-450-project-with-ancestor\pom.xml
[INFO] run script verify.groovy
[INFO] ..SUCCESS (6.5 s)
[INFO] Building: mdep-450-project-without-ancestor\pom.xml
[INFO] run script verify.groovy
[INFO] ..SUCCESS (6.7 s)
[INFO] Building: mdep-506-dependency-without-version-in-depmgt\pom.xml
[INFO] ..SUCCESS (7.6 s)
[INFO] Building: mdep-571-resolve-java9\pom.xml
[INFO] ..SKIPPED due to JRE version
[INFO] Building: mdep-572-unpack-tar-long-file\pom.xml
[INFO] run script verify.bsh
[INFO] ..SUCCESS (7.9 s)
[INFO] Building: mdep-578_display-reason-invalid-module\pom.xml
[INFO] ..SKIPPED due to JRE version
[INFO] Building: mdep-580_display-manifest-automodules\pom.xml
[INFO] ..SKIPPED due to JRE version
[INFO] Building: purge-local-repository\pom.xml
[INFO] run script setup.bsh
[INFO] artifact org.apache.maven.its.dependency.purged:1.0: checking for updates from central
[INFO] run script verify.bsh
[INFO] ..SUCCESS (6.6 s)
[INFO] Building: purge-local-repository-bad-dep\pom.xml
[INFO] snapshot org.apache.maven.its.dependency:purge-local-repository-bad-dep:1.0-SNAPSHOT: checking for updates from apache.snapshots
[INFO] artifact org.apache.maven.its.dependency.purge-local-repository-bad-dep:1.0-SNAPSHOT: checking for updates from central
[INFO] artifact org.apache.maven.its.dependency.i-do-not-exist:1.0: checking for updates from central
[INFO] run script verify.groovy
[INFO] ..SUCCESS (6.9 s)
[INFO] Building: purge-local-repository-include\pom.xml
[INFO] snapshot org.apache.maven.its.dependency:purge-local-repository-include:1.0-SNAPSHOT: checking for updates from apache.snapshots
[INFO] artifact org.apache.maven.its.dependency.purge-local-repository-include:1.0-SNAPSHOT: checking for updates from central
[INFO] run script verify.groovy
[INFO] ..SUCCESS (7.0 s)
[INFO] Building: purge-local-repository-multi-module\pom.xml
[INFO] run script setup.bsh
[INFO] snapshot org.apache.maven.its.dependency:child1:1.0-SNAPSHOT: checking for updates from apache.snapshots
[INFO] artifact org.apache.maven.its.dependency.child1:1.0-SNAPSHOT: checking for updates from central
[INFO] artifact org.apache.maven.its.dependency.purged-a:1.0: checking for updates from central
[INFO] snapshot org.apache.maven.its.dependency:child2:1.0-SNAPSHOT: checking for updates from apache.snapshots
[INFO] artifact org.apache.maven.its.dependency.child2:1.0-SNAPSHOT: checking for updates from central
[INFO] artifact org.apache.maven.its.dependency.purged-b:1.0: checking for updates from central
[INFO] run script verify.bsh
[INFO] ..SUCCESS (7.5 s)
[INFO] Building: purge-local-repository-multi-module-execution\pom.xml
[INFO] run script setup.bsh
[INFO] run script verify.bsh
[INFO] ..SUCCESS (7.8 s)
[INFO] Building: purge-local-repository-non-transitive\pom.xml
[INFO] run script verify.bsh
[INFO] ..SUCCESS (6.9 s)
[INFO] Building: purge-local-repository-reresolve\pom.xml
[INFO] run script verify.bsh
[INFO] ..SUCCESS (7.0 s)
[INFO] Building: purge-local-repository-snapshots-only\pom.xml
[INFO] run script setup.bsh
[INFO] snapshot org.apache.maven.its.dependency:snap-purged:1.0-SNAPSHOT: checking for updates from apache.snapshots
[INFO] artifact org.apache.maven.its.dependency.snap-purged:1.0-SNAPSHOT: checking for updates from central
[INFO] run script verify.bsh
[INFO] ..SUCCESS (7.8 s)
[INFO] Building: purge-local-repository-version-range\pom.xml
[INFO] artifact org.apache.maven.its.dependency:purge-local-repository: checking for updates from central
[INFO] artifact org.apache.maven.its.dependency:purge-local-repository: checking for updates from central
[INFO] run script verify.bsh
[INFO] ..SUCCESS (7.0 s)
[INFO] Building: resolve\pom.xml
[INFO] ..SUCCESS (6.8 s)
[INFO] Building: resolve-plugins\pom.xml
[INFO] ..SUCCESS (7.3 s)
[INFO] Building: resolve-plugins-exclude-reactor\pom.xml
[INFO] run script verify.groovy
[INFO] ..SUCCESS (8.6 s)
[INFO] Building: resolve-plugins-with-exclude\pom.xml
[INFO] run script verify.groovy
[INFO] ..SUCCESS (7.4 s)
[INFO] Building: sources\pom.xml
[INFO] artifact classworlds.classworlds:1.1-alpha-2: checking for updates from central
[INFO] ..SUCCESS (7.0 s)
[INFO] Building: tree\pom.xml
[INFO] run script verify.bsh
[INFO] ..SUCCESS (6.5 s)
[INFO] Building: tree-includes\pom.xml
[INFO] run script verify.bsh
[INFO] ..SUCCESS (6.8 s)
[INFO] Building: tree-multimodule\pom.xml
[INFO] snapshot org.apache.maven.its.dependency:tree-multimodule-module-a:1.0-SNAPSHOT: checking for updates from apache.snapshots
[INFO] artifact org.apache.maven.its.dependency.tree-multimodule-module-a:1.0-SNAPSHOT: checking for updates from central
[INFO] run script verify.bsh
[INFO] ..SUCCESS (8.0 s)
[INFO] Building: unpack\pom.xml
[INFO] run script verify.bsh
[INFO] ..SUCCESS (8.2 s)
[INFO] Building: unpack-cli\pom.xml
[INFO] run script verify.bsh
[INFO] ..SUCCESS (6.8 s)
[INFO] Building: unpack-custom-ear\pom.xml
[INFO] run script verify.groovy
[INFO] ..SUCCESS (7.1 s)
[INFO] Building: unpack-dependencies\pom.xml
[INFO] run script verify.groovy
[INFO] ..SUCCESS (8.9 s)
[INFO] Building: unpack-from-remote-repository\pom.xml
[INFO] run script setup.bsh
[INFO] artifact org.apache.maven.its.dependency.fake-remote-unpack:1.0: checking for updates from central
[INFO] run script verify.bsh
[INFO] ..SUCCESS (8.3 s)
[INFO] Building: used-dependencies\pom.xml
[INFO] ..SUCCESS (8.5 s)
[INFO] Building: purge-local-repository-without-pom
[INFO] run script setup.bsh
[INFO] run script verify.bsh
[INFO] ..SUCCESS (6.8 s)
[INFO]
[INFO] --- mrm-maven-plugin:1.0.0:stop (default) @ maven-dependency-plugin ---
[INFO] Stopping Mock Repository Manager on http://localhost:62157
[INFO] Mock Repository Manager http://localhost:62157 is stopped.
[INFO]
[INFO] --- maven-checkstyle-plugin:2.15:check (checkstyle-check) @ maven-dependency-plugin ---
[INFO] There is 1 error reported by Checkstyle 6.1.1 with config/maven_checks.xml ruleset.
[INFO] Ignored 1 error, 0 violation remaining.
[INFO]
[INFO] --- maven-invoker-plugin:2.0.0:verify (integration-test) @ maven-dependency-plugin ---
[INFO] -------------------------------------------------
[INFO] Build Summary:
[INFO]   Passed: 53, Failed: 0, Errors: 0, Skipped: 4
[INFO] -------------------------------------------------
[INFO]
[INFO] --- maven-install-plugin:2.5.2:install (default-install) @ maven-dependency-plugin ---
[INFO] Installing F:\jenkins\jenkins-slave\workspace\maven-plugins-ITs-m3-windows\maven-dependency-plugin\target\maven-dependency-plugin-3.0.2-SNAPSHOT.jar to C:\Users\jenkins\.m2\repository\org\apache\maven\plugins\maven-dependency-plugin\3.0.2-SNAPSHOT\maven-dependency-plugin-3.0.2-SNAPSHOT.jar
[INFO] Installing F:\jenkins\jenkins-slave\workspace\maven-plugins-ITs-m3-windows\maven-dependency-plugin\pom.xml to C:\Users\jenkins\.m2\repository\org\apache\maven\plugins\maven-dependency-plugin\3.0.2-SNAPSHOT\maven-dependency-plugin-3.0.2-SNAPSHOT.pom
[INFO]                                                                        
[INFO] ------------------------------------------------------------------------
[INFO] Building Apache Maven Plugins Aggregator 1-SNAPSHOT
[INFO] ------------------------------------------------------------------------
[INFO]
[INFO] --- maven-clean-plugin:2.5:clean (default-clean) @ maven-plugins-aggregator ---
[INFO]
[INFO] --- maven-enforcer-plugin:1.3.1:enforce (enforce-bytecode-version) @ maven-plugins-aggregator ---
[INFO]
[INFO] --- maven-enforcer-plugin:1.3.1:enforce (ban-known-bad-maven-versions) @ maven-plugins-aggregator ---
[INFO]
[INFO] --- maven-remote-resources-plugin:1.5:process (default) @ maven-plugins-aggregator ---
[INFO]
[INFO] --- maven-site-plugin:3.3:attach-descriptor (attach-descriptor) @ maven-plugins-aggregator ---
[INFO]
[INFO] --- maven-install-plugin:2.5.1:install (default-install) @ maven-plugins-aggregator ---
[INFO] Installing <https://builds.apache.org/job/maven-plugins-ITs-m3-windows/ws/pom.xml> to C:\Users\jenkins\.m2\repository\org\apache\maven\plugins\maven-plugins-aggregator\1-SNAPSHOT\maven-plugins-aggregator-1-SNAPSHOT.pom
[INFO] ------------------------------------------------------------------------
[INFO] Reactor Summary:
[INFO]
[INFO] Apache Maven ACR Plugin ............................ SUCCESS [ 49.125 s]
[INFO] Apache Maven AntRun Plugin ......................... SUCCESS [02:47 min]
[INFO] Apache Maven Changelog Plugin ...................... SUCCESS [01:16 min]
[INFO] Apache Maven Changes Plugin ........................ SUCCESS [02:03 min]
[INFO] Apache Maven Clean Plugin .......................... SUCCESS [ 50.144 s]
[INFO] Apache Maven Compiler Plugin ....................... SUCCESS [03:54 min]
[INFO] Apache Maven Deploy Plugin ......................... SUCCESS [03:38 min]
[INFO] Apache Maven Documentation Checker Plugin .......... SUCCESS [ 10.194 s]
[INFO] Apache Maven EAR Plugin ............................ SUCCESS [10:11 min]
[INFO] Apache Maven EJB Plugin ............................ SUCCESS [01:13 min]
[INFO] Apache Maven Help Plugin ........................... SUCCESS [03:24 min]
[INFO] Apache Maven Install Plugin ........................ SUCCESS [03:04 min]
[INFO] Apache Maven Jarsigner Plugin ...................... SUCCESS [01:19 min]
[INFO] Apache Maven JDeps Plugin .......................... SUCCESS [  3.851 s]
[INFO] Apache Maven Linkcheck Plugin ...................... SUCCESS [  5.037 s]
[INFO] Apache Maven Patch Plugin .......................... SUCCESS [ 10.466 s]
[INFO] Apache Maven PDF Plugin ............................ SUCCESS [ 42.252 s]
[INFO] Apache Maven RAR Plugin ............................ SUCCESS [ 20.782 s]
[INFO] Apache Maven Repository Plugin ..................... SUCCESS [ 45.541 s]
[INFO] Apache Maven Resources Plugin ...................... SUCCESS [02:23 min]
[INFO] Apache Maven Site Plugin ........................... SUCCESS [11:16 min]
[INFO] Apache Maven Source Plugin ......................... SUCCESS [01:47 min]
[INFO] Apache Maven Stage Plugin .......................... SUCCESS [  4.131 s]
[INFO] Apache Maven Toolchains Plugin ..................... SUCCESS [ 26.758 s]
[INFO] Apache Maven Verifier Plugin ....................... SUCCESS [ 17.689 s]
[INFO] Apache Maven WAR Plugin ............................ SUCCESS [03:16 min]
[INFO] Apache Maven DOAP Plugin ........................... SUCCESS [ 34.725 s]
[INFO] Apache Maven Invoker Plugin ........................ SUCCESS [11:59 min]
[INFO] Apache Maven JAR Plugin ............................ SUCCESS [03:07 min]
[INFO] Apache Maven Assembly Plugin ....................... SUCCESS [18:41 min]
[INFO] Apache Maven Checkstyle Plugin ..................... SUCCESS [07:13 min]
[INFO] Apache Maven Javadoc Plugin ........................ SUCCESS [09:15 min]
[INFO] Apache Maven PMD Plugin ............................ SUCCESS [03:45 min]
[INFO] Apache Maven JLink Plugin .......................... SUCCESS [  6.632 s]
[INFO] Apache Maven JMod Plugin ........................... FAILURE [01:17 min]
[INFO] Apache Maven Project Info Reports Plugin ........... SUCCESS [03:52 min]
[INFO] Apache Maven Remote Resources Plugin ............... SUCCESS [01:52 min]
[INFO] Apache Maven Shade Plugin .......................... SUCCESS [07:23 min]
[INFO] Apache Maven SCM Publish Plugin .................... SUCCESS [01:16 min]
[INFO] Apache Maven Dependency Plugin ..................... SUCCESS [07:51 min]
[INFO] Apache Maven Plugins Aggregator .................... SUCCESS [  1.045 s]
[INFO] ------------------------------------------------------------------------
[INFO] BUILD FAILURE
[INFO] ------------------------------------------------------------------------
[INFO] Total time: 02:14 h
[INFO] Finished at: 2017-09-09T09:48:24+00:00
[INFO] Final Memory: 163M/589M
[INFO] ------------------------------------------------------------------------
[WARNING] The requested profile "apache.snapshots" could not be activated because it does not exist.
[ERROR] Failed to execute goal org.apache.maven.plugins:maven-invoker-plugin:3.0.1:verify (integration-test) on project maven-jmod-plugin: 11 builds failed. See console output above for details. -> [Help 1]
[ERROR]
[ERROR] To see the full stack trace of the errors, re-run Maven with the -e switch.
[ERROR] Re-run Maven using the -X switch to enable full debug logging.
[ERROR]
[ERROR] For more information about the errors and possible solutions, please read the following articles:
[ERROR] [Help 1] http://cwiki.apache.org/confluence/display/MAVEN/MojoFailureException
[ERROR]
[ERROR] After correcting the problems, you can resume the build with the command
[ERROR]   mvn <goals> -rf :maven-jmod-plugin
Build step 'Invoke top-level Maven targets' marked build as failure
Deleting 1 temporary files
Recording test results
Reply | Threaded
Open this post in threaded view
|

Build failed in Jenkins: maven-plugins-ITs-m3-windows #1991

Apache Jenkins Server-2
See <https://builds.apache.org/job/maven-plugins-ITs-m3-windows/1991/display/redirect?page=changes>

Changes:

[khmarbaise] Undone release base on JDK 8 JavaDoc issues.

[khmarbaise] [maven-release-plugin] prepare for next development iteration

[khmarbaise] [maven-release-plugin] prepare release maven-dependency-plugin-3.0.2

------------------------------------------
[...truncated 3.38 MB...]
[INFO] Building: analyze-report\pom.xml
[INFO] run script verify.bsh
[INFO] ..SUCCESS (10.0 s)
[INFO] Building: build-classpath\pom.xml
[INFO] run script verify.bsh
[INFO] ..SUCCESS (7.0 s)
[INFO] Building: build-classpath-output-file-and-property\pom.xml
[INFO] run script verify.bsh
[INFO] ..SUCCESS (9.6 s)
[INFO] Building: collect\pom.xml
[INFO] ..SUCCESS (7.1 s)
[INFO] Building: copy\pom.xml
[INFO] run script verify.bsh
[INFO] ..SUCCESS (7.0 s)
[INFO] Building: copy-and-unpack-with-alternate-local-repo\pom.xml
[INFO] run script verify.bsh
[INFO] ..SUCCESS (8.6 s)
[INFO] Building: copy-cli\pom.xml
[INFO] run script verify.bsh
[INFO] ..SUCCESS (6.7 s)
[INFO] Building: copy-dependencies\pom.xml
[INFO] run script verify.bsh
[INFO] ..SUCCESS (7.9 s)
[INFO] Building: copy-from-reactor\pom.xml
[INFO] run script verify.bsh
[INFO] ..SUCCESS (8.3 s)
[INFO] Building: copy-from-remote-repository\pom.xml
[INFO] run script setup.bsh
[INFO] run script verify.bsh
[INFO] ..SUCCESS (8.2 s)
[INFO] Building: dependency-properties\pom.xml
[INFO] run script verify.bsh
[INFO] ..SUCCESS (6.8 s)
[INFO] Building: filterunpack\pom.xml
[INFO] run script verify.groovy
[INFO] ..SUCCESS (6.9 s)
[INFO] Building: get-artifact\pom.xml
[INFO] run script setup.bsh
[INFO] run script verify.bsh
[INFO] ..SUCCESS (6.7 s)
[INFO] Building: get-artifact-maven-plugin\pom.xml
[INFO] run script setup.bsh
[INFO] run script verify.bsh
[INFO] ..SUCCESS (6.6 s)
[INFO] Building: get-artifact-no-transitive\pom.xml
[INFO] run script setup.bsh
[INFO] run script verify.bsh
[INFO] ..SUCCESS (6.6 s)
[INFO] Building: get-gav\pom.xml
[INFO] run script setup.bsh
[INFO] run script verify.bsh
[INFO] ..SUCCESS (6.8 s)
[INFO] Building: go-offline\pom.xml
[INFO] ..SUCCESS (8.4 s)
[INFO] Building: list-repositories\pom.xml
[INFO] ..SUCCESS (6.6 s)
[INFO] Building: mdep-439-analyze-java8\pom.xml
[INFO] ..SKIPPED due to JRE version
[INFO] Building: mdep-450-project-with-ancestor\pom.xml
[INFO] run script verify.groovy
[INFO] ..SUCCESS (6.6 s)
[INFO] Building: mdep-450-project-without-ancestor\pom.xml
[INFO] run script verify.groovy
[INFO] ..SUCCESS (6.4 s)
[INFO] Building: mdep-506-dependency-without-version-in-depmgt\pom.xml
[INFO] ..SUCCESS (7.9 s)
[INFO] Building: mdep-571-resolve-java9\pom.xml
[INFO] ..SKIPPED due to JRE version
[INFO] Building: mdep-572-unpack-tar-long-file\pom.xml
[INFO] run script verify.bsh
[INFO] ..SUCCESS (8.3 s)
[INFO] Building: mdep-578_display-reason-invalid-module\pom.xml
[INFO] ..SKIPPED due to JRE version
[INFO] Building: mdep-580_display-manifest-automodules\pom.xml
[INFO] ..SKIPPED due to JRE version
[INFO] Building: purge-local-repository\pom.xml
[INFO] run script setup.bsh
[INFO] run script verify.bsh
[INFO] ..SUCCESS (6.7 s)
[INFO] Building: purge-local-repository-bad-dep\pom.xml
[INFO] run script verify.groovy
[INFO] ..SUCCESS (7.0 s)
[INFO] Building: purge-local-repository-include\pom.xml
[INFO] run script verify.groovy
[INFO] ..SUCCESS (6.8 s)
[INFO] Building: purge-local-repository-multi-module\pom.xml
[INFO] run script setup.bsh
[INFO] run script verify.bsh
[INFO] ..SUCCESS (6.9 s)
[INFO] Building: purge-local-repository-multi-module-execution\pom.xml
[INFO] run script setup.bsh
[INFO] run script verify.bsh
[INFO] ..SUCCESS (8.0 s)
[INFO] Building: purge-local-repository-non-transitive\pom.xml
[INFO] run script verify.bsh
[INFO] ..SUCCESS (6.8 s)
[INFO] Building: purge-local-repository-reresolve\pom.xml
[INFO] run script verify.bsh
[INFO] ..SUCCESS (7.3 s)
[INFO] Building: purge-local-repository-snapshots-only\pom.xml
[INFO] run script setup.bsh
[INFO] run script verify.bsh
[INFO] ..SUCCESS (7.3 s)
[INFO] Building: purge-local-repository-version-range\pom.xml
[INFO] run script verify.bsh
[INFO] ..SUCCESS (7.0 s)
[INFO] Building: resolve\pom.xml
[INFO] ..SUCCESS (6.8 s)
[INFO] Building: resolve-plugins\pom.xml
[INFO] ..SUCCESS (7.7 s)
[INFO] Building: resolve-plugins-exclude-reactor\pom.xml
[INFO] run script verify.groovy
[INFO] ..SUCCESS (8.6 s)
[INFO] Building: resolve-plugins-with-exclude\pom.xml
[INFO] run script verify.groovy
[INFO] ..SUCCESS (7.4 s)
[INFO] Building: sources\pom.xml
[INFO] ..SUCCESS (7.1 s)
[INFO] Building: tree\pom.xml
[INFO] run script verify.bsh
[INFO] ..SUCCESS (7.1 s)
[INFO] Building: tree-includes\pom.xml
[INFO] run script verify.bsh
[INFO] ..SUCCESS (6.7 s)
[INFO] Building: tree-multimodule\pom.xml
[INFO] run script verify.bsh
[INFO] ..SUCCESS (7.6 s)
[INFO] Building: unpack\pom.xml
[INFO] run script verify.bsh
[INFO] ..SUCCESS (8.7 s)
[INFO] Building: unpack-cli\pom.xml
[INFO] run script verify.bsh
[INFO] ..SUCCESS (7.0 s)
[INFO] Building: unpack-custom-ear\pom.xml
[INFO] run script verify.groovy
[INFO] ..SUCCESS (7.1 s)
[INFO] Building: unpack-dependencies\pom.xml
[INFO] run script verify.groovy
[INFO] ..SUCCESS (8.8 s)
[INFO] Building: unpack-from-remote-repository\pom.xml
[INFO] run script setup.bsh
[INFO] run script verify.bsh
[INFO] ..SUCCESS (8.4 s)
[INFO] Building: used-dependencies\pom.xml
[INFO] ..SUCCESS (9.0 s)
[INFO] Building: purge-local-repository-without-pom
[INFO] run script setup.bsh
[INFO] run script verify.bsh
[INFO] ..SUCCESS (6.7 s)
[INFO]
[INFO] --- mrm-maven-plugin:1.0.0:stop (default) @ maven-dependency-plugin ---
[INFO] Stopping Mock Repository Manager on http://localhost:49812
[INFO] Mock Repository Manager http://localhost:49812 is stopped.
[INFO]
[INFO] --- maven-checkstyle-plugin:2.15:check (checkstyle-check) @ maven-dependency-plugin ---
[INFO] There is 1 error reported by Checkstyle 6.1.1 with config/maven_checks.xml ruleset.
[INFO] Ignored 1 error, 0 violation remaining.
[INFO]
[INFO] --- maven-invoker-plugin:2.0.0:verify (integration-test) @ maven-dependency-plugin ---
[INFO] -------------------------------------------------
[INFO] Build Summary:
[INFO]   Passed: 53, Failed: 0, Errors: 0, Skipped: 4
[INFO] -------------------------------------------------
[INFO]
[INFO] --- maven-install-plugin:2.5.2:install (default-install) @ maven-dependency-plugin ---
[INFO] Installing F:\jenkins\jenkins-slave\workspace\maven-plugins-ITs-m3-windows\maven-dependency-plugin\target\maven-dependency-plugin-3.0.2-SNAPSHOT.jar to C:\Users\jenkins\.m2\repository\org\apache\maven\plugins\maven-dependency-plugin\3.0.2-SNAPSHOT\maven-dependency-plugin-3.0.2-SNAPSHOT.jar
[INFO] Installing F:\jenkins\jenkins-slave\workspace\maven-plugins-ITs-m3-windows\maven-dependency-plugin\pom.xml to C:\Users\jenkins\.m2\repository\org\apache\maven\plugins\maven-dependency-plugin\3.0.2-SNAPSHOT\maven-dependency-plugin-3.0.2-SNAPSHOT.pom
[INFO]                                                                        
[INFO] ------------------------------------------------------------------------
[INFO] Building Apache Maven Plugins Aggregator 1-SNAPSHOT
[INFO] ------------------------------------------------------------------------
[INFO]
[INFO] --- maven-clean-plugin:2.5:clean (default-clean) @ maven-plugins-aggregator ---
[INFO]
[INFO] --- maven-enforcer-plugin:1.3.1:enforce (enforce-bytecode-version) @ maven-plugins-aggregator ---
[INFO]
[INFO] --- maven-enforcer-plugin:1.3.1:enforce (ban-known-bad-maven-versions) @ maven-plugins-aggregator ---
[INFO]
[INFO] --- maven-remote-resources-plugin:1.5:process (default) @ maven-plugins-aggregator ---
[INFO]
[INFO] --- maven-site-plugin:3.3:attach-descriptor (attach-descriptor) @ maven-plugins-aggregator ---
[INFO]
[INFO] --- maven-install-plugin:2.5.1:install (default-install) @ maven-plugins-aggregator ---
[INFO] Installing <https://builds.apache.org/job/maven-plugins-ITs-m3-windows/ws/pom.xml> to C:\Users\jenkins\.m2\repository\org\apache\maven\plugins\maven-plugins-aggregator\1-SNAPSHOT\maven-plugins-aggregator-1-SNAPSHOT.pom
[INFO] ------------------------------------------------------------------------
[INFO] Reactor Summary:
[INFO]
[INFO] Apache Maven ACR Plugin ............................ SUCCESS [ 45.258 s]
[INFO] Apache Maven AntRun Plugin ......................... SUCCESS [02:39 min]
[INFO] Apache Maven Changelog Plugin ...................... SUCCESS [01:14 min]
[INFO] Apache Maven Changes Plugin ........................ SUCCESS [02:06 min]
[INFO] Apache Maven Clean Plugin .......................... SUCCESS [ 50.630 s]
[INFO] Apache Maven Compiler Plugin ....................... SUCCESS [03:58 min]
[INFO] Apache Maven Deploy Plugin ......................... SUCCESS [03:37 min]
[INFO] Apache Maven Documentation Checker Plugin .......... SUCCESS [  9.738 s]
[INFO] Apache Maven EAR Plugin ............................ SUCCESS [10:14 min]
[INFO] Apache Maven EJB Plugin ............................ SUCCESS [01:12 min]
[INFO] Apache Maven Help Plugin ........................... SUCCESS [03:23 min]
[INFO] Apache Maven Install Plugin ........................ SUCCESS [03:11 min]
[INFO] Apache Maven Jarsigner Plugin ...................... SUCCESS [01:26 min]
[INFO] Apache Maven JDeps Plugin .......................... SUCCESS [  4.606 s]
[INFO] Apache Maven Linkcheck Plugin ...................... SUCCESS [  5.424 s]
[INFO] Apache Maven Patch Plugin .......................... SUCCESS [ 11.482 s]
[INFO] Apache Maven PDF Plugin ............................ SUCCESS [ 46.758 s]
[INFO] Apache Maven RAR Plugin ............................ SUCCESS [ 22.657 s]
[INFO] Apache Maven Repository Plugin ..................... SUCCESS [ 48.484 s]
[INFO] Apache Maven Resources Plugin ...................... SUCCESS [02:30 min]
[INFO] Apache Maven Site Plugin ........................... SUCCESS [11:38 min]
[INFO] Apache Maven Source Plugin ......................... SUCCESS [01:44 min]
[INFO] Apache Maven Stage Plugin .......................... SUCCESS [  3.911 s]
[INFO] Apache Maven Toolchains Plugin ..................... SUCCESS [ 26.251 s]
[INFO] Apache Maven Verifier Plugin ....................... SUCCESS [ 17.674 s]
[INFO] Apache Maven WAR Plugin ............................ SUCCESS [03:18 min]
[INFO] Apache Maven DOAP Plugin ........................... SUCCESS [ 34.208 s]
[INFO] Apache Maven Invoker Plugin ........................ SUCCESS [12:14 min]
[INFO] Apache Maven JAR Plugin ............................ SUCCESS [03:23 min]
[INFO] Apache Maven Assembly Plugin ....................... SUCCESS [20:10 min]
[INFO] Apache Maven Checkstyle Plugin ..................... SUCCESS [07:58 min]
[INFO] Apache Maven Javadoc Plugin ........................ SUCCESS [09:32 min]
[INFO] Apache Maven PMD Plugin ............................ SUCCESS [03:45 min]
[INFO] Apache Maven JLink Plugin .......................... SUCCESS [  6.809 s]
[INFO] Apache Maven JMod Plugin ........................... FAILURE [01:09 min]
[INFO] Apache Maven Project Info Reports Plugin ........... SUCCESS [03:33 min]
[INFO] Apache Maven Remote Resources Plugin ............... SUCCESS [01:43 min]
[INFO] Apache Maven Shade Plugin .......................... SUCCESS [07:05 min]
[INFO] Apache Maven SCM Publish Plugin .................... SUCCESS [01:19 min]
[INFO] Apache Maven Dependency Plugin ..................... SUCCESS [07:53 min]
[INFO] Apache Maven Plugins Aggregator .................... SUCCESS [  0.984 s]
[INFO] ------------------------------------------------------------------------
[INFO] BUILD FAILURE
[INFO] ------------------------------------------------------------------------
[INFO] Total time: 02:17 h
[INFO] Finished at: 2017-09-09T12:10:14+00:00
[INFO] Final Memory: 162M/536M
[INFO] ------------------------------------------------------------------------
[WARNING] The requested profile "apache.snapshots" could not be activated because it does not exist.
[ERROR] Failed to execute goal org.apache.maven.plugins:maven-invoker-plugin:3.0.1:verify (integration-test) on project maven-jmod-plugin: 11 builds failed. See console output above for details. -> [Help 1]
[ERROR]
[ERROR] To see the full stack trace of the errors, re-run Maven with the -e switch.
[ERROR] Re-run Maven using the -X switch to enable full debug logging.
[ERROR]
[ERROR] For more information about the errors and possible solutions, please read the following articles:
[ERROR] [Help 1] http://cwiki.apache.org/confluence/display/MAVEN/MojoFailureException
[ERROR]
[ERROR] After correcting the problems, you can resume the build with the command
[ERROR]   mvn <goals> -rf :maven-jmod-plugin
Build step 'Invoke top-level Maven targets' marked build as failure
Deleting 1 temporary files
Recording test results
Reply | Threaded
Open this post in threaded view
|

Build failed in Jenkins: maven-plugins-ITs-m3-windows #1992

Apache Jenkins Server-2
See <https://builds.apache.org/job/maven-plugins-ITs-m3-windows/1992/display/redirect?page=changes>

Changes:

[khmarbaise] [maven-release-plugin] prepare for next development iteration

[khmarbaise] [maven-release-plugin] prepare release maven-dependency-plugin-3.0.2

[khmarbaise] [MDEP-583] Failed to create release on JDK 8 based on JavaDoc issues
 o Fixed JavaDoc issues with JDK 8.
 o Fixed some checkstyle reported issues as well.

------------------------------------------
[...truncated 3.38 MB...]
[INFO] Building: analyze-report\pom.xml
[INFO] run script verify.bsh
[INFO] ..SUCCESS (12.2 s)
[INFO] Building: build-classpath\pom.xml
[INFO] run script verify.bsh
[INFO] ..SUCCESS (7.3 s)
[INFO] Building: build-classpath-output-file-and-property\pom.xml
[INFO] run script verify.bsh
[INFO] ..SUCCESS (10.9 s)
[INFO] Building: collect\pom.xml
[INFO] ..SUCCESS (7.5 s)
[INFO] Building: copy\pom.xml
[INFO] run script verify.bsh
[INFO] ..SUCCESS (7.9 s)
[INFO] Building: copy-and-unpack-with-alternate-local-repo\pom.xml
[INFO] run script verify.bsh
[INFO] ..SUCCESS (9.1 s)
[INFO] Building: copy-cli\pom.xml
[INFO] run script verify.bsh
[INFO] ..SUCCESS (7.6 s)
[INFO] Building: copy-dependencies\pom.xml
[INFO] run script verify.bsh
[INFO] ..SUCCESS (8.3 s)
[INFO] Building: copy-from-reactor\pom.xml
[INFO] run script verify.bsh
[INFO] ..SUCCESS (9.0 s)
[INFO] Building: copy-from-remote-repository\pom.xml
[INFO] run script setup.bsh
[INFO] run script verify.bsh
[INFO] ..SUCCESS (9.0 s)
[INFO] Building: dependency-properties\pom.xml
[INFO] run script verify.bsh
[INFO] ..SUCCESS (7.3 s)
[INFO] Building: filterunpack\pom.xml
[INFO] run script verify.groovy
[INFO] ..SUCCESS (7.7 s)
[INFO] Building: get-artifact\pom.xml
[INFO] run script setup.bsh
[INFO] run script verify.bsh
[INFO] ..SUCCESS (7.0 s)
[INFO] Building: get-artifact-maven-plugin\pom.xml
[INFO] run script setup.bsh
[INFO] run script verify.bsh
[INFO] ..SUCCESS (7.1 s)
[INFO] Building: get-artifact-no-transitive\pom.xml
[INFO] run script setup.bsh
[INFO] run script verify.bsh
[INFO] ..SUCCESS (7.4 s)
[INFO] Building: get-gav\pom.xml
[INFO] run script setup.bsh
[INFO] run script verify.bsh
[INFO] ..SUCCESS (7.6 s)
[INFO] Building: go-offline\pom.xml
[INFO] ..SUCCESS (9.5 s)
[INFO] Building: list-repositories\pom.xml
[INFO] ..SUCCESS (7.6 s)
[INFO] Building: mdep-439-analyze-java8\pom.xml
[INFO] ..SKIPPED due to JRE version
[INFO] Building: mdep-450-project-with-ancestor\pom.xml
[INFO] run script verify.groovy
[INFO] ..SUCCESS (7.5 s)
[INFO] Building: mdep-450-project-without-ancestor\pom.xml
[INFO] run script verify.groovy
[INFO] ..SUCCESS (7.3 s)
[INFO] Building: mdep-506-dependency-without-version-in-depmgt\pom.xml
[INFO] ..SUCCESS (8.6 s)
[INFO] Building: mdep-571-resolve-java9\pom.xml
[INFO] ..SKIPPED due to JRE version
[INFO] Building: mdep-572-unpack-tar-long-file\pom.xml
[INFO] run script verify.bsh
[INFO] ..SUCCESS (8.7 s)
[INFO] Building: mdep-578_display-reason-invalid-module\pom.xml
[INFO] ..SKIPPED due to JRE version
[INFO] Building: mdep-580_display-manifest-automodules\pom.xml
[INFO] ..SKIPPED due to JRE version
[INFO] Building: purge-local-repository\pom.xml
[INFO] run script setup.bsh
[INFO] run script verify.bsh
[INFO] ..SUCCESS (7.3 s)
[INFO] Building: purge-local-repository-bad-dep\pom.xml
[INFO] run script verify.groovy
[INFO] ..SUCCESS (7.6 s)
[INFO] Building: purge-local-repository-include\pom.xml
[INFO] run script verify.groovy
[INFO] ..SUCCESS (6.9 s)
[INFO] Building: purge-local-repository-multi-module\pom.xml
[INFO] run script setup.bsh
[INFO] run script verify.bsh
[INFO] ..SUCCESS (6.7 s)
[INFO] Building: purge-local-repository-multi-module-execution\pom.xml
[INFO] run script setup.bsh
[INFO] run script verify.bsh
[INFO] ..SUCCESS (8.8 s)
[INFO] Building: purge-local-repository-non-transitive\pom.xml
[INFO] run script verify.bsh
[INFO] ..SUCCESS (7.4 s)
[INFO] Building: purge-local-repository-reresolve\pom.xml
[INFO] run script verify.bsh
[INFO] ..SUCCESS (7.3 s)
[INFO] Building: purge-local-repository-snapshots-only\pom.xml
[INFO] run script setup.bsh
[INFO] run script verify.bsh
[INFO] ..SUCCESS (8.1 s)
[INFO] Building: purge-local-repository-version-range\pom.xml
[INFO] run script verify.bsh
[INFO] ..SUCCESS (7.5 s)
[INFO] Building: resolve\pom.xml
[INFO] ..SUCCESS (7.7 s)
[INFO] Building: resolve-plugins\pom.xml
[INFO] ..SUCCESS (7.9 s)
[INFO] Building: resolve-plugins-exclude-reactor\pom.xml
[INFO] run script verify.groovy
[INFO] ..SUCCESS (9.7 s)
[INFO] Building: resolve-plugins-with-exclude\pom.xml
[INFO] run script verify.groovy
[INFO] ..SUCCESS (8.3 s)
[INFO] Building: sources\pom.xml
[INFO] ..SUCCESS (7.9 s)
[INFO] Building: tree\pom.xml
[INFO] run script verify.bsh
[INFO] ..SUCCESS (7.5 s)
[INFO] Building: tree-includes\pom.xml
[INFO] run script verify.bsh
[INFO] ..SUCCESS (7.5 s)
[INFO] Building: tree-multimodule\pom.xml
[INFO] run script verify.bsh
[INFO] ..SUCCESS (8.3 s)
[INFO] Building: unpack\pom.xml
[INFO] run script verify.bsh
[INFO] ..SUCCESS (8.9 s)
[INFO] Building: unpack-cli\pom.xml
[INFO] run script verify.bsh
[INFO] ..SUCCESS (7.5 s)
[INFO] Building: unpack-custom-ear\pom.xml
[INFO] run script verify.groovy
[INFO] ..SUCCESS (8.1 s)
[INFO] Building: unpack-dependencies\pom.xml
[INFO] run script verify.groovy
[INFO] ..SUCCESS (9.3 s)
[INFO] Building: unpack-from-remote-repository\pom.xml
[INFO] run script setup.bsh
[INFO] run script verify.bsh
[INFO] ..SUCCESS (9.2 s)
[INFO] Building: used-dependencies\pom.xml
[INFO] ..SUCCESS (9.2 s)
[INFO] Building: purge-local-repository-without-pom
[INFO] run script setup.bsh
[INFO] run script verify.bsh
[INFO] ..SUCCESS (7.4 s)
[INFO]
[INFO] --- mrm-maven-plugin:1.0.0:stop (default) @ maven-dependency-plugin ---
[INFO] Stopping Mock Repository Manager on http://localhost:53521
[INFO] Mock Repository Manager http://localhost:53521 is stopped.
[INFO]
[INFO] --- maven-checkstyle-plugin:2.15:check (checkstyle-check) @ maven-dependency-plugin ---
[INFO] There is 1 error reported by Checkstyle 6.1.1 with config/maven_checks.xml ruleset.
[INFO] Ignored 1 error, 0 violation remaining.
[INFO]
[INFO] --- maven-invoker-plugin:2.0.0:verify (integration-test) @ maven-dependency-plugin ---
[INFO] -------------------------------------------------
[INFO] Build Summary:
[INFO]   Passed: 53, Failed: 0, Errors: 0, Skipped: 4
[INFO] -------------------------------------------------
[INFO]
[INFO] --- maven-install-plugin:2.5.2:install (default-install) @ maven-dependency-plugin ---
[INFO] Installing F:\jenkins\jenkins-slave\workspace\maven-plugins-ITs-m3-windows\maven-dependency-plugin\target\maven-dependency-plugin-3.0.3-SNAPSHOT.jar to C:\Users\jenkins\.m2\repository\org\apache\maven\plugins\maven-dependency-plugin\3.0.3-SNAPSHOT\maven-dependency-plugin-3.0.3-SNAPSHOT.jar
[INFO] Installing F:\jenkins\jenkins-slave\workspace\maven-plugins-ITs-m3-windows\maven-dependency-plugin\pom.xml to C:\Users\jenkins\.m2\repository\org\apache\maven\plugins\maven-dependency-plugin\3.0.3-SNAPSHOT\maven-dependency-plugin-3.0.3-SNAPSHOT.pom
[INFO]                                                                        
[INFO] ------------------------------------------------------------------------
[INFO] Building Apache Maven Plugins Aggregator 1-SNAPSHOT
[INFO] ------------------------------------------------------------------------
[INFO]
[INFO] --- maven-clean-plugin:2.5:clean (default-clean) @ maven-plugins-aggregator ---
[INFO]
[INFO] --- maven-enforcer-plugin:1.3.1:enforce (enforce-bytecode-version) @ maven-plugins-aggregator ---
[INFO]
[INFO] --- maven-enforcer-plugin:1.3.1:enforce (ban-known-bad-maven-versions) @ maven-plugins-aggregator ---
[INFO]
[INFO] --- maven-remote-resources-plugin:1.5:process (default) @ maven-plugins-aggregator ---
[INFO]
[INFO] --- maven-site-plugin:3.3:attach-descriptor (attach-descriptor) @ maven-plugins-aggregator ---
[INFO]
[INFO] --- maven-install-plugin:2.5.1:install (default-install) @ maven-plugins-aggregator ---
[INFO] Installing <https://builds.apache.org/job/maven-plugins-ITs-m3-windows/ws/pom.xml> to C:\Users\jenkins\.m2\repository\org\apache\maven\plugins\maven-plugins-aggregator\1-SNAPSHOT\maven-plugins-aggregator-1-SNAPSHOT.pom
[INFO] ------------------------------------------------------------------------
[INFO] Reactor Summary:
[INFO]
[INFO] Apache Maven ACR Plugin ............................ SUCCESS [ 45.107 s]
[INFO] Apache Maven AntRun Plugin ......................... SUCCESS [02:41 min]
[INFO] Apache Maven Changelog Plugin ...................... SUCCESS [01:14 min]
[INFO] Apache Maven Changes Plugin ........................ SUCCESS [02:08 min]
[INFO] Apache Maven Clean Plugin .......................... SUCCESS [ 52.138 s]
[INFO] Apache Maven Compiler Plugin ....................... SUCCESS [04:10 min]
[INFO] Apache Maven Deploy Plugin ......................... SUCCESS [04:01 min]
[INFO] Apache Maven Documentation Checker Plugin .......... SUCCESS [ 10.132 s]
[INFO] Apache Maven EAR Plugin ............................ SUCCESS [10:41 min]
[INFO] Apache Maven EJB Plugin ............................ SUCCESS [01:13 min]
[INFO] Apache Maven Help Plugin ........................... SUCCESS [03:22 min]
[INFO] Apache Maven Install Plugin ........................ SUCCESS [03:06 min]
[INFO] Apache Maven Jarsigner Plugin ...................... SUCCESS [01:18 min]
[INFO] Apache Maven JDeps Plugin .......................... SUCCESS [  3.871 s]
[INFO] Apache Maven Linkcheck Plugin ...................... SUCCESS [  5.722 s]
[INFO] Apache Maven Patch Plugin .......................... SUCCESS [ 11.109 s]
[INFO] Apache Maven PDF Plugin ............................ SUCCESS [ 42.567 s]
[INFO] Apache Maven RAR Plugin ............................ SUCCESS [ 21.558 s]
[INFO] Apache Maven Repository Plugin ..................... SUCCESS [ 44.924 s]
[INFO] Apache Maven Resources Plugin ...................... SUCCESS [02:26 min]
[INFO] Apache Maven Site Plugin ........................... SUCCESS [11:15 min]
[INFO] Apache Maven Source Plugin ......................... SUCCESS [01:46 min]
[INFO] Apache Maven Stage Plugin .......................... SUCCESS [  3.979 s]
[INFO] Apache Maven Toolchains Plugin ..................... SUCCESS [ 26.788 s]
[INFO] Apache Maven Verifier Plugin ....................... SUCCESS [ 16.751 s]
[INFO] Apache Maven WAR Plugin ............................ SUCCESS [03:22 min]
[INFO] Apache Maven DOAP Plugin ........................... SUCCESS [ 35.444 s]
[INFO] Apache Maven Invoker Plugin ........................ SUCCESS [12:11 min]
[INFO] Apache Maven JAR Plugin ............................ SUCCESS [03:28 min]
[INFO] Apache Maven Assembly Plugin ....................... SUCCESS [19:39 min]
[INFO] Apache Maven Checkstyle Plugin ..................... SUCCESS [07:21 min]
[INFO] Apache Maven Javadoc Plugin ........................ SUCCESS [09:15 min]
[INFO] Apache Maven PMD Plugin ............................ SUCCESS [03:46 min]
[INFO] Apache Maven JLink Plugin .......................... SUCCESS [  6.847 s]
[INFO] Apache Maven JMod Plugin ........................... FAILURE [01:08 min]
[INFO] Apache Maven Project Info Reports Plugin ........... SUCCESS [03:31 min]
[INFO] Apache Maven Remote Resources Plugin ............... SUCCESS [01:42 min]
[INFO] Apache Maven Shade Plugin .......................... SUCCESS [06:59 min]
[INFO] Apache Maven SCM Publish Plugin .................... SUCCESS [01:17 min]
[INFO] Apache Maven Dependency Plugin ..................... SUCCESS [08:29 min]
[INFO] Apache Maven Plugins Aggregator .................... SUCCESS [  1.044 s]
[INFO] ------------------------------------------------------------------------
[INFO] BUILD FAILURE
[INFO] ------------------------------------------------------------------------
[INFO] Total time: 02:17 h
[INFO] Finished at: 2017-09-09T14:31:43+00:00
[INFO] Final Memory: 163M/528M
[INFO] ------------------------------------------------------------------------
[WARNING] The requested profile "apache.snapshots" could not be activated because it does not exist.
[ERROR] Failed to execute goal org.apache.maven.plugins:maven-invoker-plugin:3.0.1:verify (integration-test) on project maven-jmod-plugin: 11 builds failed. See console output above for details. -> [Help 1]
[ERROR]
[ERROR] To see the full stack trace of the errors, re-run Maven with the -e switch.
[ERROR] Re-run Maven using the -X switch to enable full debug logging.
[ERROR]
[ERROR] For more information about the errors and possible solutions, please read the following articles:
[ERROR] [Help 1] http://cwiki.apache.org/confluence/display/MAVEN/MojoFailureException
[ERROR]
[ERROR] After correcting the problems, you can resume the build with the command
[ERROR]   mvn <goals> -rf :maven-jmod-plugin
Build step 'Invoke top-level Maven targets' marked build as failure
Deleting 1 temporary files
Recording test results
Reply | Threaded
Open this post in threaded view
|

Jenkins build is back to normal : maven-plugins-ITs-m3-windows #1993

Apache Jenkins Server-2