Build failed in Jenkins: maven-plugins-ITs-m3-windows #1984

Previous Topic Next Topic
 
classic Classic list List threaded Threaded
3 messages Options
Reply | Threaded
Open this post in threaded view
|

Build failed in Jenkins: maven-plugins-ITs-m3-windows #1984

Apache Jenkins Server-2
See <https://builds.apache.org/job/maven-plugins-ITs-m3-windows/1984/display/redirect?page=changes>

Changes:

[khmarbaise] o Improved error message
o Fixed command line options issue.

[khmarbaise] Cleaned up docs.
Removed some unused parameters.

[khmarbaise] o Changed ResolutionScope from COMPILE_PLUS_RUNTIME
  to RUNTIME only.
o Improved usage docs.

[khmarbaise] Added plexus-java cause we need information about module-info.class
to correctly create a Java Run Time Image.
Using the dependencies only to handle modules.

------------------------------------------
[...truncated 3.32 MB...]
[INFO] Building: copy-from-reactor\pom.xml
[INFO] run script verify.bsh
[INFO] ..SUCCESS (8.8 s)
[INFO] Building: copy-from-remote-repository\pom.xml
[INFO] run script setup.bsh
[INFO] artifact org.apache.maven.its.dependency.fake-remote-copy:1.0: checking for updates from central
[INFO] run script verify.bsh
[INFO] ..SUCCESS (9.0 s)
[INFO] Building: dependency-properties\pom.xml
[INFO] run script verify.bsh
[INFO] ..SUCCESS (7.8 s)
[INFO] Building: filterunpack\pom.xml
[INFO] run script verify.groovy
[INFO] ..SUCCESS (6.8 s)
[INFO] Building: get-artifact\pom.xml
[INFO] run script setup.bsh
[INFO] run script verify.bsh
[INFO] ..SUCCESS (6.7 s)
[INFO] Building: get-artifact-maven-plugin\pom.xml
[INFO] run script setup.bsh
[INFO] run script verify.bsh
[INFO] ..SUCCESS (6.4 s)
[INFO] Building: get-artifact-no-transitive\pom.xml
[INFO] run script setup.bsh
[INFO] run script verify.bsh
[INFO] ..SUCCESS (7.2 s)
[INFO] Building: get-gav\pom.xml
[INFO] run script setup.bsh
[INFO] run script verify.bsh
[INFO] ..SUCCESS (7.1 s)
[INFO] Building: go-offline\pom.xml
[INFO] ..SUCCESS (9.1 s)
[INFO] Building: list-repositories\pom.xml
[INFO] snapshot org.apache.maven.its.dependency:test:1.0-SNAPSHOT: checking for updates from apache.snapshots
[INFO] artifact org.apache.maven.its.dependency.test:1.0-SNAPSHOT: checking for updates from central
[INFO] ..SUCCESS (7.4 s)
[INFO] Building: mdep-439-analyze-java8\pom.xml
[INFO] ..SKIPPED due to JRE version
[INFO] Building: mdep-450-project-with-ancestor\pom.xml
[INFO] run script verify.groovy
[INFO] ..SUCCESS (7.2 s)
[INFO] Building: mdep-450-project-without-ancestor\pom.xml
[INFO] run script verify.groovy
[INFO] ..SUCCESS (7.0 s)
[INFO] Building: mdep-506-dependency-without-version-in-depmgt\pom.xml
[INFO] ..SUCCESS (9.2 s)
[INFO] Building: mdep-571-resolve-java9\pom.xml
[INFO] ..SKIPPED due to JRE version
[INFO] Building: mdep-572-unpack-tar-long-file\pom.xml
[INFO] run script verify.bsh
[INFO] ..SUCCESS (11.1 s)
[INFO] Building: mdep-578_display-reason-invalid-module\pom.xml
[INFO] ..SKIPPED due to JRE version
[INFO] Building: mdep-580_display-manifest-automodules\pom.xml
[INFO] ..SKIPPED due to JRE version
[INFO] Building: purge-local-repository\pom.xml
[INFO] run script setup.bsh
[INFO] artifact org.apache.maven.its.dependency.purged:1.0: checking for updates from central
[INFO] run script verify.bsh
[INFO] ..SUCCESS (7.5 s)
[INFO] Building: purge-local-repository-bad-dep\pom.xml
[INFO] snapshot org.apache.maven.its.dependency:purge-local-repository-bad-dep:1.0-SNAPSHOT: checking for updates from apache.snapshots
[INFO] artifact org.apache.maven.its.dependency.purge-local-repository-bad-dep:1.0-SNAPSHOT: checking for updates from central
[INFO] artifact org.apache.maven.its.dependency.i-do-not-exist:1.0: checking for updates from central
[INFO] run script verify.groovy
[INFO] ..SUCCESS (7.6 s)
[INFO] Building: purge-local-repository-include\pom.xml
[INFO] snapshot org.apache.maven.its.dependency:purge-local-repository-include:1.0-SNAPSHOT: checking for updates from apache.snapshots
[INFO] artifact org.apache.maven.its.dependency.purge-local-repository-include:1.0-SNAPSHOT: checking for updates from central
[INFO] run script verify.groovy
[INFO] ..SUCCESS (8.4 s)
[INFO] Building: purge-local-repository-multi-module\pom.xml
[INFO] run script setup.bsh
[INFO] snapshot org.apache.maven.its.dependency:child1:1.0-SNAPSHOT: checking for updates from apache.snapshots
[INFO] artifact org.apache.maven.its.dependency.child1:1.0-SNAPSHOT: checking for updates from central
[INFO] artifact org.apache.maven.its.dependency.purged-a:1.0: checking for updates from central
[INFO] snapshot org.apache.maven.its.dependency:child2:1.0-SNAPSHOT: checking for updates from apache.snapshots
[INFO] artifact org.apache.maven.its.dependency.child2:1.0-SNAPSHOT: checking for updates from central
[INFO] artifact org.apache.maven.its.dependency.purged-b:1.0: checking for updates from central
[INFO] run script verify.bsh
[INFO] ..SUCCESS (8.2 s)
[INFO] Building: purge-local-repository-multi-module-execution\pom.xml
[INFO] run script setup.bsh
[INFO] run script verify.bsh
[INFO] ..SUCCESS (7.7 s)
[INFO] Building: purge-local-repository-non-transitive\pom.xml
[INFO] run script verify.bsh
[INFO] ..SUCCESS (6.8 s)
[INFO] Building: purge-local-repository-reresolve\pom.xml
[INFO] run script verify.bsh
[INFO] ..SUCCESS (7.7 s)
[INFO] Building: purge-local-repository-snapshots-only\pom.xml
[INFO] run script setup.bsh
[INFO] snapshot org.apache.maven.its.dependency:snap-purged:1.0-SNAPSHOT: checking for updates from apache.snapshots
[INFO] artifact org.apache.maven.its.dependency.snap-purged:1.0-SNAPSHOT: checking for updates from central
[INFO] run script verify.bsh
[INFO] ..SUCCESS (8.3 s)
[INFO] Building: purge-local-repository-version-range\pom.xml
[INFO] artifact org.apache.maven.its.dependency:purge-local-repository: checking for updates from central
[INFO] artifact org.apache.maven.its.dependency:purge-local-repository: checking for updates from central
[INFO] run script verify.bsh
[INFO] ..SUCCESS (7.6 s)
[INFO] Building: resolve\pom.xml
[INFO] ..SUCCESS (7.5 s)
[INFO] Building: resolve-plugins\pom.xml
[INFO] ..SUCCESS (8.5 s)
[INFO] Building: resolve-plugins-exclude-reactor\pom.xml
[INFO] run script verify.groovy
[INFO] ..SUCCESS (9.5 s)
[INFO] Building: resolve-plugins-with-exclude\pom.xml
[INFO] run script verify.groovy
[INFO] ..SUCCESS (8.0 s)
[INFO] Building: sources\pom.xml
[INFO] artifact classworlds.classworlds:1.1-alpha-2: checking for updates from central
[INFO] ..SUCCESS (7.4 s)
[INFO] Building: tree\pom.xml
[INFO] run script verify.bsh
[INFO] ..SUCCESS (7.5 s)
[INFO] Building: tree-includes\pom.xml
[INFO] run script verify.bsh
[INFO] ..SUCCESS (8.1 s)
[INFO] Building: tree-multimodule\pom.xml
[INFO] snapshot org.apache.maven.its.dependency:tree-multimodule-module-a:1.0-SNAPSHOT: checking for updates from apache.snapshots
[INFO] artifact org.apache.maven.its.dependency.tree-multimodule-module-a:1.0-SNAPSHOT: checking for updates from central
[INFO] run script verify.bsh
[INFO] ..SUCCESS (9.0 s)
[INFO] Building: unpack\pom.xml
[INFO] run script verify.bsh
[INFO] ..SUCCESS (9.2 s)
[INFO] Building: unpack-cli\pom.xml
[INFO] run script verify.bsh
[INFO] ..SUCCESS (7.2 s)
[INFO] Building: unpack-custom-ear\pom.xml
[INFO] run script verify.groovy
[INFO] ..SUCCESS (7.6 s)
[INFO] Building: unpack-dependencies\pom.xml
[INFO] run script verify.groovy
[INFO] ..SUCCESS (10.2 s)
[INFO] Building: unpack-from-remote-repository\pom.xml
[INFO] run script setup.bsh
[INFO] artifact org.apache.maven.its.dependency.fake-remote-unpack:1.0: checking for updates from central
[INFO] run script verify.bsh
[INFO] ..SUCCESS (9.2 s)
[INFO] Building: used-dependencies\pom.xml
[INFO] ..SUCCESS (9.3 s)
[INFO] Building: purge-local-repository-without-pom
[INFO] run script setup.bsh
[INFO] run script verify.bsh
[INFO] ..SUCCESS (7.4 s)
[INFO]
[INFO] --- mrm-maven-plugin:1.0.0:stop (default) @ maven-dependency-plugin ---
[INFO] Stopping Mock Repository Manager on http://localhost:57271
[INFO] Mock Repository Manager http://localhost:57271 is stopped.
[INFO]
[INFO] --- maven-checkstyle-plugin:2.15:check (checkstyle-check) @ maven-dependency-plugin ---
[INFO] There is 1 error reported by Checkstyle 6.1.1 with config/maven_checks.xml ruleset.
[INFO] Ignored 1 error, 0 violation remaining.
[INFO]
[INFO] --- maven-invoker-plugin:2.0.0:verify (integration-test) @ maven-dependency-plugin ---
[INFO] -------------------------------------------------
[INFO] Build Summary:
[INFO]   Passed: 53, Failed: 0, Errors: 0, Skipped: 4
[INFO] -------------------------------------------------
[INFO]
[INFO] --- maven-install-plugin:2.5.2:install (default-install) @ maven-dependency-plugin ---
[INFO] Installing F:\jenkins\jenkins-slave\workspace\maven-plugins-ITs-m3-windows\maven-dependency-plugin\target\maven-dependency-plugin-3.0.2-SNAPSHOT.jar to C:\Users\jenkins\.m2\repository\org\apache\maven\plugins\maven-dependency-plugin\3.0.2-SNAPSHOT\maven-dependency-plugin-3.0.2-SNAPSHOT.jar
[INFO] Installing F:\jenkins\jenkins-slave\workspace\maven-plugins-ITs-m3-windows\maven-dependency-plugin\pom.xml to C:\Users\jenkins\.m2\repository\org\apache\maven\plugins\maven-dependency-plugin\3.0.2-SNAPSHOT\maven-dependency-plugin-3.0.2-SNAPSHOT.pom
[INFO]                                                                        
[INFO] ------------------------------------------------------------------------
[INFO] Building Apache Maven Plugins Aggregator 1-SNAPSHOT
[INFO] ------------------------------------------------------------------------
[INFO]
[INFO] --- maven-clean-plugin:2.5:clean (default-clean) @ maven-plugins-aggregator ---
[INFO]
[INFO] --- maven-enforcer-plugin:1.3.1:enforce (enforce-bytecode-version) @ maven-plugins-aggregator ---
[INFO]
[INFO] --- maven-enforcer-plugin:1.3.1:enforce (ban-known-bad-maven-versions) @ maven-plugins-aggregator ---
[INFO]
[INFO] --- maven-remote-resources-plugin:1.5:process (default) @ maven-plugins-aggregator ---
[INFO]
[INFO] --- maven-site-plugin:3.3:attach-descriptor (attach-descriptor) @ maven-plugins-aggregator ---
[INFO]
[INFO] --- maven-install-plugin:2.5.1:install (default-install) @ maven-plugins-aggregator ---
[INFO] Installing <https://builds.apache.org/job/maven-plugins-ITs-m3-windows/ws/pom.xml> to C:\Users\jenkins\.m2\repository\org\apache\maven\plugins\maven-plugins-aggregator\1-SNAPSHOT\maven-plugins-aggregator-1-SNAPSHOT.pom
[INFO] ------------------------------------------------------------------------
[INFO] Reactor Summary:
[INFO]
[INFO] Apache Maven ACR Plugin ............................ SUCCESS [ 53.942 s]
[INFO] Apache Maven AntRun Plugin ......................... SUCCESS [02:52 min]
[INFO] Apache Maven Changelog Plugin ...................... SUCCESS [01:15 min]
[INFO] Apache Maven Changes Plugin ........................ SUCCESS [02:05 min]
[INFO] Apache Maven Clean Plugin .......................... SUCCESS [ 50.978 s]
[INFO] Apache Maven Compiler Plugin ....................... SUCCESS [03:56 min]
[INFO] Apache Maven Deploy Plugin ......................... SUCCESS [03:40 min]
[INFO] Apache Maven Documentation Checker Plugin .......... SUCCESS [ 10.963 s]
[INFO] Apache Maven EAR Plugin ............................ SUCCESS [10:15 min]
[INFO] Apache Maven EJB Plugin ............................ SUCCESS [01:14 min]
[INFO] Apache Maven Help Plugin ........................... SUCCESS [03:23 min]
[INFO] Apache Maven Install Plugin ........................ SUCCESS [03:06 min]
[INFO] Apache Maven Jarsigner Plugin ...................... SUCCESS [01:18 min]
[INFO] Apache Maven JDeps Plugin .......................... SUCCESS [  3.871 s]
[INFO] Apache Maven Linkcheck Plugin ...................... SUCCESS [  5.625 s]
[INFO] Apache Maven Patch Plugin .......................... SUCCESS [ 10.721 s]
[INFO] Apache Maven PDF Plugin ............................ SUCCESS [ 44.295 s]
[INFO] Apache Maven RAR Plugin ............................ SUCCESS [ 21.417 s]
[INFO] Apache Maven Repository Plugin ..................... SUCCESS [ 46.607 s]
[INFO] Apache Maven Resources Plugin ...................... SUCCESS [02:24 min]
[INFO] Apache Maven Site Plugin ........................... SUCCESS [11:19 min]
[INFO] Apache Maven Source Plugin ......................... SUCCESS [02:00 min]
[INFO] Apache Maven Stage Plugin .......................... SUCCESS [  4.265 s]
[INFO] Apache Maven Toolchains Plugin ..................... SUCCESS [ 28.219 s]
[INFO] Apache Maven Verifier Plugin ....................... SUCCESS [ 18.469 s]
[INFO] Apache Maven WAR Plugin ............................ SUCCESS [03:39 min]
[INFO] Apache Maven DOAP Plugin ........................... SUCCESS [ 37.526 s]
[INFO] Apache Maven Invoker Plugin ........................ SUCCESS [12:27 min]
[INFO] Apache Maven JAR Plugin ............................ SUCCESS [03:10 min]
[INFO] Apache Maven Assembly Plugin ....................... SUCCESS [19:01 min]
[INFO] Apache Maven Checkstyle Plugin ..................... SUCCESS [07:13 min]
[INFO] Apache Maven Javadoc Plugin ........................ SUCCESS [10:07 min]
[INFO] Apache Maven PMD Plugin ............................ SUCCESS [04:09 min]
[INFO] Apache Maven JLink Plugin .......................... FAILURE [  1.121 s]
[INFO] Apache Maven JMod Plugin ........................... SUCCESS [  3.293 s]
[INFO] Apache Maven Project Info Reports Plugin ........... SUCCESS [03:42 min]
[INFO] Apache Maven Remote Resources Plugin ............... SUCCESS [01:40 min]
[INFO] Apache Maven Shade Plugin .......................... SUCCESS [06:59 min]
[INFO] Apache Maven SCM Publish Plugin .................... SUCCESS [01:20 min]
[INFO] Apache Maven Dependency Plugin ..................... SUCCESS [08:40 min]
[INFO] Apache Maven Plugins Aggregator .................... SUCCESS [  1.004 s]
[INFO] ------------------------------------------------------------------------
[INFO] BUILD FAILURE
[INFO] ------------------------------------------------------------------------
[INFO] Total time: 02:16 h
[INFO] Finished at: 2017-09-05T20:50:51+00:00
[INFO] Final Memory: 156M/579M
[INFO] ------------------------------------------------------------------------
[WARNING] The requested profile "apache.snapshots" could not be activated because it does not exist.
[ERROR] Failed to execute goal on project maven-jlink-plugin: Could not resolve dependencies for project org.apache.maven.plugins:maven-jlink-plugin:maven-plugin:3.0.0-SNAPSHOT: Could not find artifact org.codehaus.plexus:plexus-java:jar:0.9.3-SNAPSHOT in apache.snapshots (https://repository.apache.org/snapshots) -> [Help 1]
[ERROR]
[ERROR] To see the full stack trace of the errors, re-run Maven with the -e switch.
[ERROR] Re-run Maven using the -X switch to enable full debug logging.
[ERROR]
[ERROR] For more information about the errors and possible solutions, please read the following articles:
[ERROR] [Help 1] http://cwiki.apache.org/confluence/display/MAVEN/DependencyResolutionException
[ERROR]
[ERROR] After correcting the problems, you can resume the build with the command
[ERROR]   mvn <goals> -rf :maven-jlink-plugin
Build step 'Invoke top-level Maven targets' marked build as failure
Deleting 1 temporary files
Recording test results
Reply | Threaded
Open this post in threaded view
|

Build failed in Jenkins: maven-plugins-ITs-m3-windows #1985

Apache Jenkins Server-2
See <https://builds.apache.org/job/maven-plugins-ITs-m3-windows/1985/display/redirect?page=changes>

Changes:

[khmarbaise] Added hint about alpha release state.

[khmarbaise] Fixed docs.

[khmarbaise] Cleaned up docs.

------------------------------------------
[...truncated 3.32 MB...]
[INFO] Building: copy-from-reactor\pom.xml
[INFO] run script verify.bsh
[INFO] ..SUCCESS (6.5 s)
[INFO] Building: copy-from-remote-repository\pom.xml
[INFO] run script setup.bsh
[INFO] artifact org.apache.maven.its.dependency.fake-remote-copy:1.0: checking for updates from central
[INFO] run script verify.bsh
[INFO] ..SUCCESS (6.8 s)
[INFO] Building: dependency-properties\pom.xml
[INFO] run script verify.bsh
[INFO] ..SUCCESS (5.4 s)
[INFO] Building: filterunpack\pom.xml
[INFO] run script verify.groovy
[INFO] ..SUCCESS (5.4 s)
[INFO] Building: get-artifact\pom.xml
[INFO] run script setup.bsh
[INFO] run script verify.bsh
[INFO] ..SUCCESS (5.6 s)
[INFO] Building: get-artifact-maven-plugin\pom.xml
[INFO] run script setup.bsh
[INFO] run script verify.bsh
[INFO] ..SUCCESS (5.3 s)
[INFO] Building: get-artifact-no-transitive\pom.xml
[INFO] run script setup.bsh
[INFO] run script verify.bsh
[INFO] ..SUCCESS (5.4 s)
[INFO] Building: get-gav\pom.xml
[INFO] run script setup.bsh
[INFO] run script verify.bsh
[INFO] ..SUCCESS (5.5 s)
[INFO] Building: go-offline\pom.xml
[INFO] ..SUCCESS (6.9 s)
[INFO] Building: list-repositories\pom.xml
[INFO] snapshot org.apache.maven.its.dependency:test:1.0-SNAPSHOT: checking for updates from apache.snapshots
[INFO] artifact org.apache.maven.its.dependency.test:1.0-SNAPSHOT: checking for updates from central
[INFO] ..SUCCESS (5.7 s)
[INFO] Building: mdep-439-analyze-java8\pom.xml
[INFO] ..SKIPPED due to JRE version
[INFO] Building: mdep-450-project-with-ancestor\pom.xml
[INFO] run script verify.groovy
[INFO] ..SUCCESS (5.3 s)
[INFO] Building: mdep-450-project-without-ancestor\pom.xml
[INFO] run script verify.groovy
[INFO] ..SUCCESS (5.1 s)
[INFO] Building: mdep-506-dependency-without-version-in-depmgt\pom.xml
[INFO] ..SUCCESS (6.8 s)
[INFO] Building: mdep-571-resolve-java9\pom.xml
[INFO] ..SKIPPED due to JRE version
[INFO] Building: mdep-572-unpack-tar-long-file\pom.xml
[INFO] run script verify.bsh
[INFO] ..SUCCESS (6.6 s)
[INFO] Building: mdep-578_display-reason-invalid-module\pom.xml
[INFO] ..SKIPPED due to JRE version
[INFO] Building: mdep-580_display-manifest-automodules\pom.xml
[INFO] ..SKIPPED due to JRE version
[INFO] Building: purge-local-repository\pom.xml
[INFO] run script setup.bsh
[INFO] artifact org.apache.maven.its.dependency.purged:1.0: checking for updates from central
[INFO] run script verify.bsh
[INFO] ..SUCCESS (5.3 s)
[INFO] Building: purge-local-repository-bad-dep\pom.xml
[INFO] snapshot org.apache.maven.its.dependency:purge-local-repository-bad-dep:1.0-SNAPSHOT: checking for updates from apache.snapshots
[INFO] artifact org.apache.maven.its.dependency.purge-local-repository-bad-dep:1.0-SNAPSHOT: checking for updates from central
[INFO] artifact org.apache.maven.its.dependency.i-do-not-exist:1.0: checking for updates from central
[INFO] run script verify.groovy
[INFO] ..SUCCESS (5.7 s)
[INFO] Building: purge-local-repository-include\pom.xml
[INFO] snapshot org.apache.maven.its.dependency:purge-local-repository-include:1.0-SNAPSHOT: checking for updates from apache.snapshots
[INFO] artifact org.apache.maven.its.dependency.purge-local-repository-include:1.0-SNAPSHOT: checking for updates from central
[INFO] run script verify.groovy
[INFO] ..SUCCESS (5.6 s)
[INFO] Building: purge-local-repository-multi-module\pom.xml
[INFO] run script setup.bsh
[INFO] snapshot org.apache.maven.its.dependency:child1:1.0-SNAPSHOT: checking for updates from apache.snapshots
[INFO] artifact org.apache.maven.its.dependency.child1:1.0-SNAPSHOT: checking for updates from central
[INFO] artifact org.apache.maven.its.dependency.purged-a:1.0: checking for updates from central
[INFO] snapshot org.apache.maven.its.dependency:child2:1.0-SNAPSHOT: checking for updates from apache.snapshots
[INFO] artifact org.apache.maven.its.dependency.child2:1.0-SNAPSHOT: checking for updates from central
[INFO] artifact org.apache.maven.its.dependency.purged-b:1.0: checking for updates from central
[INFO] run script verify.bsh
[INFO] ..SUCCESS (6.2 s)
[INFO] Building: purge-local-repository-multi-module-execution\pom.xml
[INFO] run script setup.bsh
[INFO] run script verify.bsh
[INFO] ..SUCCESS (6.1 s)
[INFO] Building: purge-local-repository-non-transitive\pom.xml
[INFO] run script verify.bsh
[INFO] ..SUCCESS (5.3 s)
[INFO] Building: purge-local-repository-reresolve\pom.xml
[INFO] run script verify.bsh
[INFO] ..SUCCESS (5.5 s)
[INFO] Building: purge-local-repository-snapshots-only\pom.xml
[INFO] run script setup.bsh
[INFO] snapshot org.apache.maven.its.dependency:snap-purged:1.0-SNAPSHOT: checking for updates from apache.snapshots
[INFO] artifact org.apache.maven.its.dependency.snap-purged:1.0-SNAPSHOT: checking for updates from central
[INFO] run script verify.bsh
[INFO] ..SUCCESS (6.3 s)
[INFO] Building: purge-local-repository-version-range\pom.xml
[INFO] artifact org.apache.maven.its.dependency:purge-local-repository: checking for updates from central
[INFO] artifact org.apache.maven.its.dependency:purge-local-repository: checking for updates from central
[INFO] run script verify.bsh
[INFO] ..SUCCESS (5.5 s)
[INFO] Building: resolve\pom.xml
[INFO] ..SUCCESS (5.4 s)
[INFO] Building: resolve-plugins\pom.xml
[INFO] ..SUCCESS (6.0 s)
[INFO] Building: resolve-plugins-exclude-reactor\pom.xml
[INFO] run script verify.groovy
[INFO] ..SUCCESS (6.9 s)
[INFO] Building: resolve-plugins-with-exclude\pom.xml
[INFO] run script verify.groovy
[INFO] ..SUCCESS (5.9 s)
[INFO] Building: sources\pom.xml
[INFO] artifact classworlds.classworlds:1.1-alpha-2: checking for updates from central
[INFO] ..SUCCESS (5.7 s)
[INFO] Building: tree\pom.xml
[INFO] run script verify.bsh
[INFO] ..SUCCESS (5.4 s)
[INFO] Building: tree-includes\pom.xml
[INFO] run script verify.bsh
[INFO] ..SUCCESS (5.4 s)
[INFO] Building: tree-multimodule\pom.xml
[INFO] snapshot org.apache.maven.its.dependency:tree-multimodule-module-a:1.0-SNAPSHOT: checking for updates from apache.snapshots
[INFO] artifact org.apache.maven.its.dependency.tree-multimodule-module-a:1.0-SNAPSHOT: checking for updates from central
[INFO] run script verify.bsh
[INFO] ..SUCCESS (6.4 s)
[INFO] Building: unpack\pom.xml
[INFO] run script verify.bsh
[INFO] ..SUCCESS (6.6 s)
[INFO] Building: unpack-cli\pom.xml
[INFO] run script verify.bsh
[INFO] ..SUCCESS (5.4 s)
[INFO] Building: unpack-custom-ear\pom.xml
[INFO] run script verify.groovy
[INFO] ..SUCCESS (5.7 s)
[INFO] Building: unpack-dependencies\pom.xml
[INFO] run script verify.groovy
[INFO] ..SUCCESS (7.0 s)
[INFO] Building: unpack-from-remote-repository\pom.xml
[INFO] run script setup.bsh
[INFO] artifact org.apache.maven.its.dependency.fake-remote-unpack:1.0: checking for updates from central
[INFO] run script verify.bsh
[INFO] ..SUCCESS (6.7 s)
[INFO] Building: used-dependencies\pom.xml
[INFO] ..SUCCESS (6.8 s)
[INFO] Building: purge-local-repository-without-pom
[INFO] run script setup.bsh
[INFO] run script verify.bsh
[INFO] ..SUCCESS (5.3 s)
[INFO]
[INFO] --- mrm-maven-plugin:1.0.0:stop (default) @ maven-dependency-plugin ---
[INFO] Stopping Mock Repository Manager on http://localhost:52221
[INFO] Mock Repository Manager http://localhost:52221 is stopped.
[INFO]
[INFO] --- maven-checkstyle-plugin:2.15:check (checkstyle-check) @ maven-dependency-plugin ---
[INFO] There is 1 error reported by Checkstyle 6.1.1 with config/maven_checks.xml ruleset.
[INFO] Ignored 1 error, 0 violation remaining.
[INFO]
[INFO] --- maven-invoker-plugin:2.0.0:verify (integration-test) @ maven-dependency-plugin ---
[INFO] -------------------------------------------------
[INFO] Build Summary:
[INFO]   Passed: 53, Failed: 0, Errors: 0, Skipped: 4
[INFO] -------------------------------------------------
[INFO]
[INFO] --- maven-install-plugin:2.5.2:install (default-install) @ maven-dependency-plugin ---
[INFO] Installing F:\jenkins\jenkins-slave\workspace\maven-plugins-ITs-m3-windows\maven-dependency-plugin\target\maven-dependency-plugin-3.0.2-SNAPSHOT.jar to C:\Users\jenkins\.m2\repository\org\apache\maven\plugins\maven-dependency-plugin\3.0.2-SNAPSHOT\maven-dependency-plugin-3.0.2-SNAPSHOT.jar
[INFO] Installing F:\jenkins\jenkins-slave\workspace\maven-plugins-ITs-m3-windows\maven-dependency-plugin\pom.xml to C:\Users\jenkins\.m2\repository\org\apache\maven\plugins\maven-dependency-plugin\3.0.2-SNAPSHOT\maven-dependency-plugin-3.0.2-SNAPSHOT.pom
[INFO]                                                                        
[INFO] ------------------------------------------------------------------------
[INFO] Building Apache Maven Plugins Aggregator 1-SNAPSHOT
[INFO] ------------------------------------------------------------------------
[INFO]
[INFO] --- maven-clean-plugin:2.5:clean (default-clean) @ maven-plugins-aggregator ---
[INFO]
[INFO] --- maven-enforcer-plugin:1.3.1:enforce (enforce-bytecode-version) @ maven-plugins-aggregator ---
[INFO]
[INFO] --- maven-enforcer-plugin:1.3.1:enforce (ban-known-bad-maven-versions) @ maven-plugins-aggregator ---
[INFO]
[INFO] --- maven-remote-resources-plugin:1.5:process (default) @ maven-plugins-aggregator ---
[INFO]
[INFO] --- maven-site-plugin:3.3:attach-descriptor (attach-descriptor) @ maven-plugins-aggregator ---
[INFO]
[INFO] --- maven-install-plugin:2.5.1:install (default-install) @ maven-plugins-aggregator ---
[INFO] Installing <https://builds.apache.org/job/maven-plugins-ITs-m3-windows/ws/pom.xml> to C:\Users\jenkins\.m2\repository\org\apache\maven\plugins\maven-plugins-aggregator\1-SNAPSHOT\maven-plugins-aggregator-1-SNAPSHOT.pom
[INFO] ------------------------------------------------------------------------
[INFO] Reactor Summary:
[INFO]
[INFO] Apache Maven ACR Plugin ............................ SUCCESS [ 40.975 s]
[INFO] Apache Maven AntRun Plugin ......................... SUCCESS [02:16 min]
[INFO] Apache Maven Changelog Plugin ...................... SUCCESS [01:09 min]
[INFO] Apache Maven Changes Plugin ........................ SUCCESS [01:54 min]
[INFO] Apache Maven Clean Plugin .......................... SUCCESS [ 41.063 s]
[INFO] Apache Maven Compiler Plugin ....................... SUCCESS [03:13 min]
[INFO] Apache Maven Deploy Plugin ......................... SUCCESS [02:53 min]
[INFO] Apache Maven Documentation Checker Plugin .......... SUCCESS [  8.043 s]
[INFO] Apache Maven EAR Plugin ............................ SUCCESS [08:54 min]
[INFO] Apache Maven EJB Plugin ............................ SUCCESS [01:02 min]
[INFO] Apache Maven Help Plugin ........................... SUCCESS [02:58 min]
[INFO] Apache Maven Install Plugin ........................ SUCCESS [02:37 min]
[INFO] Apache Maven Jarsigner Plugin ...................... SUCCESS [01:03 min]
[INFO] Apache Maven JDeps Plugin .......................... SUCCESS [  3.087 s]
[INFO] Apache Maven Linkcheck Plugin ...................... SUCCESS [  4.633 s]
[INFO] Apache Maven Patch Plugin .......................... SUCCESS [  8.811 s]
[INFO] Apache Maven PDF Plugin ............................ SUCCESS [ 35.587 s]
[INFO] Apache Maven RAR Plugin ............................ SUCCESS [ 17.423 s]
[INFO] Apache Maven Repository Plugin ..................... SUCCESS [ 38.132 s]
[INFO] Apache Maven Resources Plugin ...................... SUCCESS [01:55 min]
[INFO] Apache Maven Site Plugin ........................... SUCCESS [09:15 min]
[INFO] Apache Maven Source Plugin ......................... SUCCESS [01:25 min]
[INFO] Apache Maven Stage Plugin .......................... SUCCESS [  3.388 s]
[INFO] Apache Maven Toolchains Plugin ..................... SUCCESS [ 22.896 s]
[INFO] Apache Maven Verifier Plugin ....................... SUCCESS [ 14.624 s]
[INFO] Apache Maven WAR Plugin ............................ SUCCESS [02:41 min]
[INFO] Apache Maven DOAP Plugin ........................... SUCCESS [ 28.486 s]
[INFO] Apache Maven Invoker Plugin ........................ SUCCESS [09:51 min]
[INFO] Apache Maven JAR Plugin ............................ SUCCESS [02:30 min]
[INFO] Apache Maven Assembly Plugin ....................... SUCCESS [15:10 min]
[INFO] Apache Maven Checkstyle Plugin ..................... SUCCESS [05:36 min]
[INFO] Apache Maven Javadoc Plugin ........................ SUCCESS [07:22 min]
[INFO] Apache Maven PMD Plugin ............................ SUCCESS [03:01 min]
[INFO] Apache Maven JLink Plugin .......................... FAILURE [  1.055 s]
[INFO] Apache Maven JMod Plugin ........................... SUCCESS [  2.155 s]
[INFO] Apache Maven Project Info Reports Plugin ........... SUCCESS [02:57 min]
[INFO] Apache Maven Remote Resources Plugin ............... SUCCESS [01:21 min]
[INFO] Apache Maven Shade Plugin .......................... SUCCESS [05:33 min]
[INFO] Apache Maven SCM Publish Plugin .................... SUCCESS [01:06 min]
[INFO] Apache Maven Dependency Plugin ..................... SUCCESS [06:24 min]
[INFO] Apache Maven Plugins Aggregator .................... SUCCESS [  0.802 s]
[INFO] ------------------------------------------------------------------------
[INFO] BUILD FAILURE
[INFO] ------------------------------------------------------------------------
[INFO] Total time: 01:48 h
[INFO] Finished at: 2017-09-06T00:06:47+00:00
[INFO] Final Memory: 158M/537M
[INFO] ------------------------------------------------------------------------
[WARNING] The requested profile "apache.snapshots" could not be activated because it does not exist.
[ERROR] Failed to execute goal on project maven-jlink-plugin: Could not resolve dependencies for project org.apache.maven.plugins:maven-jlink-plugin:maven-plugin:3.0.0-SNAPSHOT: Could not find artifact org.codehaus.plexus:plexus-java:jar:0.9.3-SNAPSHOT in apache.snapshots (https://repository.apache.org/snapshots) -> [Help 1]
[ERROR]
[ERROR] To see the full stack trace of the errors, re-run Maven with the -e switch.
[ERROR] Re-run Maven using the -X switch to enable full debug logging.
[ERROR]
[ERROR] For more information about the errors and possible solutions, please read the following articles:
[ERROR] [Help 1] http://cwiki.apache.org/confluence/display/MAVEN/DependencyResolutionException
[ERROR]
[ERROR] After correcting the problems, you can resume the build with the command
[ERROR]   mvn <goals> -rf :maven-jlink-plugin
Build step 'Invoke top-level Maven targets' marked build as failure
Deleting 1 temporary files
Recording test results
Reply | Threaded
Open this post in threaded view
|

Jenkins build is back to normal : maven-plugins-ITs-m3-windows #1986

Apache Jenkins Server-2