Build failed in Jenkins: maven-plugins-ITs-m3-windows #1945

Previous Topic Next Topic
 
classic Classic list List threaded Threaded
2 messages Options
Reply | Threaded
Open this post in threaded view
|  
Report Content as Inappropriate

Build failed in Jenkins: maven-plugins-ITs-m3-windows #1945

Apache Jenkins Server-2
See <https://builds.apache.org/job/maven-plugins-ITs-m3-windows/1945/display/redirect?page=changes>

Changes:

[olamy] [maven-release-plugin] prepare for next development iteration

[olamy] [maven-release-plugin] prepare release maven-compiler-plugin-3.6.2

------------------------------------------
[...truncated 3.11 MB...]
F:\jenkins\jenkins-slave\workspace\maven-plugins-ITs-m3-windows\maven-dependency-plugin\target\unit-tests\build-classpath\localTestRepo\snapshot-2.0-SNAPSHOT.jar;F:\jenkins\jenkins-slave\workspace\maven-plugins-ITs-m3-windows\maven-dependency-plugin\target\unit-tests\build-classpath\localTestRepo\test-1.0.jar;F:\jenkins\jenkins-slave\workspace\maven-plugins-ITs-m3-windows\maven-dependency-plugin\target\unit-tests\build-classpath\localTestRepo\provided-1.0.jar;F:\jenkins\jenkins-slave\workspace\maven-plugins-ITs-m3-windows\maven-dependency-plugin\target\unit-tests\build-classpath\localTestRepo\release-1.0.jar;F:\jenkins\jenkins-slave\workspace\maven-plugins-ITs-m3-windows\maven-dependency-plugin\target\unit-tests\build-classpath\localTestRepo\runtime-1.0.jar;F:\jenkins\jenkins-slave\workspace\maven-plugins-ITs-m3-windows\maven-dependency-plugin\target\unit-tests\build-classpath\localTestRepo\compile-1.0.jar;F:\jenkins\jenkins-slave\workspace\maven-plugins-ITs-m3-windows\maven-dependency-plugin\target\unit-tests\build-classpath\localTestRepo\system-1.0.jar
[INFO] Wrote classpath file 'F:\jenkins\jenkins-slave\workspace\maven-plugins-ITs-m3-windows\maven-dependency-plugin\target\unit-tests\build-classpath\buildClasspath.txt'.
[INFO] Wrote classpath file 'F:\jenkins\jenkins-slave\workspace\maven-plugins-ITs-m3-windows\maven-dependency-plugin\target\unit-tests\build-classpath\buildClasspath.txt'.
[INFO] Skipped writing classpath file 'F:\jenkins\jenkins-slave\workspace\maven-plugins-ITs-m3-windows\maven-dependency-plugin\target\unit-tests\build-classpath\buildClasspath.txt'.  No changes found.
Tests run: 2, Failures: 0, Errors: 0, Skipped: 0, Time elapsed: 0.379 sec - in org.apache.maven.plugins.dependency.fromDependencies.TestBuildClasspathMojo
Running org.apache.maven.plugins.dependency.fromDependencies.TestCopyDependenciesMojo
Tests run: 33, Failures: 0, Errors: 0, Skipped: 0, Time elapsed: 8.56 sec - in org.apache.maven.plugins.dependency.fromDependencies.TestCopyDependenciesMojo
Running org.apache.maven.plugins.dependency.fromDependencies.TestCopyDependenciesMojo2
Tests run: 11, Failures: 0, Errors: 0, Skipped: 0, Time elapsed: 1.77 sec - in org.apache.maven.plugins.dependency.fromDependencies.TestCopyDependenciesMojo2
Running org.apache.maven.plugins.dependency.fromDependencies.TestIncludeExcludeUnpackDependenciesMojo
Tests run: 7, Failures: 0, Errors: 0, Skipped: 0, Time elapsed: 2.324 sec - in org.apache.maven.plugins.dependency.fromDependencies.TestIncludeExcludeUnpackDependenciesMojo
Running org.apache.maven.plugins.dependency.fromDependencies.TestUnpackDependenciesMojo
Tests run: 28, Failures: 0, Errors: 0, Skipped: 0, Time elapsed: 11.237 sec - in org.apache.maven.plugins.dependency.fromDependencies.TestUnpackDependenciesMojo
Running org.apache.maven.plugins.dependency.fromDependencies.TestUnpackDependenciesMojo2
Tests run: 5, Failures: 0, Errors: 0, Skipped: 0, Time elapsed: 7.194 sec - in org.apache.maven.plugins.dependency.fromDependencies.TestUnpackDependenciesMojo2
Running org.apache.maven.plugins.dependency.resolvers.TestResolveMojo
Tests run: 2, Failures: 0, Errors: 0, Skipped: 0, Time elapsed: 0.262 sec - in org.apache.maven.plugins.dependency.resolvers.TestResolveMojo
Running org.apache.maven.plugins.dependency.TestCollectMojo
Tests run: 3, Failures: 0, Errors: 0, Skipped: 0, Time elapsed: 0.399 sec - in org.apache.maven.plugins.dependency.TestCollectMojo
Running org.apache.maven.plugins.dependency.TestGetMojo
[INFO] Resolving org.apache.maven:maven-model:jar:2.0.9 with transitive dependencies
[INFO] Resolving org.apache.maven:maven-model:jar:2.0.9
[INFO] Resolving org.apache.maven:maven-model:jar:2.0.9
Tests run: 3, Failures: 0, Errors: 0, Skipped: 0, Time elapsed: 0.873 sec - in org.apache.maven.plugins.dependency.TestGetMojo
Running org.apache.maven.plugins.dependency.TestPropertiesMojo
Tests run: 1, Failures: 0, Errors: 0, Skipped: 0, Time elapsed: 0.137 sec - in org.apache.maven.plugins.dependency.TestPropertiesMojo
Running org.apache.maven.plugins.dependency.TestSkip
Tests run: 19, Failures: 0, Errors: 0, Skipped: 0, Time elapsed: 3.752 sec - in org.apache.maven.plugins.dependency.TestSkip
Running org.apache.maven.plugins.dependency.tree.TestTreeMojo
Tests run: 1, Failures: 0, Errors: 0, Skipped: 0, Time elapsed: 0.132 sec - in org.apache.maven.plugins.dependency.tree.TestTreeMojo
Running org.apache.maven.plugins.dependency.utils.filters.TestDestFileFilter
Tests run: 8, Failures: 0, Errors: 0, Skipped: 0, Time elapsed: 0.019 sec - in org.apache.maven.plugins.dependency.utils.filters.TestDestFileFilter
Running org.apache.maven.plugins.dependency.utils.filters.TestMarkerFileFilter
Tests run: 5, Failures: 0, Errors: 0, Skipped: 0, Time elapsed: 0.032 sec - in org.apache.maven.plugins.dependency.utils.filters.TestMarkerFileFilter
Running org.apache.maven.plugins.dependency.utils.filters.TestResolveMarkerFileFilter
Tests run: 1, Failures: 0, Errors: 0, Skipped: 0, Time elapsed: 0.004 sec - in org.apache.maven.plugins.dependency.utils.filters.TestResolveMarkerFileFilter
Running org.apache.maven.plugins.dependency.utils.markers.TestDefaultMarkerFileHandler
Tests run: 6, Failures: 0, Errors: 0, Skipped: 0, Time elapsed: 0.014 sec - in org.apache.maven.plugins.dependency.utils.markers.TestDefaultMarkerFileHandler
Running org.apache.maven.plugins.dependency.utils.markers.TestSourcesMarkerFileHandler
Tests run: 10, Failures: 0, Errors: 0, Skipped: 0, Time elapsed: 0.014 sec - in org.apache.maven.plugins.dependency.utils.markers.TestSourcesMarkerFileHandler
Running org.apache.maven.plugins.dependency.utils.markers.TestUnpackMarkerFileHandler
Tests run: 9, Failures: 0, Errors: 0, Skipped: 0, Time elapsed: 1.104 sec - in org.apache.maven.plugins.dependency.utils.markers.TestUnpackMarkerFileHandler
Running org.apache.maven.plugins.dependency.utils.TestDependencyStatusSets
Tests run: 5, Failures: 0, Errors: 0, Skipped: 0, Time elapsed: 0.869 sec - in org.apache.maven.plugins.dependency.utils.TestDependencyStatusSets
Running org.apache.maven.plugins.dependency.utils.TestDependencyUtil
Tests run: 9, Failures: 0, Errors: 0, Skipped: 0, Time elapsed: 0.006 sec - in org.apache.maven.plugins.dependency.utils.TestDependencyUtil
Running org.apache.maven.plugins.dependency.utils.TestSilentLog
Tests run: 2, Failures: 0, Errors: 0, Skipped: 0, Time elapsed: 0 sec - in org.apache.maven.plugins.dependency.utils.TestSilentLog
Running org.apache.maven.plugins.dependency.utils.translators.TestClassifierTypeTranslator
Tests run: 6, Failures: 0, Errors: 0, Skipped: 0, Time elapsed: 0.767 sec - in org.apache.maven.plugins.dependency.utils.translators.TestClassifierTypeTranslator

Results :

Tests run: 244, Failures: 0, Errors: 0, Skipped: 0

[INFO]
[INFO] --- maven-jar-plugin:3.0.0:jar (default-jar) @ maven-dependency-plugin ---
[INFO] Building jar: F:\jenkins\jenkins-slave\workspace\maven-plugins-ITs-m3-windows\maven-dependency-plugin\target\maven-dependency-plugin-3.0.2-SNAPSHOT.jar
[INFO]
[INFO] --- maven-plugin-plugin:3.4:addPluginArtifactMetadata (default-addPluginArtifactMetadata) @ maven-dependency-plugin ---
[INFO]
[INFO] --- maven-site-plugin:3.5.1:attach-descriptor (attach-descriptor) @ maven-dependency-plugin ---
[INFO]
[INFO] --- maven-invoker-plugin:2.0.0:install (integration-test) @ maven-dependency-plugin ---
[INFO] Installing F:\jenkins\jenkins-slave\workspace\maven-plugins-ITs-m3-windows\maven-acr-plugin\pom.xml to F:\jenkins\jenkins-slave\workspace\maven-plugins-ITs-m3-windows\maven-dependency-plugin\target\local-repo\org\apache\maven\plugins\maven-acr-plugin\3.0.1-SNAPSHOT\maven-acr-plugin-3.0.1-SNAPSHOT.pom
[INFO] Installing F:\jenkins\jenkins-slave\workspace\maven-plugins-ITs-m3-windows\maven-acr-plugin\target\maven-acr-plugin-3.0.1-SNAPSHOT.jar to F:\jenkins\jenkins-slave\workspace\maven-plugins-ITs-m3-windows\maven-dependency-plugin\target\local-repo\org\apache\maven\plugins\maven-acr-plugin\3.0.1-SNAPSHOT\maven-acr-plugin-3.0.1-SNAPSHOT.jar
[INFO] Installing F:\jenkins\jenkins-slave\workspace\maven-plugins-ITs-m3-windows\maven-acr-plugin\pom.xml to F:\jenkins\jenkins-slave\workspace\maven-plugins-ITs-m3-windows\maven-dependency-plugin\target\local-repo\org\apache\maven\plugins\maven-acr-plugin\3.0.1-SNAPSHOT\maven-acr-plugin-3.0.1-SNAPSHOT.pom
[INFO] Installing F:\jenkins\jenkins-slave\workspace\maven-plugins-ITs-m3-windows\maven-antrun-plugin\pom.xml to F:\jenkins\jenkins-slave\workspace\maven-plugins-ITs-m3-windows\maven-dependency-plugin\target\local-repo\org\apache\maven\plugins\maven-antrun-plugin\3.0.0-SNAPSHOT\maven-antrun-plugin-3.0.0-SNAPSHOT.pom
[INFO] Installing F:\jenkins\jenkins-slave\workspace\maven-plugins-ITs-m3-windows\maven-antrun-plugin\target\maven-antrun-plugin-3.0.0-SNAPSHOT.jar to F:\jenkins\jenkins-slave\workspace\maven-plugins-ITs-m3-windows\maven-dependency-plugin\target\local-repo\org\apache\maven\plugins\maven-antrun-plugin\3.0.0-SNAPSHOT\maven-antrun-plugin-3.0.0-SNAPSHOT.jar
[INFO] Installing F:\jenkins\jenkins-slave\workspace\maven-plugins-ITs-m3-windows\maven-antrun-plugin\pom.xml to F:\jenkins\jenkins-slave\workspace\maven-plugins-ITs-m3-windows\maven-dependency-plugin\target\local-repo\org\apache\maven\plugins\maven-antrun-plugin\3.0.0-SNAPSHOT\maven-antrun-plugin-3.0.0-SNAPSHOT.pom
[INFO] Installing F:\jenkins\jenkins-slave\workspace\maven-plugins-ITs-m3-windows\maven-changelog-plugin\pom.xml to F:\jenkins\jenkins-slave\workspace\maven-plugins-ITs-m3-windows\maven-dependency-plugin\target\local-repo\org\apache\maven\plugins\maven-changelog-plugin\2.4-SNAPSHOT\maven-changelog-plugin-2.4-SNAPSHOT.pom
[INFO] Installing F:\jenkins\jenkins-slave\workspace\maven-plugins-ITs-m3-windows\maven-changelog-plugin\target\maven-changelog-plugin-2.4-SNAPSHOT.jar to F:\jenkins\jenkins-slave\workspace\maven-plugins-ITs-m3-windows\maven-dependency-plugin\target\local-repo\org\apache\maven\plugins\maven-changelog-plugin\2.4-SNAPSHOT\maven-changelog-plugin-2.4-SNAPSHOT.jar
[INFO] Installing F:\jenkins\jenkins-slave\workspace\maven-plugins-ITs-m3-windows\maven-changelog-plugin\pom.xml to F:\jenkins\jenkins-slave\workspace\maven-plugins-ITs-m3-windows\maven-dependency-plugin\target\local-repo\org\apache\maven\plugins\maven-changelog-plugin\2.4-SNAPSHOT\maven-changelog-plugin-2.4-SNAPSHOT.pom
[INFO] Installing F:\jenkins\jenkins-slave\workspace\maven-plugins-ITs-m3-windows\maven-changes-plugin\pom.xml to F:\jenkins\jenkins-slave\workspace\maven-plugins-ITs-m3-windows\maven-dependency-plugin\target\local-repo\org\apache\maven\plugins\maven-changes-plugin\3.0.0-SNAPSHOT\maven-changes-plugin-3.0.0-SNAPSHOT.pom
[INFO] Installing F:\jenkins\jenkins-slave\workspace\maven-plugins-ITs-m3-windows\maven-changes-plugin\target\maven-changes-plugin-3.0.0-SNAPSHOT.jar to F:\jenkins\jenkins-slave\workspace\maven-plugins-ITs-m3-windows\maven-dependency-plugin\target\local-repo\org\apache\maven\plugins\maven-changes-plugin\3.0.0-SNAPSHOT\maven-changes-plugin-3.0.0-SNAPSHOT.jar
[INFO] Installing F:\jenkins\jenkins-slave\workspace\maven-plugins-ITs-m3-windows\maven-changes-plugin\pom.xml to F:\jenkins\jenkins-slave\workspace\maven-plugins-ITs-m3-windows\maven-dependency-plugin\target\local-repo\org\apache\maven\plugins\maven-changes-plugin\3.0.0-SNAPSHOT\maven-changes-plugin-3.0.0-SNAPSHOT.pom
[INFO] Installing F:\jenkins\jenkins-slave\workspace\maven-plugins-ITs-m3-windows\maven-clean-plugin\pom.xml to F:\jenkins\jenkins-slave\workspace\maven-plugins-ITs-m3-windows\maven-dependency-plugin\target\local-repo\org\apache\maven\plugins\maven-clean-plugin\3.0.1-SNAPSHOT\maven-clean-plugin-3.0.1-SNAPSHOT.pom
[INFO] Installing F:\jenkins\jenkins-slave\workspace\maven-plugins-ITs-m3-windows\maven-clean-plugin\target\maven-clean-plugin-3.0.1-SNAPSHOT.jar to F:\jenkins\jenkins-slave\workspace\maven-plugins-ITs-m3-windows\maven-dependency-plugin\target\local-repo\org\apache\maven\plugins\maven-clean-plugin\3.0.1-SNAPSHOT\maven-clean-plugin-3.0.1-SNAPSHOT.jar
[INFO] Installing F:\jenkins\jenkins-slave\workspace\maven-plugins-ITs-m3-windows\maven-clean-plugin\pom.xml to F:\jenkins\jenkins-slave\workspace\maven-plugins-ITs-m3-windows\maven-dependency-plugin\target\local-repo\org\apache\maven\plugins\maven-clean-plugin\3.0.1-SNAPSHOT\maven-clean-plugin-3.0.1-SNAPSHOT.pom
[INFO] Installing F:\jenkins\jenkins-slave\workspace\maven-plugins-ITs-m3-windows\maven-compiler-plugin\pom.xml to F:\jenkins\jenkins-slave\workspace\maven-plugins-ITs-m3-windows\maven-dependency-plugin\target\local-repo\org\apache\maven\plugins\maven-compiler-plugin\3.6.3-SNAPSHOT\maven-compiler-plugin-3.6.3-SNAPSHOT.pom
[INFO] Installing F:\jenkins\jenkins-slave\workspace\maven-plugins-ITs-m3-windows\maven-compiler-plugin\target\maven-compiler-plugin-3.6.3-SNAPSHOT.jar to F:\jenkins\jenkins-slave\workspace\maven-plugins-ITs-m3-windows\maven-dependency-plugin\target\local-repo\org\apache\maven\plugins\maven-compiler-plugin\3.6.3-SNAPSHOT\maven-compiler-plugin-3.6.3-SNAPSHOT.jar
[INFO] Installing F:\jenkins\jenkins-slave\workspace\maven-plugins-ITs-m3-windows\maven-compiler-plugin\pom.xml to F:\jenkins\jenkins-slave\workspace\maven-plugins-ITs-m3-windows\maven-dependency-plugin\target\local-repo\org\apache\maven\plugins\maven-compiler-plugin\3.6.3-SNAPSHOT\maven-compiler-plugin-3.6.3-SNAPSHOT.pom
[INFO] Installing F:\jenkins\jenkins-slave\workspace\maven-plugins-ITs-m3-windows\maven-deploy-plugin\pom.xml to F:\jenkins\jenkins-slave\workspace\maven-plugins-ITs-m3-windows\maven-dependency-plugin\target\local-repo\org\apache\maven\plugins\maven-deploy-plugin\3.0.0-SNAPSHOT\maven-deploy-plugin-3.0.0-SNAPSHOT.pom
[INFO] Installing F:\jenkins\jenkins-slave\workspace\maven-plugins-ITs-m3-windows\maven-deploy-plugin\target\maven-deploy-plugin-3.0.0-SNAPSHOT.jar to F:\jenkins\jenkins-slave\workspace\maven-plugins-ITs-m3-windows\maven-dependency-plugin\target\local-repo\org\apache\maven\plugins\maven-deploy-plugin\3.0.0-SNAPSHOT\maven-deploy-plugin-3.0.0-SNAPSHOT.jar
[INFO] Installing F:\jenkins\jenkins-slave\workspace\maven-plugins-ITs-m3-windows\maven-deploy-plugin\pom.xml to F:\jenkins\jenkins-slave\workspace\maven-plugins-ITs-m3-windows\maven-dependency-plugin\target\local-repo\org\apache\maven\plugins\maven-deploy-plugin\3.0.0-SNAPSHOT\maven-deploy-plugin-3.0.0-SNAPSHOT.pom
[INFO] Installing F:\jenkins\jenkins-slave\workspace\maven-plugins-ITs-m3-windows\maven-docck-plugin\pom.xml to F:\jenkins\jenkins-slave\workspace\maven-plugins-ITs-m3-windows\maven-dependency-plugin\target\local-repo\org\apache\maven\plugins\maven-docck-plugin\1.2-SNAPSHOT\maven-docck-plugin-1.2-SNAPSHOT.pom
[INFO] Installing F:\jenkins\jenkins-slave\workspace\maven-plugins-ITs-m3-windows\maven-docck-plugin\target\maven-docck-plugin-1.2-SNAPSHOT.jar to F:\jenkins\jenkins-slave\workspace\maven-plugins-ITs-m3-windows\maven-dependency-plugin\target\local-repo\org\apache\maven\plugins\maven-docck-plugin\1.2-SNAPSHOT\maven-docck-plugin-1.2-SNAPSHOT.jar
[INFO] Installing F:\jenkins\jenkins-slave\workspace\maven-plugins-ITs-m3-windows\maven-docck-plugin\pom.xml to F:\jenkins\jenkins-slave\workspace\maven-plugins-ITs-m3-windows\maven-dependency-plugin\target\local-repo\org\apache\maven\plugins\maven-docck-plugin\1.2-SNAPSHOT\maven-docck-plugin-1.2-SNAPSHOT.pom
[INFO] Installing F:\jenkins\jenkins-slave\workspace\maven-plugins-ITs-m3-windows\maven-ear-plugin\pom.xml to F:\jenkins\jenkins-slave\workspace\maven-plugins-ITs-m3-windows\maven-dependency-plugin\target\local-repo\org\apache\maven\plugins\maven-ear-plugin\3.0.0-SNAPSHOT\maven-ear-plugin-3.0.0-SNAPSHOT.pom
[INFO] Installing F:\jenkins\jenkins-slave\workspace\maven-plugins-ITs-m3-windows\maven-ear-plugin\target\maven-ear-plugin-3.0.0-SNAPSHOT.jar to F:\jenkins\jenkins-slave\workspace\maven-plugins-ITs-m3-windows\maven-dependency-plugin\target\local-repo\org\apache\maven\plugins\maven-ear-plugin\3.0.0-SNAPSHOT\maven-ear-plugin-3.0.0-SNAPSHOT.jar
[INFO] Installing F:\jenkins\jenkins-slave\workspace\maven-plugins-ITs-m3-windows\maven-ear-plugin\pom.xml to F:\jenkins\jenkins-slave\workspace\maven-plugins-ITs-m3-windows\maven-dependency-plugin\target\local-repo\org\apache\maven\plugins\maven-ear-plugin\3.0.0-SNAPSHOT\maven-ear-plugin-3.0.0-SNAPSHOT.pom
[INFO] Installing F:\jenkins\jenkins-slave\workspace\maven-plugins-ITs-m3-windows\maven-ejb-plugin\pom.xml to F:\jenkins\jenkins-slave\workspace\maven-plugins-ITs-m3-windows\maven-dependency-plugin\target\local-repo\org\apache\maven\plugins\maven-ejb-plugin\3.0.0-SNAPSHOT\maven-ejb-plugin-3.0.0-SNAPSHOT.pom
[INFO] Installing F:\jenkins\jenkins-slave\workspace\maven-plugins-ITs-m3-windows\maven-ejb-plugin\target\maven-ejb-plugin-3.0.0-SNAPSHOT.jar to F:\jenkins\jenkins-slave\workspace\maven-plugins-ITs-m3-windows\maven-dependency-plugin\target\local-repo\org\apache\maven\plugins\maven-ejb-plugin\3.0.0-SNAPSHOT\maven-ejb-plugin-3.0.0-SNAPSHOT.jar
[INFO] Installing F:\jenkins\jenkins-slave\workspace\maven-plugins-ITs-m3-windows\maven-ejb-plugin\pom.xml to F:\jenkins\jenkins-slave\workspace\maven-plugins-ITs-m3-windows\maven-dependency-plugin\target\local-repo\org\apache\maven\plugins\maven-ejb-plugin\3.0.0-SNAPSHOT\maven-ejb-plugin-3.0.0-SNAPSHOT.pom
[INFO] Installing F:\jenkins\jenkins-slave\workspace\maven-plugins-ITs-m3-windows\maven-help-plugin\pom.xml to F:\jenkins\jenkins-slave\workspace\maven-plugins-ITs-m3-windows\maven-dependency-plugin\target\local-repo\org\apache\maven\plugins\maven-help-plugin\3.0.0-SNAPSHOT\maven-help-plugin-3.0.0-SNAPSHOT.pom
[INFO] Installing F:\jenkins\jenkins-slave\workspace\maven-plugins-ITs-m3-windows\maven-help-plugin\target\maven-help-plugin-3.0.0-SNAPSHOT.jar to F:\jenkins\jenkins-slave\workspace\maven-plugins-ITs-m3-windows\maven-dependency-plugin\target\local-repo\org\apache\maven\plugins\maven-help-plugin\3.0.0-SNAPSHOT\maven-help-plugin-3.0.0-SNAPSHOT.jar
[INFO] Installing F:\jenkins\jenkins-slave\workspace\maven-plugins-ITs-m3-windows\maven-help-plugin\pom.xml to F:\jenkins\jenkins-slave\workspace\maven-plugins-ITs-m3-windows\maven-dependency-plugin\target\local-repo\org\apache\maven\plugins\maven-help-plugin\3.0.0-SNAPSHOT\maven-help-plugin-3.0.0-SNAPSHOT.pom
[INFO] Installing F:\jenkins\jenkins-slave\workspace\maven-plugins-ITs-m3-windows\maven-install-plugin\pom.xml to F:\jenkins\jenkins-slave\workspace\maven-plugins-ITs-m3-windows\maven-dependency-plugin\target\local-repo\org\apache\maven\plugins\maven-install-plugin\3.0.0-SNAPSHOT\maven-install-plugin-3.0.0-SNAPSHOT.pom
[INFO] Installing F:\jenkins\jenkins-slave\workspace\maven-plugins-ITs-m3-windows\maven-install-plugin\target\maven-install-plugin-3.0.0-SNAPSHOT.jar to F:\jenkins\jenkins-slave\workspace\maven-plugins-ITs-m3-windows\maven-dependency-plugin\target\local-repo\org\apache\maven\plugins\maven-install-plugin\3.0.0-SNAPSHOT\maven-install-plugin-3.0.0-SNAPSHOT.jar
[INFO] Installing F:\jenkins\jenkins-slave\workspace\maven-plugins-ITs-m3-windows\maven-install-plugin\pom.xml to F:\jenkins\jenkins-slave\workspace\maven-plugins-ITs-m3-windows\maven-dependency-plugin\target\local-repo\org\apache\maven\plugins\maven-install-plugin\3.0.0-SNAPSHOT\maven-install-plugin-3.0.0-SNAPSHOT.pom
[INFO] Installing F:\jenkins\jenkins-slave\workspace\maven-plugins-ITs-m3-windows\maven-jarsigner-plugin\pom.xml to F:\jenkins\jenkins-slave\workspace\maven-plugins-ITs-m3-windows\maven-dependency-plugin\target\local-repo\org\apache\maven\plugins\maven-jarsigner-plugin\1.5-SNAPSHOT\maven-jarsigner-plugin-1.5-SNAPSHOT.pom
[INFO] Installing F:\jenkins\jenkins-slave\workspace\maven-plugins-ITs-m3-windows\maven-jarsigner-plugin\target\maven-jarsigner-plugin-1.5-SNAPSHOT.jar to F:\jenkins\jenkins-slave\workspace\maven-plugins-ITs-m3-windows\maven-dependency-plugin\target\local-repo\org\apache\maven\plugins\maven-jarsigner-plugin\1.5-SNAPSHOT\maven-jarsigner-plugin-1.5-SNAPSHOT.jar
[INFO] Installing F:\jenkins\jenkins-slave\workspace\maven-plugins-ITs-m3-windows\maven-jarsigner-plugin\pom.xml to F:\jenkins\jenkins-slave\workspace\maven-plugins-ITs-m3-windows\maven-dependency-plugin\target\local-repo\org\apache\maven\plugins\maven-jarsigner-plugin\1.5-SNAPSHOT\maven-jarsigner-plugin-1.5-SNAPSHOT.pom
[INFO] Installing F:\jenkins\jenkins-slave\workspace\maven-plugins-ITs-m3-windows\maven-jdeps-plugin\pom.xml to F:\jenkins\jenkins-slave\workspace\maven-plugins-ITs-m3-windows\maven-dependency-plugin\target\local-repo\org\apache\maven\plugins\maven-jdeps-plugin\3.0.1-SNAPSHOT\maven-jdeps-plugin-3.0.1-SNAPSHOT.pom
[INFO] Installing F:\jenkins\jenkins-slave\workspace\maven-plugins-ITs-m3-windows\maven-jdeps-plugin\target\maven-jdeps-plugin-3.0.1-SNAPSHOT.jar to F:\jenkins\jenkins-slave\workspace\maven-plugins-ITs-m3-windows\maven-dependency-plugin\target\local-repo\org\apache\maven\plugins\maven-jdeps-plugin\3.0.1-SNAPSHOT\maven-jdeps-plugin-3.0.1-SNAPSHOT.jar
[INFO] Installing F:\jenkins\jenkins-slave\workspace\maven-plugins-ITs-m3-windows\maven-jdeps-plugin\pom.xml to F:\jenkins\jenkins-slave\workspace\maven-plugins-ITs-m3-windows\maven-dependency-plugin\target\local-repo\org\apache\maven\plugins\maven-jdeps-plugin\3.0.1-SNAPSHOT\maven-jdeps-plugin-3.0.1-SNAPSHOT.pom
[INFO] Installing F:\jenkins\jenkins-slave\workspace\maven-plugins-ITs-m3-windows\maven-linkcheck-plugin\pom.xml to F:\jenkins\jenkins-slave\workspace\maven-plugins-ITs-m3-windows\maven-dependency-plugin\target\local-repo\org\apache\maven\plugins\maven-linkcheck-plugin\1.3-SNAPSHOT\maven-linkcheck-plugin-1.3-SNAPSHOT.pom
[INFO] Installing F:\jenkins\jenkins-slave\workspace\maven-plugins-ITs-m3-windows\maven-linkcheck-plugin\target\maven-linkcheck-plugin-1.3-SNAPSHOT.jar to F:\jenkins\jenkins-slave\workspace\maven-plugins-ITs-m3-windows\maven-dependency-plugin\target\local-repo\org\apache\maven\plugins\maven-linkcheck-plugin\1.3-SNAPSHOT\maven-linkcheck-plugin-1.3-SNAPSHOT.jar
[INFO] Installing F:\jenkins\jenkins-slave\workspace\maven-plugins-ITs-m3-windows\maven-linkcheck-plugin\pom.xml to F:\jenkins\jenkins-slave\workspace\maven-plugins-ITs-m3-windows\maven-dependency-plugin\target\local-repo\org\apache\maven\plugins\maven-linkcheck-plugin\1.3-SNAPSHOT\maven-linkcheck-plugin-1.3-SNAPSHOT.pom
[INFO] Installing F:\jenkins\jenkins-slave\workspace\maven-plugins-ITs-m3-windows\maven-patch-plugin\pom.xml to F:\jenkins\jenkins-slave\workspace\maven-plugins-ITs-m3-windows\maven-dependency-plugin\target\local-repo\org\apache\maven\plugins\maven-patch-plugin\1.3-SNAPSHOT\maven-patch-plugin-1.3-SNAPSHOT.pom
[INFO] Installing F:\jenkins\jenkins-slave\workspace\maven-plugins-ITs-m3-windows\maven-patch-plugin\target\maven-patch-plugin-1.3-SNAPSHOT.jar to F:\jenkins\jenkins-slave\workspace\maven-plugins-ITs-m3-windows\maven-dependency-plugin\target\local-repo\org\apache\maven\plugins\maven-patch-plugin\1.3-SNAPSHOT\maven-patch-plugin-1.3-SNAPSHOT.jar
[INFO] Installing F:\jenkins\jenkins-slave\workspace\maven-plugins-ITs-m3-windows\maven-patch-plugin\pom.xml to F:\jenkins\jenkins-slave\workspace\maven-plugins-ITs-m3-windows\maven-dependency-plugin\target\local-repo\org\apache\maven\plugins\maven-patch-plugin\1.3-SNAPSHOT\maven-patch-plugin-1.3-SNAPSHOT.pom
[INFO] Installing F:\jenkins\jenkins-slave\workspace\maven-plugins-ITs-m3-windows\maven-pdf-plugin\pom.xml to F:\jenkins\jenkins-slave\workspace\maven-plugins-ITs-m3-windows\maven-dependency-plugin\target\local-repo\org\apache\maven\plugins\maven-pdf-plugin\1.4-SNAPSHOT\maven-pdf-plugin-1.4-SNAPSHOT.pom
[INFO] Installing F:\jenkins\jenkins-slave\workspace\maven-plugins-ITs-m3-windows\maven-pdf-plugin\target\maven-pdf-plugin-1.4-SNAPSHOT.jar to F:\jenkins\jenkins-slave\workspace\maven-plugins-ITs-m3-windows\maven-dependency-plugin\target\local-repo\org\apache\maven\plugins\maven-pdf-plugin\1.4-SNAPSHOT\maven-pdf-plugin-1.4-SNAPSHOT.jar
[INFO] Installing F:\jenkins\jenkins-slave\workspace\maven-plugins-ITs-m3-windows\maven-pdf-plugin\pom.xml to F:\jenkins\jenkins-slave\workspace\maven-plugins-ITs-m3-windows\maven-dependency-plugin\target\local-repo\org\apache\maven\plugins\maven-pdf-plugin\1.4-SNAPSHOT\maven-pdf-plugin-1.4-SNAPSHOT.pom
[INFO] Installing F:\jenkins\jenkins-slave\workspace\maven-plugins-ITs-m3-windows\maven-rar-plugin\pom.xml to F:\jenkins\jenkins-slave\workspace\maven-plugins-ITs-m3-windows\maven-dependency-plugin\target\local-repo\org\apache\maven\plugins\maven-rar-plugin\3.0.0-SNAPSHOT\maven-rar-plugin-3.0.0-SNAPSHOT.pom
[INFO] Installing F:\jenkins\jenkins-slave\workspace\maven-plugins-ITs-m3-windows\maven-rar-plugin\target\maven-rar-plugin-3.0.0-SNAPSHOT.jar to F:\jenkins\jenkins-slave\workspace\maven-plugins-ITs-m3-windows\maven-dependency-plugin\target\local-repo\org\apache\maven\plugins\maven-rar-plugin\3.0.0-SNAPSHOT\maven-rar-plugin-3.0.0-SNAPSHOT.jar
[INFO] Installing F:\jenkins\jenkins-slave\workspace\maven-plugins-ITs-m3-windows\maven-rar-plugin\pom.xml to F:\jenkins\jenkins-slave\workspace\maven-plugins-ITs-m3-windows\maven-dependency-plugin\target\local-repo\org\apache\maven\plugins\maven-rar-plugin\3.0.0-SNAPSHOT\maven-rar-plugin-3.0.0-SNAPSHOT.pom
[INFO] Installing F:\jenkins\jenkins-slave\workspace\maven-plugins-ITs-m3-windows\maven-repository-plugin\pom.xml to F:\jenkins\jenkins-slave\workspace\maven-plugins-ITs-m3-windows\maven-dependency-plugin\target\local-repo\org\apache\maven\plugins\maven-repository-plugin\2.5-SNAPSHOT\maven-repository-plugin-2.5-SNAPSHOT.pom
[INFO] Installing F:\jenkins\jenkins-slave\workspace\maven-plugins-ITs-m3-windows\maven-repository-plugin\target\maven-repository-plugin-2.5-SNAPSHOT.jar to F:\jenkins\jenkins-slave\workspace\maven-plugins-ITs-m3-windows\maven-dependency-plugin\target\local-repo\org\apache\maven\plugins\maven-repository-plugin\2.5-SNAPSHOT\maven-repository-plugin-2.5-SNAPSHOT.jar
[INFO] Installing F:\jenkins\jenkins-slave\workspace\maven-plugins-ITs-m3-windows\maven-repository-plugin\pom.xml to F:\jenkins\jenkins-slave\workspace\maven-plugins-ITs-m3-windows\maven-dependency-plugin\target\local-repo\org\apache\maven\plugins\maven-repository-plugin\2.5-SNAPSHOT\maven-repository-plugin-2.5-SNAPSHOT.pom
[INFO] Installing F:\jenkins\jenkins-slave\workspace\maven-plugins-ITs-m3-windows\maven-resources-plugin\pom.xml to F:\jenkins\jenkins-slave\workspace\maven-plugins-ITs-m3-windows\maven-dependency-plugin\target\local-repo\org\apache\maven\plugins\maven-resources-plugin\3.0.3-SNAPSHOT\maven-resources-plugin-3.0.3-SNAPSHOT.pom
[INFO] Installing F:\jenkins\jenkins-slave\workspace\maven-plugins-ITs-m3-windows\maven-resources-plugin\target\maven-resources-plugin-3.0.3-SNAPSHOT.jar to F:\jenkins\jenkins-slave\workspace\maven-plugins-ITs-m3-windows\maven-dependency-plugin\target\local-repo\org\apache\maven\plugins\maven-resources-plugin\3.0.3-SNAPSHOT\maven-resources-plugin-3.0.3-SNAPSHOT.jar
[INFO] Installing F:\jenkins\jenkins-slave\workspace\maven-plugins-ITs-m3-windows\maven-resources-plugin\pom.xml to F:\jenkins\jenkins-slave\workspace\maven-plugins-ITs-m3-windows\maven-dependency-plugin\target\local-repo\org\apache\maven\plugins\maven-resources-plugin\3.0.3-SNAPSHOT\maven-resources-plugin-3.0.3-SNAPSHOT.pom
[INFO] Installing F:\jenkins\jenkins-slave\workspace\maven-plugins-ITs-m3-windows\maven-resources-plugin\target\maven-resources-plugin-3.0.3-SNAPSHOT-tests.jar to F:\jenkins\jenkins-slave\workspace\maven-plugins-ITs-m3-windows\maven-dependency-plugin\target\local-repo\org\apache\maven\plugins\maven-resources-plugin\3.0.3-SNAPSHOT\maven-resources-plugin-3.0.3-SNAPSHOT-tests.jar
[INFO] Installing F:\jenkins\jenkins-slave\workspace\maven-plugins-ITs-m3-windows\maven-site-plugin\dependency-reduced-pom.xml to F:\jenkins\jenkins-slave\workspace\maven-plugins-ITs-m3-windows\maven-dependency-plugin\target\local-repo\org\apache\maven\plugins\maven-site-plugin\3.7-SNAPSHOT\maven-site-plugin-3.7-SNAPSHOT.pom
[INFO] Installing F:\jenkins\jenkins-slave\workspace\maven-plugins-ITs-m3-windows\maven-site-plugin\target\maven-site-plugin-3.7-SNAPSHOT.jar to F:\jenkins\jenkins-slave\workspace\maven-plugins-ITs-m3-windows\maven-dependency-plugin\target\local-repo\org\apache\maven\plugins\maven-site-plugin\3.7-SNAPSHOT\maven-site-plugin-3.7-SNAPSHOT.jar
[INFO] Installing F:\jenkins\jenkins-slave\workspace\maven-plugins-ITs-m3-windows\maven-site-plugin\dependency-reduced-pom.xml to F:\jenkins\jenkins-slave\workspace\maven-plugins-ITs-m3-windows\maven-dependency-plugin\target\local-repo\org\apache\maven\plugins\maven-site-plugin\3.7-SNAPSHOT\maven-site-plugin-3.7-SNAPSHOT.pom
[INFO] Installing F:\jenkins\jenkins-slave\workspace\maven-plugins-ITs-m3-windows\maven-source-plugin\pom.xml to F:\jenkins\jenkins-slave\workspace\maven-plugins-ITs-m3-windows\maven-dependency-plugin\target\local-repo\org\apache\maven\plugins\maven-source-plugin\3.0.2-SNAPSHOT\maven-source-plugin-3.0.2-SNAPSHOT.pom
[INFO] Installing F:\jenkins\jenkins-slave\workspace\maven-plugins-ITs-m3-windows\maven-source-plugin\target\maven-source-plugin-3.0.2-SNAPSHOT.jar to F:\jenkins\jenkins-slave\workspace\maven-plugins-ITs-m3-windows\maven-dependency-plugin\target\local-repo\org\apache\maven\plugins\maven-source-plugin\3.0.2-SNAPSHOT\maven-source-plugin-3.0.2-SNAPSHOT.jar
[INFO] Installing F:\jenkins\jenkins-slave\workspace\maven-plugins-ITs-m3-windows\maven-source-plugin\pom.xml to F:\jenkins\jenkins-slave\workspace\maven-plugins-ITs-m3-windows\maven-dependency-plugin\target\local-repo\org\apache\maven\plugins\maven-source-plugin\3.0.2-SNAPSHOT\maven-source-plugin-3.0.2-SNAPSHOT.pom
[INFO] Installing F:\jenkins\jenkins-slave\workspace\maven-plugins-ITs-m3-windows\maven-stage-plugin\pom.xml to F:\jenkins\jenkins-slave\workspace\maven-plugins-ITs-m3-windows\maven-dependency-plugin\target\local-repo\org\apache\maven\plugins\maven-stage-plugin\1.1-SNAPSHOT\maven-stage-plugin-1.1-SNAPSHOT.pom
[INFO] Installing F:\jenkins\jenkins-slave\workspace\maven-plugins-ITs-m3-windows\maven-stage-plugin\target\maven-stage-plugin-1.1-SNAPSHOT.jar to F:\jenkins\jenkins-slave\workspace\maven-plugins-ITs-m3-windows\maven-dependency-plugin\target\local-repo\org\apache\maven\plugins\maven-stage-plugin\1.1-SNAPSHOT\maven-stage-plugin-1.1-SNAPSHOT.jar
[INFO] Installing F:\jenkins\jenkins-slave\workspace\maven-plugins-ITs-m3-windows\maven-stage-plugin\pom.xml to F:\jenkins\jenkins-slave\workspace\maven-plugins-ITs-m3-windows\maven-dependency-plugin\target\local-repo\org\apache\maven\plugins\maven-stage-plugin\1.1-SNAPSHOT\maven-stage-plugin-1.1-SNAPSHOT.pom
[INFO] Installing F:\jenkins\jenkins-slave\workspace\maven-plugins-ITs-m3-windows\maven-toolchains-plugin\pom.xml to F:\jenkins\jenkins-slave\workspace\maven-plugins-ITs-m3-windows\maven-dependency-plugin\target\local-repo\org\apache\maven\plugins\maven-toolchains-plugin\3.0.0-SNAPSHOT\maven-toolchains-plugin-3.0.0-SNAPSHOT.pom
[INFO] Installing F:\jenkins\jenkins-slave\workspace\maven-plugins-ITs-m3-windows\maven-toolchains-plugin\target\maven-toolchains-plugin-3.0.0-SNAPSHOT.jar to F:\jenkins\jenkins-slave\workspace\maven-plugins-ITs-m3-windows\maven-dependency-plugin\target\local-repo\org\apache\maven\plugins\maven-toolchains-plugin\3.0.0-SNAPSHOT\maven-toolchains-plugin-3.0.0-SNAPSHOT.jar
[INFO] Installing F:\jenkins\jenkins-slave\workspace\maven-plugins-ITs-m3-windows\maven-toolchains-plugin\pom.xml to F:\jenkins\jenkins-slave\workspace\maven-plugins-ITs-m3-windows\maven-dependency-plugin\target\local-repo\org\apache\maven\plugins\maven-toolchains-plugin\3.0.0-SNAPSHOT\maven-toolchains-plugin-3.0.0-SNAPSHOT.pom
[INFO] Installing F:\jenkins\jenkins-slave\workspace\maven-plugins-ITs-m3-windows\maven-verifier-plugin\pom.xml to F:\jenkins\jenkins-slave\workspace\maven-plugins-ITs-m3-windows\maven-dependency-plugin\target\local-repo\org\apache\maven\plugins\maven-verifier-plugin\3.0.0-SNAPSHOT\maven-verifier-plugin-3.0.0-SNAPSHOT.pom
[INFO] Installing F:\jenkins\jenkins-slave\workspace\maven-plugins-ITs-m3-windows\maven-verifier-plugin\target\maven-verifier-plugin-3.0.0-SNAPSHOT.jar to F:\jenkins\jenkins-slave\workspace\maven-plugins-ITs-m3-windows\maven-dependency-plugin\target\local-repo\org\apache\maven\plugins\maven-verifier-plugin\3.0.0-SNAPSHOT\maven-verifier-plugin-3.0.0-SNAPSHOT.jar
[INFO] Installing F:\jenkins\jenkins-slave\workspace\maven-plugins-ITs-m3-windows\maven-verifier-plugin\pom.xml to F:\jenkins\jenkins-slave\workspace\maven-plugins-ITs-m3-windows\maven-dependency-plugin\target\local-repo\org\apache\maven\plugins\maven-verifier-plugin\3.0.0-SNAPSHOT\maven-verifier-plugin-3.0.0-SNAPSHOT.pom
[INFO] Installing F:\jenkins\jenkins-slave\workspace\maven-plugins-ITs-m3-windows\maven-war-plugin\pom.xml to F:\jenkins\jenkins-slave\workspace\maven-plugins-ITs-m3-windows\maven-dependency-plugin\target\local-repo\org\apache\maven\plugins\maven-war-plugin\3.1.1-SNAPSHOT\maven-war-plugin-3.1.1-SNAPSHOT.pom
[INFO] Installing F:\jenkins\jenkins-slave\workspace\maven-plugins-ITs-m3-windows\maven-war-plugin\target\maven-war-plugin-3.1.1-SNAPSHOT.jar to F:\jenkins\jenkins-slave\workspace\maven-plugins-ITs-m3-windows\maven-dependency-plugin\target\local-repo\org\apache\maven\plugins\maven-war-plugin\3.1.1-SNAPSHOT\maven-war-plugin-3.1.1-SNAPSHOT.jar
[INFO] Installing F:\jenkins\jenkins-slave\workspace\maven-plugins-ITs-m3-windows\maven-war-plugin\pom.xml to F:\jenkins\jenkins-slave\workspace\maven-plugins-ITs-m3-windows\maven-dependency-plugin\target\local-repo\org\apache\maven\plugins\maven-war-plugin\3.1.1-SNAPSHOT\maven-war-plugin-3.1.1-SNAPSHOT.pom
[INFO] Installing F:\jenkins\jenkins-slave\workspace\maven-plugins-ITs-m3-windows\maven-doap-plugin\pom.xml to F:\jenkins\jenkins-slave\workspace\maven-plugins-ITs-m3-windows\maven-dependency-plugin\target\local-repo\org\apache\maven\plugins\maven-doap-plugin\1.3-SNAPSHOT\maven-doap-plugin-1.3-SNAPSHOT.pom
[INFO] Installing F:\jenkins\jenkins-slave\workspace\maven-plugins-ITs-m3-windows\maven-doap-plugin\target\maven-doap-plugin-1.3-SNAPSHOT.jar to F:\jenkins\jenkins-slave\workspace\maven-plugins-ITs-m3-windows\maven-dependency-plugin\target\local-repo\org\apache\maven\plugins\maven-doap-plugin\1.3-SNAPSHOT\maven-doap-plugin-1.3-SNAPSHOT.jar
[INFO] Installing F:\jenkins\jenkins-slave\workspace\maven-plugins-ITs-m3-windows\maven-doap-plugin\pom.xml to F:\jenkins\jenkins-slave\workspace\maven-plugins-ITs-m3-windows\maven-dependency-plugin\target\local-repo\org\apache\maven\plugins\maven-doap-plugin\1.3-SNAPSHOT\maven-doap-plugin-1.3-SNAPSHOT.pom
[INFO] Installing F:\jenkins\jenkins-slave\workspace\maven-plugins-ITs-m3-windows\maven-invoker-plugin\pom.xml to F:\jenkins\jenkins-slave\workspace\maven-plugins-ITs-m3-windows\maven-dependency-plugin\target\local-repo\org\apache\maven\plugins\maven-invoker-plugin\3.0.2-SNAPSHOT\maven-invoker-plugin-3.0.2-SNAPSHOT.pom
[INFO] Installing F:\jenkins\jenkins-slave\workspace\maven-plugins-ITs-m3-windows\maven-invoker-plugin\target\maven-invoker-plugin-3.0.2-SNAPSHOT.jar to F:\jenkins\jenkins-slave\workspace\maven-plugins-ITs-m3-windows\maven-dependency-plugin\target\local-repo\org\apache\maven\plugins\maven-invoker-plugin\3.0.2-SNAPSHOT\maven-invoker-plugin-3.0.2-SNAPSHOT.jar
[INFO] Installing F:\jenkins\jenkins-slave\workspace\maven-plugins-ITs-m3-windows\maven-invoker-plugin\pom.xml to F:\jenkins\jenkins-slave\workspace\maven-plugins-ITs-m3-windows\maven-dependency-plugin\target\local-repo\org\apache\maven\plugins\maven-invoker-plugin\3.0.2-SNAPSHOT\maven-invoker-plugin-3.0.2-SNAPSHOT.pom
[INFO] Installing F:\jenkins\jenkins-slave\workspace\maven-plugins-ITs-m3-windows\maven-jar-plugin\pom.xml to F:\jenkins\jenkins-slave\workspace\maven-plugins-ITs-m3-windows\maven-dependency-plugin\target\local-repo\org\apache\maven\plugins\maven-jar-plugin\3.0.3-SNAPSHOT\maven-jar-plugin-3.0.3-SNAPSHOT.pom
[INFO] Installing F:\jenkins\jenkins-slave\workspace\maven-plugins-ITs-m3-windows\maven-jar-plugin\target\maven-jar-plugin-3.0.3-SNAPSHOT.jar to F:\jenkins\jenkins-slave\workspace\maven-plugins-ITs-m3-windows\maven-dependency-plugin\target\local-repo\org\apache\maven\plugins\maven-jar-plugin\3.0.3-SNAPSHOT\maven-jar-plugin-3.0.3-SNAPSHOT.jar
[INFO] Installing F:\jenkins\jenkins-slave\workspace\maven-plugins-ITs-m3-windows\maven-jar-plugin\pom.xml to F:\jenkins\jenkins-slave\workspace\maven-plugins-ITs-m3-windows\maven-dependency-plugin\target\local-repo\org\apache\maven\plugins\maven-jar-plugin\3.0.3-SNAPSHOT\maven-jar-plugin-3.0.3-SNAPSHOT.pom
[INFO] Installing F:\jenkins\jenkins-slave\workspace\maven-plugins-ITs-m3-windows\maven-assembly-plugin\pom.xml to F:\jenkins\jenkins-slave\workspace\maven-plugins-ITs-m3-windows\maven-dependency-plugin\target\local-repo\org\apache\maven\plugins\maven-assembly-plugin\3.1.0-SNAPSHOT\maven-assembly-plugin-3.1.0-SNAPSHOT.pom
[INFO] Installing F:\jenkins\jenkins-slave\workspace\maven-plugins-ITs-m3-windows\maven-assembly-plugin\target\maven-assembly-plugin-3.1.0-SNAPSHOT.jar to F:\jenkins\jenkins-slave\workspace\maven-plugins-ITs-m3-windows\maven-dependency-plugin\target\local-repo\org\apache\maven\plugins\maven-assembly-plugin\3.1.0-SNAPSHOT\maven-assembly-plugin-3.1.0-SNAPSHOT.jar
[INFO] Installing F:\jenkins\jenkins-slave\workspace\maven-plugins-ITs-m3-windows\maven-assembly-plugin\pom.xml to F:\jenkins\jenkins-slave\workspace\maven-plugins-ITs-m3-windows\maven-dependency-plugin\target\local-repo\org\apache\maven\plugins\maven-assembly-plugin\3.1.0-SNAPSHOT\maven-assembly-plugin-3.1.0-SNAPSHOT.pom
[INFO] Installing F:\jenkins\jenkins-slave\workspace\maven-plugins-ITs-m3-windows\maven-checkstyle-plugin\pom.xml to F:\jenkins\jenkins-slave\workspace\maven-plugins-ITs-m3-windows\maven-dependency-plugin\target\local-repo\org\apache\maven\plugins\maven-checkstyle-plugin\3.0.0-SNAPSHOT\maven-checkstyle-plugin-3.0.0-SNAPSHOT.pom
[INFO] Installing F:\jenkins\jenkins-slave\workspace\maven-plugins-ITs-m3-windows\maven-checkstyle-plugin\target\maven-checkstyle-plugin-3.0.0-SNAPSHOT.jar to F:\jenkins\jenkins-slave\workspace\maven-plugins-ITs-m3-windows\maven-dependency-plugin\target\local-repo\org\apache\maven\plugins\maven-checkstyle-plugin\3.0.0-SNAPSHOT\maven-checkstyle-plugin-3.0.0-SNAPSHOT.jar
[INFO] Installing F:\jenkins\jenkins-slave\workspace\maven-plugins-ITs-m3-windows\maven-checkstyle-plugin\pom.xml to F:\jenkins\jenkins-slave\workspace\maven-plugins-ITs-m3-windows\maven-dependency-plugin\target\local-repo\org\apache\maven\plugins\maven-checkstyle-plugin\3.0.0-SNAPSHOT\maven-checkstyle-plugin-3.0.0-SNAPSHOT.pom
[INFO] Installing F:\jenkins\jenkins-slave\workspace\maven-plugins-ITs-m3-windows\maven-javadoc-plugin\pom.xml to F:\jenkins\jenkins-slave\workspace\maven-plugins-ITs-m3-windows\maven-dependency-plugin\target\local-repo\org\apache\maven\plugins\maven-javadoc-plugin\3.0.0-SNAPSHOT\maven-javadoc-plugin-3.0.0-SNAPSHOT.pom
[INFO]                                                                        
[INFO] ------------------------------------------------------------------------
[INFO] Building Apache Maven Plugins Aggregator 1-SNAPSHOT
[INFO] ------------------------------------------------------------------------
[INFO]
[INFO] --- maven-clean-plugin:2.5:clean (default-clean) @ maven-plugins-aggregator ---
[INFO]
[INFO] --- maven-enforcer-plugin:1.3.1:enforce (enforce-bytecode-version) @ maven-plugins-aggregator ---
[INFO]
[INFO] --- maven-enforcer-plugin:1.3.1:enforce (ban-known-bad-maven-versions) @ maven-plugins-aggregator ---
[INFO]
[INFO] --- maven-remote-resources-plugin:1.5:process (default) @ maven-plugins-aggregator ---
[INFO]
[INFO] --- maven-site-plugin:3.3:attach-descriptor (attach-descriptor) @ maven-plugins-aggregator ---
[INFO]
[INFO] --- maven-install-plugin:2.5.1:install (default-install) @ maven-plugins-aggregator ---
[INFO] Installing <https://builds.apache.org/job/maven-plugins-ITs-m3-windows/ws/pom.xml> to C:\Users\jenkins\.m2\repository\org\apache\maven\plugins\maven-plugins-aggregator\1-SNAPSHOT\maven-plugins-aggregator-1-SNAPSHOT.pom
[INFO] ------------------------------------------------------------------------
[INFO] Reactor Summary:
[INFO]
[INFO] Apache Maven ACR Plugin ............................ SUCCESS [ 53.650 s]
[INFO] Apache Maven AntRun Plugin ......................... SUCCESS [02:52 min]
[INFO] Apache Maven Changelog Plugin ...................... SUCCESS [01:18 min]
[INFO] Apache Maven Changes Plugin ........................ SUCCESS [02:06 min]
[INFO] Apache Maven Clean Plugin .......................... SUCCESS [ 50.961 s]
[INFO] Apache Maven Compiler Plugin ....................... SUCCESS [03:59 min]
[INFO] Apache Maven Deploy Plugin ......................... SUCCESS [03:43 min]
[INFO] Apache Maven Documentation Checker Plugin .......... SUCCESS [ 10.773 s]
[INFO] Apache Maven EAR Plugin ............................ SUCCESS [10:58 min]
[INFO] Apache Maven EJB Plugin ............................ SUCCESS [01:23 min]
[INFO] Apache Maven Help Plugin ........................... SUCCESS [04:27 min]
[INFO] Apache Maven Install Plugin ........................ SUCCESS [03:57 min]
[INFO] Apache Maven Jarsigner Plugin ...................... SUCCESS [01:54 min]
[INFO] Apache Maven JDeps Plugin .......................... SUCCESS [  6.400 s]
[INFO] Apache Maven Linkcheck Plugin ...................... SUCCESS [  8.347 s]
[INFO] Apache Maven Patch Plugin .......................... SUCCESS [ 12.665 s]
[INFO] Apache Maven PDF Plugin ............................ SUCCESS [ 54.365 s]
[INFO] Apache Maven RAR Plugin ............................ SUCCESS [ 27.713 s]
[INFO] Apache Maven Repository Plugin ..................... SUCCESS [ 58.434 s]
[INFO] Apache Maven Resources Plugin ...................... SUCCESS [02:50 min]
[INFO] Apache Maven Site Plugin ........................... SUCCESS [13:55 min]
[INFO] Apache Maven Source Plugin ......................... SUCCESS [02:05 min]
[INFO] Apache Maven Stage Plugin .......................... SUCCESS [  5.313 s]
[INFO] Apache Maven Toolchains Plugin ..................... SUCCESS [ 32.530 s]
[INFO] Apache Maven Verifier Plugin ....................... SUCCESS [ 17.459 s]
[INFO] Apache Maven WAR Plugin ............................ SUCCESS [03:23 min]
[INFO] Apache Maven DOAP Plugin ........................... SUCCESS [ 37.618 s]
[INFO] Apache Maven Invoker Plugin ........................ SUCCESS [12:15 min]
[INFO] Apache Maven JAR Plugin ............................ SUCCESS [03:07 min]
[INFO] Apache Maven Assembly Plugin ....................... SUCCESS [19:01 min]
[INFO] Apache Maven Checkstyle Plugin ..................... SUCCESS [07:21 min]
[INFO] Apache Maven Javadoc Plugin ........................ FAILURE [02:23 min]
[INFO] Apache Maven PMD Plugin ............................ FAILURE [ 20.537 s]
[INFO] Apache Maven Project Info Reports Plugin ........... FAILURE [ 24.510 s]
[INFO] Apache Maven Remote Resources Plugin ............... FAILURE [  6.713 s]
[INFO] Apache Maven Shade Plugin .......................... FAILURE [  8.829 s]
[INFO] Apache Maven SCM Publish Plugin .................... FAILURE [  5.862 s]
[INFO] Apache Maven Dependency Plugin ..................... FAILURE [01:03 min]
[INFO] Apache Maven Plugins Aggregator .................... SUCCESS [  0.915 s]
[INFO] ------------------------------------------------------------------------
[INFO] BUILD FAILURE
[INFO] ------------------------------------------------------------------------
[INFO] Total time: 01:51 h
[INFO] Finished at: 2017-07-26T01:26:20+00:00
[INFO] Final Memory: 159M/578M
[INFO] ------------------------------------------------------------------------
[WARNING] The requested profile "apache.snapshots" could not be activated because it does not exist.
[ERROR] Failed to execute goal org.apache.maven.plugins:maven-surefire-plugin:2.19.1:test (default-test) on project maven-javadoc-plugin: There are test failures.
[ERROR]
[ERROR] Please refer to F:\jenkins\jenkins-slave\workspace\maven-plugins-ITs-m3-windows\maven-javadoc-plugin\target\surefire-reports for the individual test results.
[ERROR] -> [Help 1]
[ERROR] Failed to execute goal org.apache.maven.plugins:maven-invoker-plugin:2.0.0:install (integration-test) on project maven-pmd-plugin: Failed to install project dependencies: MavenProject: org.apache.maven.plugins:maven-pmd-plugin:3.9-SNAPSHOT @ F:\jenkins\jenkins-slave\workspace\maven-plugins-ITs-m3-windows\maven-pmd-plugin\pom.xml: Failed to install project artifacts: MavenProject: org.apache.maven.plugins:maven-javadoc-plugin:3.0.0-SNAPSHOT @ F:\jenkins\jenkins-slave\workspace\maven-plugins-ITs-m3-windows\maven-javadoc-plugin\pom.xml: Failed to install artifact: org.apache.maven.plugins:maven-javadoc-plugin:maven-plugin:3.0.0-SNAPSHOT: Artifact is not fully assembled: F:\jenkins\jenkins-slave\workspace\maven-plugins-ITs-m3-windows\maven-javadoc-plugin\target\classes -> [Help 2]
[ERROR] Failed to execute goal org.apache.maven.plugins:maven-invoker-plugin:2.0.0:install (integration-test) on project maven-project-info-reports-plugin: Failed to install project dependencies: MavenProject: org.apache.maven.plugins:maven-project-info-reports-plugin:2.10-SNAPSHOT @ F:\jenkins\jenkins-slave\workspace\maven-plugins-ITs-m3-windows\maven-project-info-reports-plugin\pom.xml: Failed to install project artifacts: MavenProject: org.apache.maven.plugins:maven-javadoc-plugin:3.0.0-SNAPSHOT @ F:\jenkins\jenkins-slave\workspace\maven-plugins-ITs-m3-windows\maven-javadoc-plugin\pom.xml: Failed to install artifact: org.apache.maven.plugins:maven-javadoc-plugin:maven-plugin:3.0.0-SNAPSHOT: Artifact is not fully assembled: F:\jenkins\jenkins-slave\workspace\maven-plugins-ITs-m3-windows\maven-javadoc-plugin\target\classes -> [Help 2]
[ERROR] Failed to execute goal org.apache.maven.plugins:maven-invoker-plugin:2.0.0:install (integration-test) on project maven-remote-resources-plugin: Failed to install project dependencies: MavenProject: org.apache.maven.plugins:maven-remote-resources-plugin:1.6-SNAPSHOT @ F:\jenkins\jenkins-slave\workspace\maven-plugins-ITs-m3-windows\maven-remote-resources-plugin\pom.xml: Failed to install project artifacts: MavenProject: org.apache.maven.plugins:maven-javadoc-plugin:3.0.0-SNAPSHOT @ F:\jenkins\jenkins-slave\workspace\maven-plugins-ITs-m3-windows\maven-javadoc-plugin\pom.xml: Failed to install artifact: org.apache.maven.plugins:maven-javadoc-plugin:maven-plugin:3.0.0-SNAPSHOT: Artifact is not fully assembled: F:\jenkins\jenkins-slave\workspace\maven-plugins-ITs-m3-windows\maven-javadoc-plugin\target\classes -> [Help 2]
[ERROR] Failed to execute goal org.apache.maven.plugins:maven-invoker-plugin:2.0.0:install (integration-test) on project maven-shade-plugin: Failed to install project dependencies: MavenProject: org.apache.maven.plugins:maven-shade-plugin:3.0.1-SNAPSHOT @ F:\jenkins\jenkins-slave\workspace\maven-plugins-ITs-m3-windows\maven-shade-plugin\pom.xml: Failed to install project artifacts: MavenProject: org.apache.maven.plugins:maven-javadoc-plugin:3.0.0-SNAPSHOT @ F:\jenkins\jenkins-slave\workspace\maven-plugins-ITs-m3-windows\maven-javadoc-plugin\pom.xml: Failed to install artifact: org.apache.maven.plugins:maven-javadoc-plugin:maven-plugin:3.0.0-SNAPSHOT: Artifact is not fully assembled: F:\jenkins\jenkins-slave\workspace\maven-plugins-ITs-m3-windows\maven-javadoc-plugin\target\classes -> [Help 2]
[ERROR] Failed to execute goal org.apache.maven.plugins:maven-invoker-plugin:2.0.0:install (integration-test) on project maven-scm-publish-plugin: Failed to install project dependencies: MavenProject: org.apache.maven.plugins:maven-scm-publish-plugin:1.2-SNAPSHOT @ F:\jenkins\jenkins-slave\workspace\maven-plugins-ITs-m3-windows\maven-scm-publish-plugin\pom.xml: Failed to install project artifacts: MavenProject: org.apache.maven.plugins:maven-javadoc-plugin:3.0.0-SNAPSHOT @ F:\jenkins\jenkins-slave\workspace\maven-plugins-ITs-m3-windows\maven-javadoc-plugin\pom.xml: Failed to install artifact: org.apache.maven.plugins:maven-javadoc-plugin:maven-plugin:3.0.0-SNAPSHOT: Artifact is not fully assembled: F:\jenkins\jenkins-slave\workspace\maven-plugins-ITs-m3-windows\maven-javadoc-plugin\target\classes -> [Help 2]
[ERROR] Failed to execute goal org.apache.maven.plugins:maven-invoker-plugin:2.0.0:install (integration-test) on project maven-dependency-plugin: Failed to install project dependencies: MavenProject: org.apache.maven.plugins:maven-dependency-plugin:3.0.2-SNAPSHOT @ F:\jenkins\jenkins-slave\workspace\maven-plugins-ITs-m3-windows\maven-dependency-plugin\pom.xml: Failed to install project artifacts: MavenProject: org.apache.maven.plugins:maven-javadoc-plugin:3.0.0-SNAPSHOT @ F:\jenkins\jenkins-slave\workspace\maven-plugins-ITs-m3-windows\maven-javadoc-plugin\pom.xml: Failed to install artifact: org.apache.maven.plugins:maven-javadoc-plugin:maven-plugin:3.0.0-SNAPSHOT: Artifact is not fully assembled: F:\jenkins\jenkins-slave\workspace\maven-plugins-ITs-m3-windows\maven-javadoc-plugin\target\classes -> [Help 2]
[ERROR]
[ERROR] To see the full stack trace of the errors, re-run Maven with the -e switch.
[ERROR] Re-run Maven using the -X switch to enable full debug logging.
[ERROR]
[ERROR] For more information about the errors and possible solutions, please read the following articles:
[ERROR] [Help 1] http://cwiki.apache.org/confluence/display/MAVEN/MojoFailureException
[ERROR] [Help 2] http://cwiki.apache.org/confluence/display/MAVEN/MojoExecutionException
[ERROR]
[ERROR] After correcting the problems, you can resume the build with the command
[ERROR]   mvn <goals> -rf :maven-javadoc-plugin
Build step 'Invoke top-level Maven targets' marked build as failure
Deleting 1 temporary files
Recording test results
Reply | Threaded
Open this post in threaded view
|  
Report Content as Inappropriate

Jenkins build is back to normal : maven-plugins-ITs-m3-windows #1946

Apache Jenkins Server-2
Loading...