Build failed in Jenkins: maven-plugins-ITs-m3-windows #1925

Previous Topic Next Topic
 
classic Classic list List threaded Threaded
3 messages Options
Reply | Threaded
Open this post in threaded view
|  
Report Content as Inappropriate

Build failed in Jenkins: maven-plugins-ITs-m3-windows #1925

Apache Jenkins Server-2
See <https://builds.apache.org/job/maven-plugins-ITs-m3-windows/1925/display/redirect?page=changes>

Changes:

[Robert Scholte] [MJAVADOC-485] Upgrade to commons-lang3
Introduce JavadocVersion, first step to get rid of floats comparison

------------------------------------------
[...truncated 2.61 MB...]
marker       2017-07-08T20:13:02 \target\unit-tests\unpack\markers\testGroupId-snapshot-jar-2.0-SNAPSHOT.marker
marker.lastModified() = 1499544782000
unpackedFile.lastModified() = 1499544770000
Tests run: 18, Failures: 0, Errors: 0, Skipped: 0, Time elapsed: 3.997 sec - in org.apache.maven.plugins.dependency.fromConfiguration.TestUnpackMojo
Running org.apache.maven.plugins.dependency.fromDependencies.TestBuildClasspathMojo
[INFO] Dependencies classpath:
F:\jenkins\jenkins-slave\workspace\maven-plugins-ITs-m3-windows\maven-dependency-plugin\target\unit-tests\build-classpath\localTestRepo\snapshot-2.0-SNAPSHOT.jar;F:\jenkins\jenkins-slave\workspace\maven-plugins-ITs-m3-windows\maven-dependency-plugin\target\unit-tests\build-classpath\localTestRepo\test-1.0.jar;F:\jenkins\jenkins-slave\workspace\maven-plugins-ITs-m3-windows\maven-dependency-plugin\target\unit-tests\build-classpath\localTestRepo\provided-1.0.jar;F:\jenkins\jenkins-slave\workspace\maven-plugins-ITs-m3-windows\maven-dependency-plugin\target\unit-tests\build-classpath\localTestRepo\release-1.0.jar;F:\jenkins\jenkins-slave\workspace\maven-plugins-ITs-m3-windows\maven-dependency-plugin\target\unit-tests\build-classpath\localTestRepo\runtime-1.0.jar;F:\jenkins\jenkins-slave\workspace\maven-plugins-ITs-m3-windows\maven-dependency-plugin\target\unit-tests\build-classpath\localTestRepo\compile-1.0.jar;F:\jenkins\jenkins-slave\workspace\maven-plugins-ITs-m3-windows\maven-dependency-plugin\target\unit-tests\build-classpath\localTestRepo\system-1.0.jar
[INFO] Wrote classpath file 'F:\jenkins\jenkins-slave\workspace\maven-plugins-ITs-m3-windows\maven-dependency-plugin\target\unit-tests\build-classpath\buildClasspath.txt'.
[INFO] Wrote classpath file 'F:\jenkins\jenkins-slave\workspace\maven-plugins-ITs-m3-windows\maven-dependency-plugin\target\unit-tests\build-classpath\buildClasspath.txt'.
[INFO] Skipped writing classpath file 'F:\jenkins\jenkins-slave\workspace\maven-plugins-ITs-m3-windows\maven-dependency-plugin\target\unit-tests\build-classpath\buildClasspath.txt'.  No changes found.
Tests run: 2, Failures: 0, Errors: 0, Skipped: 0, Time elapsed: 0.392 sec - in org.apache.maven.plugins.dependency.fromDependencies.TestBuildClasspathMojo
Running org.apache.maven.plugins.dependency.fromDependencies.TestCopyDependenciesMojo
Tests run: 33, Failures: 0, Errors: 0, Skipped: 0, Time elapsed: 9.167 sec - in org.apache.maven.plugins.dependency.fromDependencies.TestCopyDependenciesMojo
Running org.apache.maven.plugins.dependency.fromDependencies.TestCopyDependenciesMojo2
Tests run: 11, Failures: 0, Errors: 0, Skipped: 0, Time elapsed: 1.997 sec - in org.apache.maven.plugins.dependency.fromDependencies.TestCopyDependenciesMojo2
Running org.apache.maven.plugins.dependency.fromDependencies.TestIncludeExcludeUnpackDependenciesMojo
Tests run: 7, Failures: 0, Errors: 0, Skipped: 0, Time elapsed: 2.887 sec - in org.apache.maven.plugins.dependency.fromDependencies.TestIncludeExcludeUnpackDependenciesMojo
Running org.apache.maven.plugins.dependency.fromDependencies.TestUnpackDependenciesMojo
Tests run: 28, Failures: 0, Errors: 0, Skipped: 0, Time elapsed: 13.861 sec - in org.apache.maven.plugins.dependency.fromDependencies.TestUnpackDependenciesMojo
Running org.apache.maven.plugins.dependency.fromDependencies.TestUnpackDependenciesMojo2
Tests run: 5, Failures: 0, Errors: 0, Skipped: 0, Time elapsed: 7.48 sec - in org.apache.maven.plugins.dependency.fromDependencies.TestUnpackDependenciesMojo2
Running org.apache.maven.plugins.dependency.resolvers.TestResolveMojo
Tests run: 2, Failures: 0, Errors: 0, Skipped: 0, Time elapsed: 0.238 sec - in org.apache.maven.plugins.dependency.resolvers.TestResolveMojo
Running org.apache.maven.plugins.dependency.TestCollectMojo
Tests run: 3, Failures: 0, Errors: 0, Skipped: 0, Time elapsed: 0.371 sec - in org.apache.maven.plugins.dependency.TestCollectMojo
Running org.apache.maven.plugins.dependency.TestGetMojo
[INFO] Resolving org.apache.maven:maven-model:jar:2.0.9 with transitive dependencies
[INFO] Resolving org.apache.maven:maven-model:jar:2.0.9
[INFO] Resolving org.apache.maven:maven-model:jar:2.0.9
Tests run: 3, Failures: 0, Errors: 0, Skipped: 0, Time elapsed: 1.068 sec - in org.apache.maven.plugins.dependency.TestGetMojo
Running org.apache.maven.plugins.dependency.TestPropertiesMojo
Tests run: 1, Failures: 0, Errors: 0, Skipped: 0, Time elapsed: 0.105 sec - in org.apache.maven.plugins.dependency.TestPropertiesMojo
Running org.apache.maven.plugins.dependency.TestSkip
Tests run: 19, Failures: 0, Errors: 0, Skipped: 0, Time elapsed: 3.911 sec - in org.apache.maven.plugins.dependency.TestSkip
Running org.apache.maven.plugins.dependency.tree.TestTreeMojo
Tests run: 1, Failures: 0, Errors: 0, Skipped: 0, Time elapsed: 0.128 sec - in org.apache.maven.plugins.dependency.tree.TestTreeMojo
Running org.apache.maven.plugins.dependency.utils.filters.TestDestFileFilter
Tests run: 8, Failures: 0, Errors: 0, Skipped: 0, Time elapsed: 0.018 sec - in org.apache.maven.plugins.dependency.utils.filters.TestDestFileFilter
Running org.apache.maven.plugins.dependency.utils.filters.TestMarkerFileFilter
Tests run: 5, Failures: 0, Errors: 0, Skipped: 0, Time elapsed: 0.009 sec - in org.apache.maven.plugins.dependency.utils.filters.TestMarkerFileFilter
Running org.apache.maven.plugins.dependency.utils.filters.TestResolveMarkerFileFilter
Tests run: 1, Failures: 0, Errors: 0, Skipped: 0, Time elapsed: 0.002 sec - in org.apache.maven.plugins.dependency.utils.filters.TestResolveMarkerFileFilter
Running org.apache.maven.plugins.dependency.utils.markers.TestDefaultMarkerFileHandler
Tests run: 6, Failures: 0, Errors: 0, Skipped: 0, Time elapsed: 0.012 sec - in org.apache.maven.plugins.dependency.utils.markers.TestDefaultMarkerFileHandler
Running org.apache.maven.plugins.dependency.utils.markers.TestSourcesMarkerFileHandler
Tests run: 10, Failures: 0, Errors: 0, Skipped: 0, Time elapsed: 0.015 sec - in org.apache.maven.plugins.dependency.utils.markers.TestSourcesMarkerFileHandler
Running org.apache.maven.plugins.dependency.utils.markers.TestUnpackMarkerFileHandler
Tests run: 9, Failures: 0, Errors: 0, Skipped: 0, Time elapsed: 1.199 sec - in org.apache.maven.plugins.dependency.utils.markers.TestUnpackMarkerFileHandler
Running org.apache.maven.plugins.dependency.utils.TestDependencyStatusSets
Tests run: 5, Failures: 0, Errors: 0, Skipped: 0, Time elapsed: 0.81 sec - in org.apache.maven.plugins.dependency.utils.TestDependencyStatusSets
Running org.apache.maven.plugins.dependency.utils.TestDependencyUtil
Tests run: 9, Failures: 0, Errors: 0, Skipped: 0, Time elapsed: 0.005 sec - in org.apache.maven.plugins.dependency.utils.TestDependencyUtil
Running org.apache.maven.plugins.dependency.utils.TestSilentLog
Tests run: 2, Failures: 0, Errors: 0, Skipped: 0, Time elapsed: 0.001 sec - in org.apache.maven.plugins.dependency.utils.TestSilentLog
Running org.apache.maven.plugins.dependency.utils.translators.TestClassifierTypeTranslator
Tests run: 6, Failures: 0, Errors: 0, Skipped: 0, Time elapsed: 0.81 sec - in org.apache.maven.plugins.dependency.utils.translators.TestClassifierTypeTranslator

Results :

Tests run: 244, Failures: 0, Errors: 0, Skipped: 0

[INFO]
[INFO] --- maven-jar-plugin:3.0.0:jar (default-jar) @ maven-dependency-plugin ---
[INFO] Building jar: F:\jenkins\jenkins-slave\workspace\maven-plugins-ITs-m3-windows\maven-dependency-plugin\target\maven-dependency-plugin-3.0.2-SNAPSHOT.jar
[INFO]
[INFO] --- maven-plugin-plugin:3.4:addPluginArtifactMetadata (default-addPluginArtifactMetadata) @ maven-dependency-plugin ---
[INFO]
[INFO] --- maven-site-plugin:3.5.1:attach-descriptor (attach-descriptor) @ maven-dependency-plugin ---
[INFO]
[INFO] --- maven-invoker-plugin:2.0.0:install (integration-test) @ maven-dependency-plugin ---
[INFO] Installing F:\jenkins\jenkins-slave\workspace\maven-plugins-ITs-m3-windows\maven-acr-plugin\pom.xml to F:\jenkins\jenkins-slave\workspace\maven-plugins-ITs-m3-windows\maven-dependency-plugin\target\local-repo\org\apache\maven\plugins\maven-acr-plugin\3.0.1-SNAPSHOT\maven-acr-plugin-3.0.1-SNAPSHOT.pom
[INFO] Installing F:\jenkins\jenkins-slave\workspace\maven-plugins-ITs-m3-windows\maven-acr-plugin\target\maven-acr-plugin-3.0.1-SNAPSHOT.jar to F:\jenkins\jenkins-slave\workspace\maven-plugins-ITs-m3-windows\maven-dependency-plugin\target\local-repo\org\apache\maven\plugins\maven-acr-plugin\3.0.1-SNAPSHOT\maven-acr-plugin-3.0.1-SNAPSHOT.jar
[INFO] Installing F:\jenkins\jenkins-slave\workspace\maven-plugins-ITs-m3-windows\maven-acr-plugin\pom.xml to F:\jenkins\jenkins-slave\workspace\maven-plugins-ITs-m3-windows\maven-dependency-plugin\target\local-repo\org\apache\maven\plugins\maven-acr-plugin\3.0.1-SNAPSHOT\maven-acr-plugin-3.0.1-SNAPSHOT.pom
[INFO] Installing F:\jenkins\jenkins-slave\workspace\maven-plugins-ITs-m3-windows\maven-antrun-plugin\pom.xml to F:\jenkins\jenkins-slave\workspace\maven-plugins-ITs-m3-windows\maven-dependency-plugin\target\local-repo\org\apache\maven\plugins\maven-antrun-plugin\3.0.0-SNAPSHOT\maven-antrun-plugin-3.0.0-SNAPSHOT.pom
[INFO] Installing F:\jenkins\jenkins-slave\workspace\maven-plugins-ITs-m3-windows\maven-antrun-plugin\target\maven-antrun-plugin-3.0.0-SNAPSHOT.jar to F:\jenkins\jenkins-slave\workspace\maven-plugins-ITs-m3-windows\maven-dependency-plugin\target\local-repo\org\apache\maven\plugins\maven-antrun-plugin\3.0.0-SNAPSHOT\maven-antrun-plugin-3.0.0-SNAPSHOT.jar
[INFO] Installing F:\jenkins\jenkins-slave\workspace\maven-plugins-ITs-m3-windows\maven-antrun-plugin\pom.xml to F:\jenkins\jenkins-slave\workspace\maven-plugins-ITs-m3-windows\maven-dependency-plugin\target\local-repo\org\apache\maven\plugins\maven-antrun-plugin\3.0.0-SNAPSHOT\maven-antrun-plugin-3.0.0-SNAPSHOT.pom
[INFO] Installing F:\jenkins\jenkins-slave\workspace\maven-plugins-ITs-m3-windows\maven-changelog-plugin\pom.xml to F:\jenkins\jenkins-slave\workspace\maven-plugins-ITs-m3-windows\maven-dependency-plugin\target\local-repo\org\apache\maven\plugins\maven-changelog-plugin\2.4-SNAPSHOT\maven-changelog-plugin-2.4-SNAPSHOT.pom
[INFO] Installing F:\jenkins\jenkins-slave\workspace\maven-plugins-ITs-m3-windows\maven-changelog-plugin\target\maven-changelog-plugin-2.4-SNAPSHOT.jar to F:\jenkins\jenkins-slave\workspace\maven-plugins-ITs-m3-windows\maven-dependency-plugin\target\local-repo\org\apache\maven\plugins\maven-changelog-plugin\2.4-SNAPSHOT\maven-changelog-plugin-2.4-SNAPSHOT.jar
[INFO] Installing F:\jenkins\jenkins-slave\workspace\maven-plugins-ITs-m3-windows\maven-changelog-plugin\pom.xml to F:\jenkins\jenkins-slave\workspace\maven-plugins-ITs-m3-windows\maven-dependency-plugin\target\local-repo\org\apache\maven\plugins\maven-changelog-plugin\2.4-SNAPSHOT\maven-changelog-plugin-2.4-SNAPSHOT.pom
[INFO] Installing F:\jenkins\jenkins-slave\workspace\maven-plugins-ITs-m3-windows\maven-changes-plugin\pom.xml to F:\jenkins\jenkins-slave\workspace\maven-plugins-ITs-m3-windows\maven-dependency-plugin\target\local-repo\org\apache\maven\plugins\maven-changes-plugin\3.0.0-SNAPSHOT\maven-changes-plugin-3.0.0-SNAPSHOT.pom
[INFO] Installing F:\jenkins\jenkins-slave\workspace\maven-plugins-ITs-m3-windows\maven-changes-plugin\target\maven-changes-plugin-3.0.0-SNAPSHOT.jar to F:\jenkins\jenkins-slave\workspace\maven-plugins-ITs-m3-windows\maven-dependency-plugin\target\local-repo\org\apache\maven\plugins\maven-changes-plugin\3.0.0-SNAPSHOT\maven-changes-plugin-3.0.0-SNAPSHOT.jar
[INFO] Installing F:\jenkins\jenkins-slave\workspace\maven-plugins-ITs-m3-windows\maven-changes-plugin\pom.xml to F:\jenkins\jenkins-slave\workspace\maven-plugins-ITs-m3-windows\maven-dependency-plugin\target\local-repo\org\apache\maven\plugins\maven-changes-plugin\3.0.0-SNAPSHOT\maven-changes-plugin-3.0.0-SNAPSHOT.pom
[INFO] Installing F:\jenkins\jenkins-slave\workspace\maven-plugins-ITs-m3-windows\maven-clean-plugin\pom.xml to F:\jenkins\jenkins-slave\workspace\maven-plugins-ITs-m3-windows\maven-dependency-plugin\target\local-repo\org\apache\maven\plugins\maven-clean-plugin\3.0.1-SNAPSHOT\maven-clean-plugin-3.0.1-SNAPSHOT.pom
[INFO] Installing F:\jenkins\jenkins-slave\workspace\maven-plugins-ITs-m3-windows\maven-clean-plugin\target\maven-clean-plugin-3.0.1-SNAPSHOT.jar to F:\jenkins\jenkins-slave\workspace\maven-plugins-ITs-m3-windows\maven-dependency-plugin\target\local-repo\org\apache\maven\plugins\maven-clean-plugin\3.0.1-SNAPSHOT\maven-clean-plugin-3.0.1-SNAPSHOT.jar
[INFO] Installing F:\jenkins\jenkins-slave\workspace\maven-plugins-ITs-m3-windows\maven-clean-plugin\pom.xml to F:\jenkins\jenkins-slave\workspace\maven-plugins-ITs-m3-windows\maven-dependency-plugin\target\local-repo\org\apache\maven\plugins\maven-clean-plugin\3.0.1-SNAPSHOT\maven-clean-plugin-3.0.1-SNAPSHOT.pom
[INFO] Installing F:\jenkins\jenkins-slave\workspace\maven-plugins-ITs-m3-windows\maven-compiler-plugin\pom.xml to F:\jenkins\jenkins-slave\workspace\maven-plugins-ITs-m3-windows\maven-dependency-plugin\target\local-repo\org\apache\maven\plugins\maven-compiler-plugin\3.6.2-SNAPSHOT\maven-compiler-plugin-3.6.2-SNAPSHOT.pom
[INFO] Installing F:\jenkins\jenkins-slave\workspace\maven-plugins-ITs-m3-windows\maven-compiler-plugin\target\maven-compiler-plugin-3.6.2-SNAPSHOT.jar to F:\jenkins\jenkins-slave\workspace\maven-plugins-ITs-m3-windows\maven-dependency-plugin\target\local-repo\org\apache\maven\plugins\maven-compiler-plugin\3.6.2-SNAPSHOT\maven-compiler-plugin-3.6.2-SNAPSHOT.jar
[INFO] Installing F:\jenkins\jenkins-slave\workspace\maven-plugins-ITs-m3-windows\maven-compiler-plugin\pom.xml to F:\jenkins\jenkins-slave\workspace\maven-plugins-ITs-m3-windows\maven-dependency-plugin\target\local-repo\org\apache\maven\plugins\maven-compiler-plugin\3.6.2-SNAPSHOT\maven-compiler-plugin-3.6.2-SNAPSHOT.pom
[INFO] Installing F:\jenkins\jenkins-slave\workspace\maven-plugins-ITs-m3-windows\maven-deploy-plugin\pom.xml to F:\jenkins\jenkins-slave\workspace\maven-plugins-ITs-m3-windows\maven-dependency-plugin\target\local-repo\org\apache\maven\plugins\maven-deploy-plugin\3.0.0-SNAPSHOT\maven-deploy-plugin-3.0.0-SNAPSHOT.pom
[INFO] Installing F:\jenkins\jenkins-slave\workspace\maven-plugins-ITs-m3-windows\maven-deploy-plugin\target\maven-deploy-plugin-3.0.0-SNAPSHOT.jar to F:\jenkins\jenkins-slave\workspace\maven-plugins-ITs-m3-windows\maven-dependency-plugin\target\local-repo\org\apache\maven\plugins\maven-deploy-plugin\3.0.0-SNAPSHOT\maven-deploy-plugin-3.0.0-SNAPSHOT.jar
[INFO] Installing F:\jenkins\jenkins-slave\workspace\maven-plugins-ITs-m3-windows\maven-deploy-plugin\pom.xml to F:\jenkins\jenkins-slave\workspace\maven-plugins-ITs-m3-windows\maven-dependency-plugin\target\local-repo\org\apache\maven\plugins\maven-deploy-plugin\3.0.0-SNAPSHOT\maven-deploy-plugin-3.0.0-SNAPSHOT.pom
[INFO] Installing F:\jenkins\jenkins-slave\workspace\maven-plugins-ITs-m3-windows\maven-docck-plugin\pom.xml to F:\jenkins\jenkins-slave\workspace\maven-plugins-ITs-m3-windows\maven-dependency-plugin\target\local-repo\org\apache\maven\plugins\maven-docck-plugin\1.2-SNAPSHOT\maven-docck-plugin-1.2-SNAPSHOT.pom
[INFO] Installing F:\jenkins\jenkins-slave\workspace\maven-plugins-ITs-m3-windows\maven-docck-plugin\target\maven-docck-plugin-1.2-SNAPSHOT.jar to F:\jenkins\jenkins-slave\workspace\maven-plugins-ITs-m3-windows\maven-dependency-plugin\target\local-repo\org\apache\maven\plugins\maven-docck-plugin\1.2-SNAPSHOT\maven-docck-plugin-1.2-SNAPSHOT.jar
[INFO] Installing F:\jenkins\jenkins-slave\workspace\maven-plugins-ITs-m3-windows\maven-docck-plugin\pom.xml to F:\jenkins\jenkins-slave\workspace\maven-plugins-ITs-m3-windows\maven-dependency-plugin\target\local-repo\org\apache\maven\plugins\maven-docck-plugin\1.2-SNAPSHOT\maven-docck-plugin-1.2-SNAPSHOT.pom
[INFO] Installing F:\jenkins\jenkins-slave\workspace\maven-plugins-ITs-m3-windows\maven-ear-plugin\pom.xml to F:\jenkins\jenkins-slave\workspace\maven-plugins-ITs-m3-windows\maven-dependency-plugin\target\local-repo\org\apache\maven\plugins\maven-ear-plugin\3.0.0-SNAPSHOT\maven-ear-plugin-3.0.0-SNAPSHOT.pom
[INFO] Installing F:\jenkins\jenkins-slave\workspace\maven-plugins-ITs-m3-windows\maven-ear-plugin\target\maven-ear-plugin-3.0.0-SNAPSHOT.jar to F:\jenkins\jenkins-slave\workspace\maven-plugins-ITs-m3-windows\maven-dependency-plugin\target\local-repo\org\apache\maven\plugins\maven-ear-plugin\3.0.0-SNAPSHOT\maven-ear-plugin-3.0.0-SNAPSHOT.jar
[INFO] Installing F:\jenkins\jenkins-slave\workspace\maven-plugins-ITs-m3-windows\maven-ear-plugin\pom.xml to F:\jenkins\jenkins-slave\workspace\maven-plugins-ITs-m3-windows\maven-dependency-plugin\target\local-repo\org\apache\maven\plugins\maven-ear-plugin\3.0.0-SNAPSHOT\maven-ear-plugin-3.0.0-SNAPSHOT.pom
[INFO] Installing F:\jenkins\jenkins-slave\workspace\maven-plugins-ITs-m3-windows\maven-ejb-plugin\pom.xml to F:\jenkins\jenkins-slave\workspace\maven-plugins-ITs-m3-windows\maven-dependency-plugin\target\local-repo\org\apache\maven\plugins\maven-ejb-plugin\3.0.0-SNAPSHOT\maven-ejb-plugin-3.0.0-SNAPSHOT.pom
[INFO] Installing F:\jenkins\jenkins-slave\workspace\maven-plugins-ITs-m3-windows\maven-ejb-plugin\target\maven-ejb-plugin-3.0.0-SNAPSHOT.jar to F:\jenkins\jenkins-slave\workspace\maven-plugins-ITs-m3-windows\maven-dependency-plugin\target\local-repo\org\apache\maven\plugins\maven-ejb-plugin\3.0.0-SNAPSHOT\maven-ejb-plugin-3.0.0-SNAPSHOT.jar
[INFO] Installing F:\jenkins\jenkins-slave\workspace\maven-plugins-ITs-m3-windows\maven-ejb-plugin\pom.xml to F:\jenkins\jenkins-slave\workspace\maven-plugins-ITs-m3-windows\maven-dependency-plugin\target\local-repo\org\apache\maven\plugins\maven-ejb-plugin\3.0.0-SNAPSHOT\maven-ejb-plugin-3.0.0-SNAPSHOT.pom
[INFO] Installing F:\jenkins\jenkins-slave\workspace\maven-plugins-ITs-m3-windows\maven-help-plugin\pom.xml to F:\jenkins\jenkins-slave\workspace\maven-plugins-ITs-m3-windows\maven-dependency-plugin\target\local-repo\org\apache\maven\plugins\maven-help-plugin\3.0.0-SNAPSHOT\maven-help-plugin-3.0.0-SNAPSHOT.pom
[INFO] Installing F:\jenkins\jenkins-slave\workspace\maven-plugins-ITs-m3-windows\maven-help-plugin\target\maven-help-plugin-3.0.0-SNAPSHOT.jar to F:\jenkins\jenkins-slave\workspace\maven-plugins-ITs-m3-windows\maven-dependency-plugin\target\local-repo\org\apache\maven\plugins\maven-help-plugin\3.0.0-SNAPSHOT\maven-help-plugin-3.0.0-SNAPSHOT.jar
[INFO] Installing F:\jenkins\jenkins-slave\workspace\maven-plugins-ITs-m3-windows\maven-help-plugin\pom.xml to F:\jenkins\jenkins-slave\workspace\maven-plugins-ITs-m3-windows\maven-dependency-plugin\target\local-repo\org\apache\maven\plugins\maven-help-plugin\3.0.0-SNAPSHOT\maven-help-plugin-3.0.0-SNAPSHOT.pom
[INFO] Installing F:\jenkins\jenkins-slave\workspace\maven-plugins-ITs-m3-windows\maven-install-plugin\pom.xml to F:\jenkins\jenkins-slave\workspace\maven-plugins-ITs-m3-windows\maven-dependency-plugin\target\local-repo\org\apache\maven\plugins\maven-install-plugin\3.0.0-SNAPSHOT\maven-install-plugin-3.0.0-SNAPSHOT.pom
[INFO] Installing F:\jenkins\jenkins-slave\workspace\maven-plugins-ITs-m3-windows\maven-install-plugin\target\maven-install-plugin-3.0.0-SNAPSHOT.jar to F:\jenkins\jenkins-slave\workspace\maven-plugins-ITs-m3-windows\maven-dependency-plugin\target\local-repo\org\apache\maven\plugins\maven-install-plugin\3.0.0-SNAPSHOT\maven-install-plugin-3.0.0-SNAPSHOT.jar
[INFO] Installing F:\jenkins\jenkins-slave\workspace\maven-plugins-ITs-m3-windows\maven-install-plugin\pom.xml to F:\jenkins\jenkins-slave\workspace\maven-plugins-ITs-m3-windows\maven-dependency-plugin\target\local-repo\org\apache\maven\plugins\maven-install-plugin\3.0.0-SNAPSHOT\maven-install-plugin-3.0.0-SNAPSHOT.pom
[INFO] Installing F:\jenkins\jenkins-slave\workspace\maven-plugins-ITs-m3-windows\maven-jarsigner-plugin\pom.xml to F:\jenkins\jenkins-slave\workspace\maven-plugins-ITs-m3-windows\maven-dependency-plugin\target\local-repo\org\apache\maven\plugins\maven-jarsigner-plugin\1.5-SNAPSHOT\maven-jarsigner-plugin-1.5-SNAPSHOT.pom
[INFO] Installing F:\jenkins\jenkins-slave\workspace\maven-plugins-ITs-m3-windows\maven-jarsigner-plugin\target\maven-jarsigner-plugin-1.5-SNAPSHOT.jar to F:\jenkins\jenkins-slave\workspace\maven-plugins-ITs-m3-windows\maven-dependency-plugin\target\local-repo\org\apache\maven\plugins\maven-jarsigner-plugin\1.5-SNAPSHOT\maven-jarsigner-plugin-1.5-SNAPSHOT.jar
[INFO] Installing F:\jenkins\jenkins-slave\workspace\maven-plugins-ITs-m3-windows\maven-jarsigner-plugin\pom.xml to F:\jenkins\jenkins-slave\workspace\maven-plugins-ITs-m3-windows\maven-dependency-plugin\target\local-repo\org\apache\maven\plugins\maven-jarsigner-plugin\1.5-SNAPSHOT\maven-jarsigner-plugin-1.5-SNAPSHOT.pom
[INFO] Installing F:\jenkins\jenkins-slave\workspace\maven-plugins-ITs-m3-windows\maven-javadoc-plugin\pom.xml to F:\jenkins\jenkins-slave\workspace\maven-plugins-ITs-m3-windows\maven-dependency-plugin\target\local-repo\org\apache\maven\plugins\maven-javadoc-plugin\3.0.0-SNAPSHOT\maven-javadoc-plugin-3.0.0-SNAPSHOT.pom
[INFO]                                                                        
[INFO] ------------------------------------------------------------------------
[INFO] Building Apache Maven Plugins Aggregator 1-SNAPSHOT
[INFO] ------------------------------------------------------------------------
[INFO]
[INFO] --- maven-clean-plugin:2.5:clean (default-clean) @ maven-plugins-aggregator ---
[INFO]
[INFO] --- maven-enforcer-plugin:1.3.1:enforce (enforce-bytecode-version) @ maven-plugins-aggregator ---
[INFO]
[INFO] --- maven-enforcer-plugin:1.3.1:enforce (ban-known-bad-maven-versions) @ maven-plugins-aggregator ---
[INFO]
[INFO] --- maven-remote-resources-plugin:1.5:process (default) @ maven-plugins-aggregator ---
[INFO]
[INFO] --- maven-site-plugin:3.3:attach-descriptor (attach-descriptor) @ maven-plugins-aggregator ---
[INFO]
[INFO] --- maven-install-plugin:2.5.1:install (default-install) @ maven-plugins-aggregator ---
[INFO] Installing <https://builds.apache.org/job/maven-plugins-ITs-m3-windows/ws/pom.xml> to C:\Users\jenkins\.m2\repository\org\apache\maven\plugins\maven-plugins-aggregator\1-SNAPSHOT\maven-plugins-aggregator-1-SNAPSHOT.pom
[INFO] ------------------------------------------------------------------------
[INFO] Reactor Summary:
[INFO]
[INFO] Apache Maven ACR Plugin ............................ SUCCESS [ 44.694 s]
[INFO] Apache Maven AntRun Plugin ......................... SUCCESS [02:34 min]
[INFO] Apache Maven Changelog Plugin ...................... SUCCESS [01:12 min]
[INFO] Apache Maven Changes Plugin ........................ SUCCESS [01:58 min]
[INFO] Apache Maven Clean Plugin .......................... SUCCESS [ 49.473 s]
[INFO] Apache Maven Compiler Plugin ....................... SUCCESS [03:57 min]
[INFO] Apache Maven Deploy Plugin ......................... SUCCESS [03:47 min]
[INFO] Apache Maven Documentation Checker Plugin .......... SUCCESS [ 10.031 s]
[INFO] Apache Maven EAR Plugin ............................ SUCCESS [10:34 min]
[INFO] Apache Maven EJB Plugin ............................ SUCCESS [01:21 min]
[INFO] Apache Maven Help Plugin ........................... SUCCESS [03:34 min]
[INFO] Apache Maven Install Plugin ........................ SUCCESS [03:12 min]
[INFO] Apache Maven Jarsigner Plugin ...................... SUCCESS [01:24 min]
[INFO] Apache Maven Javadoc Plugin ........................ FAILURE [ 10.144 s]
[INFO] Apache Maven JDeps Plugin .......................... FAILURE [  2.725 s]
[INFO] Apache Maven Linkcheck Plugin ...................... FAILURE [  3.713 s]
[INFO] Apache Maven Patch Plugin .......................... FAILURE [  0.551 s]
[INFO] Apache Maven PDF Plugin ............................ FAILURE [ 11.886 s]
[INFO] Apache Maven RAR Plugin ............................ FAILURE [  6.428 s]
[INFO] Apache Maven Repository Plugin ..................... FAILURE [  4.684 s]
[INFO] Apache Maven Resources Plugin ...................... FAILURE [  9.922 s]
[INFO] Apache Maven Site Plugin ........................... FAILURE [ 21.929 s]
[INFO] Apache Maven Source Plugin ......................... FAILURE [  7.843 s]
[INFO] Apache Maven Stage Plugin .......................... FAILURE [  2.193 s]
[INFO] Apache Maven Toolchains Plugin ..................... FAILURE [  1.394 s]
[INFO] Apache Maven Verifier Plugin ....................... FAILURE [  1.899 s]
[INFO] Apache Maven WAR Plugin ............................ FAILURE [ 18.459 s]
[INFO] Apache Maven DOAP Plugin ........................... FAILURE [  7.225 s]
[INFO] Apache Maven Invoker Plugin ........................ FAILURE [ 12.221 s]
[INFO] Apache Maven JAR Plugin ............................ FAILURE [  5.118 s]
[INFO] Apache Maven Assembly Plugin ....................... FAILURE [ 23.818 s]
[INFO] Apache Maven Checkstyle Plugin ..................... FAILURE [ 36.139 s]
[INFO] Apache Maven PMD Plugin ............................ FAILURE [ 22.118 s]
[INFO] Apache Maven Project Info Reports Plugin ........... FAILURE [ 25.465 s]
[INFO] Apache Maven Remote Resources Plugin ............... FAILURE [  6.753 s]
[INFO] Apache Maven Shade Plugin .......................... FAILURE [  9.940 s]
[INFO] Apache Maven SCM Publish Plugin .................... FAILURE [  4.897 s]
[INFO] Apache Maven Dependency Plugin ..................... FAILURE [01:10 min]
[INFO] Apache Maven Plugins Aggregator .................... SUCCESS [  0.960 s]
[INFO] ------------------------------------------------------------------------
[INFO] BUILD FAILURE
[INFO] ------------------------------------------------------------------------
[INFO] Total time: 40:54 min
[INFO] Finished at: 2017-07-08T20:13:56+00:00
[INFO] Final Memory: 165M/595M
[INFO] ------------------------------------------------------------------------
[WARNING] The requested profile "apache.snapshots" could not be activated because it does not exist.
[ERROR] Failed to execute goal org.apache.maven.plugins:maven-compiler-plugin:3.5.1:testCompile (default-testCompile) on project maven-javadoc-plugin: Compilation failure: Compilation failure:
[ERROR] /F:/jenkins/jenkins-slave/workspace/maven-plugins-ITs-m3-windows/maven-javadoc-plugin/src/test/java/org/apache/maven/plugin/javadoc/JavadocVersionTest.java:[22,24] package org.junit does not exist
[ERROR] /F:/jenkins/jenkins-slave/workspace/maven-plugins-ITs-m3-windows/maven-javadoc-plugin/src/test/java/org/apache/maven/plugin/javadoc/JavadocVersionTest.java:[22,1] static import only from classes and interfaces
[ERROR] /F:/jenkins/jenkins-slave/workspace/maven-plugins-ITs-m3-windows/maven-javadoc-plugin/src/test/java/org/apache/maven/plugin/javadoc/JavadocVersionTest.java:[24,17] package org.junit does not exist
[ERROR] /F:/jenkins/jenkins-slave/workspace/maven-plugins-ITs-m3-windows/maven-javadoc-plugin/src/test/java/org/apache/maven/plugin/javadoc/JavadocVersionTest.java:[33,6] cannot find symbol
[ERROR] symbol:   class Test
[ERROR] location: class org.apache.maven.plugin.javadoc.JavadocVersionTest
[ERROR] /F:/jenkins/jenkins-slave/workspace/maven-plugins-ITs-m3-windows/maven-javadoc-plugin/src/test/java/org/apache/maven/plugin/javadoc/JavadocVersionTest.java:[36,9] cannot find symbol
[ERROR] symbol:   method assertTrue(boolean)
[ERROR] location: class org.apache.maven.plugin.javadoc.JavadocVersionTest
[ERROR] /F:/jenkins/jenkins-slave/workspace/maven-plugins-ITs-m3-windows/maven-javadoc-plugin/src/test/java/org/apache/maven/plugin/javadoc/JavadocVersionTest.java:[37,9] cannot find symbol
[ERROR] symbol:   method assertTrue(boolean)
[ERROR] location: class org.apache.maven.plugin.javadoc.JavadocVersionTest
[ERROR] /F:/jenkins/jenkins-slave/workspace/maven-plugins-ITs-m3-windows/maven-javadoc-plugin/src/test/java/org/apache/maven/plugin/javadoc/JavadocVersionTest.java:[38,9] cannot find symbol
[ERROR] symbol:   method assertTrue(boolean)
[ERROR] location: class org.apache.maven.plugin.javadoc.JavadocVersionTest
[ERROR] /F:/jenkins/jenkins-slave/workspace/maven-plugins-ITs-m3-windows/maven-javadoc-plugin/src/test/java/org/apache/maven/plugin/javadoc/JavadocVersionTest.java:[40,9] cannot find symbol
[ERROR] symbol:   method assertTrue(boolean)
[ERROR] location: class org.apache.maven.plugin.javadoc.JavadocVersionTest
[ERROR] /F:/jenkins/jenkins-slave/workspace/maven-plugins-ITs-m3-windows/maven-javadoc-plugin/src/test/java/org/apache/maven/plugin/javadoc/JavadocVersionTest.java:[41,9] cannot find symbol
[ERROR] symbol:   method assertTrue(boolean)
[ERROR] location: class org.apache.maven.plugin.javadoc.JavadocVersionTest
[ERROR] /F:/jenkins/jenkins-slave/workspace/maven-plugins-ITs-m3-windows/maven-javadoc-plugin/src/test/java/org/apache/maven/plugin/javadoc/JavadocVersionTest.java:[42,9] cannot find symbol
[ERROR] symbol:   method assertTrue(boolean)
[ERROR] location: class org.apache.maven.plugin.javadoc.JavadocVersionTest
[ERROR] /F:/jenkins/jenkins-slave/workspace/maven-plugins-ITs-m3-windows/maven-javadoc-plugin/src/test/java/org/apache/maven/plugin/javadoc/JavadocVersionTest.java:[44,9] cannot find symbol
[ERROR] symbol:   method assertTrue(boolean)
[ERROR] location: class org.apache.maven.plugin.javadoc.JavadocVersionTest
[ERROR] /F:/jenkins/jenkins-slave/workspace/maven-plugins-ITs-m3-windows/maven-javadoc-plugin/src/test/java/org/apache/maven/plugin/javadoc/JavadocVersionTest.java:[45,9] cannot find symbol
[ERROR] symbol:   method assertTrue(boolean)
[ERROR] location: class org.apache.maven.plugin.javadoc.JavadocVersionTest
[ERROR] /F:/jenkins/jenkins-slave/workspace/maven-plugins-ITs-m3-windows/maven-javadoc-plugin/src/test/java/org/apache/maven/plugin/javadoc/JavadocVersionTest.java:[46,9] cannot find symbol
[ERROR] symbol:   method assertTrue(boolean)
[ERROR] location: class org.apache.maven.plugin.javadoc.JavadocVersionTest
[ERROR] -> [Help 1]
[ERROR] Failed to execute goal org.apache.maven.plugins:maven-invoker-plugin:2.0.0:install (integration-test) on project maven-jdeps-plugin: Failed to install project dependencies: MavenProject: org.apache.maven.plugins:maven-jdeps-plugin:3.0.1-SNAPSHOT @ F:\jenkins\jenkins-slave\workspace\maven-plugins-ITs-m3-windows\maven-jdeps-plugin\pom.xml: Failed to install project artifacts: MavenProject: org.apache.maven.plugins:maven-javadoc-plugin:3.0.0-SNAPSHOT @ F:\jenkins\jenkins-slave\workspace\maven-plugins-ITs-m3-windows\maven-javadoc-plugin\pom.xml: Failed to install artifact: org.apache.maven.plugins:maven-javadoc-plugin:maven-plugin:3.0.0-SNAPSHOT: Artifact is not fully assembled: F:\jenkins\jenkins-slave\workspace\maven-plugins-ITs-m3-windows\maven-javadoc-plugin\target\classes -> [Help 2]
[ERROR] Failed to execute goal org.apache.maven.plugins:maven-invoker-plugin:2.0.0:install (integration-test) on project maven-linkcheck-plugin: Failed to install project dependencies: MavenProject: org.apache.maven.plugins:maven-linkcheck-plugin:1.3-SNAPSHOT @ F:\jenkins\jenkins-slave\workspace\maven-plugins-ITs-m3-windows\maven-linkcheck-plugin\pom.xml: Failed to install project artifacts: MavenProject: org.apache.maven.plugins:maven-javadoc-plugin:3.0.0-SNAPSHOT @ F:\jenkins\jenkins-slave\workspace\maven-plugins-ITs-m3-windows\maven-javadoc-plugin\pom.xml: Failed to install artifact: org.apache.maven.plugins:maven-javadoc-plugin:maven-plugin:3.0.0-SNAPSHOT: Artifact is not fully assembled: F:\jenkins\jenkins-slave\workspace\maven-plugins-ITs-m3-windows\maven-javadoc-plugin\target\classes -> [Help 2]
[ERROR] Failed to execute goal org.apache.maven.plugins:maven-invoker-plugin:2.0.0:install (integration-test) on project maven-patch-plugin: Failed to install project dependencies: MavenProject: org.apache.maven.plugins:maven-patch-plugin:1.3-SNAPSHOT @ F:\jenkins\jenkins-slave\workspace\maven-plugins-ITs-m3-windows\maven-patch-plugin\pom.xml: Failed to install project artifacts: MavenProject: org.apache.maven.plugins:maven-javadoc-plugin:3.0.0-SNAPSHOT @ F:\jenkins\jenkins-slave\workspace\maven-plugins-ITs-m3-windows\maven-javadoc-plugin\pom.xml: Failed to install artifact: org.apache.maven.plugins:maven-javadoc-plugin:maven-plugin:3.0.0-SNAPSHOT: Artifact is not fully assembled: F:\jenkins\jenkins-slave\workspace\maven-plugins-ITs-m3-windows\maven-javadoc-plugin\target\classes -> [Help 2]
[ERROR] Failed to execute goal org.apache.maven.plugins:maven-invoker-plugin:2.0.0:install (integration-test) on project maven-pdf-plugin: Failed to install project dependencies: MavenProject: org.apache.maven.plugins:maven-pdf-plugin:1.4-SNAPSHOT @ F:\jenkins\jenkins-slave\workspace\maven-plugins-ITs-m3-windows\maven-pdf-plugin\pom.xml: Failed to install project artifacts: MavenProject: org.apache.maven.plugins:maven-javadoc-plugin:3.0.0-SNAPSHOT @ F:\jenkins\jenkins-slave\workspace\maven-plugins-ITs-m3-windows\maven-javadoc-plugin\pom.xml: Failed to install artifact: org.apache.maven.plugins:maven-javadoc-plugin:maven-plugin:3.0.0-SNAPSHOT: Artifact is not fully assembled: F:\jenkins\jenkins-slave\workspace\maven-plugins-ITs-m3-windows\maven-javadoc-plugin\target\classes -> [Help 2]
[ERROR] Failed to execute goal org.apache.maven.plugins:maven-invoker-plugin:2.0.0:install (integration-test) on project maven-rar-plugin: Failed to install project dependencies: MavenProject: org.apache.maven.plugins:maven-rar-plugin:3.0.0-SNAPSHOT @ F:\jenkins\jenkins-slave\workspace\maven-plugins-ITs-m3-windows\maven-rar-plugin\pom.xml: Failed to install project artifacts: MavenProject: org.apache.maven.plugins:maven-javadoc-plugin:3.0.0-SNAPSHOT @ F:\jenkins\jenkins-slave\workspace\maven-plugins-ITs-m3-windows\maven-javadoc-plugin\pom.xml: Failed to install artifact: org.apache.maven.plugins:maven-javadoc-plugin:maven-plugin:3.0.0-SNAPSHOT: Artifact is not fully assembled: F:\jenkins\jenkins-slave\workspace\maven-plugins-ITs-m3-windows\maven-javadoc-plugin\target\classes -> [Help 2]
[ERROR] Failed to execute goal org.apache.maven.plugins:maven-invoker-plugin:2.0.0:install (integration-test) on project maven-repository-plugin: Failed to install project dependencies: MavenProject: org.apache.maven.plugins:maven-repository-plugin:2.5-SNAPSHOT @ F:\jenkins\jenkins-slave\workspace\maven-plugins-ITs-m3-windows\maven-repository-plugin\pom.xml: Failed to install project artifacts: MavenProject: org.apache.maven.plugins:maven-javadoc-plugin:3.0.0-SNAPSHOT @ F:\jenkins\jenkins-slave\workspace\maven-plugins-ITs-m3-windows\maven-javadoc-plugin\pom.xml: Failed to install artifact: org.apache.maven.plugins:maven-javadoc-plugin:maven-plugin:3.0.0-SNAPSHOT: Artifact is not fully assembled: F:\jenkins\jenkins-slave\workspace\maven-plugins-ITs-m3-windows\maven-javadoc-plugin\target\classes -> [Help 2]
[ERROR] Failed to execute goal org.apache.maven.plugins:maven-invoker-plugin:2.0.0:install (integration-test) on project maven-resources-plugin: Failed to install project dependencies: MavenProject: org.apache.maven.plugins:maven-resources-plugin:3.0.3-SNAPSHOT @ F:\jenkins\jenkins-slave\workspace\maven-plugins-ITs-m3-windows\maven-resources-plugin\pom.xml: Failed to install project artifacts: MavenProject: org.apache.maven.plugins:maven-javadoc-plugin:3.0.0-SNAPSHOT @ F:\jenkins\jenkins-slave\workspace\maven-plugins-ITs-m3-windows\maven-javadoc-plugin\pom.xml: Failed to install artifact: org.apache.maven.plugins:maven-javadoc-plugin:maven-plugin:3.0.0-SNAPSHOT: Artifact is not fully assembled: F:\jenkins\jenkins-slave\workspace\maven-plugins-ITs-m3-windows\maven-javadoc-plugin\target\classes -> [Help 2]
[ERROR] Failed to execute goal org.apache.maven.plugins:maven-invoker-plugin:2.0.0:install (integration-test) on project maven-site-plugin: Failed to install project dependencies: MavenProject: org.apache.maven.plugins:maven-site-plugin:3.7-SNAPSHOT @ F:\jenkins\jenkins-slave\workspace\maven-plugins-ITs-m3-windows\maven-site-plugin\dependency-reduced-pom.xml: Failed to install project artifacts: MavenProject: org.apache.maven.plugins:maven-javadoc-plugin:3.0.0-SNAPSHOT @ F:\jenkins\jenkins-slave\workspace\maven-plugins-ITs-m3-windows\maven-javadoc-plugin\pom.xml: Failed to install artifact: org.apache.maven.plugins:maven-javadoc-plugin:maven-plugin:3.0.0-SNAPSHOT: Artifact is not fully assembled: F:\jenkins\jenkins-slave\workspace\maven-plugins-ITs-m3-windows\maven-javadoc-plugin\target\classes -> [Help 2]
[ERROR] Failed to execute goal org.apache.maven.plugins:maven-invoker-plugin:2.0.0:install (integration-test) on project maven-source-plugin: Failed to install project dependencies: MavenProject: org.apache.maven.plugins:maven-source-plugin:3.0.2-SNAPSHOT @ F:\jenkins\jenkins-slave\workspace\maven-plugins-ITs-m3-windows\maven-source-plugin\pom.xml: Failed to install project artifacts: MavenProject: org.apache.maven.plugins:maven-javadoc-plugin:3.0.0-SNAPSHOT @ F:\jenkins\jenkins-slave\workspace\maven-plugins-ITs-m3-windows\maven-javadoc-plugin\pom.xml: Failed to install artifact: org.apache.maven.plugins:maven-javadoc-plugin:maven-plugin:3.0.0-SNAPSHOT: Artifact is not fully assembled: F:\jenkins\jenkins-slave\workspace\maven-plugins-ITs-m3-windows\maven-javadoc-plugin\target\classes -> [Help 2]
[ERROR] Failed to execute goal org.apache.maven.plugins:maven-invoker-plugin:2.0.0:install (integration-test) on project maven-stage-plugin: Failed to install project dependencies: MavenProject: org.apache.maven.plugins:maven-stage-plugin:1.1-SNAPSHOT @ F:\jenkins\jenkins-slave\workspace\maven-plugins-ITs-m3-windows\maven-stage-plugin\pom.xml: Failed to install project artifacts: MavenProject: org.apache.maven.plugins:maven-javadoc-plugin:3.0.0-SNAPSHOT @ F:\jenkins\jenkins-slave\workspace\maven-plugins-ITs-m3-windows\maven-javadoc-plugin\pom.xml: Failed to install artifact: org.apache.maven.plugins:maven-javadoc-plugin:maven-plugin:3.0.0-SNAPSHOT: Artifact is not fully assembled: F:\jenkins\jenkins-slave\workspace\maven-plugins-ITs-m3-windows\maven-javadoc-plugin\target\classes -> [Help 2]
[ERROR] Failed to execute goal org.apache.maven.plugins:maven-invoker-plugin:2.0.0:install (integration-test) on project maven-toolchains-plugin: Failed to install project dependencies: MavenProject: org.apache.maven.plugins:maven-toolchains-plugin:3.0.0-SNAPSHOT @ F:\jenkins\jenkins-slave\workspace\maven-plugins-ITs-m3-windows\maven-toolchains-plugin\pom.xml: Failed to install project artifacts: MavenProject: org.apache.maven.plugins:maven-javadoc-plugin:3.0.0-SNAPSHOT @ F:\jenkins\jenkins-slave\workspace\maven-plugins-ITs-m3-windows\maven-javadoc-plugin\pom.xml: Failed to install artifact: org.apache.maven.plugins:maven-javadoc-plugin:maven-plugin:3.0.0-SNAPSHOT: Artifact is not fully assembled: F:\jenkins\jenkins-slave\workspace\maven-plugins-ITs-m3-windows\maven-javadoc-plugin\target\classes -> [Help 2]
[ERROR] Failed to execute goal org.apache.maven.plugins:maven-invoker-plugin:2.0.0:install (integration-test) on project maven-verifier-plugin: Failed to install project dependencies: MavenProject: org.apache.maven.plugins:maven-verifier-plugin:3.0.0-SNAPSHOT @ F:\jenkins\jenkins-slave\workspace\maven-plugins-ITs-m3-windows\maven-verifier-plugin\pom.xml: Failed to install project artifacts: MavenProject: org.apache.maven.plugins:maven-javadoc-plugin:3.0.0-SNAPSHOT @ F:\jenkins\jenkins-slave\workspace\maven-plugins-ITs-m3-windows\maven-javadoc-plugin\pom.xml: Failed to install artifact: org.apache.maven.plugins:maven-javadoc-plugin:maven-plugin:3.0.0-SNAPSHOT: Artifact is not fully assembled: F:\jenkins\jenkins-slave\workspace\maven-plugins-ITs-m3-windows\maven-javadoc-plugin\target\classes -> [Help 2]
[ERROR] Failed to execute goal org.apache.maven.plugins:maven-invoker-plugin:2.0.0:install (integration-test) on project maven-war-plugin: Failed to install project dependencies: MavenProject: org.apache.maven.plugins:maven-war-plugin:3.1.1-SNAPSHOT @ F:\jenkins\jenkins-slave\workspace\maven-plugins-ITs-m3-windows\maven-war-plugin\pom.xml: Failed to install project artifacts: MavenProject: org.apache.maven.plugins:maven-javadoc-plugin:3.0.0-SNAPSHOT @ F:\jenkins\jenkins-slave\workspace\maven-plugins-ITs-m3-windows\maven-javadoc-plugin\pom.xml: Failed to install artifact: org.apache.maven.plugins:maven-javadoc-plugin:maven-plugin:3.0.0-SNAPSHOT: Artifact is not fully assembled: F:\jenkins\jenkins-slave\workspace\maven-plugins-ITs-m3-windows\maven-javadoc-plugin\target\classes -> [Help 2]
[ERROR] Failed to execute goal org.apache.maven.plugins:maven-invoker-plugin:2.0.0:install (integration-test) on project maven-doap-plugin: Failed to install project dependencies: MavenProject: org.apache.maven.plugins:maven-doap-plugin:1.3-SNAPSHOT @ F:\jenkins\jenkins-slave\workspace\maven-plugins-ITs-m3-windows\maven-doap-plugin\pom.xml: Failed to install project artifacts: MavenProject: org.apache.maven.plugins:maven-javadoc-plugin:3.0.0-SNAPSHOT @ F:\jenkins\jenkins-slave\workspace\maven-plugins-ITs-m3-windows\maven-javadoc-plugin\pom.xml: Failed to install artifact: org.apache.maven.plugins:maven-javadoc-plugin:maven-plugin:3.0.0-SNAPSHOT: Artifact is not fully assembled: F:\jenkins\jenkins-slave\workspace\maven-plugins-ITs-m3-windows\maven-javadoc-plugin\target\classes -> [Help 2]
[ERROR] Failed to execute goal org.apache.maven.plugins:maven-invoker-plugin:2.0.0:install (integration-test) on project maven-invoker-plugin: Failed to install project dependencies: MavenProject: org.apache.maven.plugins:maven-invoker-plugin:3.0.1-SNAPSHOT @ F:\jenkins\jenkins-slave\workspace\maven-plugins-ITs-m3-windows\maven-invoker-plugin\pom.xml: Failed to install project artifacts: MavenProject: org.apache.maven.plugins:maven-javadoc-plugin:3.0.0-SNAPSHOT @ F:\jenkins\jenkins-slave\workspace\maven-plugins-ITs-m3-windows\maven-javadoc-plugin\pom.xml: Failed to install artifact: org.apache.maven.plugins:maven-javadoc-plugin:maven-plugin:3.0.0-SNAPSHOT: Artifact is not fully assembled: F:\jenkins\jenkins-slave\workspace\maven-plugins-ITs-m3-windows\maven-javadoc-plugin\target\classes -> [Help 2]
[ERROR] Failed to execute goal org.apache.maven.plugins:maven-invoker-plugin:2.0.0:install (integration-test) on project maven-jar-plugin: Failed to install project dependencies: MavenProject: org.apache.maven.plugins:maven-jar-plugin:3.0.3-SNAPSHOT @ F:\jenkins\jenkins-slave\workspace\maven-plugins-ITs-m3-windows\maven-jar-plugin\pom.xml: Failed to install project artifacts: MavenProject: org.apache.maven.plugins:maven-javadoc-plugin:3.0.0-SNAPSHOT @ F:\jenkins\jenkins-slave\workspace\maven-plugins-ITs-m3-windows\maven-javadoc-plugin\pom.xml: Failed to install artifact: org.apache.maven.plugins:maven-javadoc-plugin:maven-plugin:3.0.0-SNAPSHOT: Artifact is not fully assembled: F:\jenkins\jenkins-slave\workspace\maven-plugins-ITs-m3-windows\maven-javadoc-plugin\target\classes -> [Help 2]
[ERROR] Failed to execute goal org.apache.maven.plugins:maven-invoker-plugin:3.0.0:install (integration-test) on project maven-assembly-plugin: Failed to install project dependencies: MavenProject: org.apache.maven.plugins:maven-assembly-plugin:3.1.0-SNAPSHOT @ F:\jenkins\jenkins-slave\workspace\maven-plugins-ITs-m3-windows\maven-assembly-plugin\pom.xml: Failed to install project artifacts: MavenProject: org.apache.maven.plugins:maven-javadoc-plugin:3.0.0-SNAPSHOT @ F:\jenkins\jenkins-slave\workspace\maven-plugins-ITs-m3-windows\maven-javadoc-plugin\pom.xml: Failed to install artifact: org.apache.maven.plugins:maven-javadoc-plugin:maven-plugin:3.0.0-SNAPSHOT: Artifact is not fully assembled: F:\jenkins\jenkins-slave\workspace\maven-plugins-ITs-m3-windows\maven-javadoc-plugin\target\classes -> [Help 2]
[ERROR] Failed to execute goal org.apache.maven.plugins:maven-invoker-plugin:2.0.0:install (integration-test) on project maven-checkstyle-plugin: Failed to install project dependencies: MavenProject: org.apache.maven.plugins:maven-checkstyle-plugin:3.0.0-SNAPSHOT @ F:\jenkins\jenkins-slave\workspace\maven-plugins-ITs-m3-windows\maven-checkstyle-plugin\pom.xml: Failed to install project artifacts: MavenProject: org.apache.maven.plugins:maven-javadoc-plugin:3.0.0-SNAPSHOT @ F:\jenkins\jenkins-slave\workspace\maven-plugins-ITs-m3-windows\maven-javadoc-plugin\pom.xml: Failed to install artifact: org.apache.maven.plugins:maven-javadoc-plugin:maven-plugin:3.0.0-SNAPSHOT: Artifact is not fully assembled: F:\jenkins\jenkins-slave\workspace\maven-plugins-ITs-m3-windows\maven-javadoc-plugin\target\classes -> [Help 2]
[ERROR] Failed to execute goal org.apache.maven.plugins:maven-invoker-plugin:2.0.0:install (integration-test) on project maven-pmd-plugin: Failed to install project dependencies: MavenProject: org.apache.maven.plugins:maven-pmd-plugin:3.9-SNAPSHOT @ F:\jenkins\jenkins-slave\workspace\maven-plugins-ITs-m3-windows\maven-pmd-plugin\pom.xml: Failed to install project artifacts: MavenProject: org.apache.maven.plugins:maven-javadoc-plugin:3.0.0-SNAPSHOT @ F:\jenkins\jenkins-slave\workspace\maven-plugins-ITs-m3-windows\maven-javadoc-plugin\pom.xml: Failed to install artifact: org.apache.maven.plugins:maven-javadoc-plugin:maven-plugin:3.0.0-SNAPSHOT: Artifact is not fully assembled: F:\jenkins\jenkins-slave\workspace\maven-plugins-ITs-m3-windows\maven-javadoc-plugin\target\classes -> [Help 2]
[ERROR] Failed to execute goal org.apache.maven.plugins:maven-invoker-plugin:2.0.0:install (integration-test) on project maven-project-info-reports-plugin: Failed to install project dependencies: MavenProject: org.apache.maven.plugins:maven-project-info-reports-plugin:2.10-SNAPSHOT @ F:\jenkins\jenkins-slave\workspace\maven-plugins-ITs-m3-windows\maven-project-info-reports-plugin\pom.xml: Failed to install project artifacts: MavenProject: org.apache.maven.plugins:maven-javadoc-plugin:3.0.0-SNAPSHOT @ F:\jenkins\jenkins-slave\workspace\maven-plugins-ITs-m3-windows\maven-javadoc-plugin\pom.xml: Failed to install artifact: org.apache.maven.plugins:maven-javadoc-plugin:maven-plugin:3.0.0-SNAPSHOT: Artifact is not fully assembled: F:\jenkins\jenkins-slave\workspace\maven-plugins-ITs-m3-windows\maven-javadoc-plugin\target\classes -> [Help 2]
[ERROR] Failed to execute goal org.apache.maven.plugins:maven-invoker-plugin:2.0.0:install (integration-test) on project maven-remote-resources-plugin: Failed to install project dependencies: MavenProject: org.apache.maven.plugins:maven-remote-resources-plugin:1.6-SNAPSHOT @ F:\jenkins\jenkins-slave\workspace\maven-plugins-ITs-m3-windows\maven-remote-resources-plugin\pom.xml: Failed to install project artifacts: MavenProject: org.apache.maven.plugins:maven-javadoc-plugin:3.0.0-SNAPSHOT @ F:\jenkins\jenkins-slave\workspace\maven-plugins-ITs-m3-windows\maven-javadoc-plugin\pom.xml: Failed to install artifact: org.apache.maven.plugins:maven-javadoc-plugin:maven-plugin:3.0.0-SNAPSHOT: Artifact is not fully assembled: F:\jenkins\jenkins-slave\workspace\maven-plugins-ITs-m3-windows\maven-javadoc-plugin\target\classes -> [Help 2]
[ERROR] Failed to execute goal org.apache.maven.plugins:maven-invoker-plugin:2.0.0:install (integration-test) on project maven-shade-plugin: Failed to install project dependencies: MavenProject: org.apache.maven.plugins:maven-shade-plugin:3.0.1-SNAPSHOT @ F:\jenkins\jenkins-slave\workspace\maven-plugins-ITs-m3-windows\maven-shade-plugin\pom.xml: Failed to install project artifacts: MavenProject: org.apache.maven.plugins:maven-javadoc-plugin:3.0.0-SNAPSHOT @ F:\jenkins\jenkins-slave\workspace\maven-plugins-ITs-m3-windows\maven-javadoc-plugin\pom.xml: Failed to install artifact: org.apache.maven.plugins:maven-javadoc-plugin:maven-plugin:3.0.0-SNAPSHOT: Artifact is not fully assembled: F:\jenkins\jenkins-slave\workspace\maven-plugins-ITs-m3-windows\maven-javadoc-plugin\target\classes -> [Help 2]
[ERROR] Failed to execute goal org.apache.maven.plugins:maven-invoker-plugin:2.0.0:install (integration-test) on project maven-scm-publish-plugin: Failed to install project dependencies: MavenProject: org.apache.maven.plugins:maven-scm-publish-plugin:1.2-SNAPSHOT @ F:\jenkins\jenkins-slave\workspace\maven-plugins-ITs-m3-windows\maven-scm-publish-plugin\pom.xml: Failed to install project artifacts: MavenProject: org.apache.maven.plugins:maven-javadoc-plugin:3.0.0-SNAPSHOT @ F:\jenkins\jenkins-slave\workspace\maven-plugins-ITs-m3-windows\maven-javadoc-plugin\pom.xml: Failed to install artifact: org.apache.maven.plugins:maven-javadoc-plugin:maven-plugin:3.0.0-SNAPSHOT: Artifact is not fully assembled: F:\jenkins\jenkins-slave\workspace\maven-plugins-ITs-m3-windows\maven-javadoc-plugin\target\classes -> [Help 2]
[ERROR] Failed to execute goal org.apache.maven.plugins:maven-invoker-plugin:2.0.0:install (integration-test) on project maven-dependency-plugin: Failed to install project dependencies: MavenProject: org.apache.maven.plugins:maven-dependency-plugin:3.0.2-SNAPSHOT @ F:\jenkins\jenkins-slave\workspace\maven-plugins-ITs-m3-windows\maven-dependency-plugin\pom.xml: Failed to install project artifacts: MavenProject: org.apache.maven.plugins:maven-javadoc-plugin:3.0.0-SNAPSHOT @ F:\jenkins\jenkins-slave\workspace\maven-plugins-ITs-m3-windows\maven-javadoc-plugin\pom.xml: Failed to install artifact: org.apache.maven.plugins:maven-javadoc-plugin:maven-plugin:3.0.0-SNAPSHOT: Artifact is not fully assembled: F:\jenkins\jenkins-slave\workspace\maven-plugins-ITs-m3-windows\maven-javadoc-plugin\target\classes -> [Help 2]
[ERROR]
[ERROR] To see the full stack trace of the errors, re-run Maven with the -e switch.
[ERROR] Re-run Maven using the -X switch to enable full debug logging.
[ERROR]
[ERROR] For more information about the errors and possible solutions, please read the following articles:
[ERROR] [Help 1] http://cwiki.apache.org/confluence/display/MAVEN/MojoFailureException
[ERROR] [Help 2] http://cwiki.apache.org/confluence/display/MAVEN/MojoExecutionException
[ERROR]
[ERROR] After correcting the problems, you can resume the build with the command
[ERROR]   mvn <goals> -rf :maven-javadoc-plugin
Build step 'Invoke top-level Maven targets' marked build as failure
Deleting 1 temporary files
Recording test results
Reply | Threaded
Open this post in threaded view
|  
Report Content as Inappropriate

Build failed in Jenkins: maven-plugins-ITs-m3-windows #1926

Apache Jenkins Server-2
See <https://builds.apache.org/job/maven-plugins-ITs-m3-windows/1926/display/redirect?page=changes>

Changes:

[Robert Scholte] [MJAVADOC-485] Upgrade to commons-lang3
Upgrade junit to 4.12

------------------------------------------
[...truncated 3.25 MB...]
[INFO] Building: copy-cli\pom.xml
[INFO] run script verify.bsh
[INFO] ..SUCCESS (6.8 s)
[INFO] Building: copy-dependencies\pom.xml
[INFO] run script verify.bsh
[INFO] ..SUCCESS (7.4 s)
[INFO] Building: copy-from-reactor\pom.xml
[INFO] run script verify.bsh
[INFO] ..SUCCESS (8.3 s)
[INFO] Building: copy-from-remote-repository\pom.xml
[INFO] run script setup.bsh
[INFO] artifact org.apache.maven.its.dependency.fake-remote-copy:1.0: checking for updates from central
[INFO] run script verify.bsh
[INFO] ..SUCCESS (8.2 s)
[INFO] Building: dependency-properties\pom.xml
[INFO] run script verify.bsh
[INFO] ..SUCCESS (6.8 s)
[INFO] Building: filterunpack\pom.xml
[INFO] run script verify.groovy
[INFO] ..SUCCESS (6.7 s)
[INFO] Building: get-artifact\pom.xml
[INFO] run script setup.bsh
[INFO] run script verify.bsh
[INFO] ..SUCCESS (7.1 s)
[INFO] Building: get-artifact-maven-plugin\pom.xml
[INFO] run script setup.bsh
[INFO] run script verify.bsh
[INFO] ..SUCCESS (6.6 s)
[INFO] Building: get-artifact-no-transitive\pom.xml
[INFO] run script setup.bsh
[INFO] run script verify.bsh
[INFO] ..SUCCESS (6.6 s)
[INFO] Building: get-gav\pom.xml
[INFO] run script setup.bsh
[INFO] run script verify.bsh
[INFO] ..SUCCESS (6.7 s)
[INFO] Building: go-offline\pom.xml
[INFO] ..SUCCESS (8.6 s)
[INFO] Building: list-repositories\pom.xml
[INFO] snapshot org.apache.maven.its.dependency:test:1.0-SNAPSHOT: checking for updates from apache.snapshots
[INFO] artifact org.apache.maven.its.dependency.test:1.0-SNAPSHOT: checking for updates from central
[INFO] ..SUCCESS (7.2 s)
[INFO] Building: mdep-439-analyze-java8\pom.xml
[INFO] ..SKIPPED due to JRE version
[INFO] Building: mdep-450-project-with-ancestor\pom.xml
[INFO] run script verify.groovy
[INFO] ..SUCCESS (6.7 s)
[INFO] Building: mdep-450-project-without-ancestor\pom.xml
[INFO] run script verify.groovy
[INFO] ..SUCCESS (6.6 s)
[INFO] Building: mdep-506-dependency-without-version-in-depmgt\pom.xml
[INFO] ..SUCCESS (7.8 s)
[INFO] Building: mdep-571-list-java9\pom.xml
[INFO] ..SKIPPED due to JRE version
[INFO] Building: mdep-572-unpack-tar-long-file\pom.xml
[INFO] run script verify.bsh
[INFO] ..SUCCESS (8.1 s)
[INFO] Building: purge-local-repository\pom.xml
[INFO] run script setup.bsh
[INFO] artifact org.apache.maven.its.dependency.purged:1.0: checking for updates from central
[INFO] run script verify.bsh
[INFO] ..SUCCESS (6.8 s)
[INFO] Building: purge-local-repository-bad-dep\pom.xml
[INFO] snapshot org.apache.maven.its.dependency:purge-local-repository-bad-dep:1.0-SNAPSHOT: checking for updates from apache.snapshots
[INFO] artifact org.apache.maven.its.dependency.purge-local-repository-bad-dep:1.0-SNAPSHOT: checking for updates from central
[INFO] artifact org.apache.maven.its.dependency.i-do-not-exist:1.0: checking for updates from central
[INFO] run script verify.groovy
[INFO] ..SUCCESS (7.6 s)
[INFO] Building: purge-local-repository-include\pom.xml
[INFO] snapshot org.apache.maven.its.dependency:purge-local-repository-include:1.0-SNAPSHOT: checking for updates from apache.snapshots
[INFO] artifact org.apache.maven.its.dependency.purge-local-repository-include:1.0-SNAPSHOT: checking for updates from central
[INFO] run script verify.groovy
[INFO] ..SUCCESS (7.1 s)
[INFO] Building: purge-local-repository-multi-module\pom.xml
[INFO] run script setup.bsh
[INFO] snapshot org.apache.maven.its.dependency:child1:1.0-SNAPSHOT: checking for updates from apache.snapshots
[INFO] artifact org.apache.maven.its.dependency.child1:1.0-SNAPSHOT: checking for updates from central
[INFO] artifact org.apache.maven.its.dependency.purged-a:1.0: checking for updates from central
[INFO] snapshot org.apache.maven.its.dependency:child2:1.0-SNAPSHOT: checking for updates from apache.snapshots
[INFO] artifact org.apache.maven.its.dependency.child2:1.0-SNAPSHOT: checking for updates from central
[INFO] artifact org.apache.maven.its.dependency.purged-b:1.0: checking for updates from central
[INFO] run script verify.bsh
[INFO] ..SUCCESS (7.7 s)
[INFO] Building: purge-local-repository-multi-module-execution\pom.xml
[INFO] run script setup.bsh
[INFO] run script verify.bsh
[INFO] ..SUCCESS (7.5 s)
[INFO] Building: purge-local-repository-non-transitive\pom.xml
[INFO] run script verify.bsh
[INFO] ..SUCCESS (6.9 s)
[INFO] Building: purge-local-repository-reresolve\pom.xml
[INFO] run script verify.bsh
[INFO] ..SUCCESS (6.9 s)
[INFO] Building: purge-local-repository-snapshots-only\pom.xml
[INFO] run script setup.bsh
[INFO] snapshot org.apache.maven.its.dependency:snap-purged:1.0-SNAPSHOT: checking for updates from apache.snapshots
[INFO] artifact org.apache.maven.its.dependency.snap-purged:1.0-SNAPSHOT: checking for updates from central
[INFO] run script verify.bsh
[INFO] ..SUCCESS (7.7 s)
[INFO] Building: purge-local-repository-version-range\pom.xml
[INFO] artifact org.apache.maven.its.dependency:purge-local-repository: checking for updates from central
[INFO] artifact org.apache.maven.its.dependency:purge-local-repository: checking for updates from central
[INFO] run script verify.bsh
[INFO] ..SUCCESS (7.1 s)
[INFO] Building: resolve\pom.xml
[INFO] ..SUCCESS (6.7 s)
[INFO] Building: resolve-plugins\pom.xml
[INFO] ..SUCCESS (7.6 s)
[INFO] Building: resolve-plugins-exclude-reactor\pom.xml
[INFO] run script verify.groovy
[INFO] ..SUCCESS (8.4 s)
[INFO] Building: resolve-plugins-with-exclude\pom.xml
[INFO] run script verify.groovy
[INFO] ..SUCCESS (7.6 s)
[INFO] Building: sources\pom.xml
[INFO] artifact classworlds.classworlds:1.1-alpha-2: checking for updates from central
[INFO] ..SUCCESS (7.1 s)
[INFO] Building: tree\pom.xml
[INFO] run script verify.bsh
[INFO] ..SUCCESS (6.7 s)
[INFO] Building: tree-includes\pom.xml
[INFO] run script verify.bsh
[INFO] ..SUCCESS (7.1 s)
[INFO] Building: tree-multimodule\pom.xml
[INFO] snapshot org.apache.maven.its.dependency:tree-multimodule-module-a:1.0-SNAPSHOT: checking for updates from apache.snapshots
[INFO] artifact org.apache.maven.its.dependency.tree-multimodule-module-a:1.0-SNAPSHOT: checking for updates from central
[INFO] run script verify.bsh
[INFO] ..SUCCESS (7.7 s)
[INFO] Building: unpack\pom.xml
[INFO] run script verify.bsh
[INFO] ..SUCCESS (8.2 s)
[INFO] Building: unpack-cli\pom.xml
[INFO] run script verify.bsh
[INFO] ..SUCCESS (7.0 s)
[INFO] Building: unpack-custom-ear\pom.xml
[INFO] run script verify.groovy
[INFO] ..SUCCESS (7.1 s)
[INFO] Building: unpack-dependencies\pom.xml
[INFO] run script verify.groovy
[INFO] ..SUCCESS (8.6 s)
[INFO] Building: unpack-from-remote-repository\pom.xml
[INFO] run script setup.bsh
[INFO] artifact org.apache.maven.its.dependency.fake-remote-unpack:1.0: checking for updates from central
[INFO] run script verify.bsh
[INFO] ..SUCCESS (8.1 s)
[INFO] Building: used-dependencies\pom.xml
[INFO] ..SUCCESS (8.3 s)
[INFO] Building: purge-local-repository-without-pom
[INFO] run script setup.bsh
[INFO] run script verify.bsh
[INFO] ..SUCCESS (6.7 s)
[INFO]
[INFO] --- mrm-maven-plugin:1.0.0:stop (default) @ maven-dependency-plugin ---
[INFO] Stopping Mock Repository Manager on http://localhost:54175
[INFO] Mock Repository Manager http://localhost:54175 is stopped.
[INFO]
[INFO] --- maven-checkstyle-plugin:2.15:check (checkstyle-check) @ maven-dependency-plugin ---
[INFO] There is 1 error reported by Checkstyle 6.1.1 with config/maven_checks.xml ruleset.
[INFO] Ignored 1 error, 0 violation remaining.
[INFO]
[INFO] --- maven-invoker-plugin:2.0.0:verify (integration-test) @ maven-dependency-plugin ---
[INFO] -------------------------------------------------
[INFO] Build Summary:
[INFO]   Passed: 53, Failed: 0, Errors: 0, Skipped: 2
[INFO] -------------------------------------------------
[INFO]
[INFO] --- maven-install-plugin:2.5.2:install (default-install) @ maven-dependency-plugin ---
[INFO] Installing F:\jenkins\jenkins-slave\workspace\maven-plugins-ITs-m3-windows\maven-dependency-plugin\target\maven-dependency-plugin-3.0.2-SNAPSHOT.jar to C:\Users\jenkins\.m2\repository\org\apache\maven\plugins\maven-dependency-plugin\3.0.2-SNAPSHOT\maven-dependency-plugin-3.0.2-SNAPSHOT.jar
[INFO] Installing F:\jenkins\jenkins-slave\workspace\maven-plugins-ITs-m3-windows\maven-dependency-plugin\pom.xml to C:\Users\jenkins\.m2\repository\org\apache\maven\plugins\maven-dependency-plugin\3.0.2-SNAPSHOT\maven-dependency-plugin-3.0.2-SNAPSHOT.pom
[INFO]                                                                        
[INFO] ------------------------------------------------------------------------
[INFO] Building Apache Maven Plugins Aggregator 1-SNAPSHOT
[INFO] ------------------------------------------------------------------------
[INFO]
[INFO] --- maven-clean-plugin:2.5:clean (default-clean) @ maven-plugins-aggregator ---
[INFO]
[INFO] --- maven-enforcer-plugin:1.3.1:enforce (enforce-bytecode-version) @ maven-plugins-aggregator ---
[INFO]
[INFO] --- maven-enforcer-plugin:1.3.1:enforce (ban-known-bad-maven-versions) @ maven-plugins-aggregator ---
[INFO]
[INFO] --- maven-remote-resources-plugin:1.5:process (default) @ maven-plugins-aggregator ---
[INFO]
[INFO] --- maven-site-plugin:3.3:attach-descriptor (attach-descriptor) @ maven-plugins-aggregator ---
[INFO]
[INFO] --- maven-install-plugin:2.5.1:install (default-install) @ maven-plugins-aggregator ---
[INFO] Installing <https://builds.apache.org/job/maven-plugins-ITs-m3-windows/ws/pom.xml> to C:\Users\jenkins\.m2\repository\org\apache\maven\plugins\maven-plugins-aggregator\1-SNAPSHOT\maven-plugins-aggregator-1-SNAPSHOT.pom
[INFO] ------------------------------------------------------------------------
[INFO] Reactor Summary:
[INFO]
[INFO] Apache Maven ACR Plugin ............................ SUCCESS [ 47.784 s]
[INFO] Apache Maven AntRun Plugin ......................... SUCCESS [02:42 min]
[INFO] Apache Maven Changelog Plugin ...................... SUCCESS [01:17 min]
[INFO] Apache Maven Changes Plugin ........................ SUCCESS [02:11 min]
[INFO] Apache Maven Clean Plugin .......................... SUCCESS [ 52.829 s]
[INFO] Apache Maven Compiler Plugin ....................... SUCCESS [03:58 min]
[INFO] Apache Maven Deploy Plugin ......................... SUCCESS [03:32 min]
[INFO] Apache Maven Documentation Checker Plugin .......... SUCCESS [ 10.086 s]
[INFO] Apache Maven EAR Plugin ............................ SUCCESS [09:55 min]
[INFO] Apache Maven EJB Plugin ............................ SUCCESS [01:13 min]
[INFO] Apache Maven Help Plugin ........................... SUCCESS [03:29 min]
[INFO] Apache Maven Install Plugin ........................ SUCCESS [03:10 min]
[INFO] Apache Maven Jarsigner Plugin ...................... SUCCESS [01:19 min]
[INFO] Apache Maven Javadoc Plugin ........................ FAILURE [09:20 min]
[INFO] Apache Maven JDeps Plugin .......................... SUCCESS [  3.819 s]
[INFO] Apache Maven Linkcheck Plugin ...................... SUCCESS [  5.258 s]
[INFO] Apache Maven Patch Plugin .......................... SUCCESS [ 10.445 s]
[INFO] Apache Maven PDF Plugin ............................ SUCCESS [ 42.910 s]
[INFO] Apache Maven RAR Plugin ............................ SUCCESS [ 21.388 s]
[INFO] Apache Maven Repository Plugin ..................... SUCCESS [ 46.211 s]
[INFO] Apache Maven Resources Plugin ...................... SUCCESS [02:25 min]
[INFO] Apache Maven Site Plugin ........................... SUCCESS [11:18 min]
[INFO] Apache Maven Source Plugin ......................... SUCCESS [01:44 min]
[INFO] Apache Maven Stage Plugin .......................... SUCCESS [  4.044 s]
[INFO] Apache Maven Toolchains Plugin ..................... SUCCESS [ 27.461 s]
[INFO] Apache Maven Verifier Plugin ....................... SUCCESS [ 16.595 s]
[INFO] Apache Maven WAR Plugin ............................ SUCCESS [03:20 min]
[INFO] Apache Maven DOAP Plugin ........................... SUCCESS [ 35.509 s]
[INFO] Apache Maven Invoker Plugin ........................ SUCCESS [11:45 min]
[INFO] Apache Maven JAR Plugin ............................ SUCCESS [03:12 min]
[INFO] Apache Maven Assembly Plugin ....................... SUCCESS [19:14 min]
[INFO] Apache Maven Checkstyle Plugin ..................... SUCCESS [07:21 min]
[INFO] Apache Maven PMD Plugin ............................ SUCCESS [03:47 min]
[INFO] Apache Maven Project Info Reports Plugin ........... SUCCESS [03:36 min]
[INFO] Apache Maven Remote Resources Plugin ............... SUCCESS [01:40 min]
[INFO] Apache Maven Shade Plugin .......................... SUCCESS [06:45 min]
[INFO] Apache Maven SCM Publish Plugin .................... SUCCESS [01:14 min]
[INFO] Apache Maven Dependency Plugin ..................... SUCCESS [07:52 min]
[INFO] Apache Maven Plugins Aggregator .................... SUCCESS [  0.961 s]
[INFO] ------------------------------------------------------------------------
[INFO] BUILD FAILURE
[INFO] ------------------------------------------------------------------------
[INFO] Total time: 02:13 h
[INFO] Finished at: 2017-07-08T22:47:07+00:00
[INFO] Final Memory: 156M/488M
[INFO] ------------------------------------------------------------------------
[WARNING] The requested profile "apache.snapshots" could not be activated because it does not exist.
[ERROR] Failed to execute goal org.apache.maven.plugins:maven-checkstyle-plugin:2.15:check (checkstyle-check) on project maven-javadoc-plugin: You have 1 Checkstyle violation. -> [Help 1]
[ERROR]
[ERROR] To see the full stack trace of the errors, re-run Maven with the -e switch.
[ERROR] Re-run Maven using the -X switch to enable full debug logging.
[ERROR]
[ERROR] For more information about the errors and possible solutions, please read the following articles:
[ERROR] [Help 1] http://cwiki.apache.org/confluence/display/MAVEN/MojoFailureException
[ERROR]
[ERROR] After correcting the problems, you can resume the build with the command
[ERROR]   mvn <goals> -rf :maven-javadoc-plugin
Build step 'Invoke top-level Maven targets' marked build as failure
Deleting 1 temporary files
Recording test results
Reply | Threaded
Open this post in threaded view
|  
Report Content as Inappropriate

Jenkins build is back to normal : maven-plugins-ITs-m3-windows #1927

Apache Jenkins Server-2
Loading...