Build failed in Jenkins: maven-plugins-ITs-m3-windows #1904

Previous Topic Next Topic
 
classic Classic list List threaded Threaded
3 messages Options
Reply | Threaded
Open this post in threaded view
|

Build failed in Jenkins: maven-plugins-ITs-m3-windows #1904

Apache Jenkins Server-2
See <https://builds.apache.org/job/maven-plugins-ITs-m3-windows/1904/display/redirect?page=changes>

Changes:

[hboutemy] [MASSEMBLY-858] use plugin classloader instead of thread classloader
fixes issues caused by MNG-6209 fix: but currently, every m-assembly-p from 2.2 to 3.0.0 using descriptor from classloader will fail with Maven 3.5.1...

------------------------------------------
[...truncated 3.25 MB...]
[INFO] run script verify.bsh
[INFO] ..SUCCESS (6.6 s)
[INFO] Building: filterunpack\pom.xml
[INFO] run script verify.groovy
[INFO] ..SUCCESS (6.9 s)
[INFO] Building: get-artifact\pom.xml
[INFO] run script setup.bsh
[INFO] run script verify.bsh
[INFO] ..SUCCESS (6.7 s)
[INFO] Building: get-artifact-maven-plugin\pom.xml
[INFO] run script setup.bsh
[INFO] run script verify.bsh
[INFO] ..SUCCESS (6.6 s)
[INFO] Building: get-artifact-no-transitive\pom.xml
[INFO] run script setup.bsh
[INFO] run script verify.bsh
[INFO] ..SUCCESS (6.7 s)
[INFO] Building: get-gav\pom.xml
[INFO] run script setup.bsh
[INFO] run script verify.bsh
[INFO] ..SUCCESS (6.6 s)
[INFO] Building: go-offline\pom.xml
[INFO] ..SUCCESS (8.2 s)
[INFO] Building: list-repositories\pom.xml
[INFO] snapshot org.apache.maven.its.dependency:test:1.0-SNAPSHOT: checking for updates from apache.snapshots
[INFO] artifact org.apache.maven.its.dependency.test:1.0-SNAPSHOT: checking for updates from central
[INFO] ..SUCCESS (6.9 s)
[INFO] Building: mdep-439-analyze-java8\pom.xml
[INFO] ..SKIPPED due to JRE version
[INFO] Building: mdep-450-project-with-ancestor\pom.xml
[INFO] run script verify.groovy
[INFO] ..SUCCESS (6.5 s)
[INFO] Building: mdep-450-project-without-ancestor\pom.xml
[INFO] run script verify.groovy
[INFO] ..SUCCESS (6.5 s)
[INFO] Building: mdep-506-dependency-without-version-in-depmgt\pom.xml
[INFO] ..SUCCESS (7.7 s)
[INFO] Building: purge-local-repository\pom.xml
[INFO] run script setup.bsh
[INFO] artifact org.apache.maven.its.dependency.purged:1.0: checking for updates from central
[INFO] run script verify.bsh
[INFO] ..SUCCESS (7.2 s)
[INFO] Building: purge-local-repository-non-transitive\pom.xml
[INFO] run script verify.bsh
[INFO] ..SUCCESS (7.4 s)
[INFO] Building: purge-local-repository-reresolve\pom.xml
[INFO] run script verify.bsh
[INFO] ..SUCCESS (7.4 s)
[INFO] Building: purge-local-repository-snapshots-only\pom.xml
[INFO] run script setup.bsh
[INFO] snapshot org.apache.maven.its.dependency:snap-purged:1.0-SNAPSHOT: checking for updates from apache.snapshots
[INFO] artifact org.apache.maven.its.dependency.snap-purged:1.0-SNAPSHOT: checking for updates from central
[INFO] run script verify.bsh
[INFO] ..SUCCESS (8.0 s)
[INFO] Building: purge-local-repository-version-range\pom.xml
[INFO] artifact org.apache.maven.its.dependency:purge-local-repository: checking for updates from central
[INFO] artifact org.apache.maven.its.dependency:purge-local-repository: checking for updates from central
[INFO] artifact org.apache.maven.its.dependency.purge-local-repository:[0.9,1.1]: checking for updates from central
[ERROR] /org/apache/maven/its/dependency/purge-local-repository/%5B0.9,1.1%5D/purge-local-repository-%5B0.9,1.1%5D.pom
java.lang.IllegalArgumentException: Illegal character in path at index 92: https://repo.maven.apache.org/maven2/org/apache/maven/its/dependency/purge-local-repository/[0.9,1.1]/maven-metadata.xml
        at java.net.URI.create(URI.java:859)
        at org.apache.maven.wagon.providers.http.httpclient.client.methods.HttpGet.<init>(HttpGet.java:69)
        at org.apache.maven.wagon.providers.http.AbstractHttpClientWagon.fillInputData(AbstractHttpClientWagon.java:970)
        at org.apache.maven.wagon.providers.http.AbstractHttpClientWagon.fillInputData(AbstractHttpClientWagon.java:960)
        at org.apache.maven.wagon.StreamWagon.getInputStream(StreamWagon.java:116)
        at org.apache.maven.wagon.StreamWagon.getIfNewer(StreamWagon.java:88)
        at org.apache.maven.wagon.StreamWagon.get(StreamWagon.java:61)
        at org.apache.maven.repository.legacy.DefaultWagonManager.getRemoteFile(DefaultWagonManager.java:392)
        at org.apache.maven.repository.legacy.DefaultWagonManager.getArtifactMetadata(DefaultWagonManager.java:218)
        at org.apache.maven.artifact.repository.metadata.DefaultRepositoryMetadataManager.resolve(DefaultRepositoryMetadataManager.java:132)
        at org.apache.maven.artifact.repository.metadata.DefaultRepositoryMetadataManager.resolve(DefaultRepositoryMetadataManager.java:71)
        at org.codehaus.mojo.mrm.maven.ProxyArtifactStore.getMetadata(ProxyArtifactStore.java:480)
        at org.codehaus.mojo.mrm.maven.ProxyArtifactStore.getMetadataLastModified(ProxyArtifactStore.java:536)
        at org.codehaus.mojo.mrm.impl.maven.CompositeArtifactStore.getMetadataLastModified(CompositeArtifactStore.java:339)
        at org.codehaus.mojo.mrm.impl.maven.ArtifactStoreFileSystem.listEntries(ArtifactStoreFileSystem.java:147)
        at org.codehaus.mojo.mrm.impl.digest.AutoDigestFileSystem.listEntries(AutoDigestFileSystem.java:100)
        at org.codehaus.mojo.mrm.api.BaseFileSystem.get(BaseFileSystem.java:89)
        at org.codehaus.mojo.mrm.impl.digest.AutoDigestFileSystem.get(AutoDigestFileSystem.java:185)
        at org.codehaus.mojo.mrm.servlet.FileSystemServlet.doGet(FileSystemServlet.java:157)
        at javax.servlet.http.HttpServlet.service(HttpServlet.java:707)
        at javax.servlet.http.HttpServlet.service(HttpServlet.java:820)
        at org.mortbay.jetty.servlet.ServletHolder.handle(ServletHolder.java:487)
        at org.mortbay.jetty.servlet.ServletHandler.handle(ServletHandler.java:362)
        at org.mortbay.jetty.servlet.SessionHandler.handle(SessionHandler.java:181)
        at org.mortbay.jetty.handler.ContextHandler.handle(ContextHandler.java:712)
        at org.mortbay.jetty.handler.HandlerWrapper.handle(HandlerWrapper.java:139)
        at org.mortbay.jetty.Server.handle(Server.java:313)
        at org.mortbay.jetty.HttpConnection.handleRequest(HttpConnection.java:506)
        at org.mortbay.jetty.HttpConnection$RequestHandler.headerComplete(HttpConnection.java:830)
        at org.mortbay.jetty.HttpParser.parseNext(HttpParser.java:514)
        at org.mortbay.jetty.HttpParser.parseAvailable(HttpParser.java:211)
        at org.mortbay.jetty.HttpConnection.handle(HttpConnection.java:381)
        at org.mortbay.jetty.bio.SocketConnector$Connection.run(SocketConnector.java:227)
        at org.mortbay.thread.BoundedThreadPool$PoolThread.run(BoundedThreadPool.java:442)
Caused by: java.net.URISyntaxException: Illegal character in path at index 92: https://repo.maven.apache.org/maven2/org/apache/maven/its/dependency/purge-local-repository/[0.9,1.1]/maven-metadata.xml
        at java.net.URI$Parser.fail(URI.java:2829)
        at java.net.URI$Parser.checkChars(URI.java:3002)
        at java.net.URI$Parser.parseHierarchical(URI.java:3086)
        at java.net.URI$Parser.parse(URI.java:3034)
        at java.net.URI.<init>(URI.java:595)
        at java.net.URI.create(URI.java:857)
        ... 33 more
[INFO] run script verify.bsh
[INFO] ..SUCCESS (7.7 s)
[INFO] Building: resolve\pom.xml
[INFO] ..SUCCESS (6.4 s)
[INFO] Building: resolve-plugins\pom.xml
[INFO] ..SUCCESS (7.5 s)
[INFO] Building: resolve-plugins-exclude-reactor\pom.xml
[INFO] run script verify.groovy
[INFO] ..SUCCESS (8.1 s)
[INFO] Building: resolve-plugins-with-exclude\pom.xml
[INFO] run script verify.groovy
[INFO] ..SUCCESS (7.6 s)
[INFO] Building: sources\pom.xml
[INFO] artifact classworlds.classworlds:1.1-alpha-2: checking for updates from central
[INFO] ..SUCCESS (7.1 s)
[INFO] Building: tree\pom.xml
[INFO] run script verify.bsh
[INFO] ..SUCCESS (6.5 s)
[INFO] Building: tree-includes\pom.xml
[INFO] run script verify.bsh
[INFO] ..SUCCESS (6.4 s)
[INFO] Building: tree-multimodule\pom.xml
[INFO] snapshot org.apache.maven.its.dependency:tree-multimodule-module-a:1.0-SNAPSHOT: checking for updates from apache.snapshots
[INFO] artifact org.apache.maven.its.dependency.tree-multimodule-module-a:1.0-SNAPSHOT: checking for updates from central
[INFO] run script verify.bsh
[INFO] ..SUCCESS (7.7 s)
[INFO] Building: unpack\pom.xml
[INFO] run script verify.bsh
[INFO] ..SUCCESS (8.1 s)
[INFO] Building: unpack-cli\pom.xml
[INFO] run script verify.bsh
[INFO] ..SUCCESS (6.7 s)
[INFO] Building: unpack-custom-ear\pom.xml
[INFO] run script verify.groovy
[INFO] ..SUCCESS (6.8 s)
[INFO] Building: unpack-dependencies\pom.xml
[INFO] run script verify.groovy
[INFO] ..SUCCESS (8.6 s)
[INFO] Building: unpack-from-remote-repository\pom.xml
[INFO] run script setup.bsh
[INFO] artifact org.apache.maven.its.dependency.fake-remote-unpack:1.0: checking for updates from central
[INFO] run script verify.bsh
[INFO] ..SUCCESS (8.1 s)
[INFO] Building: used-dependencies\pom.xml
[INFO] ..SUCCESS (8.2 s)
[INFO] Building: purge-local-repository-without-pom
[INFO] run script setup.bsh
[INFO] run script verify.bsh
[INFO] ..SUCCESS (6.4 s)
[INFO]
[INFO] --- mrm-maven-plugin:1.0.0:stop (default) @ maven-dependency-plugin ---
[INFO] Stopping Mock Repository Manager on http://localhost:55027
[INFO] Mock Repository Manager http://localhost:55027 is stopped.
[INFO]
[INFO] --- maven-checkstyle-plugin:2.15:check (checkstyle-check) @ maven-dependency-plugin ---
[INFO] There is 1 error reported by Checkstyle 6.1.1 with config/maven_checks.xml ruleset.
[INFO] Ignored 1 error, 0 violation remaining.
[INFO]
[INFO] --- maven-invoker-plugin:2.0.0:verify (integration-test) @ maven-dependency-plugin ---
[INFO] -------------------------------------------------
[INFO] Build Summary:
[INFO]   Passed: 48, Failed: 0, Errors: 0, Skipped: 1
[INFO] -------------------------------------------------
[INFO]
[INFO] --- maven-install-plugin:2.5.2:install (default-install) @ maven-dependency-plugin ---
[INFO] Installing F:\jenkins\jenkins-slave\workspace\maven-plugins-ITs-m3-windows\maven-dependency-plugin\target\maven-dependency-plugin-3.0.2-SNAPSHOT.jar to C:\Users\jenkins\.m2\repository\org\apache\maven\plugins\maven-dependency-plugin\3.0.2-SNAPSHOT\maven-dependency-plugin-3.0.2-SNAPSHOT.jar
[INFO] Installing F:\jenkins\jenkins-slave\workspace\maven-plugins-ITs-m3-windows\maven-dependency-plugin\pom.xml to C:\Users\jenkins\.m2\repository\org\apache\maven\plugins\maven-dependency-plugin\3.0.2-SNAPSHOT\maven-dependency-plugin-3.0.2-SNAPSHOT.pom
[INFO]                                                                        
[INFO] ------------------------------------------------------------------------
[INFO] Building Apache Maven Plugins Aggregator 1-SNAPSHOT
[INFO] ------------------------------------------------------------------------
[INFO]
[INFO] --- maven-clean-plugin:2.5:clean (default-clean) @ maven-plugins-aggregator ---
[INFO]
[INFO] --- maven-enforcer-plugin:1.3.1:enforce (enforce-bytecode-version) @ maven-plugins-aggregator ---
[INFO]
[INFO] --- maven-enforcer-plugin:1.3.1:enforce (ban-known-bad-maven-versions) @ maven-plugins-aggregator ---
[INFO]
[INFO] --- maven-remote-resources-plugin:1.5:process (default) @ maven-plugins-aggregator ---
[INFO]
[INFO] --- maven-site-plugin:3.3:attach-descriptor (attach-descriptor) @ maven-plugins-aggregator ---
[INFO]
[INFO] --- maven-install-plugin:2.5.1:install (default-install) @ maven-plugins-aggregator ---
[INFO] Installing <https://builds.apache.org/job/maven-plugins-ITs-m3-windows/ws/pom.xml> to C:\Users\jenkins\.m2\repository\org\apache\maven\plugins\maven-plugins-aggregator\1-SNAPSHOT\maven-plugins-aggregator-1-SNAPSHOT.pom
[INFO] ------------------------------------------------------------------------
[INFO] Reactor Summary:
[INFO]
[INFO] Apache Maven ACR Plugin ............................ SUCCESS [ 46.632 s]
[INFO] Apache Maven AntRun Plugin ......................... SUCCESS [02:08 min]
[INFO] Apache Maven Changelog Plugin ...................... SUCCESS [01:21 min]
[INFO] Apache Maven Changes Plugin ........................ SUCCESS [02:11 min]
[INFO] Apache Maven Clean Plugin .......................... SUCCESS [ 54.080 s]
[INFO] Apache Maven Compiler Plugin ....................... SUCCESS [03:56 min]
[INFO] Apache Maven Deploy Plugin ......................... SUCCESS [03:46 min]
[INFO] Apache Maven Documentation Checker Plugin .......... SUCCESS [ 10.364 s]
[INFO] Apache Maven EAR Plugin ............................ SUCCESS [09:51 min]
[INFO] Apache Maven EJB Plugin ............................ SUCCESS [01:12 min]
[INFO] Apache Maven Help Plugin ........................... SUCCESS [03:13 min]
[INFO] Apache Maven Install Plugin ........................ SUCCESS [03:01 min]
[INFO] Apache Maven Jarsigner Plugin ...................... SUCCESS [01:19 min]
[INFO] Apache Maven Javadoc Plugin ........................ SUCCESS [09:13 min]
[INFO] Apache Maven JDeps Plugin .......................... SUCCESS [  3.943 s]
[INFO] Apache Maven Linkcheck Plugin ...................... SUCCESS [  5.583 s]
[INFO] Apache Maven Patch Plugin .......................... SUCCESS [ 10.328 s]
[INFO] Apache Maven PDF Plugin ............................ SUCCESS [ 43.464 s]
[INFO] Apache Maven RAR Plugin ............................ SUCCESS [ 20.788 s]
[INFO] Apache Maven Repository Plugin ..................... SUCCESS [ 45.602 s]
[INFO] Apache Maven Resources Plugin ...................... SUCCESS [02:21 min]
[INFO] Apache Maven Site Plugin ........................... SUCCESS [11:30 min]
[INFO] Apache Maven Source Plugin ......................... SUCCESS [01:45 min]
[INFO] Apache Maven Stage Plugin .......................... SUCCESS [  4.113 s]
[INFO] Apache Maven Toolchains Plugin ..................... SUCCESS [ 26.436 s]
[INFO] Apache Maven Verifier Plugin ....................... SUCCESS [ 17.171 s]
[INFO] Apache Maven WAR Plugin ............................ SUCCESS [03:22 min]
[INFO] Apache Maven DOAP Plugin ........................... SUCCESS [ 34.300 s]
[INFO] Apache Maven Invoker Plugin ........................ SUCCESS [11:01 min]
[INFO] Apache Maven JAR Plugin ............................ SUCCESS [03:02 min]
[INFO] Apache Maven Checkstyle Plugin ..................... SUCCESS [07:21 min]
[INFO] Apache Maven PMD Plugin ............................ SUCCESS [03:42 min]
[INFO] Apache Maven Project Info Reports Plugin ........... SUCCESS [03:36 min]
[INFO] Apache Maven Remote Resources Plugin ............... SUCCESS [01:37 min]
[INFO] Apache Maven Shade Plugin .......................... SUCCESS [06:52 min]
[INFO] Apache Maven SCM Publish Plugin .................... SUCCESS [01:15 min]
[INFO] Apache Maven Assembly Plugin ....................... FAILURE [19:05 min]
[INFO] Apache Maven Dependency Plugin ..................... SUCCESS [07:06 min]
[INFO] Apache Maven Plugins Aggregator .................... SUCCESS [  0.938 s]
[INFO] ------------------------------------------------------------------------
[INFO] BUILD FAILURE
[INFO] ------------------------------------------------------------------------
[INFO] Total time: 02:10 h
[INFO] Finished at: 2017-06-10T23:44:44+00:00
[INFO] Final Memory: 156M/538M
[INFO] ------------------------------------------------------------------------
[WARNING] The requested profile "apache.snapshots" could not be activated because it does not exist.
[ERROR] Failed to execute goal org.apache.maven.plugins:maven-invoker-plugin:3.0.0:verify (integration-test) on project maven-assembly-plugin: 1 build failed. See console output above for details. -> [Help 1]
[ERROR]
[ERROR] To see the full stack trace of the errors, re-run Maven with the -e switch.
[ERROR] Re-run Maven using the -X switch to enable full debug logging.
[ERROR]
[ERROR] For more information about the errors and possible solutions, please read the following articles:
[ERROR] [Help 1] http://cwiki.apache.org/confluence/display/MAVEN/MojoFailureException
[ERROR]
[ERROR] After correcting the problems, you can resume the build with the command
[ERROR]   mvn <goals> -rf :maven-assembly-plugin
Build step 'Invoke top-level Maven targets' marked build as failure
Deleting 1 temporary files
Recording test results
Reply | Threaded
Open this post in threaded view
|

Build failed in Jenkins: maven-plugins-ITs-m3-windows #1905

Apache Jenkins Server-2
See <https://builds.apache.org/job/maven-plugins-ITs-m3-windows/1905/display/redirect?page=changes>

Changes:

[hboutemy] [MASSEMBLY-858] don't declare m-assembly-p as extension: this is not normal use, is not useful (and caused failure when MNG-6209 was fixed)
this shows that MNG-6209 won't break every build with previous m-assembl-p versions: only builds that declare this plugin as extension, but who does that?

------------------------------------------
[...truncated 3.25 MB...]
[INFO] run script verify.bsh
[INFO] ..SUCCESS (6.7 s)
[INFO] Building: filterunpack\pom.xml
[INFO] run script verify.groovy
[INFO] ..SUCCESS (6.6 s)
[INFO] Building: get-artifact\pom.xml
[INFO] run script setup.bsh
[INFO] run script verify.bsh
[INFO] ..SUCCESS (6.4 s)
[INFO] Building: get-artifact-maven-plugin\pom.xml
[INFO] run script setup.bsh
[INFO] run script verify.bsh
[INFO] ..SUCCESS (6.5 s)
[INFO] Building: get-artifact-no-transitive\pom.xml
[INFO] run script setup.bsh
[INFO] run script verify.bsh
[INFO] ..SUCCESS (6.7 s)
[INFO] Building: get-gav\pom.xml
[INFO] run script setup.bsh
[INFO] run script verify.bsh
[INFO] ..SUCCESS (6.3 s)
[INFO] Building: go-offline\pom.xml
[INFO] ..SUCCESS (8.1 s)
[INFO] Building: list-repositories\pom.xml
[INFO] snapshot org.apache.maven.its.dependency:test:1.0-SNAPSHOT: checking for updates from apache.snapshots
[INFO] artifact org.apache.maven.its.dependency.test:1.0-SNAPSHOT: checking for updates from central
[INFO] ..SUCCESS (7.0 s)
[INFO] Building: mdep-439-analyze-java8\pom.xml
[INFO] ..SKIPPED due to JRE version
[INFO] Building: mdep-450-project-with-ancestor\pom.xml
[INFO] run script verify.groovy
[INFO] ..SUCCESS (6.6 s)
[INFO] Building: mdep-450-project-without-ancestor\pom.xml
[INFO] run script verify.groovy
[INFO] ..SUCCESS (6.8 s)
[INFO] Building: mdep-506-dependency-without-version-in-depmgt\pom.xml
[INFO] ..SUCCESS (7.5 s)
[INFO] Building: purge-local-repository\pom.xml
[INFO] run script setup.bsh
[INFO] artifact org.apache.maven.its.dependency.purged:1.0: checking for updates from central
[INFO] run script verify.bsh
[INFO] ..SUCCESS (7.4 s)
[INFO] Building: purge-local-repository-non-transitive\pom.xml
[INFO] run script verify.bsh
[INFO] ..SUCCESS (7.2 s)
[INFO] Building: purge-local-repository-reresolve\pom.xml
[INFO] run script verify.bsh
[INFO] ..SUCCESS (7.3 s)
[INFO] Building: purge-local-repository-snapshots-only\pom.xml
[INFO] run script setup.bsh
[INFO] snapshot org.apache.maven.its.dependency:snap-purged:1.0-SNAPSHOT: checking for updates from apache.snapshots
[INFO] artifact org.apache.maven.its.dependency.snap-purged:1.0-SNAPSHOT: checking for updates from central
[INFO] run script verify.bsh
[INFO] ..SUCCESS (8.1 s)
[INFO] Building: purge-local-repository-version-range\pom.xml
[INFO] artifact org.apache.maven.its.dependency:purge-local-repository: checking for updates from central
[INFO] artifact org.apache.maven.its.dependency:purge-local-repository: checking for updates from central
[INFO] artifact org.apache.maven.its.dependency.purge-local-repository:[0.9,1.1]: checking for updates from central
[ERROR] /org/apache/maven/its/dependency/purge-local-repository/%5B0.9,1.1%5D/purge-local-repository-%5B0.9,1.1%5D.pom
java.lang.IllegalArgumentException: Illegal character in path at index 92: https://repo.maven.apache.org/maven2/org/apache/maven/its/dependency/purge-local-repository/[0.9,1.1]/maven-metadata.xml
        at java.net.URI.create(URI.java:859)
        at org.apache.maven.wagon.providers.http.httpclient.client.methods.HttpGet.<init>(HttpGet.java:69)
        at org.apache.maven.wagon.providers.http.AbstractHttpClientWagon.fillInputData(AbstractHttpClientWagon.java:970)
        at org.apache.maven.wagon.providers.http.AbstractHttpClientWagon.fillInputData(AbstractHttpClientWagon.java:960)
        at org.apache.maven.wagon.StreamWagon.getInputStream(StreamWagon.java:116)
        at org.apache.maven.wagon.StreamWagon.getIfNewer(StreamWagon.java:88)
        at org.apache.maven.wagon.StreamWagon.get(StreamWagon.java:61)
        at org.apache.maven.repository.legacy.DefaultWagonManager.getRemoteFile(DefaultWagonManager.java:392)
        at org.apache.maven.repository.legacy.DefaultWagonManager.getArtifactMetadata(DefaultWagonManager.java:218)
        at org.apache.maven.artifact.repository.metadata.DefaultRepositoryMetadataManager.resolve(DefaultRepositoryMetadataManager.java:132)
        at org.apache.maven.artifact.repository.metadata.DefaultRepositoryMetadataManager.resolve(DefaultRepositoryMetadataManager.java:71)
        at org.codehaus.mojo.mrm.maven.ProxyArtifactStore.getMetadata(ProxyArtifactStore.java:480)
        at org.codehaus.mojo.mrm.maven.ProxyArtifactStore.getMetadataLastModified(ProxyArtifactStore.java:536)
        at org.codehaus.mojo.mrm.impl.maven.CompositeArtifactStore.getMetadataLastModified(CompositeArtifactStore.java:339)
        at org.codehaus.mojo.mrm.impl.maven.ArtifactStoreFileSystem.listEntries(ArtifactStoreFileSystem.java:147)
        at org.codehaus.mojo.mrm.impl.digest.AutoDigestFileSystem.listEntries(AutoDigestFileSystem.java:100)
        at org.codehaus.mojo.mrm.api.BaseFileSystem.get(BaseFileSystem.java:89)
        at org.codehaus.mojo.mrm.impl.digest.AutoDigestFileSystem.get(AutoDigestFileSystem.java:185)
        at org.codehaus.mojo.mrm.servlet.FileSystemServlet.doGet(FileSystemServlet.java:157)
        at javax.servlet.http.HttpServlet.service(HttpServlet.java:707)
        at javax.servlet.http.HttpServlet.service(HttpServlet.java:820)
        at org.mortbay.jetty.servlet.ServletHolder.handle(ServletHolder.java:487)
        at org.mortbay.jetty.servlet.ServletHandler.handle(ServletHandler.java:362)
        at org.mortbay.jetty.servlet.SessionHandler.handle(SessionHandler.java:181)
        at org.mortbay.jetty.handler.ContextHandler.handle(ContextHandler.java:712)
        at org.mortbay.jetty.handler.HandlerWrapper.handle(HandlerWrapper.java:139)
        at org.mortbay.jetty.Server.handle(Server.java:313)
        at org.mortbay.jetty.HttpConnection.handleRequest(HttpConnection.java:506)
        at org.mortbay.jetty.HttpConnection$RequestHandler.headerComplete(HttpConnection.java:830)
        at org.mortbay.jetty.HttpParser.parseNext(HttpParser.java:514)
        at org.mortbay.jetty.HttpParser.parseAvailable(HttpParser.java:211)
        at org.mortbay.jetty.HttpConnection.handle(HttpConnection.java:381)
        at org.mortbay.jetty.bio.SocketConnector$Connection.run(SocketConnector.java:227)
        at org.mortbay.thread.BoundedThreadPool$PoolThread.run(BoundedThreadPool.java:442)
Caused by: java.net.URISyntaxException: Illegal character in path at index 92: https://repo.maven.apache.org/maven2/org/apache/maven/its/dependency/purge-local-repository/[0.9,1.1]/maven-metadata.xml
        at java.net.URI$Parser.fail(URI.java:2829)
        at java.net.URI$Parser.checkChars(URI.java:3002)
        at java.net.URI$Parser.parseHierarchical(URI.java:3086)
        at java.net.URI$Parser.parse(URI.java:3034)
        at java.net.URI.<init>(URI.java:595)
        at java.net.URI.create(URI.java:857)
        ... 33 more
[INFO] run script verify.bsh
[INFO] ..SUCCESS (8.0 s)
[INFO] Building: resolve\pom.xml
[INFO] ..SUCCESS (6.7 s)
[INFO] Building: resolve-plugins\pom.xml
[INFO] ..SUCCESS (7.5 s)
[INFO] Building: resolve-plugins-exclude-reactor\pom.xml
[INFO] run script verify.groovy
[INFO] ..SUCCESS (8.4 s)
[INFO] Building: resolve-plugins-with-exclude\pom.xml
[INFO] run script verify.groovy
[INFO] ..SUCCESS (7.4 s)
[INFO] Building: sources\pom.xml
[INFO] artifact classworlds.classworlds:1.1-alpha-2: checking for updates from central
[INFO] ..SUCCESS (6.9 s)
[INFO] Building: tree\pom.xml
[INFO] run script verify.bsh
[INFO] ..SUCCESS (7.0 s)
[INFO] Building: tree-includes\pom.xml
[INFO] run script verify.bsh
[INFO] ..SUCCESS (6.8 s)
[INFO] Building: tree-multimodule\pom.xml
[INFO] snapshot org.apache.maven.its.dependency:tree-multimodule-module-a:1.0-SNAPSHOT: checking for updates from apache.snapshots
[INFO] artifact org.apache.maven.its.dependency.tree-multimodule-module-a:1.0-SNAPSHOT: checking for updates from central
[INFO] run script verify.bsh
[INFO] ..SUCCESS (7.7 s)
[INFO] Building: unpack\pom.xml
[INFO] run script verify.bsh
[INFO] ..SUCCESS (8.3 s)
[INFO] Building: unpack-cli\pom.xml
[INFO] run script verify.bsh
[INFO] ..SUCCESS (6.6 s)
[INFO] Building: unpack-custom-ear\pom.xml
[INFO] run script verify.groovy
[INFO] ..SUCCESS (7.3 s)
[INFO] Building: unpack-dependencies\pom.xml
[INFO] run script verify.groovy
[INFO] ..SUCCESS (8.5 s)
[INFO] Building: unpack-from-remote-repository\pom.xml
[INFO] run script setup.bsh
[INFO] artifact org.apache.maven.its.dependency.fake-remote-unpack:1.0: checking for updates from central
[INFO] run script verify.bsh
[INFO] ..SUCCESS (8.2 s)
[INFO] Building: used-dependencies\pom.xml
[INFO] ..SUCCESS (8.6 s)
[INFO] Building: purge-local-repository-without-pom
[INFO] run script setup.bsh
[INFO] run script verify.bsh
[INFO] ..SUCCESS (6.3 s)
[INFO]
[INFO] --- mrm-maven-plugin:1.0.0:stop (default) @ maven-dependency-plugin ---
[INFO] Stopping Mock Repository Manager on http://localhost:59465
[INFO] Mock Repository Manager http://localhost:59465 is stopped.
[INFO]
[INFO] --- maven-checkstyle-plugin:2.15:check (checkstyle-check) @ maven-dependency-plugin ---
[INFO] There is 1 error reported by Checkstyle 6.1.1 with config/maven_checks.xml ruleset.
[INFO] Ignored 1 error, 0 violation remaining.
[INFO]
[INFO] --- maven-invoker-plugin:2.0.0:verify (integration-test) @ maven-dependency-plugin ---
[INFO] -------------------------------------------------
[INFO] Build Summary:
[INFO]   Passed: 48, Failed: 0, Errors: 0, Skipped: 1
[INFO] -------------------------------------------------
[INFO]
[INFO] --- maven-install-plugin:2.5.2:install (default-install) @ maven-dependency-plugin ---
[INFO] Installing F:\jenkins\jenkins-slave\workspace\maven-plugins-ITs-m3-windows\maven-dependency-plugin\target\maven-dependency-plugin-3.0.2-SNAPSHOT.jar to C:\Users\jenkins\.m2\repository\org\apache\maven\plugins\maven-dependency-plugin\3.0.2-SNAPSHOT\maven-dependency-plugin-3.0.2-SNAPSHOT.jar
[INFO] Installing F:\jenkins\jenkins-slave\workspace\maven-plugins-ITs-m3-windows\maven-dependency-plugin\pom.xml to C:\Users\jenkins\.m2\repository\org\apache\maven\plugins\maven-dependency-plugin\3.0.2-SNAPSHOT\maven-dependency-plugin-3.0.2-SNAPSHOT.pom
[INFO]                                                                        
[INFO] ------------------------------------------------------------------------
[INFO] Building Apache Maven Plugins Aggregator 1-SNAPSHOT
[INFO] ------------------------------------------------------------------------
[INFO]
[INFO] --- maven-clean-plugin:2.5:clean (default-clean) @ maven-plugins-aggregator ---
[INFO]
[INFO] --- maven-enforcer-plugin:1.3.1:enforce (enforce-bytecode-version) @ maven-plugins-aggregator ---
[INFO]
[INFO] --- maven-enforcer-plugin:1.3.1:enforce (ban-known-bad-maven-versions) @ maven-plugins-aggregator ---
[INFO]
[INFO] --- maven-remote-resources-plugin:1.5:process (default) @ maven-plugins-aggregator ---
[INFO]
[INFO] --- maven-site-plugin:3.3:attach-descriptor (attach-descriptor) @ maven-plugins-aggregator ---
[INFO]
[INFO] --- maven-install-plugin:2.5.1:install (default-install) @ maven-plugins-aggregator ---
[INFO] Installing <https://builds.apache.org/job/maven-plugins-ITs-m3-windows/ws/pom.xml> to C:\Users\jenkins\.m2\repository\org\apache\maven\plugins\maven-plugins-aggregator\1-SNAPSHOT\maven-plugins-aggregator-1-SNAPSHOT.pom
[INFO] ------------------------------------------------------------------------
[INFO] Reactor Summary:
[INFO]
[INFO] Apache Maven ACR Plugin ............................ SUCCESS [ 45.009 s]
[INFO] Apache Maven AntRun Plugin ......................... SUCCESS [02:02 min]
[INFO] Apache Maven Changelog Plugin ...................... SUCCESS [01:17 min]
[INFO] Apache Maven Changes Plugin ........................ SUCCESS [02:04 min]
[INFO] Apache Maven Clean Plugin .......................... SUCCESS [ 51.589 s]
[INFO] Apache Maven Compiler Plugin ....................... SUCCESS [04:00 min]
[INFO] Apache Maven Deploy Plugin ......................... SUCCESS [03:55 min]
[INFO] Apache Maven Documentation Checker Plugin .......... SUCCESS [ 14.536 s]
[INFO] Apache Maven EAR Plugin ............................ SUCCESS [11:03 min]
[INFO] Apache Maven EJB Plugin ............................ SUCCESS [01:21 min]
[INFO] Apache Maven Help Plugin ........................... SUCCESS [03:42 min]
[INFO] Apache Maven Install Plugin ........................ SUCCESS [03:24 min]
[INFO] Apache Maven Jarsigner Plugin ...................... SUCCESS [01:28 min]
[INFO] Apache Maven Javadoc Plugin ........................ SUCCESS [10:31 min]
[INFO] Apache Maven JDeps Plugin .......................... SUCCESS [  4.201 s]
[INFO] Apache Maven Linkcheck Plugin ...................... SUCCESS [  5.251 s]
[INFO] Apache Maven Patch Plugin .......................... SUCCESS [ 10.603 s]
[INFO] Apache Maven PDF Plugin ............................ SUCCESS [ 47.503 s]
[INFO] Apache Maven RAR Plugin ............................ SUCCESS [ 25.702 s]
[INFO] Apache Maven Repository Plugin ..................... SUCCESS [ 45.545 s]
[INFO] Apache Maven Resources Plugin ...................... SUCCESS [02:23 min]
[INFO] Apache Maven Site Plugin ........................... SUCCESS [10:52 min]
[INFO] Apache Maven Source Plugin ......................... SUCCESS [01:42 min]
[INFO] Apache Maven Stage Plugin .......................... SUCCESS [  3.747 s]
[INFO] Apache Maven Toolchains Plugin ..................... SUCCESS [ 25.909 s]
[INFO] Apache Maven Verifier Plugin ....................... SUCCESS [ 15.842 s]
[INFO] Apache Maven WAR Plugin ............................ SUCCESS [03:14 min]
[INFO] Apache Maven DOAP Plugin ........................... SUCCESS [ 33.383 s]
[INFO] Apache Maven Invoker Plugin ........................ SUCCESS [11:09 min]
[INFO] Apache Maven JAR Plugin ............................ SUCCESS [03:06 min]
[INFO] Apache Maven Checkstyle Plugin ..................... SUCCESS [07:38 min]
[INFO] Apache Maven PMD Plugin ............................ SUCCESS [03:47 min]
[INFO] Apache Maven Project Info Reports Plugin ........... SUCCESS [03:32 min]
[INFO] Apache Maven Remote Resources Plugin ............... SUCCESS [01:37 min]
[INFO] Apache Maven Shade Plugin .......................... SUCCESS [06:42 min]
[INFO] Apache Maven SCM Publish Plugin .................... SUCCESS [01:18 min]
[INFO] Apache Maven Assembly Plugin ....................... FAILURE [18:28 min]
[INFO] Apache Maven Dependency Plugin ..................... SUCCESS [07:08 min]
[INFO] Apache Maven Plugins Aggregator .................... SUCCESS [  0.953 s]
[INFO] ------------------------------------------------------------------------
[INFO] BUILD FAILURE
[INFO] ------------------------------------------------------------------------
[INFO] Total time: 02:13 h
[INFO] Finished at: 2017-06-11T02:02:49+00:00
[INFO] Final Memory: 159M/519M
[INFO] ------------------------------------------------------------------------
[WARNING] The requested profile "apache.snapshots" could not be activated because it does not exist.
[ERROR] Failed to execute goal org.apache.maven.plugins:maven-invoker-plugin:3.0.0:verify (integration-test) on project maven-assembly-plugin: 1 build failed. See console output above for details. -> [Help 1]
[ERROR]
[ERROR] To see the full stack trace of the errors, re-run Maven with the -e switch.
[ERROR] Re-run Maven using the -X switch to enable full debug logging.
[ERROR]
[ERROR] For more information about the errors and possible solutions, please read the following articles:
[ERROR] [Help 1] http://cwiki.apache.org/confluence/display/MAVEN/MojoFailureException
[ERROR]
[ERROR] After correcting the problems, you can resume the build with the command
[ERROR]   mvn <goals> -rf :maven-assembly-plugin
Build step 'Invoke top-level Maven targets' marked build as failure
Deleting 1 temporary files
Recording test results
Reply | Threaded
Open this post in threaded view
|

Jenkins build is back to normal : maven-plugins-ITs-m3-windows #1906

Apache Jenkins Server-2