Build failed in Jenkins: maven-plugins » Apache Maven Javadoc Plugin #9023

Previous Topic Next Topic
 
classic Classic list List threaded Threaded
3 messages Options
Reply | Threaded
Open this post in threaded view
|  
Report Content as Inappropriate

Build failed in Jenkins: maven-plugins » Apache Maven Javadoc Plugin #9023

Apache Jenkins Server-2
See <https://builds.apache.org/job/maven-plugins/org.apache.maven.plugins$maven-javadoc-plugin/9023/display/redirect?page=changes>

Changes:

[Robert Scholte] [MJAVADOC-485] Upgrade to commons-lang3
Introduce JavadocVersion, first step to get rid of floats comparison

------------------------------------------
[INFO]                                                                        
[INFO] ------------------------------------------------------------------------
[INFO] Building Apache Maven Javadoc Plugin 3.0.0-SNAPSHOT
[INFO] ------------------------------------------------------------------------
[INFO] Downloading: http://repository.apache.org/snapshots/org/apache/maven/shared/maven-artifact-transfer/3.0.0-SNAPSHOT/maven-metadata.xml
[INFO] Downloaded: http://repository.apache.org/snapshots/org/apache/maven/shared/maven-artifact-transfer/3.0.0-SNAPSHOT/maven-metadata.xml (805 B at 3.1 KB/sec)
[INFO]
[INFO] --- maven-clean-plugin:3.0.0:clean (default-clean) @ maven-javadoc-plugin ---
[INFO] Deleting <https://builds.apache.org/job/maven-plugins/org.apache.maven.plugins$maven-javadoc-plugin/ws/target>
[INFO]
[INFO] --- maven-enforcer-plugin:1.4.1:enforce (enforce-bytecode-version) @ maven-javadoc-plugin ---
[INFO]
[INFO] --- maven-enforcer-plugin:1.4.1:enforce (ban-known-bad-maven-versions) @ maven-javadoc-plugin ---
[INFO]
[INFO] --- maven-enforcer-plugin:1.4.1:enforce (ensure-no-container-api) @ maven-javadoc-plugin ---
[INFO]
[INFO] --- apache-rat-plugin:0.11:check (rat-check) @ maven-javadoc-plugin ---
[INFO] 51 implicit excludes (use -debug for more details).
[INFO] Exclude: DEPENDENCIES
[INFO] Exclude: **/*.psd
[INFO] Exclude: **/*.sha1
[INFO] Exclude: **/*package-list*
[INFO] Exclude: src/main/resources/org/apache/maven/plugin/javadoc/frame-injection-fix.txt
[INFO] Exclude: src/test/resources/unit/test-javadoc-test/junit/junit/3.8.1/junit-3.8.1.pom
[INFO] Exclude: javadoc-options-javadoc-resources.xml
[INFO] 536 resources included (use -debug for more details)
[INFO] Rat check: Summary of files. Unapproved: 0 unknown: 0 generated: 0 approved: 508 licence.
[INFO]
[INFO] --- maven-plugin-plugin:3.4:helpmojo (generate-helpmojo) @ maven-javadoc-plugin ---
[INFO] Using 'UTF-8' encoding to read mojo metadata.
[INFO] Mojo extractor with id: java-annotations found 0 mojo descriptors.
[INFO] Mojo extractor with id: java-javadoc found 0 mojo descriptors.
[INFO]
[INFO] --- modello-maven-plugin:1.8.1:java (default) @ maven-javadoc-plugin ---
[INFO] outputDirectory: <https://builds.apache.org/job/maven-plugins/org.apache.maven.plugins$maven-javadoc-plugin/ws/target/generated-sources/modello>
[INFO] Working on model: src/main/mdo/javadocOptions.mdo
[INFO] Generating current version: 1.1.0
[INFO]
[INFO] --- modello-maven-plugin:1.8.1:xpp3-reader (default) @ maven-javadoc-plugin ---
[INFO] outputDirectory: <https://builds.apache.org/job/maven-plugins/org.apache.maven.plugins$maven-javadoc-plugin/ws/target/generated-sources/modello>
[INFO] Working on model: src/main/mdo/javadocOptions.mdo
[INFO] Generating current version: 1.1.0
[INFO]
[INFO] --- modello-maven-plugin:1.8.1:xpp3-writer (default) @ maven-javadoc-plugin ---
[INFO] outputDirectory: <https://builds.apache.org/job/maven-plugins/org.apache.maven.plugins$maven-javadoc-plugin/ws/target/generated-sources/modello>
[INFO] Working on model: src/main/mdo/javadocOptions.mdo
[INFO] Generating current version: 1.1.0
[INFO]
[INFO] --- maven-remote-resources-plugin:1.5:process (process-resource-bundles) @ maven-javadoc-plugin ---
[INFO]
[INFO] --- maven-resources-plugin:2.7:resources (default-resources) @ maven-javadoc-plugin ---
[INFO] Using 'UTF-8' encoding to copy filtered resources.
[INFO] Copying 21 resources
[INFO] Copying 3 resources
[INFO]
[INFO] --- maven-compiler-plugin:3.5.1:compile (default-compile) @ maven-javadoc-plugin ---
[INFO] Changes detected - recompiling the module!
[INFO] Compiling 37 source files to <https://builds.apache.org/job/maven-plugins/org.apache.maven.plugins$maven-javadoc-plugin/ws/target/classes>
[INFO] <https://builds.apache.org/job/maven-plugins/org.apache.maven.plugins$maven-javadoc-plugin/ws/src/main/java/org/apache/maven/plugin/javadoc/JavadocUtil.java>: Some input files use or override a deprecated API.
[INFO] <https://builds.apache.org/job/maven-plugins/org.apache.maven.plugins$maven-javadoc-plugin/ws/src/main/java/org/apache/maven/plugin/javadoc/JavadocUtil.java>: Recompile with -Xlint:deprecation for details.
[INFO] <https://builds.apache.org/job/maven-plugins/org.apache.maven.plugins$maven-javadoc-plugin/ws/src/main/java/org/apache/maven/plugin/javadoc/AbstractJavadocMojo.java>: Some input files use unchecked or unsafe operations.
[INFO] <https://builds.apache.org/job/maven-plugins/org.apache.maven.plugins$maven-javadoc-plugin/ws/src/main/java/org/apache/maven/plugin/javadoc/AbstractJavadocMojo.java>: Recompile with -Xlint:unchecked for details.
[INFO]
[INFO] --- maven-plugin-plugin:3.4:descriptor (default-descriptor) @ maven-javadoc-plugin ---
[INFO] Using 'UTF-8' encoding to read mojo metadata.
[INFO] Mojo extractor with id: java-annotations found 15 mojo descriptors.
[INFO] Mojo extractor with id: java-javadoc found 0 mojo descriptors.
[INFO]
[INFO] --- plexus-component-metadata:1.7.1:generate-metadata (default) @ maven-javadoc-plugin ---
[INFO] Discovered 1 component descriptors(s)
[INFO]
[INFO] --- maven-resources-plugin:2.7:testResources (default-testResources) @ maven-javadoc-plugin ---
[INFO] Using 'UTF-8' encoding to copy filtered resources.
[INFO] Copying 192 resources
[INFO] Copying 3 resources
[INFO]
[INFO] --- maven-compiler-plugin:3.5.1:testCompile (default-testCompile) @ maven-javadoc-plugin ---
[INFO] Changes detected - recompiling the module!
[INFO] Compiling 50 source files to <https://builds.apache.org/job/maven-plugins/org.apache.maven.plugins$maven-javadoc-plugin/ws/target/test-classes>
[INFO] <https://builds.apache.org/job/maven-plugins/org.apache.maven.plugins$maven-javadoc-plugin/ws/src/test/java/org/apache/maven/plugin/javadoc/stubs/StylesheetFileMavenProjectStub.java>: Some input files use or override a deprecated API.
[INFO] <https://builds.apache.org/job/maven-plugins/org.apache.maven.plugins$maven-javadoc-plugin/ws/src/test/java/org/apache/maven/plugin/javadoc/stubs/StylesheetFileMavenProjectStub.java>: Recompile with -Xlint:deprecation for details.
[INFO] <https://builds.apache.org/job/maven-plugins/org.apache.maven.plugins$maven-javadoc-plugin/ws/src/test/java/org/apache/maven/plugin/javadoc/JavadocJarTest.java>: <https://builds.apache.org/job/maven-plugins/org.apache.maven.plugins$maven-javadoc-plugin/ws/src/test/java/org/apache/maven/plugin/javadoc/JavadocJarTest.java> uses unchecked or unsafe operations.
[INFO] <https://builds.apache.org/job/maven-plugins/org.apache.maven.plugins$maven-javadoc-plugin/ws/src/test/java/org/apache/maven/plugin/javadoc/JavadocJarTest.java>: Recompile with -Xlint:unchecked for details.
[INFO] -------------------------------------------------------------
[ERROR] COMPILATION ERROR :
[INFO] -------------------------------------------------------------
[ERROR] <https://builds.apache.org/job/maven-plugins/org.apache.maven.plugins$maven-javadoc-plugin/ws/src/test/java/org/apache/maven/plugin/javadoc/JavadocVersionTest.java>:[22,24] package org.junit does not exist
[ERROR] <https://builds.apache.org/job/maven-plugins/org.apache.maven.plugins$maven-javadoc-plugin/ws/src/test/java/org/apache/maven/plugin/javadoc/JavadocVersionTest.java>:[22,1] static import only from classes and interfaces
[ERROR] <https://builds.apache.org/job/maven-plugins/org.apache.maven.plugins$maven-javadoc-plugin/ws/src/test/java/org/apache/maven/plugin/javadoc/JavadocVersionTest.java>:[24,17] package org.junit does not exist
[ERROR] <https://builds.apache.org/job/maven-plugins/org.apache.maven.plugins$maven-javadoc-plugin/ws/src/test/java/org/apache/maven/plugin/javadoc/JavadocVersionTest.java>:[33,6] cannot find symbol
  symbol:   class Test
  location: class org.apache.maven.plugin.javadoc.JavadocVersionTest
[ERROR] <https://builds.apache.org/job/maven-plugins/org.apache.maven.plugins$maven-javadoc-plugin/ws/src/test/java/org/apache/maven/plugin/javadoc/JavadocVersionTest.java>:[36,9] cannot find symbol
  symbol:   method assertTrue(boolean)
  location: class org.apache.maven.plugin.javadoc.JavadocVersionTest
[ERROR] <https://builds.apache.org/job/maven-plugins/org.apache.maven.plugins$maven-javadoc-plugin/ws/src/test/java/org/apache/maven/plugin/javadoc/JavadocVersionTest.java>:[37,9] cannot find symbol
  symbol:   method assertTrue(boolean)
  location: class org.apache.maven.plugin.javadoc.JavadocVersionTest
[ERROR] <https://builds.apache.org/job/maven-plugins/org.apache.maven.plugins$maven-javadoc-plugin/ws/src/test/java/org/apache/maven/plugin/javadoc/JavadocVersionTest.java>:[38,9] cannot find symbol
  symbol:   method assertTrue(boolean)
  location: class org.apache.maven.plugin.javadoc.JavadocVersionTest
[ERROR] <https://builds.apache.org/job/maven-plugins/org.apache.maven.plugins$maven-javadoc-plugin/ws/src/test/java/org/apache/maven/plugin/javadoc/JavadocVersionTest.java>:[40,9] cannot find symbol
  symbol:   method assertTrue(boolean)
  location: class org.apache.maven.plugin.javadoc.JavadocVersionTest
[ERROR] <https://builds.apache.org/job/maven-plugins/org.apache.maven.plugins$maven-javadoc-plugin/ws/src/test/java/org/apache/maven/plugin/javadoc/JavadocVersionTest.java>:[41,9] cannot find symbol
  symbol:   method assertTrue(boolean)
  location: class org.apache.maven.plugin.javadoc.JavadocVersionTest
[ERROR] <https://builds.apache.org/job/maven-plugins/org.apache.maven.plugins$maven-javadoc-plugin/ws/src/test/java/org/apache/maven/plugin/javadoc/JavadocVersionTest.java>:[42,9] cannot find symbol
  symbol:   method assertTrue(boolean)
  location: class org.apache.maven.plugin.javadoc.JavadocVersionTest
[ERROR] <https://builds.apache.org/job/maven-plugins/org.apache.maven.plugins$maven-javadoc-plugin/ws/src/test/java/org/apache/maven/plugin/javadoc/JavadocVersionTest.java>:[44,9] cannot find symbol
  symbol:   method assertTrue(boolean)
  location: class org.apache.maven.plugin.javadoc.JavadocVersionTest
[ERROR] <https://builds.apache.org/job/maven-plugins/org.apache.maven.plugins$maven-javadoc-plugin/ws/src/test/java/org/apache/maven/plugin/javadoc/JavadocVersionTest.java>:[45,9] cannot find symbol
  symbol:   method assertTrue(boolean)
  location: class org.apache.maven.plugin.javadoc.JavadocVersionTest
[ERROR] <https://builds.apache.org/job/maven-plugins/org.apache.maven.plugins$maven-javadoc-plugin/ws/src/test/java/org/apache/maven/plugin/javadoc/JavadocVersionTest.java>:[46,9] cannot find symbol
  symbol:   method assertTrue(boolean)
  location: class org.apache.maven.plugin.javadoc.JavadocVersionTest
[INFO] 13 errors
[INFO] -------------------------------------------------------------
Reply | Threaded
Open this post in threaded view
|  
Report Content as Inappropriate

Build failed in Jenkins: maven-plugins » Apache Maven Javadoc Plugin #9024

Apache Jenkins Server-2
See <https://builds.apache.org/job/maven-plugins/org.apache.maven.plugins$maven-javadoc-plugin/9024/display/redirect?page=changes>

Changes:

[Robert Scholte] [MJAVADOC-485] Upgrade to commons-lang3
Upgrade junit to 4.12

------------------------------------------
[INFO]                                                                        
[INFO] ------------------------------------------------------------------------
[INFO] Building Apache Maven Javadoc Plugin 3.0.0-SNAPSHOT
[INFO] ------------------------------------------------------------------------
[INFO] Downloading: http://repository.apache.org/snapshots/org/apache/maven/shared/maven-artifact-transfer/3.0.0-SNAPSHOT/maven-metadata.xml
[INFO] Downloaded: http://repository.apache.org/snapshots/org/apache/maven/shared/maven-artifact-transfer/3.0.0-SNAPSHOT/maven-metadata.xml (805 B at 1.0 KB/sec)
[INFO]
[INFO] --- maven-clean-plugin:3.0.0:clean (default-clean) @ maven-javadoc-plugin ---
[INFO] Deleting <https://builds.apache.org/job/maven-plugins/org.apache.maven.plugins$maven-javadoc-plugin/ws/target>
[INFO]
[INFO] --- maven-enforcer-plugin:1.4.1:enforce (enforce-bytecode-version) @ maven-javadoc-plugin ---
[INFO]
[INFO] --- maven-enforcer-plugin:1.4.1:enforce (ban-known-bad-maven-versions) @ maven-javadoc-plugin ---
[INFO]
[INFO] --- maven-enforcer-plugin:1.4.1:enforce (ensure-no-container-api) @ maven-javadoc-plugin ---
[INFO]
[INFO] --- apache-rat-plugin:0.11:check (rat-check) @ maven-javadoc-plugin ---
[INFO] 51 implicit excludes (use -debug for more details).
[INFO] Exclude: DEPENDENCIES
[INFO] Exclude: **/*.psd
[INFO] Exclude: **/*.sha1
[INFO] Exclude: **/*package-list*
[INFO] Exclude: src/main/resources/org/apache/maven/plugin/javadoc/frame-injection-fix.txt
[INFO] Exclude: src/test/resources/unit/test-javadoc-test/junit/junit/3.8.1/junit-3.8.1.pom
[INFO] Exclude: javadoc-options-javadoc-resources.xml
[INFO] 536 resources included (use -debug for more details)
[INFO] Rat check: Summary of files. Unapproved: 0 unknown: 0 generated: 0 approved: 508 licence.
[INFO]
[INFO] --- maven-plugin-plugin:3.4:helpmojo (generate-helpmojo) @ maven-javadoc-plugin ---
[INFO] Using 'UTF-8' encoding to read mojo metadata.
[INFO] Mojo extractor with id: java-annotations found 0 mojo descriptors.
[INFO] Mojo extractor with id: java-javadoc found 0 mojo descriptors.
[INFO]
[INFO] --- modello-maven-plugin:1.8.1:java (default) @ maven-javadoc-plugin ---
[INFO] outputDirectory: <https://builds.apache.org/job/maven-plugins/org.apache.maven.plugins$maven-javadoc-plugin/ws/target/generated-sources/modello>
[INFO] Working on model: src/main/mdo/javadocOptions.mdo
[INFO] Generating current version: 1.1.0
[INFO]
[INFO] --- modello-maven-plugin:1.8.1:xpp3-reader (default) @ maven-javadoc-plugin ---
[INFO] outputDirectory: <https://builds.apache.org/job/maven-plugins/org.apache.maven.plugins$maven-javadoc-plugin/ws/target/generated-sources/modello>
[INFO] Working on model: src/main/mdo/javadocOptions.mdo
[INFO] Generating current version: 1.1.0
[INFO]
[INFO] --- modello-maven-plugin:1.8.1:xpp3-writer (default) @ maven-javadoc-plugin ---
[INFO] outputDirectory: <https://builds.apache.org/job/maven-plugins/org.apache.maven.plugins$maven-javadoc-plugin/ws/target/generated-sources/modello>
[INFO] Working on model: src/main/mdo/javadocOptions.mdo
[INFO] Generating current version: 1.1.0
[INFO]
[INFO] --- maven-remote-resources-plugin:1.5:process (process-resource-bundles) @ maven-javadoc-plugin ---
[INFO]
[INFO] --- maven-resources-plugin:2.7:resources (default-resources) @ maven-javadoc-plugin ---
[INFO] Using 'UTF-8' encoding to copy filtered resources.
[INFO] Copying 21 resources
[INFO] Copying 3 resources
[INFO]
[INFO] --- maven-compiler-plugin:3.5.1:compile (default-compile) @ maven-javadoc-plugin ---
[INFO] Changes detected - recompiling the module!
[INFO] Compiling 37 source files to <https://builds.apache.org/job/maven-plugins/org.apache.maven.plugins$maven-javadoc-plugin/ws/target/classes>
[INFO] <https://builds.apache.org/job/maven-plugins/org.apache.maven.plugins$maven-javadoc-plugin/ws/src/main/java/org/apache/maven/plugin/javadoc/JavadocUtil.java>: Some input files use or override a deprecated API.
[INFO] <https://builds.apache.org/job/maven-plugins/org.apache.maven.plugins$maven-javadoc-plugin/ws/src/main/java/org/apache/maven/plugin/javadoc/JavadocUtil.java>: Recompile with -Xlint:deprecation for details.
[INFO] <https://builds.apache.org/job/maven-plugins/org.apache.maven.plugins$maven-javadoc-plugin/ws/src/main/java/org/apache/maven/plugin/javadoc/AbstractJavadocMojo.java>: Some input files use unchecked or unsafe operations.
[INFO] <https://builds.apache.org/job/maven-plugins/org.apache.maven.plugins$maven-javadoc-plugin/ws/src/main/java/org/apache/maven/plugin/javadoc/AbstractJavadocMojo.java>: Recompile with -Xlint:unchecked for details.
[INFO]
[INFO] --- maven-plugin-plugin:3.4:descriptor (default-descriptor) @ maven-javadoc-plugin ---
[INFO] Using 'UTF-8' encoding to read mojo metadata.
[INFO] Mojo extractor with id: java-annotations found 15 mojo descriptors.
[INFO] Mojo extractor with id: java-javadoc found 0 mojo descriptors.
[INFO]
[INFO] --- plexus-component-metadata:1.7.1:generate-metadata (default) @ maven-javadoc-plugin ---
[INFO] Discovered 1 component descriptors(s)
[INFO]
[INFO] --- maven-resources-plugin:2.7:testResources (default-testResources) @ maven-javadoc-plugin ---
[INFO] Using 'UTF-8' encoding to copy filtered resources.
[INFO] Copying 192 resources
[INFO] Copying 3 resources
[INFO]
[INFO] --- maven-compiler-plugin:3.5.1:testCompile (default-testCompile) @ maven-javadoc-plugin ---
[INFO] Changes detected - recompiling the module!
[INFO] Compiling 50 source files to <https://builds.apache.org/job/maven-plugins/org.apache.maven.plugins$maven-javadoc-plugin/ws/target/test-classes>
[INFO] <https://builds.apache.org/job/maven-plugins/org.apache.maven.plugins$maven-javadoc-plugin/ws/src/test/java/org/apache/maven/plugin/javadoc/stubs/StylesheetFileMavenProjectStub.java>: Some input files use or override a deprecated API.
[INFO] <https://builds.apache.org/job/maven-plugins/org.apache.maven.plugins$maven-javadoc-plugin/ws/src/test/java/org/apache/maven/plugin/javadoc/stubs/StylesheetFileMavenProjectStub.java>: Recompile with -Xlint:deprecation for details.
[INFO] <https://builds.apache.org/job/maven-plugins/org.apache.maven.plugins$maven-javadoc-plugin/ws/src/test/java/org/apache/maven/plugin/javadoc/JavadocJarTest.java>: <https://builds.apache.org/job/maven-plugins/org.apache.maven.plugins$maven-javadoc-plugin/ws/src/test/java/org/apache/maven/plugin/javadoc/JavadocJarTest.java> uses unchecked or unsafe operations.
[INFO] <https://builds.apache.org/job/maven-plugins/org.apache.maven.plugins$maven-javadoc-plugin/ws/src/test/java/org/apache/maven/plugin/javadoc/JavadocJarTest.java>: Recompile with -Xlint:unchecked for details.
[INFO]
[INFO] --- plexus-component-metadata:1.7.1:generate-test-metadata (default) @ maven-javadoc-plugin ---
[INFO]
[INFO] --- maven-surefire-plugin:2.19.1:test (default-test) @ maven-javadoc-plugin ---
[INFO] Surefire report directory: <https://builds.apache.org/job/maven-plugins/org.apache.maven.plugins$maven-javadoc-plugin/ws/target/surefire-reports>

-------------------------------------------------------
 T E S T S
-------------------------------------------------------
Running org.apache.maven.plugin.javadoc.TestJavadocReportTest
Tests run: 1, Failures: 0, Errors: 0, Skipped: 0, Time elapsed: 5.515 sec - in org.apache.maven.plugin.javadoc.TestJavadocReportTest
Running org.apache.maven.plugin.javadoc.JavadocReportTest
[ERROR] ProjectBuildingException for Mock for Artifact, hashCode: 1687155254: Error resolving project artifact: Could not find artifact commons-logging:commons-logging:pom:1.1.1 for project null
SLF4J: Failed to load class "org.slf4j.impl.StaticLoggerBinder".
SLF4J: Defaulting to no-operation (NOP) logger implementation
SLF4J: See http://www.slf4j.org/codes.html#StaticLoggerBinder for further details.
[ERROR] ProjectBuildingException for Mock for Artifact, hashCode: 815779586: Error resolving project artifact: Could not find artifact commons-logging:commons-logging:pom:1.1.1 for project null
[ERROR] ProjectBuildingException for Mock for Artifact, hashCode: 222069631: Error resolving project artifact: Could not find artifact commons-logging:commons-logging:pom:1.1.1 for project null
[WARNING] Source files encoding has not been set, using platform encoding UTF-8, i.e. build is platform dependent!
[WARNING] Source files encoding has not been set, using platform encoding UTF-8, i.e. build is platform dependent!
[WARNING] Unsupported option <locale/> with variant 'fr_CA_wrong', trying to use <locale/> without variant, i.e. 'fr_CA'
[WARNING] Source files encoding has not been set, using platform encoding UTF-8, i.e. build is platform dependent!
[INFO]
1 warning
[WARNING] Javadoc Warnings
[WARNING] warning: [options] bootstrap class path not set in conjunction with -source 1.5
[INFO]
1 warning
[WARNING] Javadoc Warnings
[WARNING] warning: [options] bootstrap class path not set in conjunction with -source 1.6
[WARNING] Javadoc 1.4+ doesn't support the -1.1 switch anymore. Ignore this option.
Tests run: 22, Failures: 0, Errors: 0, Skipped: 0, Time elapsed: 78.636 sec - in org.apache.maven.plugin.javadoc.JavadocReportTest
Running org.apache.maven.plugin.javadoc.AbstractJavadocMojoTest
Tests run: 1, Failures: 0, Errors: 0, Skipped: 0, Time elapsed: 0.04 sec - in org.apache.maven.plugin.javadoc.AbstractJavadocMojoTest
Running org.apache.maven.plugin.javadoc.FixJavadocMojoTest
[INFO] Clirr output file was created: <https://builds.apache.org/job/maven-plugins/org.apache.maven.plugins$maven-javadoc-plugin/ws/target/test/unit/fix-test/target/clirr980838452.txt>
[INFO] Clirr found API differences, i.e. new classes/interfaces or methods.
[INFO] Saving changes to fix.test.InterfaceWithJavadoc
[INFO] Saving changes to fix.test.InterfaceWithNoJavadoc
[WARNING] Fixed unknown param 'str' defined in fix.test.ClassWithJavadoc#wrongJavadocTag(aString)
[WARNING] Fixed unknown param 'unused' defined in fix.test.ClassWithJavadoc#unusedTag()
[WARNING] Found unknown throws 'UnknownRuntimeException' defined on fix.test.ClassWithJavadoc#throwsTagWithUnknownRuntimeException()
[INFO] Saving changes to fix.test.ClassWithJavadoc
[INFO] Saving changes to fix.test.ClassWithNoJavadoc
[debug] Removing ' * @throws java.lang.Exception'; Throwable not specified by a.b.c.Clazz#method() and it is not a RuntimeException.
[warn] Ignoring unknown throws 'com.foo.FatalException' defined on a.b.c.Clazz#method()
[warn] Found unknown throws 'com.foo.FatalException' defined on a.b.c.Clazz#method()
[INFO] Clirr output file was created: <https://builds.apache.org/job/maven-plugins/org.apache.maven.plugins$maven-javadoc-plugin/ws/target/test/unit/fix-jdk5-test/target/clirr60329065.txt>
[INFO] Clirr found API differences, i.e. new classes/interfaces or methods.
[INFO] Saving changes to fix.test.ClassWithNoJavadoc
[INFO] Saving changes to fix.test.SubClassWithJavadoc
[WARNING] Fixed unknown param '<T>' defined in fix.test.ClassWithJavadoc#withGenericDoclet2(name)
[WARNING] Fixed unknown param '<U>' defined in fix.test.ClassWithJavadoc#withGenericDoclet2(name)
[INFO] Saving changes to fix.test.ClassWithJavadoc
[INFO] Saving changes to fix.test.InterfaceWithNoJavadoc
[INFO] Saving changes to fix.test.InterfaceWithJavadoc
[INFO] Clirr output file was created: <https://builds.apache.org/job/maven-plugins/org.apache.maven.plugins$maven-javadoc-plugin/ws/target/test/unit/fix-jdk6-test/target/clirr1894019423.txt>
[INFO] Clirr found API differences, i.e. new classes/interfaces or methods.
[INFO] Saving changes to fix.test.ClassWithJavadoc
[INFO] Saving changes to fix.test.InterfaceWithJavadoc
[warn] File encoding has not been set, using platform encoding UTF-8, i.e. build is platform dependent!
[warn] Unrecognized 'fake_value' for fixTags parameter. Ignored it!
Tests run: 11, Failures: 0, Errors: 0, Skipped: 0, Time elapsed: 50.221 sec - in org.apache.maven.plugin.javadoc.FixJavadocMojoTest
Running org.apache.maven.plugin.javadoc.AggregatorJavadocReportTest
[INFO]
1 warning
[WARNING] Javadoc Warnings
[WARNING] javadoc: warning - Multiple sources of package comments found for package "resources.test"
Tests run: 2, Failures: 0, Errors: 0, Skipped: 0, Time elapsed: 5.529 sec - in org.apache.maven.plugin.javadoc.AggregatorJavadocReportTest
Running org.apache.maven.plugin.javadoc.JavadocVersionTest
Tests run: 1, Failures: 0, Errors: 0, Skipped: 0, Time elapsed: 0.053 sec - in org.apache.maven.plugin.javadoc.JavadocVersionTest
Running org.apache.maven.plugin.javadoc.JavadocUtilTest
Tests run: 8, Failures: 0, Errors: 0, Skipped: 0, Time elapsed: 6.448 sec - in org.apache.maven.plugin.javadoc.JavadocUtilTest
Running org.apache.maven.plugin.javadoc.JavadocJarTest
[INFO] Building jar: <https://builds.apache.org/job/maven-plugins/org.apache.maven.plugins$maven-javadoc-plugin/ws/target/test/unit/javadocjar-default/target/javadocjar-default-javadoc.jar>
[INFO]
1 error
[ERROR] MavenReportException: Error while generating Javadoc:
Exit code: 1 - <https://builds.apache.org/job/maven-plugins/org.apache.maven.plugins$maven-javadoc-plugin/ws/src/test/resources/unit/javadocjar-failonerror/javadocjar/def/package.html>: error - Body tag missing from HTML file

Command line was: /usr/local/asfpackages/java/jdk1.7.0_80/jre/../bin/javadoc @options @argfile

Refer to the generated Javadoc files in '<https://builds.apache.org/job/maven-plugins/org.apache.maven.plugins$maven-javadoc-plugin/ws/target/test/unit/javadocjar-failonerror/target/site/apidocs'> dir.

org.apache.maven.reporting.MavenReportException:
Exit code: 1 - <https://builds.apache.org/job/maven-plugins/org.apache.maven.plugins$maven-javadoc-plugin/ws/src/test/resources/unit/javadocjar-failonerror/javadocjar/def/package.html>: error - Body tag missing from HTML file

Command line was: /usr/local/asfpackages/java/jdk1.7.0_80/jre/../bin/javadoc @options @argfile

Refer to the generated Javadoc files in '<https://builds.apache.org/job/maven-plugins/org.apache.maven.plugins$maven-javadoc-plugin/ws/target/test/unit/javadocjar-failonerror/target/site/apidocs'> dir.

        at org.apache.maven.plugin.javadoc.AbstractJavadocMojo.executeJavadocCommandLine(AbstractJavadocMojo.java:5156)
        at org.apache.maven.plugin.javadoc.AbstractJavadocMojo.executeReport(AbstractJavadocMojo.java:2119)
        at org.apache.maven.plugin.javadoc.JavadocJar.doExecute(JavadocJar.java:188)
        at org.apache.maven.plugin.javadoc.AbstractJavadocMojo.execute(AbstractJavadocMojo.java:1915)
        at org.apache.maven.plugin.javadoc.JavadocJarTest.testContinueIfFailOnErrorIsFalse(JavadocJarTest.java:149)
        at sun.reflect.NativeMethodAccessorImpl.invoke0(Native Method)
        at sun.reflect.NativeMethodAccessorImpl.invoke(NativeMethodAccessorImpl.java:57)
        at sun.reflect.DelegatingMethodAccessorImpl.invoke(DelegatingMethodAccessorImpl.java:43)
        at java.lang.reflect.Method.invoke(Method.java:606)
        at junit.framework.TestCase.runTest(TestCase.java:176)
        at junit.framework.TestCase.runBare(TestCase.java:141)
        at junit.framework.TestResult$1.protect(TestResult.java:122)
        at junit.framework.TestResult.runProtected(TestResult.java:142)
        at junit.framework.TestResult.run(TestResult.java:125)
        at junit.framework.TestCase.run(TestCase.java:129)
        at junit.framework.TestSuite.runTest(TestSuite.java:252)
        at junit.framework.TestSuite.run(TestSuite.java:247)
        at org.junit.internal.runners.JUnit38ClassRunner.run(JUnit38ClassRunner.java:86)
        at org.apache.maven.surefire.junit4.JUnit4Provider.execute(JUnit4Provider.java:367)
        at org.apache.maven.surefire.junit4.JUnit4Provider.executeWithRerun(JUnit4Provider.java:274)
        at org.apache.maven.surefire.junit4.JUnit4Provider.executeTestSet(JUnit4Provider.java:238)
        at org.apache.maven.surefire.junit4.JUnit4Provider.invoke(JUnit4Provider.java:161)
        at org.apache.maven.surefire.booter.ForkedBooter.invokeProviderInSameClassLoader(ForkedBooter.java:290)
        at org.apache.maven.surefire.booter.ForkedBooter.runSuitesInProcess(ForkedBooter.java:242)
        at org.apache.maven.surefire.booter.ForkedBooter.main(ForkedBooter.java:121)
[INFO] Building jar: <https://builds.apache.org/job/maven-plugins/org.apache.maven.plugins$maven-javadoc-plugin/ws/target/test/unit/javadocjar-failonerror/target/javadocjar-failonerror-javadoc.jar>
[INFO] Building jar: <https://builds.apache.org/job/maven-plugins/org.apache.maven.plugins$maven-javadoc-plugin/ws/target/test/unit/javadocjar-archive-config/target/javadocjar-archive-config-javadoc.jar>
Tests run: 4, Failures: 0, Errors: 0, Skipped: 0, Time elapsed: 10.033 sec - in org.apache.maven.plugin.javadoc.JavadocJarTest
Running org.apache.maven.plugin.javadoc.AbstractFixJavadocMojoTest
Tests run: 10, Failures: 0, Errors: 0, Skipped: 0, Time elapsed: 0.15 sec - in org.apache.maven.plugin.javadoc.AbstractFixJavadocMojoTest

Results :

Tests run: 60, Failures: 0, Errors: 0, Skipped: 0

[JENKINS] Recording test results
[INFO]
[INFO] --- maven-jar-plugin:3.0.0:jar (default-jar) @ maven-javadoc-plugin ---
[INFO] Building jar: <https://builds.apache.org/job/maven-plugins/org.apache.maven.plugins$maven-javadoc-plugin/ws/target/maven-javadoc-plugin-3.0.0-SNAPSHOT.jar>
[INFO]
[INFO] --- maven-plugin-plugin:3.4:addPluginArtifactMetadata (default-addPluginArtifactMetadata) @ maven-javadoc-plugin ---
[INFO]
[INFO] --- maven-site-plugin:3.5.1:attach-descriptor (attach-descriptor) @ maven-javadoc-plugin ---
[INFO]
[INFO] --- maven-checkstyle-plugin:2.15:check (checkstyle-check) @ maven-javadoc-plugin ---
[INFO] There are 4 errors reported by Checkstyle 6.1.1 with config/maven_checks.xml ruleset.
[ERROR] src/main/java/org/apache/maven/plugin/javadoc/JavadocVersion.java[53:45] (blocks) LeftCurly: '{' should be on a new line.
[INFO] Ignored 3 errors, 1 violation remaining.
Reply | Threaded
Open this post in threaded view
|  
Report Content as Inappropriate

Build failed in Jenkins: maven-plugins » Apache Maven Javadoc Plugin #9025

Apache Jenkins Server-2
See <https://builds.apache.org/job/maven-plugins/org.apache.maven.plugins$maven-javadoc-plugin/9025/display/redirect?page=changes>

Changes:

[Robert Scholte] [MJAVADOC-485] Upgrade to commons-lang3
Use own JavadocVersion for comparison

------------------------------------------
[INFO]                                                                        
[INFO] ------------------------------------------------------------------------
[INFO] Building Apache Maven Javadoc Plugin 3.0.0-SNAPSHOT
[INFO] ------------------------------------------------------------------------
[INFO] Downloading: http://repository.apache.org/snapshots/org/apache/maven/shared/maven-artifact-transfer/3.0.0-SNAPSHOT/maven-metadata.xml
[INFO] Downloaded: http://repository.apache.org/snapshots/org/apache/maven/shared/maven-artifact-transfer/3.0.0-SNAPSHOT/maven-metadata.xml (805 B at 1.0 KB/sec)
[INFO]
[INFO] --- maven-clean-plugin:3.0.0:clean (default-clean) @ maven-javadoc-plugin ---
[INFO] Deleting <https://builds.apache.org/job/maven-plugins/org.apache.maven.plugins$maven-javadoc-plugin/ws/target>
[INFO]
[INFO] --- maven-enforcer-plugin:1.4.1:enforce (enforce-bytecode-version) @ maven-javadoc-plugin ---
[INFO]
[INFO] --- maven-enforcer-plugin:1.4.1:enforce (ban-known-bad-maven-versions) @ maven-javadoc-plugin ---
[INFO]
[INFO] --- maven-enforcer-plugin:1.4.1:enforce (ensure-no-container-api) @ maven-javadoc-plugin ---
[INFO]
[INFO] --- apache-rat-plugin:0.11:check (rat-check) @ maven-javadoc-plugin ---
[INFO] 51 implicit excludes (use -debug for more details).
[INFO] Exclude: DEPENDENCIES
[INFO] Exclude: **/*.psd
[INFO] Exclude: **/*.sha1
[INFO] Exclude: **/*package-list*
[INFO] Exclude: src/main/resources/org/apache/maven/plugin/javadoc/frame-injection-fix.txt
[INFO] Exclude: src/test/resources/unit/test-javadoc-test/junit/junit/3.8.1/junit-3.8.1.pom
[INFO] Exclude: javadoc-options-javadoc-resources.xml
[INFO] 536 resources included (use -debug for more details)
[INFO] Rat check: Summary of files. Unapproved: 0 unknown: 0 generated: 0 approved: 508 licence.
[INFO]
[INFO] --- maven-plugin-plugin:3.4:helpmojo (generate-helpmojo) @ maven-javadoc-plugin ---
[INFO] Using 'UTF-8' encoding to read mojo metadata.
[INFO] Mojo extractor with id: java-annotations found 0 mojo descriptors.
[INFO] Mojo extractor with id: java-javadoc found 0 mojo descriptors.
[INFO]
[INFO] --- modello-maven-plugin:1.8.1:java (default) @ maven-javadoc-plugin ---
[INFO] outputDirectory: <https://builds.apache.org/job/maven-plugins/org.apache.maven.plugins$maven-javadoc-plugin/ws/target/generated-sources/modello>
[INFO] Working on model: src/main/mdo/javadocOptions.mdo
[INFO] Generating current version: 1.1.0
[INFO]
[INFO] --- modello-maven-plugin:1.8.1:xpp3-reader (default) @ maven-javadoc-plugin ---
[INFO] outputDirectory: <https://builds.apache.org/job/maven-plugins/org.apache.maven.plugins$maven-javadoc-plugin/ws/target/generated-sources/modello>
[INFO] Working on model: src/main/mdo/javadocOptions.mdo
[INFO] Generating current version: 1.1.0
[INFO]
[INFO] --- modello-maven-plugin:1.8.1:xpp3-writer (default) @ maven-javadoc-plugin ---
[INFO] outputDirectory: <https://builds.apache.org/job/maven-plugins/org.apache.maven.plugins$maven-javadoc-plugin/ws/target/generated-sources/modello>
[INFO] Working on model: src/main/mdo/javadocOptions.mdo
[INFO] Generating current version: 1.1.0
[INFO]
[INFO] --- maven-remote-resources-plugin:1.5:process (process-resource-bundles) @ maven-javadoc-plugin ---
[INFO]
[INFO] --- maven-resources-plugin:2.7:resources (default-resources) @ maven-javadoc-plugin ---
[INFO] Using 'UTF-8' encoding to copy filtered resources.
[INFO] Copying 21 resources
[INFO] Copying 3 resources
[INFO]
[INFO] --- maven-compiler-plugin:3.5.1:compile (default-compile) @ maven-javadoc-plugin ---
[INFO] Changes detected - recompiling the module!
[INFO] Compiling 37 source files to <https://builds.apache.org/job/maven-plugins/org.apache.maven.plugins$maven-javadoc-plugin/ws/target/classes>
[INFO] <https://builds.apache.org/job/maven-plugins/org.apache.maven.plugins$maven-javadoc-plugin/ws/src/main/java/org/apache/maven/plugin/javadoc/JavadocUtil.java>: Some input files use or override a deprecated API.
[INFO] <https://builds.apache.org/job/maven-plugins/org.apache.maven.plugins$maven-javadoc-plugin/ws/src/main/java/org/apache/maven/plugin/javadoc/JavadocUtil.java>: Recompile with -Xlint:deprecation for details.
[INFO] <https://builds.apache.org/job/maven-plugins/org.apache.maven.plugins$maven-javadoc-plugin/ws/src/main/java/org/apache/maven/plugin/javadoc/AbstractJavadocMojo.java>: Some input files use unchecked or unsafe operations.
[INFO] <https://builds.apache.org/job/maven-plugins/org.apache.maven.plugins$maven-javadoc-plugin/ws/src/main/java/org/apache/maven/plugin/javadoc/AbstractJavadocMojo.java>: Recompile with -Xlint:unchecked for details.
[INFO]
[INFO] --- maven-plugin-plugin:3.4:descriptor (default-descriptor) @ maven-javadoc-plugin ---
[INFO] Using 'UTF-8' encoding to read mojo metadata.
[INFO] Mojo extractor with id: java-annotations found 15 mojo descriptors.
[INFO] Mojo extractor with id: java-javadoc found 0 mojo descriptors.
Loading...