Build failed in Jenkins: maven-plugins #9049

Previous Topic Next Topic
 
classic Classic list List threaded Threaded
2 messages Options
Reply | Threaded
Open this post in threaded view
|  
Report Content as Inappropriate

Build failed in Jenkins: maven-plugins #9049

Apache Jenkins Server-2
See <https://builds.apache.org/job/maven-plugins/9049/display/redirect>

------------------------------------------
[...truncated 15.21 KB...]
        at java.util.concurrent.ThreadPoolExecutor$Worker.run(ThreadPoolExecutor.java:617)
        at java.lang.Thread.run(Thread.java:748)
Caused by: java.net.UnknownHostException: svn.apache.org: Temporary failure in name resolution
        at java.net.Inet6AddressImpl.lookupAllHostAddr(Native Method)
        at java.net.InetAddress$2.lookupAllHostAddr(InetAddress.java:928)
        at java.net.InetAddress.getAddressesFromNameService(InetAddress.java:1323)
        at java.net.InetAddress.getAllByName0(InetAddress.java:1276)
        at java.net.InetAddress.getAllByName(InetAddress.java:1192)
        at java.net.InetAddress.getAllByName(InetAddress.java:1126)
        at java.net.InetAddress.getByName(InetAddress.java:1076)
        at org.tmatesoft.svn.core.internal.util.SVNSocketFactory.createAddres(SVNSocketFactory.java:205)
        at org.tmatesoft.svn.core.internal.util.SVNSocketFactory.createPlainSocket(SVNSocketFactory.java:66)
        at org.tmatesoft.svn.core.internal.io.dav.http.HTTPConnection.connect(HTTPConnection.java:275)
        at org.tmatesoft.svn.core.internal.io.dav.http.HTTPConnection.request(HTTPConnection.java:454)
        ... 34 more
java.net.UnknownHostException: svn.apache.org: Temporary failure in name resolution
        at java.net.Inet6AddressImpl.lookupAllHostAddr(Native Method)
        at java.net.InetAddress$2.lookupAllHostAddr(InetAddress.java:928)
        at java.net.InetAddress.getAddressesFromNameService(InetAddress.java:1323)
        at java.net.InetAddress.getAllByName0(InetAddress.java:1276)
        at java.net.InetAddress.getAllByName(InetAddress.java:1192)
        at java.net.InetAddress.getAllByName(InetAddress.java:1126)
        at java.net.InetAddress.getByName(InetAddress.java:1076)
        at org.tmatesoft.svn.core.internal.util.SVNSocketFactory.createAddres(SVNSocketFactory.java:205)
        at org.tmatesoft.svn.core.internal.util.SVNSocketFactory.createPlainSocket(SVNSocketFactory.java:66)
        at org.tmatesoft.svn.core.internal.io.dav.http.HTTPConnection.connect(HTTPConnection.java:275)
        at org.tmatesoft.svn.core.internal.io.dav.http.HTTPConnection.request(HTTPConnection.java:454)
Caused: org.tmatesoft.svn.core.SVNException: svn: E175002: unknown host
svn: E175002: OPTIONS request failed on '/repos/asf/maven/plugins/trunk'
        at org.tmatesoft.svn.core.internal.wc.SVNErrorManager.error(SVNErrorManager.java:112)
        at org.tmatesoft.svn.core.internal.wc.SVNErrorManager.error(SVNErrorManager.java:96)
        at org.tmatesoft.svn.core.internal.io.dav.http.HTTPConnection.request(HTTPConnection.java:803)
        at org.tmatesoft.svn.core.internal.io.dav.http.HTTPConnection.request(HTTPConnection.java:391)
        at org.tmatesoft.svn.core.internal.io.dav.http.HTTPConnection.request(HTTPConnection.java:379)
        at org.tmatesoft.svn.core.internal.io.dav.DAVConnection.performHttpRequest(DAVConnection.java:862)
        at org.tmatesoft.svn.core.internal.io.dav.DAVConnection.exchangeCapabilities(DAVConnection.java:698)
        at org.tmatesoft.svn.core.internal.io.dav.DAVConnection.open(DAVConnection.java:118)
        at org.tmatesoft.svn.core.internal.io.dav.DAVRepository.openConnection(DAVRepository.java:1049)
        at org.tmatesoft.svn.core.internal.io.dav.DAVRepository.getLatestRevision(DAVRepository.java:189)
        at org.tmatesoft.svn.core.internal.wc2.ng.SvnNgRepositoryAccess.getRevisionNumber(SvnNgRepositoryAccess.java:119)
        at org.tmatesoft.svn.core.internal.wc2.SvnRepositoryAccess.getLocations(SvnRepositoryAccess.java:195)
        at org.tmatesoft.svn.core.internal.wc2.ng.SvnNgRepositoryAccess.createRepositoryFor(SvnNgRepositoryAccess.java:46)
        at org.tmatesoft.svn.core.internal.wc2.ng.SvnNgAbstractUpdate.checkout(SvnNgAbstractUpdate.java:815)
        at org.tmatesoft.svn.core.internal.wc2.ng.SvnNgCheckout.run(SvnNgCheckout.java:26)
        at org.tmatesoft.svn.core.internal.wc2.ng.SvnNgCheckout.run(SvnNgCheckout.java:11)
        at org.tmatesoft.svn.core.internal.wc2.ng.SvnNgOperationRunner.run(SvnNgOperationRunner.java:20)
        at org.tmatesoft.svn.core.internal.wc2.SvnOperationRunner.run(SvnOperationRunner.java:21)
        at org.tmatesoft.svn.core.wc2.SvnOperationFactory.run(SvnOperationFactory.java:1235)
        at org.tmatesoft.svn.core.wc2.SvnOperation.run(SvnOperation.java:294)
        at hudson.scm.subversion.CheckoutUpdater$1.perform(CheckoutUpdater.java:119)
        at hudson.scm.subversion.WorkspaceUpdater$UpdateTask.delegateTo(WorkspaceUpdater.java:162)
        at hudson.scm.subversion.WorkspaceUpdater$UpdateTask.delegateTo(WorkspaceUpdater.java:170)
        at hudson.scm.subversion.UpdateUpdater$TaskImpl.perform(UpdateUpdater.java:134)
        at hudson.scm.subversion.WorkspaceUpdater$UpdateTask.delegateTo(WorkspaceUpdater.java:162)
        at hudson.scm.SubversionSCM$CheckOutTask.perform(SubversionSCM.java:1001)
        at hudson.scm.SubversionSCM$CheckOutTask.invoke(SubversionSCM.java:977)
        at hudson.scm.SubversionSCM$CheckOutTask.invoke(SubversionSCM.java:953)
        at hudson.FilePath$FileCallableWrapper.call(FilePath.java:2739)
        at hudson.remoting.UserRequest.perform(UserRequest.java:153)
        at hudson.remoting.UserRequest.perform(UserRequest.java:50)
        at hudson.remoting.Request$2.run(Request.java:336)
        at hudson.remoting.InterceptingExecutorService$1.call(InterceptingExecutorService.java:68)
        at java.util.concurrent.FutureTask.run(FutureTask.java:266)
        at java.util.concurrent.ThreadPoolExecutor.runWorker(ThreadPoolExecutor.java:1142)
        at java.util.concurrent.ThreadPoolExecutor$Worker.run(ThreadPoolExecutor.java:617)
        at java.lang.Thread.run(Thread.java:748)
Caused: java.io.IOException: Failed to check out http://svn.apache.org/repos/asf/maven/plugins/trunk
        at hudson.scm.subversion.CheckoutUpdater$1.perform(CheckoutUpdater.java:130)
        at hudson.scm.subversion.WorkspaceUpdater$UpdateTask.delegateTo(WorkspaceUpdater.java:162)
        at hudson.scm.subversion.WorkspaceUpdater$UpdateTask.delegateTo(WorkspaceUpdater.java:170)
        at hudson.scm.subversion.UpdateUpdater$TaskImpl.perform(UpdateUpdater.java:134)
        at hudson.scm.subversion.WorkspaceUpdater$UpdateTask.delegateTo(WorkspaceUpdater.java:162)
        at hudson.scm.SubversionSCM$CheckOutTask.perform(SubversionSCM.java:1001)
        at hudson.scm.SubversionSCM$CheckOutTask.invoke(SubversionSCM.java:977)
        at hudson.scm.SubversionSCM$CheckOutTask.invoke(SubversionSCM.java:953)
        at hudson.FilePath$FileCallableWrapper.call(FilePath.java:2739)
        at hudson.remoting.UserRequest.perform(UserRequest.java:153)
        at hudson.remoting.UserRequest.perform(UserRequest.java:50)
        at hudson.remoting.Request$2.run(Request.java:336)
        at hudson.remoting.InterceptingExecutorService$1.call(InterceptingExecutorService.java:68)
        at java.util.concurrent.FutureTask.run(FutureTask.java:266)
        at java.util.concurrent.ThreadPoolExecutor.runWorker(ThreadPoolExecutor.java:1142)
        at java.util.concurrent.ThreadPoolExecutor$Worker.run(ThreadPoolExecutor.java:617)
        at java.lang.Thread.run(Thread.java:748)
        at ......remote call to cassandra12(Native Method)
        at hudson.remoting.Channel.attachCallSiteStackTrace(Channel.java:1545)
        at hudson.remoting.UserResponse.retrieve(UserRequest.java:253)
        at hudson.remoting.Channel.call(Channel.java:830)
        at hudson.FilePath.act(FilePath.java:986)
Caused: java.io.IOException: remote file operation failed: <https://builds.apache.org/job/maven-plugins/ws/> at hudson.remoting.Channel@293897fd:cassandra12
        at hudson.FilePath.act(FilePath.java:993)
        at hudson.FilePath.act(FilePath.java:975)
        at hudson.scm.SubversionSCM.checkout(SubversionSCM.java:902)
        at hudson.scm.SubversionSCM.checkout(SubversionSCM.java:838)
        at hudson.scm.SCM.checkout(SCM.java:495)
        at hudson.model.AbstractProject.checkout(AbstractProject.java:1276)
        at hudson.model.AbstractBuild$AbstractBuildExecution.defaultCheckout(AbstractBuild.java:560)
        at jenkins.scm.SCMCheckoutStrategy.checkout(SCMCheckoutStrategy.java:86)
        at hudson.model.AbstractBuild$AbstractBuildExecution.run(AbstractBuild.java:485)
        at hudson.model.Run.execute(Run.java:1735)
        at hudson.maven.MavenModuleSetBuild.run(MavenModuleSetBuild.java:542)
        at hudson.model.ResourceController.execute(ResourceController.java:97)
        at hudson.model.Executor.run(Executor.java:405)
Retrying after 10 seconds
Checking out a fresh workspace because there's no workspace at <https://builds.apache.org/job/maven-plugins/ws/>
Cleaning local Directory .
Checking out http://svn.apache.org/repos/asf/maven/plugins/trunk at revision '2017-07-25T23:26:15.488 +0000'
ERROR: Failed to check out http://svn.apache.org/repos/asf/maven/plugins/trunk
org.tmatesoft.svn.core.SVNException: svn: E175002: unknown host
svn: E175002: OPTIONS request failed on '/repos/asf/maven/plugins/trunk'
        at org.tmatesoft.svn.core.internal.wc.SVNErrorManager.error(SVNErrorManager.java:112)
        at org.tmatesoft.svn.core.internal.wc.SVNErrorManager.error(SVNErrorManager.java:96)
        at org.tmatesoft.svn.core.internal.io.dav.http.HTTPConnection.request(HTTPConnection.java:803)
        at org.tmatesoft.svn.core.internal.io.dav.http.HTTPConnection.request(HTTPConnection.java:391)
        at org.tmatesoft.svn.core.internal.io.dav.http.HTTPConnection.request(HTTPConnection.java:379)
        at org.tmatesoft.svn.core.internal.io.dav.DAVConnection.performHttpRequest(DAVConnection.java:862)
        at org.tmatesoft.svn.core.internal.io.dav.DAVConnection.exchangeCapabilities(DAVConnection.java:698)
        at org.tmatesoft.svn.core.internal.io.dav.DAVConnection.open(DAVConnection.java:118)
        at org.tmatesoft.svn.core.internal.io.dav.DAVRepository.openConnection(DAVRepository.java:1049)
        at org.tmatesoft.svn.core.internal.io.dav.DAVRepository.getLatestRevision(DAVRepository.java:189)
        at org.tmatesoft.svn.core.internal.wc2.ng.SvnNgRepositoryAccess.getRevisionNumber(SvnNgRepositoryAccess.java:119)
        at org.tmatesoft.svn.core.internal.wc2.SvnRepositoryAccess.getLocations(SvnRepositoryAccess.java:195)
        at org.tmatesoft.svn.core.internal.wc2.ng.SvnNgRepositoryAccess.createRepositoryFor(SvnNgRepositoryAccess.java:46)
        at org.tmatesoft.svn.core.internal.wc2.ng.SvnNgAbstractUpdate.checkout(SvnNgAbstractUpdate.java:815)
        at org.tmatesoft.svn.core.internal.wc2.ng.SvnNgCheckout.run(SvnNgCheckout.java:26)
        at org.tmatesoft.svn.core.internal.wc2.ng.SvnNgCheckout.run(SvnNgCheckout.java:11)
        at org.tmatesoft.svn.core.internal.wc2.ng.SvnNgOperationRunner.run(SvnNgOperationRunner.java:20)
        at org.tmatesoft.svn.core.internal.wc2.SvnOperationRunner.run(SvnOperationRunner.java:21)
        at org.tmatesoft.svn.core.wc2.SvnOperationFactory.run(SvnOperationFactory.java:1235)
        at org.tmatesoft.svn.core.wc2.SvnOperation.run(SvnOperation.java:294)
        at hudson.scm.subversion.CheckoutUpdater$1.perform(CheckoutUpdater.java:119)
        at hudson.scm.subversion.WorkspaceUpdater$UpdateTask.delegateTo(WorkspaceUpdater.java:162)
        at hudson.scm.subversion.WorkspaceUpdater$UpdateTask.delegateTo(WorkspaceUpdater.java:170)
        at hudson.scm.subversion.UpdateUpdater$TaskImpl.perform(UpdateUpdater.java:134)
        at hudson.scm.subversion.WorkspaceUpdater$UpdateTask.delegateTo(WorkspaceUpdater.java:162)
        at hudson.scm.SubversionSCM$CheckOutTask.perform(SubversionSCM.java:1001)
        at hudson.scm.SubversionSCM$CheckOutTask.invoke(SubversionSCM.java:977)
        at hudson.scm.SubversionSCM$CheckOutTask.invoke(SubversionSCM.java:953)
        at hudson.FilePath$FileCallableWrapper.call(FilePath.java:2739)
        at hudson.remoting.UserRequest.perform(UserRequest.java:153)
        at hudson.remoting.UserRequest.perform(UserRequest.java:50)
        at hudson.remoting.Request$2.run(Request.java:336)
        at hudson.remoting.InterceptingExecutorService$1.call(InterceptingExecutorService.java:68)
        at java.util.concurrent.FutureTask.run(FutureTask.java:266)
        at java.util.concurrent.ThreadPoolExecutor.runWorker(ThreadPoolExecutor.java:1142)
        at java.util.concurrent.ThreadPoolExecutor$Worker.run(ThreadPoolExecutor.java:617)
        at java.lang.Thread.run(Thread.java:748)
Caused by: java.net.UnknownHostException: svn.apache.org: Temporary failure in name resolution
        at java.net.Inet6AddressImpl.lookupAllHostAddr(Native Method)
        at java.net.InetAddress$2.lookupAllHostAddr(InetAddress.java:928)
        at java.net.InetAddress.getAddressesFromNameService(InetAddress.java:1323)
        at java.net.InetAddress.getAllByName0(InetAddress.java:1276)
        at java.net.InetAddress.getAllByName(InetAddress.java:1192)
        at java.net.InetAddress.getAllByName(InetAddress.java:1126)
        at java.net.InetAddress.getByName(InetAddress.java:1076)
        at org.tmatesoft.svn.core.internal.util.SVNSocketFactory.createAddres(SVNSocketFactory.java:205)
        at org.tmatesoft.svn.core.internal.util.SVNSocketFactory.createPlainSocket(SVNSocketFactory.java:66)
        at org.tmatesoft.svn.core.internal.io.dav.http.HTTPConnection.connect(HTTPConnection.java:275)
        at org.tmatesoft.svn.core.internal.io.dav.http.HTTPConnection.request(HTTPConnection.java:454)
        ... 34 more
java.net.UnknownHostException: svn.apache.org: Temporary failure in name resolution
        at java.net.Inet6AddressImpl.lookupAllHostAddr(Native Method)
        at java.net.InetAddress$2.lookupAllHostAddr(InetAddress.java:928)
        at java.net.InetAddress.getAddressesFromNameService(InetAddress.java:1323)
        at java.net.InetAddress.getAllByName0(InetAddress.java:1276)
        at java.net.InetAddress.getAllByName(InetAddress.java:1192)
        at java.net.InetAddress.getAllByName(InetAddress.java:1126)
        at java.net.InetAddress.getByName(InetAddress.java:1076)
        at org.tmatesoft.svn.core.internal.util.SVNSocketFactory.createAddres(SVNSocketFactory.java:205)
        at org.tmatesoft.svn.core.internal.util.SVNSocketFactory.createPlainSocket(SVNSocketFactory.java:66)
        at org.tmatesoft.svn.core.internal.io.dav.http.HTTPConnection.connect(HTTPConnection.java:275)
        at org.tmatesoft.svn.core.internal.io.dav.http.HTTPConnection.request(HTTPConnection.java:454)
Caused: org.tmatesoft.svn.core.SVNException: svn: E175002: unknown host
svn: E175002: OPTIONS request failed on '/repos/asf/maven/plugins/trunk'
        at org.tmatesoft.svn.core.internal.wc.SVNErrorManager.error(SVNErrorManager.java:112)
        at org.tmatesoft.svn.core.internal.wc.SVNErrorManager.error(SVNErrorManager.java:96)
        at org.tmatesoft.svn.core.internal.io.dav.http.HTTPConnection.request(HTTPConnection.java:803)
        at org.tmatesoft.svn.core.internal.io.dav.http.HTTPConnection.request(HTTPConnection.java:391)
        at org.tmatesoft.svn.core.internal.io.dav.http.HTTPConnection.request(HTTPConnection.java:379)
        at org.tmatesoft.svn.core.internal.io.dav.DAVConnection.performHttpRequest(DAVConnection.java:862)
        at org.tmatesoft.svn.core.internal.io.dav.DAVConnection.exchangeCapabilities(DAVConnection.java:698)
        at org.tmatesoft.svn.core.internal.io.dav.DAVConnection.open(DAVConnection.java:118)
        at org.tmatesoft.svn.core.internal.io.dav.DAVRepository.openConnection(DAVRepository.java:1049)
        at org.tmatesoft.svn.core.internal.io.dav.DAVRepository.getLatestRevision(DAVRepository.java:189)
        at org.tmatesoft.svn.core.internal.wc2.ng.SvnNgRepositoryAccess.getRevisionNumber(SvnNgRepositoryAccess.java:119)
        at org.tmatesoft.svn.core.internal.wc2.SvnRepositoryAccess.getLocations(SvnRepositoryAccess.java:195)
        at org.tmatesoft.svn.core.internal.wc2.ng.SvnNgRepositoryAccess.createRepositoryFor(SvnNgRepositoryAccess.java:46)
        at org.tmatesoft.svn.core.internal.wc2.ng.SvnNgAbstractUpdate.checkout(SvnNgAbstractUpdate.java:815)
        at org.tmatesoft.svn.core.internal.wc2.ng.SvnNgCheckout.run(SvnNgCheckout.java:26)
        at org.tmatesoft.svn.core.internal.wc2.ng.SvnNgCheckout.run(SvnNgCheckout.java:11)
        at org.tmatesoft.svn.core.internal.wc2.ng.SvnNgOperationRunner.run(SvnNgOperationRunner.java:20)
        at org.tmatesoft.svn.core.internal.wc2.SvnOperationRunner.run(SvnOperationRunner.java:21)
        at org.tmatesoft.svn.core.wc2.SvnOperationFactory.run(SvnOperationFactory.java:1235)
        at org.tmatesoft.svn.core.wc2.SvnOperation.run(SvnOperation.java:294)
        at hudson.scm.subversion.CheckoutUpdater$1.perform(CheckoutUpdater.java:119)
        at hudson.scm.subversion.WorkspaceUpdater$UpdateTask.delegateTo(WorkspaceUpdater.java:162)
        at hudson.scm.subversion.WorkspaceUpdater$UpdateTask.delegateTo(WorkspaceUpdater.java:170)
        at hudson.scm.subversion.UpdateUpdater$TaskImpl.perform(UpdateUpdater.java:134)
        at hudson.scm.subversion.WorkspaceUpdater$UpdateTask.delegateTo(WorkspaceUpdater.java:162)
        at hudson.scm.SubversionSCM$CheckOutTask.perform(SubversionSCM.java:1001)
        at hudson.scm.SubversionSCM$CheckOutTask.invoke(SubversionSCM.java:977)
        at hudson.scm.SubversionSCM$CheckOutTask.invoke(SubversionSCM.java:953)
        at hudson.FilePath$FileCallableWrapper.call(FilePath.java:2739)
        at hudson.remoting.UserRequest.perform(UserRequest.java:153)
        at hudson.remoting.UserRequest.perform(UserRequest.java:50)
        at hudson.remoting.Request$2.run(Request.java:336)
        at hudson.remoting.InterceptingExecutorService$1.call(InterceptingExecutorService.java:68)
        at java.util.concurrent.FutureTask.run(FutureTask.java:266)
        at java.util.concurrent.ThreadPoolExecutor.runWorker(ThreadPoolExecutor.java:1142)
        at java.util.concurrent.ThreadPoolExecutor$Worker.run(ThreadPoolExecutor.java:617)
        at java.lang.Thread.run(Thread.java:748)
Caused: java.io.IOException: Failed to check out http://svn.apache.org/repos/asf/maven/plugins/trunk
        at hudson.scm.subversion.CheckoutUpdater$1.perform(CheckoutUpdater.java:130)
        at hudson.scm.subversion.WorkspaceUpdater$UpdateTask.delegateTo(WorkspaceUpdater.java:162)
        at hudson.scm.subversion.WorkspaceUpdater$UpdateTask.delegateTo(WorkspaceUpdater.java:170)
        at hudson.scm.subversion.UpdateUpdater$TaskImpl.perform(UpdateUpdater.java:134)
        at hudson.scm.subversion.WorkspaceUpdater$UpdateTask.delegateTo(WorkspaceUpdater.java:162)
        at hudson.scm.SubversionSCM$CheckOutTask.perform(SubversionSCM.java:1001)
        at hudson.scm.SubversionSCM$CheckOutTask.invoke(SubversionSCM.java:977)
        at hudson.scm.SubversionSCM$CheckOutTask.invoke(SubversionSCM.java:953)
        at hudson.FilePath$FileCallableWrapper.call(FilePath.java:2739)
        at hudson.remoting.UserRequest.perform(UserRequest.java:153)
        at hudson.remoting.UserRequest.perform(UserRequest.java:50)
        at hudson.remoting.Request$2.run(Request.java:336)
        at hudson.remoting.InterceptingExecutorService$1.call(InterceptingExecutorService.java:68)
        at java.util.concurrent.FutureTask.run(FutureTask.java:266)
        at java.util.concurrent.ThreadPoolExecutor.runWorker(ThreadPoolExecutor.java:1142)
        at java.util.concurrent.ThreadPoolExecutor$Worker.run(ThreadPoolExecutor.java:617)
        at java.lang.Thread.run(Thread.java:748)
        at ......remote call to cassandra12(Native Method)
        at hudson.remoting.Channel.attachCallSiteStackTrace(Channel.java:1545)
        at hudson.remoting.UserResponse.retrieve(UserRequest.java:253)
        at hudson.remoting.Channel.call(Channel.java:830)
        at hudson.FilePath.act(FilePath.java:986)
Caused: java.io.IOException: remote file operation failed: <https://builds.apache.org/job/maven-plugins/ws/> at hudson.remoting.Channel@293897fd:cassandra12
        at hudson.FilePath.act(FilePath.java:993)
        at hudson.FilePath.act(FilePath.java:975)
        at hudson.scm.SubversionSCM.checkout(SubversionSCM.java:902)
        at hudson.scm.SubversionSCM.checkout(SubversionSCM.java:838)
        at hudson.scm.SCM.checkout(SCM.java:495)
        at hudson.model.AbstractProject.checkout(AbstractProject.java:1276)
        at hudson.model.AbstractBuild$AbstractBuildExecution.defaultCheckout(AbstractBuild.java:560)
        at jenkins.scm.SCMCheckoutStrategy.checkout(SCMCheckoutStrategy.java:86)
        at hudson.model.AbstractBuild$AbstractBuildExecution.run(AbstractBuild.java:485)
        at hudson.model.Run.execute(Run.java:1735)
        at hudson.maven.MavenModuleSetBuild.run(MavenModuleSetBuild.java:542)
        at hudson.model.ResourceController.execute(ResourceController.java:97)
        at hudson.model.Executor.run(Executor.java:405)
[WARNINGS] Skipping publisher since build result is FAILURE
Reply | Threaded
Open this post in threaded view
|  
Report Content as Inappropriate

Jenkins build is back to normal : maven-plugins #9050

Apache Jenkins Server-2
Loading...