Build failed in Jenkins: maven-plugins #8897

Previous Topic Next Topic
 
classic Classic list List threaded Threaded
2 messages Options
Reply | Threaded
Open this post in threaded view
|

Build failed in Jenkins: maven-plugins #8897

Apache Jenkins Server-2
See <https://builds.apache.org/job/maven-plugins/8897/display/redirect>

------------------------------------------
[...truncated 544.12 KB...]
[INFO] Building Apache Maven Plugins Aggregator 1-SNAPSHOT
[INFO] ------------------------------------------------------------------------
[INFO]
[INFO] --- maven-clean-plugin:2.5:clean (default-clean) @ maven-plugins-aggregator ---
[INFO] Deleting <https://builds.apache.org/job/maven-plugins/ws/target>
[INFO]
[INFO] --- maven-enforcer-plugin:1.3.1:enforce (enforce-bytecode-version) @ maven-plugins-aggregator ---
[INFO]
[INFO] --- maven-enforcer-plugin:1.3.1:enforce (ban-known-bad-maven-versions) @ maven-plugins-aggregator ---
[INFO]
[INFO] --- maven-remote-resources-plugin:1.5:process (default) @ maven-plugins-aggregator ---
[INFO]
[INFO] --- maven-site-plugin:3.3:attach-descriptor (attach-descriptor) @ maven-plugins-aggregator ---
[INFO]
[INFO] --- maven-install-plugin:2.5.1:install (default-install) @ maven-plugins-aggregator ---
[INFO] Installing <https://builds.apache.org/job/maven-plugins/ws/pom.xml> to /home/jenkins/jenkins-slave/maven-repositories/0/org/apache/maven/plugins/maven-plugins-aggregator/1-SNAPSHOT/maven-plugins-aggregator-1-SNAPSHOT.pom
[INFO] ------------------------------------------------------------------------
[INFO] Reactor Summary:
[INFO]
[INFO] Apache Maven ACR Plugin ............................ SUCCESS [ 28.059 s]
[INFO] Apache Maven AntRun Plugin ......................... SUCCESS [  7.687 s]
[INFO] Apache Maven Changelog Plugin ...................... SUCCESS [ 49.061 s]
[INFO] Apache Maven Changes Plugin ........................ SUCCESS [ 29.427 s]
[INFO] Apache Maven Clean Plugin .......................... SUCCESS [  8.938 s]
[INFO] Apache Maven Compiler Plugin ....................... SUCCESS [ 17.475 s]
[INFO] Apache Maven Deploy Plugin ......................... SUCCESS [ 12.410 s]
[INFO] Apache Maven Documentation Checker Plugin .......... SUCCESS [  4.184 s]
[INFO] Apache Maven EAR Plugin ............................ SUCCESS [ 11.394 s]
[INFO] Apache Maven EJB Plugin ............................ SUCCESS [ 15.963 s]
[INFO] Apache Maven Help Plugin ........................... SUCCESS [ 15.572 s]
[INFO] Apache Maven Install Plugin ........................ SUCCESS [ 10.442 s]
[INFO] Apache Maven Jarsigner Plugin ...................... SUCCESS [  5.284 s]
[INFO] Apache Maven Javadoc Plugin ........................ FAILURE [09:35 min]
[INFO] Apache Maven JDeps Plugin .......................... SUCCESS [  7.530 s]
[INFO] Apache Maven Linkcheck Plugin ...................... SUCCESS [  9.040 s]
[INFO] Apache Maven Patch Plugin .......................... SUCCESS [  3.943 s]
[INFO] Apache Maven PDF Plugin ............................ SUCCESS [ 18.732 s]
[INFO] Apache Maven RAR Plugin ............................ SUCCESS [ 11.729 s]
[INFO] Apache Maven Repository Plugin ..................... SUCCESS [  7.516 s]
[INFO] Apache Maven Resources Plugin ...................... SUCCESS [ 11.817 s]
[INFO] Apache Maven Site Plugin ........................... SUCCESS [ 15.125 s]
[INFO] Apache Maven Source Plugin ......................... SUCCESS [  8.859 s]
[INFO] Apache Maven Stage Plugin .......................... SUCCESS [  4.523 s]
[INFO] Apache Maven Toolchains Plugin ..................... SUCCESS [  3.792 s]
[INFO] Apache Maven Verifier Plugin ....................... SUCCESS [  4.949 s]
[INFO] Apache Maven WAR Plugin ............................ SUCCESS [ 20.886 s]
[INFO] Apache Maven DOAP Plugin ........................... SUCCESS [  8.336 s]
[INFO] Apache Maven Invoker Plugin ........................ SUCCESS [ 14.221 s]
[INFO] Apache Maven JAR Plugin ............................ SUCCESS [  7.501 s]
[INFO] Apache Maven Checkstyle Plugin ..................... FAILURE [  3.925 s]
[INFO] Apache Maven PMD Plugin ............................ SUCCESS [ 24.169 s]
[INFO] Apache Maven Project Info Reports Plugin ........... SUCCESS [ 32.026 s]
[INFO] Apache Maven Remote Resources Plugin ............... SUCCESS [ 12.101 s]
[INFO] Apache Maven Shade Plugin .......................... SUCCESS [ 17.692 s]
[INFO] Apache Maven SCM Publish Plugin .................... SUCCESS [ 11.069 s]
[INFO] Apache Maven Assembly Plugin ....................... SUCCESS [ 25.653 s]
[INFO] Apache Maven Dependency Plugin ..................... SUCCESS [01:17 min]
[INFO] Apache Maven GPG Plugin ............................ SUCCESS [  5.165 s]
[INFO] Apache Maven Plugins Aggregator .................... SUCCESS [  2.173 s]
[INFO] ------------------------------------------------------------------------
[INFO] BUILD FAILURE
[INFO] ------------------------------------------------------------------------
[INFO] Total time: 20:30 min
[INFO] Finished at: 2017-02-27T19:03:48+00:00
[INFO] Final Memory: 161M/783M
[INFO] ------------------------------------------------------------------------
[ERROR] Failed to execute goal org.apache.maven.plugins:maven-surefire-plugin:2.19.1:test (default-test) on project maven-javadoc-plugin: Execution default-test of goal org.apache.maven.plugins:maven-surefire-plugin:2.19.1:test failed: The forked VM terminated without properly saying goodbye. VM crash or System.exit called?
[ERROR] Command was /bin/sh -c cd <https://builds.apache.org/job/maven-plugins/ws/maven-javadoc-plugin> && /usr/local/asfpackages/java/jdk1.7.0_80/jre/bin/java -jar <https://builds.apache.org/job/maven-plugins/ws/maven-javadoc-plugin/target/surefire/surefirebooter1633814508518826795.jar> <https://builds.apache.org/job/maven-plugins/ws/maven-javadoc-plugin/target/surefire/surefire5878334434262083588tmp> <https://builds.apache.org/job/maven-plugins/ws/maven-javadoc-plugin/target/surefire/surefire_96502412331044732331tmp>
[ERROR] -> [Help 1]
org.apache.maven.lifecycle.LifecycleExecutionException: Failed to execute goal org.apache.maven.plugins:maven-surefire-plugin:2.19.1:test (default-test) on project maven-javadoc-plugin: Execution default-test of goal org.apache.maven.plugins:maven-surefire-plugin:2.19.1:test failed: The forked VM terminated without properly saying goodbye. VM crash or System.exit called?
Command was /bin/sh -c cd <https://builds.apache.org/job/maven-plugins/ws/maven-javadoc-plugin> && /usr/local/asfpackages/java/jdk1.7.0_80/jre/bin/java -jar <https://builds.apache.org/job/maven-plugins/ws/maven-javadoc-plugin/target/surefire/surefirebooter1633814508518826795.jar> <https://builds.apache.org/job/maven-plugins/ws/maven-javadoc-plugin/target/surefire/surefire5878334434262083588tmp> <https://builds.apache.org/job/maven-plugins/ws/maven-javadoc-plugin/target/surefire/surefire_96502412331044732331tmp>
        at org.apache.maven.lifecycle.internal.MojoExecutor.execute(MojoExecutor.java:212)
        at org.apache.maven.lifecycle.internal.MojoExecutor.execute(MojoExecutor.java:153)
        at org.apache.maven.lifecycle.internal.MojoExecutor.execute(MojoExecutor.java:145)
        at org.apache.maven.lifecycle.internal.LifecycleModuleBuilder.buildProject(LifecycleModuleBuilder.java:116)
        at org.apache.maven.lifecycle.internal.LifecycleModuleBuilder.buildProject(LifecycleModuleBuilder.java:80)
        at org.apache.maven.lifecycle.internal.builder.singlethreaded.SingleThreadedBuilder.build(SingleThreadedBuilder.java:51)
        at org.apache.maven.lifecycle.internal.LifecycleStarter.execute(LifecycleStarter.java:128)
        at org.apache.maven.DefaultMaven.doExecute(DefaultMaven.java:307)
        at org.apache.maven.DefaultMaven.doExecute(DefaultMaven.java:193)
        at org.apache.maven.DefaultMaven.execute(DefaultMaven.java:106)
        at org.jvnet.hudson.maven3.launcher.Maven33Launcher.main(Maven33Launcher.java:129)
        at sun.reflect.NativeMethodAccessorImpl.invoke0(Native Method)
        at sun.reflect.NativeMethodAccessorImpl.invoke(NativeMethodAccessorImpl.java:57)
        at sun.reflect.DelegatingMethodAccessorImpl.invoke(DelegatingMethodAccessorImpl.java:43)
        at java.lang.reflect.Method.invoke(Method.java:606)
        at org.codehaus.plexus.classworlds.launcher.Launcher.launchStandard(Launcher.java:330)
        at org.codehaus.plexus.classworlds.launcher.Launcher.launch(Launcher.java:238)
        at jenkins.maven3.agent.Maven33Main.launch(Maven33Main.java:176)
        at sun.reflect.NativeMethodAccessorImpl.invoke0(Native Method)
        at sun.reflect.NativeMethodAccessorImpl.invoke(NativeMethodAccessorImpl.java:57)
        at sun.reflect.DelegatingMethodAccessorImpl.invoke(DelegatingMethodAccessorImpl.java:43)
        at java.lang.reflect.Method.invoke(Method.java:606)
        at hudson.maven.Maven3Builder.call(Maven3Builder.java:139)
        at hudson.maven.Maven3Builder.call(Maven3Builder.java:70)
        at hudson.remoting.UserRequest.perform(UserRequest.java:153)
        at hudson.remoting.UserRequest.perform(UserRequest.java:50)
        at hudson.remoting.Request$2.run(Request.java:336)
        at hudson.remoting.InterceptingExecutorService$1.call(InterceptingExecutorService.java:68)
        at java.util.concurrent.FutureTask.run(FutureTask.java:262)
        at java.util.concurrent.ThreadPoolExecutor.runWorker(ThreadPoolExecutor.java:1145)
        at java.util.concurrent.ThreadPoolExecutor$Worker.run(ThreadPoolExecutor.java:615)
        at java.lang.Thread.run(Thread.java:745)
Caused by: org.apache.maven.plugin.PluginExecutionException: Execution default-test of goal org.apache.maven.plugins:maven-surefire-plugin:2.19.1:test failed: The forked VM terminated without properly saying goodbye. VM crash or System.exit called?
Command was /bin/sh -c cd <https://builds.apache.org/job/maven-plugins/ws/maven-javadoc-plugin> && /usr/local/asfpackages/java/jdk1.7.0_80/jre/bin/java -jar <https://builds.apache.org/job/maven-plugins/ws/maven-javadoc-plugin/target/surefire/surefirebooter1633814508518826795.jar> <https://builds.apache.org/job/maven-plugins/ws/maven-javadoc-plugin/target/surefire/surefire5878334434262083588tmp> <https://builds.apache.org/job/maven-plugins/ws/maven-javadoc-plugin/target/surefire/surefire_96502412331044732331tmp>
        at org.apache.maven.plugin.DefaultBuildPluginManager.executeMojo(DefaultBuildPluginManager.java:145)
        at org.apache.maven.lifecycle.internal.MojoExecutor.execute(MojoExecutor.java:207)
        ... 31 more
Caused by: java.lang.RuntimeException: The forked VM terminated without properly saying goodbye. VM crash or System.exit called?
Command was /bin/sh -c cd <https://builds.apache.org/job/maven-plugins/ws/maven-javadoc-plugin> && /usr/local/asfpackages/java/jdk1.7.0_80/jre/bin/java -jar <https://builds.apache.org/job/maven-plugins/ws/maven-javadoc-plugin/target/surefire/surefirebooter1633814508518826795.jar> <https://builds.apache.org/job/maven-plugins/ws/maven-javadoc-plugin/target/surefire/surefire5878334434262083588tmp> <https://builds.apache.org/job/maven-plugins/ws/maven-javadoc-plugin/target/surefire/surefire_96502412331044732331tmp>
        at org.apache.maven.plugin.surefire.booterclient.ForkStarter.fork(ForkStarter.java:590)
        at org.apache.maven.plugin.surefire.booterclient.ForkStarter.fork(ForkStarter.java:460)
        at org.apache.maven.plugin.surefire.booterclient.ForkStarter.run(ForkStarter.java:229)
        at org.apache.maven.plugin.surefire.booterclient.ForkStarter.run(ForkStarter.java:201)
        at org.apache.maven.plugin.surefire.AbstractSurefireMojo.executeProvider(AbstractSurefireMojo.java:1026)
        at org.apache.maven.plugin.surefire.AbstractSurefireMojo.executeAfterPreconditionsChecked(AbstractSurefireMojo.java:862)
        at org.apache.maven.plugin.surefire.AbstractSurefireMojo.execute(AbstractSurefireMojo.java:755)
        at org.apache.maven.plugin.DefaultBuildPluginManager.executeMojo(DefaultBuildPluginManager.java:134)
        ... 32 more
[ERROR] Failed to execute goal org.apache.rat:apache-rat-plugin:0.11:check (rat-check) on project maven-checkstyle-plugin: Too many files with unapproved license: 1 See RAT report in: <https://builds.apache.org/job/maven-plugins/ws/maven-checkstyle-plugin/target/rat.txt> -> [Help 2]
org.apache.maven.lifecycle.LifecycleExecutionException: Failed to execute goal org.apache.rat:apache-rat-plugin:0.11:check (rat-check) on project maven-checkstyle-plugin: Too many files with unapproved license: 1 See RAT report in: <https://builds.apache.org/job/maven-plugins/ws/maven-checkstyle-plugin/target/rat.txt>
        at org.apache.maven.lifecycle.internal.MojoExecutor.execute(MojoExecutor.java:212)
        at org.apache.maven.lifecycle.internal.MojoExecutor.execute(MojoExecutor.java:153)
        at org.apache.maven.lifecycle.internal.MojoExecutor.execute(MojoExecutor.java:145)
        at org.apache.maven.lifecycle.internal.LifecycleModuleBuilder.buildProject(LifecycleModuleBuilder.java:116)
        at org.apache.maven.lifecycle.internal.LifecycleModuleBuilder.buildProject(LifecycleModuleBuilder.java:80)
        at org.apache.maven.lifecycle.internal.builder.singlethreaded.SingleThreadedBuilder.build(SingleThreadedBuilder.java:51)
        at org.apache.maven.lifecycle.internal.LifecycleStarter.execute(LifecycleStarter.java:128)
        at org.apache.maven.DefaultMaven.doExecute(DefaultMaven.java:307)
        at org.apache.maven.DefaultMaven.doExecute(DefaultMaven.java:193)
        at org.apache.maven.DefaultMaven.execute(DefaultMaven.java:106)
        at org.jvnet.hudson.maven3.launcher.Maven33Launcher.main(Maven33Launcher.java:129)
        at sun.reflect.NativeMethodAccessorImpl.invoke0(Native Method)
        at sun.reflect.NativeMethodAccessorImpl.invoke(NativeMethodAccessorImpl.java:57)
        at sun.reflect.DelegatingMethodAccessorImpl.invoke(DelegatingMethodAccessorImpl.java:43)
        at java.lang.reflect.Method.invoke(Method.java:606)
        at org.codehaus.plexus.classworlds.launcher.Launcher.launchStandard(Launcher.java:330)
        at org.codehaus.plexus.classworlds.launcher.Launcher.launch(Launcher.java:238)
        at jenkins.maven3.agent.Maven33Main.launch(Maven33Main.java:176)
        at sun.reflect.NativeMethodAccessorImpl.invoke0(Native Method)
        at sun.reflect.NativeMethodAccessorImpl.invoke(NativeMethodAccessorImpl.java:57)
        at sun.reflect.DelegatingMethodAccessorImpl.invoke(DelegatingMethodAccessorImpl.java:43)
        at java.lang.reflect.Method.invoke(Method.java:606)
        at hudson.maven.Maven3Builder.call(Maven3Builder.java:139)
        at hudson.maven.Maven3Builder.call(Maven3Builder.java:70)
        at hudson.remoting.UserRequest.perform(UserRequest.java:153)
        at hudson.remoting.UserRequest.perform(UserRequest.java:50)
        at hudson.remoting.Request$2.run(Request.java:336)
        at hudson.remoting.InterceptingExecutorService$1.call(InterceptingExecutorService.java:68)
        at java.util.concurrent.FutureTask.run(FutureTask.java:262)
        at java.util.concurrent.ThreadPoolExecutor.runWorker(ThreadPoolExecutor.java:1145)
        at java.util.concurrent.ThreadPoolExecutor$Worker.run(ThreadPoolExecutor.java:615)
        at java.lang.Thread.run(Thread.java:745)
Caused by: org.apache.rat.mp.RatCheckException: Too many files with unapproved license: 1 See RAT report in: <https://builds.apache.org/job/maven-plugins/ws/maven-checkstyle-plugin/target/rat.txt>
        at org.apache.rat.mp.RatCheckMojo.check(RatCheckMojo.java:194)
        at org.apache.rat.mp.RatCheckMojo.execute(RatCheckMojo.java:182)
        at org.apache.maven.plugin.DefaultBuildPluginManager.executeMojo(DefaultBuildPluginManager.java:134)
        at org.apache.maven.lifecycle.internal.MojoExecutor.execute(MojoExecutor.java:207)
        ... 31 more
[ERROR]
[ERROR] Re-run Maven using the -X switch to enable full debug logging.
[ERROR]
[ERROR] For more information about the errors and possible solutions, please read the following articles:
[ERROR] [Help 1] http://cwiki.apache.org/confluence/display/MAVEN/PluginExecutionException
[ERROR] [Help 2] http://cwiki.apache.org/confluence/display/MAVEN/MojoFailureException
[ERROR]
[ERROR] After correcting the problems, you can resume the build with the command
[ERROR]   mvn <goals> -rf :maven-javadoc-plugin
[JENKINS] Archiving <https://builds.apache.org/job/maven-plugins/ws/maven-antrun-plugin/pom.xml> to org.apache.maven.plugins/maven-antrun-plugin/1.9-SNAPSHOT/maven-antrun-plugin-1.9-SNAPSHOT.pom
[JENKINS] Archiving <https://builds.apache.org/job/maven-plugins/ws/maven-antrun-plugin/target/maven-antrun-plugin-1.9-SNAPSHOT.jar> to org.apache.maven.plugins/maven-antrun-plugin/1.9-SNAPSHOT/maven-antrun-plugin-1.9-SNAPSHOT.jar
[JENKINS] Archiving <https://builds.apache.org/job/maven-plugins/ws/maven-linkcheck-plugin/pom.xml> to org.apache.maven.plugins/maven-linkcheck-plugin/1.3-SNAPSHOT/maven-linkcheck-plugin-1.3-SNAPSHOT.pom
[JENKINS] Archiving <https://builds.apache.org/job/maven-plugins/ws/maven-linkcheck-plugin/target/maven-linkcheck-plugin-1.3-SNAPSHOT.jar> to org.apache.maven.plugins/maven-linkcheck-plugin/1.3-SNAPSHOT/maven-linkcheck-plugin-1.3-SNAPSHOT.jar
[JENKINS] Archiving <https://builds.apache.org/job/maven-plugins/ws/maven-scm-publish-plugin/pom.xml> to org.apache.maven.plugins/maven-scm-publish-plugin/1.2-SNAPSHOT/maven-scm-publish-plugin-1.2-SNAPSHOT.pom
[JENKINS] Archiving <https://builds.apache.org/job/maven-plugins/ws/maven-scm-publish-plugin/target/maven-scm-publish-plugin-1.2-SNAPSHOT.jar> to org.apache.maven.plugins/maven-scm-publish-plugin/1.2-SNAPSHOT/maven-scm-publish-plugin-1.2-SNAPSHOT.jar
[JENKINS] Archiving <https://builds.apache.org/job/maven-plugins/ws/maven-acr-plugin/pom.xml> to org.apache.maven.plugins/maven-acr-plugin/3.0.1-SNAPSHOT/maven-acr-plugin-3.0.1-SNAPSHOT.pom
[JENKINS] Archiving <https://builds.apache.org/job/maven-plugins/ws/maven-acr-plugin/target/maven-acr-plugin-3.0.1-SNAPSHOT.jar> to org.apache.maven.plugins/maven-acr-plugin/3.0.1-SNAPSHOT/maven-acr-plugin-3.0.1-SNAPSHOT.jar
[JENKINS] Archiving <https://builds.apache.org/job/maven-plugins/ws/maven-install-plugin/pom.xml> to org.apache.maven.plugins/maven-install-plugin/3.0.0-SNAPSHOT/maven-install-plugin-3.0.0-SNAPSHOT.pom
[JENKINS] Archiving <https://builds.apache.org/job/maven-plugins/ws/maven-install-plugin/target/maven-install-plugin-3.0.0-SNAPSHOT.jar> to org.apache.maven.plugins/maven-install-plugin/3.0.0-SNAPSHOT/maven-install-plugin-3.0.0-SNAPSHOT.jar
[JENKINS] Archiving <https://builds.apache.org/job/maven-plugins/ws/maven-assembly-plugin/pom.xml> to org.apache.maven.plugins/maven-assembly-plugin/3.0.1-SNAPSHOT/maven-assembly-plugin-3.0.1-SNAPSHOT.pom
[JENKINS] Archiving <https://builds.apache.org/job/maven-plugins/ws/maven-assembly-plugin/target/maven-assembly-plugin-3.0.1-SNAPSHOT.jar> to org.apache.maven.plugins/maven-assembly-plugin/3.0.1-SNAPSHOT/maven-assembly-plugin-3.0.1-SNAPSHOT.jar
[JENKINS] Archiving <https://builds.apache.org/job/maven-plugins/ws/maven-docck-plugin/pom.xml> to org.apache.maven.plugins/maven-docck-plugin/1.2-SNAPSHOT/maven-docck-plugin-1.2-SNAPSHOT.pom
[JENKINS] Archiving <https://builds.apache.org/job/maven-plugins/ws/maven-docck-plugin/target/maven-docck-plugin-1.2-SNAPSHOT.jar> to org.apache.maven.plugins/maven-docck-plugin/1.2-SNAPSHOT/maven-docck-plugin-1.2-SNAPSHOT.jar
[JENKINS] Archiving <https://builds.apache.org/job/maven-plugins/ws/pom.xml> to org.apache.maven.plugins/maven-plugins-aggregator/1-SNAPSHOT/maven-plugins-aggregator-1-SNAPSHOT.pom
[JENKINS] Archiving <https://builds.apache.org/job/maven-plugins/ws/maven-clean-plugin/pom.xml> to org.apache.maven.plugins/maven-clean-plugin/3.0.1-SNAPSHOT/maven-clean-plugin-3.0.1-SNAPSHOT.pom
[JENKINS] Archiving <https://builds.apache.org/job/maven-plugins/ws/maven-clean-plugin/target/maven-clean-plugin-3.0.1-SNAPSHOT.jar> to org.apache.maven.plugins/maven-clean-plugin/3.0.1-SNAPSHOT/maven-clean-plugin-3.0.1-SNAPSHOT.jar
[JENKINS] Archiving <https://builds.apache.org/job/maven-plugins/ws/maven-resources-plugin/pom.xml> to org.apache.maven.plugins/maven-resources-plugin/3.0.3-SNAPSHOT/maven-resources-plugin-3.0.3-SNAPSHOT.pom
[JENKINS] Archiving <https://builds.apache.org/job/maven-plugins/ws/maven-resources-plugin/target/maven-resources-plugin-3.0.3-SNAPSHOT.jar> to org.apache.maven.plugins/maven-resources-plugin/3.0.3-SNAPSHOT/maven-resources-plugin-3.0.3-SNAPSHOT.jar
[JENKINS] Archiving <https://builds.apache.org/job/maven-plugins/ws/maven-pmd-plugin/pom.xml> to org.apache.maven.plugins/maven-pmd-plugin/3.8-SNAPSHOT/maven-pmd-plugin-3.8-SNAPSHOT.pom
[JENKINS] Archiving <https://builds.apache.org/job/maven-plugins/ws/maven-pmd-plugin/target/maven-pmd-plugin-3.8-SNAPSHOT.jar> to org.apache.maven.plugins/maven-pmd-plugin/3.8-SNAPSHOT/maven-pmd-plugin-3.8-SNAPSHOT.jar
[JENKINS] Archiving <https://builds.apache.org/job/maven-plugins/ws/maven-shade-plugin/pom.xml> to org.apache.maven.plugins/maven-shade-plugin/3.0.1-SNAPSHOT/maven-shade-plugin-3.0.1-SNAPSHOT.pom
[JENKINS] Archiving <https://builds.apache.org/job/maven-plugins/ws/maven-shade-plugin/target/maven-shade-plugin-3.0.1-SNAPSHOT.jar> to org.apache.maven.plugins/maven-shade-plugin/3.0.1-SNAPSHOT/maven-shade-plugin-3.0.1-SNAPSHOT.jar
[JENKINS] Archiving <https://builds.apache.org/job/maven-plugins/ws/maven-toolchains-plugin/pom.xml> to org.apache.maven.plugins/maven-toolchains-plugin/3.0.0-SNAPSHOT/maven-toolchains-plugin-3.0.0-SNAPSHOT.pom
[JENKINS] Archiving <https://builds.apache.org/job/maven-plugins/ws/maven-toolchains-plugin/target/maven-toolchains-plugin-3.0.0-SNAPSHOT.jar> to org.apache.maven.plugins/maven-toolchains-plugin/3.0.0-SNAPSHOT/maven-toolchains-plugin-3.0.0-SNAPSHOT.jar
[JENKINS] Archiving <https://builds.apache.org/job/maven-plugins/ws/maven-remote-resources-plugin/pom.xml> to org.apache.maven.plugins/maven-remote-resources-plugin/1.6-SNAPSHOT/maven-remote-resources-plugin-1.6-SNAPSHOT.pom
[JENKINS] Archiving <https://builds.apache.org/job/maven-plugins/ws/maven-remote-resources-plugin/target/maven-remote-resources-plugin-1.6-SNAPSHOT.jar> to org.apache.maven.plugins/maven-remote-resources-plugin/1.6-SNAPSHOT/maven-remote-resources-plugin-1.6-SNAPSHOT.jar
[JENKINS] Archiving <https://builds.apache.org/job/maven-plugins/ws/maven-project-info-reports-plugin/pom.xml> to org.apache.maven.plugins/maven-project-info-reports-plugin/2.10-SNAPSHOT/maven-project-info-reports-plugin-2.10-SNAPSHOT.pom
[JENKINS] Archiving <https://builds.apache.org/job/maven-plugins/ws/maven-project-info-reports-plugin/target/maven-project-info-reports-plugin-2.10-SNAPSHOT.jar> to org.apache.maven.plugins/maven-project-info-reports-plugin/2.10-SNAPSHOT/maven-project-info-reports-plugin-2.10-SNAPSHOT.jar
[JENKINS] Archiving <https://builds.apache.org/job/maven-plugins/ws/maven-patch-plugin/pom.xml> to org.apache.maven.plugins/maven-patch-plugin/1.3-SNAPSHOT/maven-patch-plugin-1.3-SNAPSHOT.pom
[JENKINS] Archiving <https://builds.apache.org/job/maven-plugins/ws/maven-patch-plugin/target/maven-patch-plugin-1.3-SNAPSHOT.jar> to org.apache.maven.plugins/maven-patch-plugin/1.3-SNAPSHOT/maven-patch-plugin-1.3-SNAPSHOT.jar
[JENKINS] Archiving <https://builds.apache.org/job/maven-plugins/ws/maven-compiler-plugin/pom.xml> to org.apache.maven.plugins/maven-compiler-plugin/3.6.2-SNAPSHOT/maven-compiler-plugin-3.6.2-SNAPSHOT.pom
[JENKINS] Archiving <https://builds.apache.org/job/maven-plugins/ws/maven-compiler-plugin/target/maven-compiler-plugin-3.6.2-SNAPSHOT.jar> to org.apache.maven.plugins/maven-compiler-plugin/3.6.2-SNAPSHOT/maven-compiler-plugin-3.6.2-SNAPSHOT.jar
[JENKINS] Archiving <https://builds.apache.org/job/maven-plugins/ws/maven-stage-plugin/pom.xml> to org.apache.maven.plugins/maven-stage-plugin/1.1-SNAPSHOT/maven-stage-plugin-1.1-SNAPSHOT.pom
[JENKINS] Archiving <https://builds.apache.org/job/maven-plugins/ws/maven-stage-plugin/target/maven-stage-plugin-1.1-SNAPSHOT.jar> to org.apache.maven.plugins/maven-stage-plugin/1.1-SNAPSHOT/maven-stage-plugin-1.1-SNAPSHOT.jar
[JENKINS] Archiving <https://builds.apache.org/job/maven-plugins/ws/maven-verifier-plugin/pom.xml> to org.apache.maven.plugins/maven-verifier-plugin/3.0.0-SNAPSHOT/maven-verifier-plugin-3.0.0-SNAPSHOT.pom
[JENKINS] Archiving <https://builds.apache.org/job/maven-plugins/ws/maven-verifier-plugin/target/maven-verifier-plugin-3.0.0-SNAPSHOT.jar> to org.apache.maven.plugins/maven-verifier-plugin/3.0.0-SNAPSHOT/maven-verifier-plugin-3.0.0-SNAPSHOT.jar
[JENKINS] Archiving <https://builds.apache.org/job/maven-plugins/ws/maven-jarsigner-plugin/pom.xml> to org.apache.maven.plugins/maven-jarsigner-plugin/1.5-SNAPSHOT/maven-jarsigner-plugin-1.5-SNAPSHOT.pom
[JENKINS] Archiving <https://builds.apache.org/job/maven-plugins/ws/maven-jarsigner-plugin/target/maven-jarsigner-plugin-1.5-SNAPSHOT.jar> to org.apache.maven.plugins/maven-jarsigner-plugin/1.5-SNAPSHOT/maven-jarsigner-plugin-1.5-SNAPSHOT.jar
[JENKINS] Archiving <https://builds.apache.org/job/maven-plugins/ws/maven-ejb-plugin/pom.xml> to org.apache.maven.plugins/maven-ejb-plugin/2.5.2-SNAPSHOT/maven-ejb-plugin-2.5.2-SNAPSHOT.pom
[JENKINS] Archiving <https://builds.apache.org/job/maven-plugins/ws/maven-ejb-plugin/target/maven-ejb-plugin-2.5.2-SNAPSHOT.jar> to org.apache.maven.plugins/maven-ejb-plugin/2.5.2-SNAPSHOT/maven-ejb-plugin-2.5.2-SNAPSHOT.jar
[JENKINS] Archiving <https://builds.apache.org/job/maven-plugins/ws/maven-changelog-plugin/pom.xml> to org.apache.maven.plugins/maven-changelog-plugin/2.4-SNAPSHOT/maven-changelog-plugin-2.4-SNAPSHOT.pom
[JENKINS] Archiving <https://builds.apache.org/job/maven-plugins/ws/maven-changelog-plugin/target/maven-changelog-plugin-2.4-SNAPSHOT.jar> to org.apache.maven.plugins/maven-changelog-plugin/2.4-SNAPSHOT/maven-changelog-plugin-2.4-SNAPSHOT.jar
[JENKINS] Archiving <https://builds.apache.org/job/maven-plugins/ws/maven-help-plugin/pom.xml> to org.apache.maven.plugins/maven-help-plugin/3.0.0-SNAPSHOT/maven-help-plugin-3.0.0-SNAPSHOT.pom
[JENKINS] Archiving <https://builds.apache.org/job/maven-plugins/ws/maven-help-plugin/target/maven-help-plugin-3.0.0-SNAPSHOT.jar> to org.apache.maven.plugins/maven-help-plugin/3.0.0-SNAPSHOT/maven-help-plugin-3.0.0-SNAPSHOT.jar
[JENKINS] Archiving <https://builds.apache.org/job/maven-plugins/ws/maven-war-plugin/pom.xml> to org.apache.maven.plugins/maven-war-plugin/3.1.0-SNAPSHOT/maven-war-plugin-3.1.0-SNAPSHOT.pom
[JENKINS] Archiving <https://builds.apache.org/job/maven-plugins/ws/maven-war-plugin/target/maven-war-plugin-3.1.0-SNAPSHOT.jar> to org.apache.maven.plugins/maven-war-plugin/3.1.0-SNAPSHOT/maven-war-plugin-3.1.0-SNAPSHOT.jar
[JENKINS] Archiving <https://builds.apache.org/job/maven-plugins/ws/maven-gpg-plugin/pom.xml> to org.apache.maven.plugins/maven-gpg-plugin/1.7-SNAPSHOT/maven-gpg-plugin-1.7-SNAPSHOT.pom
[JENKINS] Archiving <https://builds.apache.org/job/maven-plugins/ws/maven-gpg-plugin/target/maven-gpg-plugin-1.7-SNAPSHOT.jar> to org.apache.maven.plugins/maven-gpg-plugin/1.7-SNAPSHOT/maven-gpg-plugin-1.7-SNAPSHOT.jar
[JENKINS] Archiving <https://builds.apache.org/job/maven-plugins/ws/maven-ear-plugin/pom.xml> to org.apache.maven.plugins/maven-ear-plugin/3.0.0-SNAPSHOT/maven-ear-plugin-3.0.0-SNAPSHOT.pom
[JENKINS] Archiving <https://builds.apache.org/job/maven-plugins/ws/maven-ear-plugin/target/maven-ear-plugin-3.0.0-SNAPSHOT.jar> to org.apache.maven.plugins/maven-ear-plugin/3.0.0-SNAPSHOT/maven-ear-plugin-3.0.0-SNAPSHOT.jar
[JENKINS] Archiving <https://builds.apache.org/job/maven-plugins/ws/maven-invoker-plugin/pom.xml> to org.apache.maven.plugins/maven-invoker-plugin/3.0.0-SNAPSHOT/maven-invoker-plugin-3.0.0-SNAPSHOT.pom
[JENKINS] Archiving <https://builds.apache.org/job/maven-plugins/ws/maven-invoker-plugin/target/maven-invoker-plugin-3.0.0-SNAPSHOT.jar> to org.apache.maven.plugins/maven-invoker-plugin/3.0.0-SNAPSHOT/maven-invoker-plugin-3.0.0-SNAPSHOT.jar
[JENKINS] Archiving <https://builds.apache.org/job/maven-plugins/ws/maven-jdeps-plugin/pom.xml> to org.apache.maven.plugins/maven-jdeps-plugin/3.0.1-SNAPSHOT/maven-jdeps-plugin-3.0.1-SNAPSHOT.pom
[JENKINS] Archiving <https://builds.apache.org/job/maven-plugins/ws/maven-jdeps-plugin/target/maven-jdeps-plugin-3.0.1-SNAPSHOT.jar> to org.apache.maven.plugins/maven-jdeps-plugin/3.0.1-SNAPSHOT/maven-jdeps-plugin-3.0.1-SNAPSHOT.jar
[JENKINS] Archiving <https://builds.apache.org/job/maven-plugins/ws/maven-doap-plugin/pom.xml> to org.apache.maven.plugins/maven-doap-plugin/1.3-SNAPSHOT/maven-doap-plugin-1.3-SNAPSHOT.pom
[JENKINS] Archiving <https://builds.apache.org/job/maven-plugins/ws/maven-doap-plugin/target/maven-doap-plugin-1.3-SNAPSHOT.jar> to org.apache.maven.plugins/maven-doap-plugin/1.3-SNAPSHOT/maven-doap-plugin-1.3-SNAPSHOT.jar
[JENKINS] Archiving <https://builds.apache.org/job/maven-plugins/ws/maven-site-plugin/dependency-reduced-pom.xml> to org.apache.maven.plugins/maven-site-plugin/3.7-SNAPSHOT/maven-site-plugin-3.7-SNAPSHOT.pom
[JENKINS] Archiving <https://builds.apache.org/job/maven-plugins/ws/maven-site-plugin/target/maven-site-plugin-3.7-SNAPSHOT.jar> to org.apache.maven.plugins/maven-site-plugin/3.7-SNAPSHOT/maven-site-plugin-3.7-SNAPSHOT.jar
[JENKINS] Archiving <https://builds.apache.org/job/maven-plugins/ws/maven-changes-plugin/pom.xml> to org.apache.maven.plugins/maven-changes-plugin/3.0.0-SNAPSHOT/maven-changes-plugin-3.0.0-SNAPSHOT.pom
[JENKINS] Archiving <https://builds.apache.org/job/maven-plugins/ws/maven-changes-plugin/target/maven-changes-plugin-3.0.0-SNAPSHOT.jar> to org.apache.maven.plugins/maven-changes-plugin/3.0.0-SNAPSHOT/maven-changes-plugin-3.0.0-SNAPSHOT.jar
[JENKINS] Archiving <https://builds.apache.org/job/maven-plugins/ws/maven-deploy-plugin/pom.xml> to org.apache.maven.plugins/maven-deploy-plugin/3.0.0-SNAPSHOT/maven-deploy-plugin-3.0.0-SNAPSHOT.pom
[JENKINS] Archiving <https://builds.apache.org/job/maven-plugins/ws/maven-deploy-plugin/target/maven-deploy-plugin-3.0.0-SNAPSHOT.jar> to org.apache.maven.plugins/maven-deploy-plugin/3.0.0-SNAPSHOT/maven-deploy-plugin-3.0.0-SNAPSHOT.jar
[JENKINS] Archiving <https://builds.apache.org/job/maven-plugins/ws/maven-repository-plugin/pom.xml> to org.apache.maven.plugins/maven-repository-plugin/2.5-SNAPSHOT/maven-repository-plugin-2.5-SNAPSHOT.pom
[JENKINS] Archiving <https://builds.apache.org/job/maven-plugins/ws/maven-repository-plugin/target/maven-repository-plugin-2.5-SNAPSHOT.jar> to org.apache.maven.plugins/maven-repository-plugin/2.5-SNAPSHOT/maven-repository-plugin-2.5-SNAPSHOT.jar
[JENKINS] Archiving <https://builds.apache.org/job/maven-plugins/ws/maven-source-plugin/pom.xml> to org.apache.maven.plugins/maven-source-plugin/3.0.2-SNAPSHOT/maven-source-plugin-3.0.2-SNAPSHOT.pom
[JENKINS] Archiving <https://builds.apache.org/job/maven-plugins/ws/maven-source-plugin/target/maven-source-plugin-3.0.2-SNAPSHOT.jar> to org.apache.maven.plugins/maven-source-plugin/3.0.2-SNAPSHOT/maven-source-plugin-3.0.2-SNAPSHOT.jar
[JENKINS] Archiving <https://builds.apache.org/job/maven-plugins/ws/maven-pdf-plugin/pom.xml> to org.apache.maven.plugins/maven-pdf-plugin/1.4-SNAPSHOT/maven-pdf-plugin-1.4-SNAPSHOT.pom
[JENKINS] Archiving <https://builds.apache.org/job/maven-plugins/ws/maven-pdf-plugin/target/maven-pdf-plugin-1.4-SNAPSHOT.jar> to org.apache.maven.plugins/maven-pdf-plugin/1.4-SNAPSHOT/maven-pdf-plugin-1.4-SNAPSHOT.jar
[JENKINS] Archiving <https://builds.apache.org/job/maven-plugins/ws/maven-jar-plugin/pom.xml> to org.apache.maven.plugins/maven-jar-plugin/3.0.3-SNAPSHOT/maven-jar-plugin-3.0.3-SNAPSHOT.pom
[JENKINS] Archiving <https://builds.apache.org/job/maven-plugins/ws/maven-jar-plugin/target/maven-jar-plugin-3.0.3-SNAPSHOT.jar> to org.apache.maven.plugins/maven-jar-plugin/3.0.3-SNAPSHOT/maven-jar-plugin-3.0.3-SNAPSHOT.jar
[JENKINS] Archiving <https://builds.apache.org/job/maven-plugins/ws/maven-javadoc-plugin/pom.xml> to org.apache.maven.plugins/maven-javadoc-plugin/3.0.0-SNAPSHOT/maven-javadoc-plugin-3.0.0-SNAPSHOT.pom
[JENKINS] Archiving <https://builds.apache.org/job/maven-plugins/ws/maven-dependency-plugin/pom.xml> to org.apache.maven.plugins/maven-dependency-plugin/3.0.1-SNAPSHOT/maven-dependency-plugin-3.0.1-SNAPSHOT.pom
[JENKINS] Archiving <https://builds.apache.org/job/maven-plugins/ws/maven-dependency-plugin/target/maven-dependency-plugin-3.0.1-SNAPSHOT.jar> to org.apache.maven.plugins/maven-dependency-plugin/3.0.1-SNAPSHOT/maven-dependency-plugin-3.0.1-SNAPSHOT.jar
[JENKINS] Archiving <https://builds.apache.org/job/maven-plugins/ws/maven-rar-plugin/pom.xml> to org.apache.maven.plugins/maven-rar-plugin/3.0.0-SNAPSHOT/maven-rar-plugin-3.0.0-SNAPSHOT.pom
[JENKINS] Archiving <https://builds.apache.org/job/maven-plugins/ws/maven-rar-plugin/target/maven-rar-plugin-3.0.0-SNAPSHOT.jar> to org.apache.maven.plugins/maven-rar-plugin/3.0.0-SNAPSHOT/maven-rar-plugin-3.0.0-SNAPSHOT.jar
[JENKINS] Archiving <https://builds.apache.org/job/maven-plugins/ws/maven-checkstyle-plugin/pom.xml> to org.apache.maven.plugins/maven-checkstyle-plugin/3.0.0-SNAPSHOT/maven-checkstyle-plugin-3.0.0-SNAPSHOT.pom
Sending e-mails to: [hidden email]
Sending e-mails to: [hidden email]
channel stopped
[WARNINGS] Skipping publisher since build result is FAILURE
Reply | Threaded
Open this post in threaded view
|

Jenkins build is back to normal : maven-plugins #8898

Apache Jenkins Server-2