Build failed in Jenkins: maven-plugin-tools-windows #129

Previous Topic Next Topic
 
classic Classic list List threaded Threaded
5 messages Options
Reply | Threaded
Open this post in threaded view
|

Build failed in Jenkins: maven-plugin-tools-windows #129

Apache Jenkins Server-2
See <https://builds.apache.org/job/maven-plugin-tools-windows/129/display/redirect?page=changes>

Changes:

[Robert Scholte] [MPLUGIN-324] javadoc generated by helpmojo goal of maven-plugin-plugin produces build failures

------------------------------------------
[...truncated 112.92 KB...]
[INFO] Installing <https://builds.apache.org/job/maven-plugin-tools-windows/ws/target\maven-plugin-tools-3.5.1-SNAPSHOT-site.xml> to F:\jenkins\jenkins-slave\workspace\maven-plugin-tools-windows\maven-plugin-plugin\target\local-repo\org\apache\maven\plugin-tools\maven-plugin-tools\3.5.1-SNAPSHOT\maven-plugin-tools-3.5.1-SNAPSHOT-site.xml
[INFO] Installing F:\jenkins\jenkins-slave\workspace\maven-plugin-tools-windows\maven-plugin-tools-api\pom.xml to F:\jenkins\jenkins-slave\workspace\maven-plugin-tools-windows\maven-plugin-plugin\target\local-repo\org\apache\maven\plugin-tools\maven-plugin-tools-api\3.5.1-SNAPSHOT\maven-plugin-tools-api-3.5.1-SNAPSHOT.pom
[INFO] Installing F:\jenkins\jenkins-slave\workspace\maven-plugin-tools-windows\maven-plugin-tools-api\target\maven-plugin-tools-api-3.5.1-SNAPSHOT.jar to F:\jenkins\jenkins-slave\workspace\maven-plugin-tools-windows\maven-plugin-plugin\target\local-repo\org\apache\maven\plugin-tools\maven-plugin-tools-api\3.5.1-SNAPSHOT\maven-plugin-tools-api-3.5.1-SNAPSHOT.jar
[INFO] Installing F:\jenkins\jenkins-slave\workspace\maven-plugin-tools-windows\maven-plugin-tools-api\pom.xml to F:\jenkins\jenkins-slave\workspace\maven-plugin-tools-windows\maven-plugin-plugin\target\local-repo\org\apache\maven\plugin-tools\maven-plugin-tools-api\3.5.1-SNAPSHOT\maven-plugin-tools-api-3.5.1-SNAPSHOT.pom
[INFO] Installing F:\jenkins\jenkins-slave\workspace\maven-plugin-tools-windows\maven-plugin-tools-generators\pom.xml to F:\jenkins\jenkins-slave\workspace\maven-plugin-tools-windows\maven-plugin-plugin\target\local-repo\org\apache\maven\plugin-tools\maven-plugin-tools-generators\3.5.1-SNAPSHOT\maven-plugin-tools-generators-3.5.1-SNAPSHOT.pom
[INFO] Installing F:\jenkins\jenkins-slave\workspace\maven-plugin-tools-windows\maven-plugin-tools-generators\target\maven-plugin-tools-generators-3.5.1-SNAPSHOT.jar to F:\jenkins\jenkins-slave\workspace\maven-plugin-tools-windows\maven-plugin-plugin\target\local-repo\org\apache\maven\plugin-tools\maven-plugin-tools-generators\3.5.1-SNAPSHOT\maven-plugin-tools-generators-3.5.1-SNAPSHOT.jar
[INFO] Installing F:\jenkins\jenkins-slave\workspace\maven-plugin-tools-windows\maven-plugin-tools-generators\pom.xml to F:\jenkins\jenkins-slave\workspace\maven-plugin-tools-windows\maven-plugin-plugin\target\local-repo\org\apache\maven\plugin-tools\maven-plugin-tools-generators\3.5.1-SNAPSHOT\maven-plugin-tools-generators-3.5.1-SNAPSHOT.pom
[INFO] Installing F:\jenkins\jenkins-slave\workspace\maven-plugin-tools-windows\maven-plugin-tools-java\pom.xml to F:\jenkins\jenkins-slave\workspace\maven-plugin-tools-windows\maven-plugin-plugin\target\local-repo\org\apache\maven\plugin-tools\maven-plugin-tools-java\3.5.1-SNAPSHOT\maven-plugin-tools-java-3.5.1-SNAPSHOT.pom
[INFO] Installing F:\jenkins\jenkins-slave\workspace\maven-plugin-tools-windows\maven-plugin-tools-java\target\maven-plugin-tools-java-3.5.1-SNAPSHOT.jar to F:\jenkins\jenkins-slave\workspace\maven-plugin-tools-windows\maven-plugin-plugin\target\local-repo\org\apache\maven\plugin-tools\maven-plugin-tools-java\3.5.1-SNAPSHOT\maven-plugin-tools-java-3.5.1-SNAPSHOT.jar
[INFO] Installing F:\jenkins\jenkins-slave\workspace\maven-plugin-tools-windows\maven-plugin-tools-java\pom.xml to F:\jenkins\jenkins-slave\workspace\maven-plugin-tools-windows\maven-plugin-plugin\target\local-repo\org\apache\maven\plugin-tools\maven-plugin-tools-java\3.5.1-SNAPSHOT\maven-plugin-tools-java-3.5.1-SNAPSHOT.pom
[INFO] Installing F:\jenkins\jenkins-slave\workspace\maven-plugin-tools-windows\maven-plugin-annotations\pom.xml to F:\jenkins\jenkins-slave\workspace\maven-plugin-tools-windows\maven-plugin-plugin\target\local-repo\org\apache\maven\plugin-tools\maven-plugin-annotations\3.5.1-SNAPSHOT\maven-plugin-annotations-3.5.1-SNAPSHOT.pom
[INFO] Installing F:\jenkins\jenkins-slave\workspace\maven-plugin-tools-windows\maven-plugin-annotations\target\maven-plugin-annotations-3.5.1-SNAPSHOT.jar to F:\jenkins\jenkins-slave\workspace\maven-plugin-tools-windows\maven-plugin-plugin\target\local-repo\org\apache\maven\plugin-tools\maven-plugin-annotations\3.5.1-SNAPSHOT\maven-plugin-annotations-3.5.1-SNAPSHOT.jar
[INFO] Installing F:\jenkins\jenkins-slave\workspace\maven-plugin-tools-windows\maven-plugin-annotations\pom.xml to F:\jenkins\jenkins-slave\workspace\maven-plugin-tools-windows\maven-plugin-plugin\target\local-repo\org\apache\maven\plugin-tools\maven-plugin-annotations\3.5.1-SNAPSHOT\maven-plugin-annotations-3.5.1-SNAPSHOT.pom
[INFO] Installing F:\jenkins\jenkins-slave\workspace\maven-plugin-tools-windows\maven-plugin-tools-annotations\pom.xml to F:\jenkins\jenkins-slave\workspace\maven-plugin-tools-windows\maven-plugin-plugin\target\local-repo\org\apache\maven\plugin-tools\maven-plugin-tools-annotations\3.5.1-SNAPSHOT\maven-plugin-tools-annotations-3.5.1-SNAPSHOT.pom
[INFO] Installing F:\jenkins\jenkins-slave\workspace\maven-plugin-tools-windows\maven-plugin-tools-annotations\target\maven-plugin-tools-annotations-3.5.1-SNAPSHOT.jar to F:\jenkins\jenkins-slave\workspace\maven-plugin-tools-windows\maven-plugin-plugin\target\local-repo\org\apache\maven\plugin-tools\maven-plugin-tools-annotations\3.5.1-SNAPSHOT\maven-plugin-tools-annotations-3.5.1-SNAPSHOT.jar
[INFO] Installing F:\jenkins\jenkins-slave\workspace\maven-plugin-tools-windows\maven-plugin-tools-annotations\pom.xml to F:\jenkins\jenkins-slave\workspace\maven-plugin-tools-windows\maven-plugin-plugin\target\local-repo\org\apache\maven\plugin-tools\maven-plugin-tools-annotations\3.5.1-SNAPSHOT\maven-plugin-tools-annotations-3.5.1-SNAPSHOT.pom
[INFO] Installing F:\jenkins\jenkins-slave\workspace\maven-plugin-tools-windows\maven-plugin-tools-annotations\target\maven-plugin-tools-annotations-3.5.1-SNAPSHOT-tests.jar to F:\jenkins\jenkins-slave\workspace\maven-plugin-tools-windows\maven-plugin-plugin\target\local-repo\org\apache\maven\plugin-tools\maven-plugin-tools-annotations\3.5.1-SNAPSHOT\maven-plugin-tools-annotations-3.5.1-SNAPSHOT-tests.jar
[INFO] Installing F:\jenkins\jenkins-slave\workspace\maven-plugin-tools-windows\maven-plugin-tools-annotations\target\maven-plugin-tools-annotations-3.5.1-SNAPSHOT-test-sources.jar to F:\jenkins\jenkins-slave\workspace\maven-plugin-tools-windows\maven-plugin-plugin\target\local-repo\org\apache\maven\plugin-tools\maven-plugin-tools-annotations\3.5.1-SNAPSHOT\maven-plugin-tools-annotations-3.5.1-SNAPSHOT-test-sources.jar
[INFO] Installing F:\jenkins\jenkins-slave\workspace\maven-plugin-tools-windows\maven-plugin-tools-javadoc\pom.xml to F:\jenkins\jenkins-slave\workspace\maven-plugin-tools-windows\maven-plugin-plugin\target\local-repo\org\apache\maven\plugin-tools\maven-plugin-tools-javadoc\3.5.1-SNAPSHOT\maven-plugin-tools-javadoc-3.5.1-SNAPSHOT.pom
[INFO] Installing F:\jenkins\jenkins-slave\workspace\maven-plugin-tools-windows\maven-script\pom.xml to F:\jenkins\jenkins-slave\workspace\maven-plugin-tools-windows\maven-plugin-plugin\target\local-repo\org\apache\maven\plugin-tools\maven-script\3.5.1-SNAPSHOT\maven-script-3.5.1-SNAPSHOT.pom
[INFO] Installing F:\jenkins\jenkins-slave\workspace\maven-plugin-tools-windows\maven-script\target\maven-script-3.5.1-SNAPSHOT-site.xml to F:\jenkins\jenkins-slave\workspace\maven-plugin-tools-windows\maven-plugin-plugin\target\local-repo\org\apache\maven\plugin-tools\maven-script\3.5.1-SNAPSHOT\maven-script-3.5.1-SNAPSHOT-site.xml
[INFO] Installing F:\jenkins\jenkins-slave\workspace\maven-plugin-tools-windows\maven-script\maven-plugin-tools-model\pom.xml to F:\jenkins\jenkins-slave\workspace\maven-plugin-tools-windows\maven-plugin-plugin\target\local-repo\org\apache\maven\plugin-tools\maven-plugin-tools-model\3.5.1-SNAPSHOT\maven-plugin-tools-model-3.5.1-SNAPSHOT.pom
[INFO] Installing F:\jenkins\jenkins-slave\workspace\maven-plugin-tools-windows\maven-script\maven-plugin-tools-model\target\maven-plugin-tools-model-3.5.1-SNAPSHOT.jar to F:\jenkins\jenkins-slave\workspace\maven-plugin-tools-windows\maven-plugin-plugin\target\local-repo\org\apache\maven\plugin-tools\maven-plugin-tools-model\3.5.1-SNAPSHOT\maven-plugin-tools-model-3.5.1-SNAPSHOT.jar
[INFO] Installing F:\jenkins\jenkins-slave\workspace\maven-plugin-tools-windows\maven-script\maven-plugin-tools-model\pom.xml to F:\jenkins\jenkins-slave\workspace\maven-plugin-tools-windows\maven-plugin-plugin\target\local-repo\org\apache\maven\plugin-tools\maven-plugin-tools-model\3.5.1-SNAPSHOT\maven-plugin-tools-model-3.5.1-SNAPSHOT.pom
[INFO] Installing F:\jenkins\jenkins-slave\workspace\maven-plugin-tools-windows\maven-script\maven-plugin-tools-ant\pom.xml to F:\jenkins\jenkins-slave\workspace\maven-plugin-tools-windows\maven-plugin-plugin\target\local-repo\org\apache\maven\plugin-tools\maven-plugin-tools-ant\3.5.1-SNAPSHOT\maven-plugin-tools-ant-3.5.1-SNAPSHOT.pom
[INFO] Installing F:\jenkins\jenkins-slave\workspace\maven-plugin-tools-windows\maven-script\maven-plugin-tools-ant\target\maven-plugin-tools-ant-3.5.1-SNAPSHOT.jar to F:\jenkins\jenkins-slave\workspace\maven-plugin-tools-windows\maven-plugin-plugin\target\local-repo\org\apache\maven\plugin-tools\maven-plugin-tools-ant\3.5.1-SNAPSHOT\maven-plugin-tools-ant-3.5.1-SNAPSHOT.jar
[INFO] Installing F:\jenkins\jenkins-slave\workspace\maven-plugin-tools-windows\maven-script\maven-plugin-tools-ant\pom.xml to F:\jenkins\jenkins-slave\workspace\maven-plugin-tools-windows\maven-plugin-plugin\target\local-repo\org\apache\maven\plugin-tools\maven-plugin-tools-ant\3.5.1-SNAPSHOT\maven-plugin-tools-ant-3.5.1-SNAPSHOT.pom
[INFO] Installing F:\jenkins\jenkins-slave\workspace\maven-plugin-tools-windows\maven-script\maven-script-ant\pom.xml to F:\jenkins\jenkins-slave\workspace\maven-plugin-tools-windows\maven-plugin-plugin\target\local-repo\org\apache\maven\plugin-tools\maven-script-ant\3.5.1-SNAPSHOT\maven-script-ant-3.5.1-SNAPSHOT.pom
[INFO] Installing F:\jenkins\jenkins-slave\workspace\maven-plugin-tools-windows\maven-script\maven-script-ant\target\maven-script-ant-3.5.1-SNAPSHOT.jar to F:\jenkins\jenkins-slave\workspace\maven-plugin-tools-windows\maven-plugin-plugin\target\local-repo\org\apache\maven\plugin-tools\maven-script-ant\3.5.1-SNAPSHOT\maven-script-ant-3.5.1-SNAPSHOT.jar
[INFO] Installing F:\jenkins\jenkins-slave\workspace\maven-plugin-tools-windows\maven-script\maven-script-ant\pom.xml to F:\jenkins\jenkins-slave\workspace\maven-plugin-tools-windows\maven-plugin-plugin\target\local-repo\org\apache\maven\plugin-tools\maven-script-ant\3.5.1-SNAPSHOT\maven-script-ant-3.5.1-SNAPSHOT.pom
[INFO] Installing F:\jenkins\jenkins-slave\workspace\maven-plugin-tools-windows\maven-script\maven-plugin-tools-beanshell\pom.xml to F:\jenkins\jenkins-slave\workspace\maven-plugin-tools-windows\maven-plugin-plugin\target\local-repo\org\apache\maven\plugin-tools\maven-plugin-tools-beanshell\3.5.1-SNAPSHOT\maven-plugin-tools-beanshell-3.5.1-SNAPSHOT.pom
[INFO] Installing F:\jenkins\jenkins-slave\workspace\maven-plugin-tools-windows\maven-script\maven-plugin-tools-beanshell\target\maven-plugin-tools-beanshell-3.5.1-SNAPSHOT.jar to F:\jenkins\jenkins-slave\workspace\maven-plugin-tools-windows\maven-plugin-plugin\target\local-repo\org\apache\maven\plugin-tools\maven-plugin-tools-beanshell\3.5.1-SNAPSHOT\maven-plugin-tools-beanshell-3.5.1-SNAPSHOT.jar
[INFO] Installing F:\jenkins\jenkins-slave\workspace\maven-plugin-tools-windows\maven-script\maven-plugin-tools-beanshell\pom.xml to F:\jenkins\jenkins-slave\workspace\maven-plugin-tools-windows\maven-plugin-plugin\target\local-repo\org\apache\maven\plugin-tools\maven-plugin-tools-beanshell\3.5.1-SNAPSHOT\maven-plugin-tools-beanshell-3.5.1-SNAPSHOT.pom
[INFO] Installing F:\jenkins\jenkins-slave\workspace\maven-plugin-tools-windows\maven-script\maven-script-beanshell\pom.xml to F:\jenkins\jenkins-slave\workspace\maven-plugin-tools-windows\maven-plugin-plugin\target\local-repo\org\apache\maven\plugin-tools\maven-script-beanshell\3.5.1-SNAPSHOT\maven-script-beanshell-3.5.1-SNAPSHOT.pom
[INFO] Installing F:\jenkins\jenkins-slave\workspace\maven-plugin-tools-windows\maven-script\maven-script-beanshell\target\maven-script-beanshell-3.5.1-SNAPSHOT.jar to F:\jenkins\jenkins-slave\workspace\maven-plugin-tools-windows\maven-plugin-plugin\target\local-repo\org\apache\maven\plugin-tools\maven-script-beanshell\3.5.1-SNAPSHOT\maven-script-beanshell-3.5.1-SNAPSHOT.jar
[INFO] Installing F:\jenkins\jenkins-slave\workspace\maven-plugin-tools-windows\maven-script\maven-script-beanshell\pom.xml to F:\jenkins\jenkins-slave\workspace\maven-plugin-tools-windows\maven-plugin-plugin\target\local-repo\org\apache\maven\plugin-tools\maven-script-beanshell\3.5.1-SNAPSHOT\maven-script-beanshell-3.5.1-SNAPSHOT.pom
[INFO] Installing F:\jenkins\jenkins-slave\workspace\maven-plugin-tools-windows\maven-plugin-plugin\pom.xml to F:\jenkins\jenkins-slave\workspace\maven-plugin-tools-windows\maven-plugin-plugin\target\local-repo\org\apache\maven\plugins\maven-plugin-plugin\3.5.1-SNAPSHOT\maven-plugin-plugin-3.5.1-SNAPSHOT.pom
[INFO] Installing F:\jenkins\jenkins-slave\workspace\maven-plugin-tools-windows\maven-plugin-plugin\target\maven-plugin-plugin-3.5.1-SNAPSHOT.jar to F:\jenkins\jenkins-slave\workspace\maven-plugin-tools-windows\maven-plugin-plugin\target\local-repo\org\apache\maven\plugins\maven-plugin-plugin\3.5.1-SNAPSHOT\maven-plugin-plugin-3.5.1-SNAPSHOT.jar
[INFO]
[INFO] --- maven-invoker-plugin:1.10:run (integration-test) @ maven-plugin-plugin ---
[INFO] Building: annotation-with-inheritance\pom.xml
[INFO] run script verify.groovy
[INFO] ..SUCCESS (31.3 s)
[INFO] Building: annotation-with-inheritance-from-deps\pom.xml
[INFO] run script verify.groovy
[INFO] ..SUCCESS (23.6 s)
[INFO] Building: annotation-with-inheritance-reactor\pom.xml
[INFO] run script verify.groovy
[INFO] ..SUCCESS (15.7 s)
[INFO] Building: ant-basic\pom.xml
[INFO] run script verify.groovy
[INFO] ..SUCCESS (10.4 s)
[INFO] Building: ant-reference-parameter\pom.xml
[INFO] ..SUCCESS (11.1 s)
[INFO] Building: ant-simple-usage\pom.xml
[INFO] ..SUCCESS (6.7 s)
[INFO] Building: ant-since-maven-plugin\pom.xml
[INFO] ..SUCCESS (5.9 s)
[INFO] Building: beanshell-simple\pom.xml
[INFO] run script verify.groovy
[INFO] ..SUCCESS (9.3 s)
[INFO] Building: fix-maven-since-3.x\pom.xml
[INFO] run script verify.groovy
[INFO] ..SUCCESS (17.6 s)
[INFO] Building: help-basic\pom.xml
[INFO] run script verify.groovy
[INFO] ..SUCCESS (13.8 s)
[INFO] Building: help-package\pom.xml
[INFO] run script verify.bsh
[INFO] ..SUCCESS (6.9 s)
[INFO] Building: ignore-plugin-class-realm\pom.xml
[INFO] ..SUCCESS (11.3 s)
[INFO] Building: java-basic\pom.xml
[INFO] run script verify.groovy
[INFO] ..SUCCESS (11.0 s)
[INFO] Building: java-basic-annotations\pom.xml
[INFO] run script verify.groovy
[INFO] ..SUCCESS (15.7 s)
[INFO] Building: java-basic-annotations-jdk8\pom.xml
[INFO] run script verify.groovy
[INFO] ..SUCCESS (16.2 s)
[INFO] Building: mplugin-187\pom.xml
[INFO] ..SUCCESS (4.9 s)
[INFO] Building: mplugin-191\pom.xml
[INFO] run script verify.groovy
[INFO] ..SUCCESS (8.8 s)
[INFO] Building: mplugin-223\pom.xml
[INFO] run script verify.groovy
[INFO] ..SUCCESS (7.3 s)
[INFO] Building: mplugin-272_java8\pom.xml
[INFO] ..FAILED (6.0 s)
[INFO]   The build exited with code 1. See F:\jenkins\jenkins-slave\workspace\maven-plugin-tools-windows\maven-plugin-plugin\target\it\mplugin-272_java8\build.log for details.
[INFO] Building: mplugin-299_no-configuration\pom.xml
[INFO] ..SUCCESS (10.8 s)
[INFO] Building: mplugin-305_defaultMojoDependencies\pom.xml
[INFO] run script verify.groovy
[INFO] ..SUCCESS (8.9 s)
[INFO] Building: mplugin-305_emptyMojoDependencies\pom.xml
[INFO] run script verify.groovy
[INFO] ..SUCCESS (7.4 s)
[INFO] Building: mplugin-305_singleMojoDependencies\pom.xml
[INFO] run script verify.groovy
[INFO] ..SUCCESS (7.8 s)
[INFO] Building: mplugin-319_report-since\pom.xml
[INFO] run script verify.groovy
[INFO] ..SUCCESS (7.4 s)
[INFO] Building: mplugin-324_javadoc\pom.xml
[INFO] ..SUCCESS (12.7 s)
[INFO] Building: packaging-jar\pom.xml
[INFO] run script verify.groovy
[INFO] ..SUCCESS (9.3 s)
[INFO] Building: plugin-info-jdk\pom.xml
[INFO] run script verify.groovy
[INFO] ..SUCCESS (13.4 s)
[INFO] Building: plugin-info-jdk-default-version\pom.xml
[INFO] run script verify.groovy
[INFO] ..SUCCESS (7.0 s)
[INFO] Building: plugin-report\pom.xml
[INFO] run script verify.bsh
[INFO] ..SUCCESS (19.7 s)
[INFO] Building: plugin-report-annotations\pom.xml
[INFO] run script verify.bsh
[INFO] ..SUCCESS (11.2 s)
[INFO] Building: skip\pom.xml
[INFO] run script verify.groovy
[INFO] ..SUCCESS (6.1 s)
[INFO] Building: source-encoding\pom.xml
[INFO] run script verify.groovy
[INFO] ..SUCCESS (7.8 s)
[INFO] -------------------------------------------------
[INFO] Build Summary:
[INFO]   Passed: 31, Failed: 1, Errors: 0, Skipped: 0
[INFO] -------------------------------------------------
[ERROR] The following builds failed:
[ERROR] *  mplugin-272_java8\pom.xml
[INFO] -------------------------------------------------
MavenInvokerArchiver
found reports:[F:\jenkins\jenkins-slave\workspace\maven-plugin-tools-windows\maven-plugin-plugin\target\invoker-reports\BUILD-annotation-with-inheritance-from-deps.xml, F:\jenkins\jenkins-slave\workspace\maven-plugin-tools-windows\maven-plugin-plugin\target\invoker-reports\BUILD-annotation-with-inheritance-reactor.xml, F:\jenkins\jenkins-slave\workspace\maven-plugin-tools-windows\maven-plugin-plugin\target\invoker-reports\BUILD-annotation-with-inheritance.xml, F:\jenkins\jenkins-slave\workspace\maven-plugin-tools-windows\maven-plugin-plugin\target\invoker-reports\BUILD-ant-basic.xml, F:\jenkins\jenkins-slave\workspace\maven-plugin-tools-windows\maven-plugin-plugin\target\invoker-reports\BUILD-ant-reference-parameter.xml, F:\jenkins\jenkins-slave\workspace\maven-plugin-tools-windows\maven-plugin-plugin\target\invoker-reports\BUILD-ant-simple-usage.xml, F:\jenkins\jenkins-slave\workspace\maven-plugin-tools-windows\maven-plugin-plugin\target\invoker-reports\BUILD-ant-since-maven-plugin.xml, F:\jenkins\jenkins-slave\workspace\maven-plugin-tools-windows\maven-plugin-plugin\target\invoker-reports\BUILD-beanshell-simple.xml, F:\jenkins\jenkins-slave\workspace\maven-plugin-tools-windows\maven-plugin-plugin\target\invoker-reports\BUILD-fix-maven-since-3.x.xml, F:\jenkins\jenkins-slave\workspace\maven-plugin-tools-windows\maven-plugin-plugin\target\invoker-reports\BUILD-help-basic.xml, F:\jenkins\jenkins-slave\workspace\maven-plugin-tools-windows\maven-plugin-plugin\target\invoker-reports\BUILD-help-package.xml, F:\jenkins\jenkins-slave\workspace\maven-plugin-tools-windows\maven-plugin-plugin\target\invoker-reports\BUILD-ignore-plugin-class-realm.xml, F:\jenkins\jenkins-slave\workspace\maven-plugin-tools-windows\maven-plugin-plugin\target\invoker-reports\BUILD-java-basic-annotations-jdk8.xml, F:\jenkins\jenkins-slave\workspace\maven-plugin-tools-windows\maven-plugin-plugin\target\invoker-reports\BUILD-java-basic-annotations.xml, F:\jenkins\jenkins-slave\workspace\maven-plugin-tools-windows\maven-plugin-plugin\target\invoker-reports\BUILD-java-basic.xml, F:\jenkins\jenkins-slave\workspace\maven-plugin-tools-windows\maven-plugin-plugin\target\invoker-reports\BUILD-mplugin-187.xml, F:\jenkins\jenkins-slave\workspace\maven-plugin-tools-windows\maven-plugin-plugin\target\invoker-reports\BUILD-mplugin-191.xml, F:\jenkins\jenkins-slave\workspace\maven-plugin-tools-windows\maven-plugin-plugin\target\invoker-reports\BUILD-mplugin-223.xml, F:\jenkins\jenkins-slave\workspace\maven-plugin-tools-windows\maven-plugin-plugin\target\invoker-reports\BUILD-mplugin-272_java8.xml, F:\jenkins\jenkins-slave\workspace\maven-plugin-tools-windows\maven-plugin-plugin\target\invoker-reports\BUILD-mplugin-299_no-configuration.xml, F:\jenkins\jenkins-slave\workspace\maven-plugin-tools-windows\maven-plugin-plugin\target\invoker-reports\BUILD-mplugin-305_defaultMojoDependencies.xml, F:\jenkins\jenkins-slave\workspace\maven-plugin-tools-windows\maven-plugin-plugin\target\invoker-reports\BUILD-mplugin-305_emptyMojoDependencies.xml, F:\jenkins\jenkins-slave\workspace\maven-plugin-tools-windows\maven-plugin-plugin\target\invoker-reports\BUILD-mplugin-305_singleMojoDependencies.xml, F:\jenkins\jenkins-slave\workspace\maven-plugin-tools-windows\maven-plugin-plugin\target\invoker-reports\BUILD-mplugin-319_report-since.xml, F:\jenkins\jenkins-slave\workspace\maven-plugin-tools-windows\maven-plugin-plugin\target\invoker-reports\BUILD-mplugin-324_javadoc.xml, F:\jenkins\jenkins-slave\workspace\maven-plugin-tools-windows\maven-plugin-plugin\target\invoker-reports\BUILD-packaging-jar.xml, F:\jenkins\jenkins-slave\workspace\maven-plugin-tools-windows\maven-plugin-plugin\target\invoker-reports\BUILD-plugin-info-jdk-default-version.xml, F:\jenkins\jenkins-slave\workspace\maven-plugin-tools-windows\maven-plugin-plugin\target\invoker-reports\BUILD-plugin-info-jdk.xml, F:\jenkins\jenkins-slave\workspace\maven-plugin-tools-windows\maven-plugin-plugin\target\invoker-reports\BUILD-plugin-report-annotations.xml, F:\jenkins\jenkins-slave\workspace\maven-plugin-tools-windows\maven-plugin-plugin\target\invoker-reports\BUILD-plugin-report.xml, F:\jenkins\jenkins-slave\workspace\maven-plugin-tools-windows\maven-plugin-plugin\target\invoker-reports\BUILD-skip.xml, F:\jenkins\jenkins-slave\workspace\maven-plugin-tools-windows\maven-plugin-plugin\target\invoker-reports\BUILD-source-encoding.xml]
java.lang.reflect.InvocationTargetException
        at sun.reflect.NativeMethodAccessorImpl.invoke0(Native Method)
        at sun.reflect.NativeMethodAccessorImpl.invoke(Unknown Source)
        at sun.reflect.DelegatingMethodAccessorImpl.invoke(Unknown Source)
        at java.lang.reflect.Method.invoke(Unknown Source)
        at org.codehaus.plexus.classworlds.launcher.Launcher.launchStandard(Launcher.java:329)
        at org.codehaus.plexus.classworlds.launcher.Launcher.launch(Launcher.java:239)
        at org.jvnet.hudson.maven3.agent.Maven3Main.launch(Maven3Main.java:181)
        at sun.reflect.NativeMethodAccessorImpl.invoke0(Native Method)
        at sun.reflect.NativeMethodAccessorImpl.invoke(Unknown Source)
        at sun.reflect.DelegatingMethodAccessorImpl.invoke(Unknown Source)
        at java.lang.reflect.Method.invoke(Unknown Source)
        at hudson.maven.Maven3Builder.call(Maven3Builder.java:139)
        at hudson.maven.Maven3Builder.call(Maven3Builder.java:70)
        at hudson.remoting.UserRequest.perform(UserRequest.java:153)
        at hudson.remoting.UserRequest.perform(UserRequest.java:50)
        at hudson.remoting.Request$2.run(Request.java:336)
        at hudson.remoting.InterceptingExecutorService$1.call(InterceptingExecutorService.java:68)
        at java.util.concurrent.FutureTask.run(Unknown Source)
        at java.util.concurrent.ThreadPoolExecutor.runWorker(Unknown Source)
        at java.util.concurrent.ThreadPoolExecutor$Worker.run(Unknown Source)
        at java.lang.Thread.run(Unknown Source)
Caused by: java.lang.NoSuchMethodError: org.codehaus.plexus.util.xml.pull.MXParser.<init>(Lorg/codehaus/plexus/util/xml/pull/EntityReplacementMap;)V
        at org.apache.maven.plugin.invoker.model.io.xpp3.BuildJobXpp3Reader.read(BuildJobXpp3Reader.java:510)
        at org.apache.maven.plugin.invoker.model.io.xpp3.BuildJobXpp3Reader.read(BuildJobXpp3Reader.java:529)
        at org.apache.maven.plugin.invoker.model.io.xpp3.BuildJobXpp3Reader.read(BuildJobXpp3Reader.java:558)
        at org.jenkinsci.plugins.maveninvoker.MavenInvokerArchiver.postExecute(MavenInvokerArchiver.java:113)
        at hudson.maven.Maven3Builder$MavenExecutionListener.recordMojoEnded(Maven3Builder.java:629)
        at hudson.maven.Maven3Builder$MavenExecutionListener.mojoFailed(Maven3Builder.java:662)
        at org.apache.maven.lifecycle.internal.DefaultExecutionEventCatapult.fire(DefaultExecutionEventCatapult.java:90)
        at org.apache.maven.lifecycle.internal.MojoExecutor.execute(MojoExecutor.java:232)
        at org.apache.maven.lifecycle.internal.MojoExecutor.execute(MojoExecutor.java:153)
        at org.apache.maven.lifecycle.internal.MojoExecutor.execute(MojoExecutor.java:145)
        at org.apache.maven.lifecycle.internal.LifecycleModuleBuilder.buildProject(LifecycleModuleBuilder.java:84)
        at org.apache.maven.lifecycle.internal.LifecycleModuleBuilder.buildProject(LifecycleModuleBuilder.java:59)
        at org.apache.maven.lifecycle.internal.LifecycleStarter.singleThreadedBuild(LifecycleStarter.java:183)
        at org.apache.maven.lifecycle.internal.LifecycleStarter.execute(LifecycleStarter.java:161)
        at org.apache.maven.DefaultMaven.doExecute(DefaultMaven.java:320)
        at org.apache.maven.DefaultMaven.execute(DefaultMaven.java:156)
        at org.jvnet.hudson.maven3.launcher.Maven3Launcher.main(Maven3Launcher.java:117)
        ... 21 more
ERROR: Failed to parse POMs
java.io.IOException: java.lang.reflect.InvocationTargetException
        at hudson.maven.Maven3Builder.call(Maven3Builder.java:179)
        at hudson.maven.Maven3Builder.call(Maven3Builder.java:70)
        at hudson.remoting.UserRequest.perform(UserRequest.java:153)
        at hudson.remoting.UserRequest.perform(UserRequest.java:50)
        at hudson.remoting.Request$2.run(Request.java:336)
        at hudson.remoting.InterceptingExecutorService$1.call(InterceptingExecutorService.java:68)
        at java.util.concurrent.FutureTask.run(Unknown Source)
        at java.util.concurrent.ThreadPoolExecutor.runWorker(Unknown Source)
        at java.util.concurrent.ThreadPoolExecutor$Worker.run(Unknown Source)
        at java.lang.Thread.run(Unknown Source)
        at ......remote call to Channel to Maven [C:\Program Files\Java\jre1.8.0_121/bin/java, -Xmx2g, -Xms256m, -cp, f:\jenkins\jenkins-slave\maven3-agent.jar;F:\jenkins\tools\maven\apache-maven-3.0.5\boot\plexus-classworlds-2.4.jar, org.jvnet.hudson.maven3.agent.Maven3Main, F:\\jenkins\\tools\\maven\\apache-maven-3.0.5, F:\jenkins\jenkins-slave\slave.jar, f:\jenkins\jenkins-slave\maven3-interceptor.jar, f:\jenkins\jenkins-slave\maven3-interceptor-commons.jar, 53780](Native Method)
        at hudson.remoting.Channel.attachCallSiteStackTrace(Channel.java:1545)
        at hudson.remoting.UserResponse.retrieve(UserRequest.java:253)
        at hudson.remoting.Channel.call(Channel.java:830)
        at hudson.maven.ProcessCache$MavenProcess.call(ProcessCache.java:161)
        at hudson.maven.MavenModuleSetBuild$MavenModuleSetBuildExecution.doRun(MavenModuleSetBuild.java:878)
        at hudson.model.AbstractBuild$AbstractBuildExecution.run(AbstractBuild.java:490)
        at hudson.model.Run.execute(Run.java:1735)
        at hudson.maven.MavenModuleSetBuild.run(MavenModuleSetBuild.java:542)
        at hudson.model.ResourceController.execute(ResourceController.java:97)
        at hudson.model.Executor.run(Executor.java:405)
Caused by: java.lang.reflect.InvocationTargetException
        at sun.reflect.NativeMethodAccessorImpl.invoke0(Native Method)
        at sun.reflect.NativeMethodAccessorImpl.invoke(Unknown Source)
        at sun.reflect.DelegatingMethodAccessorImpl.invoke(Unknown Source)
        at java.lang.reflect.Method.invoke(Unknown Source)
        at hudson.maven.Maven3Builder.call(Maven3Builder.java:139)
        at hudson.maven.Maven3Builder.call(Maven3Builder.java:70)
        at hudson.remoting.UserRequest.perform(UserRequest.java:153)
        at hudson.remoting.UserRequest.perform(UserRequest.java:50)
        at hudson.remoting.Request$2.run(Request.java:336)
        at hudson.remoting.InterceptingExecutorService$1.call(InterceptingExecutorService.java:68)
        at java.util.concurrent.FutureTask.run(Unknown Source)
        at java.util.concurrent.ThreadPoolExecutor.runWorker(Unknown Source)
        at java.util.concurrent.ThreadPoolExecutor$Worker.run(Unknown Source)
        at java.lang.Thread.run(Unknown Source)
Caused by: java.lang.Exception: java.lang.reflect.InvocationTargetException
        at org.jvnet.hudson.maven3.agent.Maven3Main.launch(Maven3Main.java:184)
        ... 14 more
Caused by: java.lang.reflect.InvocationTargetException
        at sun.reflect.NativeMethodAccessorImpl.invoke0(Native Method)
        at sun.reflect.NativeMethodAccessorImpl.invoke(Unknown Source)
        at sun.reflect.DelegatingMethodAccessorImpl.invoke(Unknown Source)
        at java.lang.reflect.Method.invoke(Unknown Source)
        at org.codehaus.plexus.classworlds.launcher.Launcher.launchStandard(Launcher.java:329)
        at org.codehaus.plexus.classworlds.launcher.Launcher.launch(Launcher.java:239)
        at org.jvnet.hudson.maven3.agent.Maven3Main.launch(Maven3Main.java:181)
        ... 14 more
Caused by: java.lang.NoSuchMethodError: org.codehaus.plexus.util.xml.pull.MXParser.<init>(Lorg/codehaus/plexus/util/xml/pull/EntityReplacementMap;)V
        at org.apache.maven.plugin.invoker.model.io.xpp3.BuildJobXpp3Reader.read(BuildJobXpp3Reader.java:510)
        at org.apache.maven.plugin.invoker.model.io.xpp3.BuildJobXpp3Reader.read(BuildJobXpp3Reader.java:529)
        at org.apache.maven.plugin.invoker.model.io.xpp3.BuildJobXpp3Reader.read(BuildJobXpp3Reader.java:558)
        at org.jenkinsci.plugins.maveninvoker.MavenInvokerArchiver.postExecute(MavenInvokerArchiver.java:113)
        at hudson.maven.Maven3Builder$MavenExecutionListener.recordMojoEnded(Maven3Builder.java:629)
        at hudson.maven.Maven3Builder$MavenExecutionListener.mojoFailed(Maven3Builder.java:662)
        at org.apache.maven.lifecycle.internal.DefaultExecutionEventCatapult.fire(DefaultExecutionEventCatapult.java:90)
        at org.apache.maven.lifecycle.internal.MojoExecutor.execute(MojoExecutor.java:232)
        at org.apache.maven.lifecycle.internal.MojoExecutor.execute(MojoExecutor.java:153)
        at org.apache.maven.lifecycle.internal.MojoExecutor.execute(MojoExecutor.java:145)
        at org.apache.maven.lifecycle.internal.LifecycleModuleBuilder.buildProject(LifecycleModuleBuilder.java:84)
        at org.apache.maven.lifecycle.internal.LifecycleModuleBuilder.buildProject(LifecycleModuleBuilder.java:59)
        at org.apache.maven.lifecycle.internal.LifecycleStarter.singleThreadedBuild(LifecycleStarter.java:183)
        at org.apache.maven.lifecycle.internal.LifecycleStarter.execute(LifecycleStarter.java:161)
        at org.apache.maven.DefaultMaven.doExecute(DefaultMaven.java:320)
        at org.apache.maven.DefaultMaven.execute(DefaultMaven.java:156)
        at org.jvnet.hudson.maven3.launcher.Maven3Launcher.main(Maven3Launcher.java:117)
        ... 21 more
channel stopped
Reply | Threaded
Open this post in threaded view
|

Build failed in Jenkins: maven-plugin-tools-windows #130

Apache Jenkins Server-2
See <https://builds.apache.org/job/maven-plugin-tools-windows/130/display/redirect?page=changes>

Changes:

[hboutemy] upgrade m-compiler-p to a version that supports maven.compiler.source/target properties

[hboutemy] upgrade maven-invoker-plugin to latest

------------------------------------------
[...truncated 113.28 KB...]
[INFO] Installing F:\jenkins\jenkins-slave\workspace\maven-plugin-tools-windows\maven-plugin-tools-api\pom.xml to F:\jenkins\jenkins-slave\workspace\maven-plugin-tools-windows\maven-plugin-plugin\target\local-repo\org\apache\maven\plugin-tools\maven-plugin-tools-api\3.5.1-SNAPSHOT\maven-plugin-tools-api-3.5.1-SNAPSHOT.pom
[INFO] Installing F:\jenkins\jenkins-slave\workspace\maven-plugin-tools-windows\maven-plugin-tools-api\target\maven-plugin-tools-api-3.5.1-SNAPSHOT.jar to F:\jenkins\jenkins-slave\workspace\maven-plugin-tools-windows\maven-plugin-plugin\target\local-repo\org\apache\maven\plugin-tools\maven-plugin-tools-api\3.5.1-SNAPSHOT\maven-plugin-tools-api-3.5.1-SNAPSHOT.jar
[INFO] Installing F:\jenkins\jenkins-slave\workspace\maven-plugin-tools-windows\maven-plugin-tools-api\pom.xml to F:\jenkins\jenkins-slave\workspace\maven-plugin-tools-windows\maven-plugin-plugin\target\local-repo\org\apache\maven\plugin-tools\maven-plugin-tools-api\3.5.1-SNAPSHOT\maven-plugin-tools-api-3.5.1-SNAPSHOT.pom
[INFO] Installing F:\jenkins\jenkins-slave\workspace\maven-plugin-tools-windows\maven-plugin-tools-generators\pom.xml to F:\jenkins\jenkins-slave\workspace\maven-plugin-tools-windows\maven-plugin-plugin\target\local-repo\org\apache\maven\plugin-tools\maven-plugin-tools-generators\3.5.1-SNAPSHOT\maven-plugin-tools-generators-3.5.1-SNAPSHOT.pom
[INFO] Installing F:\jenkins\jenkins-slave\workspace\maven-plugin-tools-windows\maven-plugin-tools-generators\target\maven-plugin-tools-generators-3.5.1-SNAPSHOT.jar to F:\jenkins\jenkins-slave\workspace\maven-plugin-tools-windows\maven-plugin-plugin\target\local-repo\org\apache\maven\plugin-tools\maven-plugin-tools-generators\3.5.1-SNAPSHOT\maven-plugin-tools-generators-3.5.1-SNAPSHOT.jar
[INFO] Installing F:\jenkins\jenkins-slave\workspace\maven-plugin-tools-windows\maven-plugin-tools-generators\pom.xml to F:\jenkins\jenkins-slave\workspace\maven-plugin-tools-windows\maven-plugin-plugin\target\local-repo\org\apache\maven\plugin-tools\maven-plugin-tools-generators\3.5.1-SNAPSHOT\maven-plugin-tools-generators-3.5.1-SNAPSHOT.pom
[INFO] Installing F:\jenkins\jenkins-slave\workspace\maven-plugin-tools-windows\maven-plugin-tools-java\pom.xml to F:\jenkins\jenkins-slave\workspace\maven-plugin-tools-windows\maven-plugin-plugin\target\local-repo\org\apache\maven\plugin-tools\maven-plugin-tools-java\3.5.1-SNAPSHOT\maven-plugin-tools-java-3.5.1-SNAPSHOT.pom
[INFO] Installing F:\jenkins\jenkins-slave\workspace\maven-plugin-tools-windows\maven-plugin-tools-java\target\maven-plugin-tools-java-3.5.1-SNAPSHOT.jar to F:\jenkins\jenkins-slave\workspace\maven-plugin-tools-windows\maven-plugin-plugin\target\local-repo\org\apache\maven\plugin-tools\maven-plugin-tools-java\3.5.1-SNAPSHOT\maven-plugin-tools-java-3.5.1-SNAPSHOT.jar
[INFO] Installing F:\jenkins\jenkins-slave\workspace\maven-plugin-tools-windows\maven-plugin-tools-java\pom.xml to F:\jenkins\jenkins-slave\workspace\maven-plugin-tools-windows\maven-plugin-plugin\target\local-repo\org\apache\maven\plugin-tools\maven-plugin-tools-java\3.5.1-SNAPSHOT\maven-plugin-tools-java-3.5.1-SNAPSHOT.pom
[INFO] Installing F:\jenkins\jenkins-slave\workspace\maven-plugin-tools-windows\maven-plugin-annotations\pom.xml to F:\jenkins\jenkins-slave\workspace\maven-plugin-tools-windows\maven-plugin-plugin\target\local-repo\org\apache\maven\plugin-tools\maven-plugin-annotations\3.5.1-SNAPSHOT\maven-plugin-annotations-3.5.1-SNAPSHOT.pom
[INFO] Installing F:\jenkins\jenkins-slave\workspace\maven-plugin-tools-windows\maven-plugin-annotations\target\maven-plugin-annotations-3.5.1-SNAPSHOT.jar to F:\jenkins\jenkins-slave\workspace\maven-plugin-tools-windows\maven-plugin-plugin\target\local-repo\org\apache\maven\plugin-tools\maven-plugin-annotations\3.5.1-SNAPSHOT\maven-plugin-annotations-3.5.1-SNAPSHOT.jar
[INFO] Installing F:\jenkins\jenkins-slave\workspace\maven-plugin-tools-windows\maven-plugin-annotations\pom.xml to F:\jenkins\jenkins-slave\workspace\maven-plugin-tools-windows\maven-plugin-plugin\target\local-repo\org\apache\maven\plugin-tools\maven-plugin-annotations\3.5.1-SNAPSHOT\maven-plugin-annotations-3.5.1-SNAPSHOT.pom
[INFO] Installing F:\jenkins\jenkins-slave\workspace\maven-plugin-tools-windows\maven-plugin-tools-annotations\pom.xml to F:\jenkins\jenkins-slave\workspace\maven-plugin-tools-windows\maven-plugin-plugin\target\local-repo\org\apache\maven\plugin-tools\maven-plugin-tools-annotations\3.5.1-SNAPSHOT\maven-plugin-tools-annotations-3.5.1-SNAPSHOT.pom
[INFO] Installing F:\jenkins\jenkins-slave\workspace\maven-plugin-tools-windows\maven-plugin-tools-annotations\target\maven-plugin-tools-annotations-3.5.1-SNAPSHOT.jar to F:\jenkins\jenkins-slave\workspace\maven-plugin-tools-windows\maven-plugin-plugin\target\local-repo\org\apache\maven\plugin-tools\maven-plugin-tools-annotations\3.5.1-SNAPSHOT\maven-plugin-tools-annotations-3.5.1-SNAPSHOT.jar
[INFO] Installing F:\jenkins\jenkins-slave\workspace\maven-plugin-tools-windows\maven-plugin-tools-annotations\pom.xml to F:\jenkins\jenkins-slave\workspace\maven-plugin-tools-windows\maven-plugin-plugin\target\local-repo\org\apache\maven\plugin-tools\maven-plugin-tools-annotations\3.5.1-SNAPSHOT\maven-plugin-tools-annotations-3.5.1-SNAPSHOT.pom
[INFO] Installing F:\jenkins\jenkins-slave\workspace\maven-plugin-tools-windows\maven-plugin-tools-annotations\target\maven-plugin-tools-annotations-3.5.1-SNAPSHOT-tests.jar to F:\jenkins\jenkins-slave\workspace\maven-plugin-tools-windows\maven-plugin-plugin\target\local-repo\org\apache\maven\plugin-tools\maven-plugin-tools-annotations\3.5.1-SNAPSHOT\maven-plugin-tools-annotations-3.5.1-SNAPSHOT-tests.jar
[INFO] Installing F:\jenkins\jenkins-slave\workspace\maven-plugin-tools-windows\maven-plugin-tools-annotations\target\maven-plugin-tools-annotations-3.5.1-SNAPSHOT-test-sources.jar to F:\jenkins\jenkins-slave\workspace\maven-plugin-tools-windows\maven-plugin-plugin\target\local-repo\org\apache\maven\plugin-tools\maven-plugin-tools-annotations\3.5.1-SNAPSHOT\maven-plugin-tools-annotations-3.5.1-SNAPSHOT-test-sources.jar
[INFO] Installing F:\jenkins\jenkins-slave\workspace\maven-plugin-tools-windows\maven-plugin-tools-javadoc\pom.xml to F:\jenkins\jenkins-slave\workspace\maven-plugin-tools-windows\maven-plugin-plugin\target\local-repo\org\apache\maven\plugin-tools\maven-plugin-tools-javadoc\3.5.1-SNAPSHOT\maven-plugin-tools-javadoc-3.5.1-SNAPSHOT.pom
[INFO] Installing F:\jenkins\jenkins-slave\workspace\maven-plugin-tools-windows\maven-script\pom.xml to F:\jenkins\jenkins-slave\workspace\maven-plugin-tools-windows\maven-plugin-plugin\target\local-repo\org\apache\maven\plugin-tools\maven-script\3.5.1-SNAPSHOT\maven-script-3.5.1-SNAPSHOT.pom
[INFO] Installing F:\jenkins\jenkins-slave\workspace\maven-plugin-tools-windows\maven-script\target\maven-script-3.5.1-SNAPSHOT-site.xml to F:\jenkins\jenkins-slave\workspace\maven-plugin-tools-windows\maven-plugin-plugin\target\local-repo\org\apache\maven\plugin-tools\maven-script\3.5.1-SNAPSHOT\maven-script-3.5.1-SNAPSHOT-site.xml
[INFO] Installing F:\jenkins\jenkins-slave\workspace\maven-plugin-tools-windows\maven-script\maven-plugin-tools-model\pom.xml to F:\jenkins\jenkins-slave\workspace\maven-plugin-tools-windows\maven-plugin-plugin\target\local-repo\org\apache\maven\plugin-tools\maven-plugin-tools-model\3.5.1-SNAPSHOT\maven-plugin-tools-model-3.5.1-SNAPSHOT.pom
[INFO] Installing F:\jenkins\jenkins-slave\workspace\maven-plugin-tools-windows\maven-script\maven-plugin-tools-model\target\maven-plugin-tools-model-3.5.1-SNAPSHOT.jar to F:\jenkins\jenkins-slave\workspace\maven-plugin-tools-windows\maven-plugin-plugin\target\local-repo\org\apache\maven\plugin-tools\maven-plugin-tools-model\3.5.1-SNAPSHOT\maven-plugin-tools-model-3.5.1-SNAPSHOT.jar
[INFO] Installing F:\jenkins\jenkins-slave\workspace\maven-plugin-tools-windows\maven-script\maven-plugin-tools-model\pom.xml to F:\jenkins\jenkins-slave\workspace\maven-plugin-tools-windows\maven-plugin-plugin\target\local-repo\org\apache\maven\plugin-tools\maven-plugin-tools-model\3.5.1-SNAPSHOT\maven-plugin-tools-model-3.5.1-SNAPSHOT.pom
[INFO] Installing F:\jenkins\jenkins-slave\workspace\maven-plugin-tools-windows\maven-script\maven-plugin-tools-ant\pom.xml to F:\jenkins\jenkins-slave\workspace\maven-plugin-tools-windows\maven-plugin-plugin\target\local-repo\org\apache\maven\plugin-tools\maven-plugin-tools-ant\3.5.1-SNAPSHOT\maven-plugin-tools-ant-3.5.1-SNAPSHOT.pom
[INFO] Installing F:\jenkins\jenkins-slave\workspace\maven-plugin-tools-windows\maven-script\maven-plugin-tools-ant\target\maven-plugin-tools-ant-3.5.1-SNAPSHOT.jar to F:\jenkins\jenkins-slave\workspace\maven-plugin-tools-windows\maven-plugin-plugin\target\local-repo\org\apache\maven\plugin-tools\maven-plugin-tools-ant\3.5.1-SNAPSHOT\maven-plugin-tools-ant-3.5.1-SNAPSHOT.jar
[INFO] Installing F:\jenkins\jenkins-slave\workspace\maven-plugin-tools-windows\maven-script\maven-plugin-tools-ant\pom.xml to F:\jenkins\jenkins-slave\workspace\maven-plugin-tools-windows\maven-plugin-plugin\target\local-repo\org\apache\maven\plugin-tools\maven-plugin-tools-ant\3.5.1-SNAPSHOT\maven-plugin-tools-ant-3.5.1-SNAPSHOT.pom
[INFO] Installing F:\jenkins\jenkins-slave\workspace\maven-plugin-tools-windows\maven-script\maven-script-ant\pom.xml to F:\jenkins\jenkins-slave\workspace\maven-plugin-tools-windows\maven-plugin-plugin\target\local-repo\org\apache\maven\plugin-tools\maven-script-ant\3.5.1-SNAPSHOT\maven-script-ant-3.5.1-SNAPSHOT.pom
[INFO] Installing F:\jenkins\jenkins-slave\workspace\maven-plugin-tools-windows\maven-script\maven-script-ant\target\maven-script-ant-3.5.1-SNAPSHOT.jar to F:\jenkins\jenkins-slave\workspace\maven-plugin-tools-windows\maven-plugin-plugin\target\local-repo\org\apache\maven\plugin-tools\maven-script-ant\3.5.1-SNAPSHOT\maven-script-ant-3.5.1-SNAPSHOT.jar
[INFO] Installing F:\jenkins\jenkins-slave\workspace\maven-plugin-tools-windows\maven-script\maven-script-ant\pom.xml to F:\jenkins\jenkins-slave\workspace\maven-plugin-tools-windows\maven-plugin-plugin\target\local-repo\org\apache\maven\plugin-tools\maven-script-ant\3.5.1-SNAPSHOT\maven-script-ant-3.5.1-SNAPSHOT.pom
[INFO] Installing F:\jenkins\jenkins-slave\workspace\maven-plugin-tools-windows\maven-script\maven-plugin-tools-beanshell\pom.xml to F:\jenkins\jenkins-slave\workspace\maven-plugin-tools-windows\maven-plugin-plugin\target\local-repo\org\apache\maven\plugin-tools\maven-plugin-tools-beanshell\3.5.1-SNAPSHOT\maven-plugin-tools-beanshell-3.5.1-SNAPSHOT.pom
[INFO] Installing F:\jenkins\jenkins-slave\workspace\maven-plugin-tools-windows\maven-script\maven-plugin-tools-beanshell\target\maven-plugin-tools-beanshell-3.5.1-SNAPSHOT.jar to F:\jenkins\jenkins-slave\workspace\maven-plugin-tools-windows\maven-plugin-plugin\target\local-repo\org\apache\maven\plugin-tools\maven-plugin-tools-beanshell\3.5.1-SNAPSHOT\maven-plugin-tools-beanshell-3.5.1-SNAPSHOT.jar
[INFO] Installing F:\jenkins\jenkins-slave\workspace\maven-plugin-tools-windows\maven-script\maven-plugin-tools-beanshell\pom.xml to F:\jenkins\jenkins-slave\workspace\maven-plugin-tools-windows\maven-plugin-plugin\target\local-repo\org\apache\maven\plugin-tools\maven-plugin-tools-beanshell\3.5.1-SNAPSHOT\maven-plugin-tools-beanshell-3.5.1-SNAPSHOT.pom
[INFO] Installing F:\jenkins\jenkins-slave\workspace\maven-plugin-tools-windows\maven-script\maven-script-beanshell\pom.xml to F:\jenkins\jenkins-slave\workspace\maven-plugin-tools-windows\maven-plugin-plugin\target\local-repo\org\apache\maven\plugin-tools\maven-script-beanshell\3.5.1-SNAPSHOT\maven-script-beanshell-3.5.1-SNAPSHOT.pom
[INFO] Installing F:\jenkins\jenkins-slave\workspace\maven-plugin-tools-windows\maven-script\maven-script-beanshell\target\maven-script-beanshell-3.5.1-SNAPSHOT.jar to F:\jenkins\jenkins-slave\workspace\maven-plugin-tools-windows\maven-plugin-plugin\target\local-repo\org\apache\maven\plugin-tools\maven-script-beanshell\3.5.1-SNAPSHOT\maven-script-beanshell-3.5.1-SNAPSHOT.jar
[INFO] Installing F:\jenkins\jenkins-slave\workspace\maven-plugin-tools-windows\maven-script\maven-script-beanshell\pom.xml to F:\jenkins\jenkins-slave\workspace\maven-plugin-tools-windows\maven-plugin-plugin\target\local-repo\org\apache\maven\plugin-tools\maven-script-beanshell\3.5.1-SNAPSHOT\maven-script-beanshell-3.5.1-SNAPSHOT.pom
[INFO] Installing F:\jenkins\jenkins-slave\workspace\maven-plugin-tools-windows\maven-plugin-plugin\pom.xml to F:\jenkins\jenkins-slave\workspace\maven-plugin-tools-windows\maven-plugin-plugin\target\local-repo\org\apache\maven\plugins\maven-plugin-plugin\3.5.1-SNAPSHOT\maven-plugin-plugin-3.5.1-SNAPSHOT.pom
[INFO] Installing F:\jenkins\jenkins-slave\workspace\maven-plugin-tools-windows\maven-plugin-plugin\target\maven-plugin-plugin-3.5.1-SNAPSHOT.jar to F:\jenkins\jenkins-slave\workspace\maven-plugin-tools-windows\maven-plugin-plugin\target\local-repo\org\apache\maven\plugins\maven-plugin-plugin\3.5.1-SNAPSHOT\maven-plugin-plugin-3.5.1-SNAPSHOT.jar
[INFO]
[INFO] --- maven-invoker-plugin:3.0.1:run (integration-test) @ maven-plugin-plugin ---
[INFO] Running Setup Jobs
[INFO] Building: annotation-with-inheritance\pom.xml
[INFO] run post-build script verify.groovy
[INFO]           annotation-with-inheritance\pom.xml .............. SUCCESS (33.4 s)
[INFO] Building: annotation-with-inheritance-from-deps\pom.xml
[INFO] run post-build script verify.groovy
[INFO]           annotation-with-inheritance-from-deps\pom.xml .... SUCCESS (24.7 s)
[INFO] Building: annotation-with-inheritance-reactor\pom.xml
[INFO] run post-build script verify.groovy
[INFO]           annotation-with-inheritance-reactor\pom.xml ...... SUCCESS (17.3 s)
[INFO] Building: ant-basic\pom.xml
[INFO] run post-build script verify.groovy
[INFO]           ant-basic\pom.xml ................................ SUCCESS (12.7 s)
[INFO] Building: ant-reference-parameter\pom.xml
[INFO]           ant-reference-parameter\pom.xml .................. SUCCESS (11.8 s)
[INFO] Building: ant-simple-usage\pom.xml
[INFO]           ant-simple-usage\pom.xml ......................... SUCCESS (8.0 s)
[INFO] Building: ant-since-maven-plugin\pom.xml
[INFO]           ant-since-maven-plugin\pom.xml ................... SUCCESS (6.3 s)
[INFO] Building: beanshell-simple\pom.xml
[INFO] run post-build script verify.groovy
[INFO]           beanshell-simple\pom.xml ......................... SUCCESS (10.0 s)
[INFO] Building: fix-maven-since-3.x\pom.xml
[INFO] run post-build script verify.groovy
[INFO]           fix-maven-since-3.x\pom.xml ...................... SUCCESS (19.3 s)
[INFO] Building: help-basic\pom.xml
[INFO] run post-build script verify.groovy
[INFO]           help-basic\pom.xml ............................... SUCCESS (14.7 s)
[INFO] Building: help-package\pom.xml
[INFO] run post-build script verify.bsh
[INFO]           help-package\pom.xml ............................. SUCCESS (7.2 s)
[INFO] Building: ignore-plugin-class-realm\pom.xml
[INFO]           ignore-plugin-class-realm\pom.xml ................ SUCCESS (11.9 s)
[INFO] Building: java-basic\pom.xml
[INFO] run post-build script verify.groovy
[INFO]           java-basic\pom.xml ............................... SUCCESS (11.9 s)
[INFO] Building: java-basic-annotations\pom.xml
[INFO] run post-build script verify.groovy
[INFO]           java-basic-annotations\pom.xml ................... SUCCESS (17.0 s)
[INFO] Building: java-basic-annotations-jdk8\pom.xml
[INFO] run post-build script verify.groovy
[INFO]           java-basic-annotations-jdk8\pom.xml .............. SUCCESS (17.2 s)
[INFO] Building: mplugin-187\pom.xml
[INFO]           mplugin-187\pom.xml .............................. SUCCESS (5.5 s)
[INFO] Building: mplugin-191\pom.xml
[INFO] run post-build script verify.groovy
[INFO]           mplugin-191\pom.xml .............................. SUCCESS (8.8 s)
[INFO] Building: mplugin-223\pom.xml
[INFO] run post-build script verify.groovy
[INFO]           mplugin-223\pom.xml .............................. SUCCESS (7.7 s)
[INFO] Building: mplugin-272_java8\pom.xml
[INFO]           mplugin-272_java8\pom.xml ........................ FAILED (6.3 s)
[INFO]   The build exited with code 1. See F:\jenkins\jenkins-slave\workspace\maven-plugin-tools-windows\maven-plugin-plugin\target\it\mplugin-272_java8\build.log for details.
[INFO] Building: mplugin-299_no-configuration\pom.xml
[INFO]           mplugin-299_no-configuration\pom.xml ............. SUCCESS (11.2 s)
[INFO] Building: mplugin-305_defaultMojoDependencies\pom.xml
[INFO] run post-build script verify.groovy
[INFO]           mplugin-305_defaultMojoDependencies\pom.xml ...... SUCCESS (11.1 s)
[INFO] Building: mplugin-305_emptyMojoDependencies\pom.xml
[INFO] run post-build script verify.groovy
[INFO]           mplugin-305_emptyMojoDependencies\pom.xml ........ SUCCESS (8.7 s)
[INFO] Building: mplugin-305_singleMojoDependencies\pom.xml
[INFO] run post-build script verify.groovy
[INFO]           mplugin-305_singleMojoDependencies\pom.xml ....... SUCCESS (8.6 s)
[INFO] Building: mplugin-319_report-since\pom.xml
[INFO] run post-build script verify.groovy
[INFO]           mplugin-319_report-since\pom.xml ................. SUCCESS (8.0 s)
[INFO] Building: mplugin-324_javadoc\pom.xml
[INFO]           mplugin-324_javadoc\pom.xml ...................... SUCCESS (13.0 s)
[INFO] Building: packaging-jar\pom.xml
[INFO] run post-build script verify.groovy
[INFO]           packaging-jar\pom.xml ............................ SUCCESS (9.7 s)
[INFO] Building: plugin-info-jdk\pom.xml
[INFO] run post-build script verify.groovy
[INFO]           plugin-info-jdk\pom.xml .......................... SUCCESS (14.0 s)
[INFO] Building: plugin-info-jdk-default-version\pom.xml
[INFO] run post-build script verify.groovy
[INFO]           plugin-info-jdk-default-version\pom.xml .......... SUCCESS (7.5 s)
[INFO] Building: plugin-report\pom.xml
[INFO] run post-build script verify.bsh
[INFO]           plugin-report\pom.xml ............................ SUCCESS (21.3 s)
[INFO] Building: plugin-report-annotations\pom.xml
[INFO] run post-build script verify.bsh
[INFO]           plugin-report-annotations\pom.xml ................ SUCCESS (11.9 s)
[INFO] Building: skip\pom.xml
[INFO] run post-build script verify.groovy
[INFO]           skip\pom.xml ..................................... SUCCESS (6.4 s)
[INFO] Building: source-encoding\pom.xml
[INFO] run post-build script verify.groovy
[INFO]           source-encoding\pom.xml .......................... SUCCESS (8.3 s)
[INFO] -------------------------------------------------
[INFO] Build Summary:
[INFO]   Passed: 31, Failed: 1, Errors: 0, Skipped: 0
[INFO] -------------------------------------------------
[ERROR] The following builds failed:
[ERROR] *  mplugin-272_java8\pom.xml
[INFO] -------------------------------------------------
MavenInvokerArchiver
found reports:[F:\jenkins\jenkins-slave\workspace\maven-plugin-tools-windows\maven-plugin-plugin\target\invoker-reports\BUILD-annotation-with-inheritance-from-deps.xml, F:\jenkins\jenkins-slave\workspace\maven-plugin-tools-windows\maven-plugin-plugin\target\invoker-reports\BUILD-annotation-with-inheritance-reactor.xml, F:\jenkins\jenkins-slave\workspace\maven-plugin-tools-windows\maven-plugin-plugin\target\invoker-reports\BUILD-annotation-with-inheritance.xml, F:\jenkins\jenkins-slave\workspace\maven-plugin-tools-windows\maven-plugin-plugin\target\invoker-reports\BUILD-ant-basic.xml, F:\jenkins\jenkins-slave\workspace\maven-plugin-tools-windows\maven-plugin-plugin\target\invoker-reports\BUILD-ant-reference-parameter.xml, F:\jenkins\jenkins-slave\workspace\maven-plugin-tools-windows\maven-plugin-plugin\target\invoker-reports\BUILD-ant-simple-usage.xml, F:\jenkins\jenkins-slave\workspace\maven-plugin-tools-windows\maven-plugin-plugin\target\invoker-reports\BUILD-ant-since-maven-plugin.xml, F:\jenkins\jenkins-slave\workspace\maven-plugin-tools-windows\maven-plugin-plugin\target\invoker-reports\BUILD-beanshell-simple.xml, F:\jenkins\jenkins-slave\workspace\maven-plugin-tools-windows\maven-plugin-plugin\target\invoker-reports\BUILD-fix-maven-since-3.x.xml, F:\jenkins\jenkins-slave\workspace\maven-plugin-tools-windows\maven-plugin-plugin\target\invoker-reports\BUILD-help-basic.xml, F:\jenkins\jenkins-slave\workspace\maven-plugin-tools-windows\maven-plugin-plugin\target\invoker-reports\BUILD-help-package.xml, F:\jenkins\jenkins-slave\workspace\maven-plugin-tools-windows\maven-plugin-plugin\target\invoker-reports\BUILD-ignore-plugin-class-realm.xml, F:\jenkins\jenkins-slave\workspace\maven-plugin-tools-windows\maven-plugin-plugin\target\invoker-reports\BUILD-java-basic-annotations-jdk8.xml, F:\jenkins\jenkins-slave\workspace\maven-plugin-tools-windows\maven-plugin-plugin\target\invoker-reports\BUILD-java-basic-annotations.xml, F:\jenkins\jenkins-slave\workspace\maven-plugin-tools-windows\maven-plugin-plugin\target\invoker-reports\BUILD-java-basic.xml, F:\jenkins\jenkins-slave\workspace\maven-plugin-tools-windows\maven-plugin-plugin\target\invoker-reports\BUILD-mplugin-187.xml, F:\jenkins\jenkins-slave\workspace\maven-plugin-tools-windows\maven-plugin-plugin\target\invoker-reports\BUILD-mplugin-191.xml, F:\jenkins\jenkins-slave\workspace\maven-plugin-tools-windows\maven-plugin-plugin\target\invoker-reports\BUILD-mplugin-223.xml, F:\jenkins\jenkins-slave\workspace\maven-plugin-tools-windows\maven-plugin-plugin\target\invoker-reports\BUILD-mplugin-272_java8.xml, F:\jenkins\jenkins-slave\workspace\maven-plugin-tools-windows\maven-plugin-plugin\target\invoker-reports\BUILD-mplugin-299_no-configuration.xml, F:\jenkins\jenkins-slave\workspace\maven-plugin-tools-windows\maven-plugin-plugin\target\invoker-reports\BUILD-mplugin-305_defaultMojoDependencies.xml, F:\jenkins\jenkins-slave\workspace\maven-plugin-tools-windows\maven-plugin-plugin\target\invoker-reports\BUILD-mplugin-305_emptyMojoDependencies.xml, F:\jenkins\jenkins-slave\workspace\maven-plugin-tools-windows\maven-plugin-plugin\target\invoker-reports\BUILD-mplugin-305_singleMojoDependencies.xml, F:\jenkins\jenkins-slave\workspace\maven-plugin-tools-windows\maven-plugin-plugin\target\invoker-reports\BUILD-mplugin-319_report-since.xml, F:\jenkins\jenkins-slave\workspace\maven-plugin-tools-windows\maven-plugin-plugin\target\invoker-reports\BUILD-mplugin-324_javadoc.xml, F:\jenkins\jenkins-slave\workspace\maven-plugin-tools-windows\maven-plugin-plugin\target\invoker-reports\BUILD-packaging-jar.xml, F:\jenkins\jenkins-slave\workspace\maven-plugin-tools-windows\maven-plugin-plugin\target\invoker-reports\BUILD-plugin-info-jdk-default-version.xml, F:\jenkins\jenkins-slave\workspace\maven-plugin-tools-windows\maven-plugin-plugin\target\invoker-reports\BUILD-plugin-info-jdk.xml, F:\jenkins\jenkins-slave\workspace\maven-plugin-tools-windows\maven-plugin-plugin\target\invoker-reports\BUILD-plugin-report-annotations.xml, F:\jenkins\jenkins-slave\workspace\maven-plugin-tools-windows\maven-plugin-plugin\target\invoker-reports\BUILD-plugin-report.xml, F:\jenkins\jenkins-slave\workspace\maven-plugin-tools-windows\maven-plugin-plugin\target\invoker-reports\BUILD-skip.xml, F:\jenkins\jenkins-slave\workspace\maven-plugin-tools-windows\maven-plugin-plugin\target\invoker-reports\BUILD-source-encoding.xml]
java.lang.reflect.InvocationTargetException
        at sun.reflect.NativeMethodAccessorImpl.invoke0(Native Method)
        at sun.reflect.NativeMethodAccessorImpl.invoke(Unknown Source)
        at sun.reflect.DelegatingMethodAccessorImpl.invoke(Unknown Source)
        at java.lang.reflect.Method.invoke(Unknown Source)
        at org.codehaus.plexus.classworlds.launcher.Launcher.launchStandard(Launcher.java:329)
        at org.codehaus.plexus.classworlds.launcher.Launcher.launch(Launcher.java:239)
        at org.jvnet.hudson.maven3.agent.Maven3Main.launch(Maven3Main.java:181)
        at sun.reflect.NativeMethodAccessorImpl.invoke0(Native Method)
        at sun.reflect.NativeMethodAccessorImpl.invoke(Unknown Source)
        at sun.reflect.DelegatingMethodAccessorImpl.invoke(Unknown Source)
        at java.lang.reflect.Method.invoke(Unknown Source)
        at hudson.maven.Maven3Builder.call(Maven3Builder.java:139)
        at hudson.maven.Maven3Builder.call(Maven3Builder.java:70)
        at hudson.remoting.UserRequest.perform(UserRequest.java:153)
        at hudson.remoting.UserRequest.perform(UserRequest.java:50)
        at hudson.remoting.Request$2.run(Request.java:336)
        at hudson.remoting.InterceptingExecutorService$1.call(InterceptingExecutorService.java:68)
        at java.util.concurrent.FutureTask.run(Unknown Source)
        at java.util.concurrent.ThreadPoolExecutor.runWorker(Unknown Source)
        at java.util.concurrent.ThreadPoolExecutor$Worker.run(Unknown Source)
        at java.lang.Thread.run(Unknown Source)
Caused by: java.lang.NoSuchMethodError: org.codehaus.plexus.util.xml.pull.MXParser.<init>(Lorg/codehaus/plexus/util/xml/pull/EntityReplacementMap;)V
        at org.apache.maven.plugin.invoker.model.io.xpp3.BuildJobXpp3Reader.read(BuildJobXpp3Reader.java:510)
        at org.apache.maven.plugin.invoker.model.io.xpp3.BuildJobXpp3Reader.read(BuildJobXpp3Reader.java:529)
        at org.apache.maven.plugin.invoker.model.io.xpp3.BuildJobXpp3Reader.read(BuildJobXpp3Reader.java:558)
        at org.jenkinsci.plugins.maveninvoker.MavenInvokerArchiver.postExecute(MavenInvokerArchiver.java:113)
        at hudson.maven.Maven3Builder$MavenExecutionListener.recordMojoEnded(Maven3Builder.java:629)
        at hudson.maven.Maven3Builder$MavenExecutionListener.mojoFailed(Maven3Builder.java:662)
        at org.apache.maven.lifecycle.internal.DefaultExecutionEventCatapult.fire(DefaultExecutionEventCatapult.java:90)
        at org.apache.maven.lifecycle.internal.MojoExecutor.execute(MojoExecutor.java:232)
        at org.apache.maven.lifecycle.internal.MojoExecutor.execute(MojoExecutor.java:153)
        at org.apache.maven.lifecycle.internal.MojoExecutor.execute(MojoExecutor.java:145)
        at org.apache.maven.lifecycle.internal.LifecycleModuleBuilder.buildProject(LifecycleModuleBuilder.java:84)
        at org.apache.maven.lifecycle.internal.LifecycleModuleBuilder.buildProject(LifecycleModuleBuilder.java:59)
        at org.apache.maven.lifecycle.internal.LifecycleStarter.singleThreadedBuild(LifecycleStarter.java:183)
        at org.apache.maven.lifecycle.internal.LifecycleStarter.execute(LifecycleStarter.java:161)
        at org.apache.maven.DefaultMaven.doExecute(DefaultMaven.java:320)
        at org.apache.maven.DefaultMaven.execute(DefaultMaven.java:156)
        at org.jvnet.hudson.maven3.launcher.Maven3Launcher.main(Maven3Launcher.java:117)
        ... 21 more
ERROR: Failed to parse POMs
java.io.IOException: java.lang.reflect.InvocationTargetException
        at hudson.maven.Maven3Builder.call(Maven3Builder.java:179)
        at hudson.maven.Maven3Builder.call(Maven3Builder.java:70)
        at hudson.remoting.UserRequest.perform(UserRequest.java:153)
        at hudson.remoting.UserRequest.perform(UserRequest.java:50)
        at hudson.remoting.Request$2.run(Request.java:336)
        at hudson.remoting.InterceptingExecutorService$1.call(InterceptingExecutorService.java:68)
        at java.util.concurrent.FutureTask.run(Unknown Source)
        at java.util.concurrent.ThreadPoolExecutor.runWorker(Unknown Source)
        at java.util.concurrent.ThreadPoolExecutor$Worker.run(Unknown Source)
        at java.lang.Thread.run(Unknown Source)
        at ......remote call to Channel to Maven [C:\Program Files\Java\jre1.8.0_121/bin/java, -Xmx2g, -Xms256m, -cp, f:\jenkins\jenkins-slave\maven3-agent.jar;F:\jenkins\tools\maven\apache-maven-3.0.5\boot\plexus-classworlds-2.4.jar, org.jvnet.hudson.maven3.agent.Maven3Main, F:\\jenkins\\tools\\maven\\apache-maven-3.0.5, F:\jenkins\jenkins-slave\slave.jar, f:\jenkins\jenkins-slave\maven3-interceptor.jar, f:\jenkins\jenkins-slave\maven3-interceptor-commons.jar, 57822](Native Method)
        at hudson.remoting.Channel.attachCallSiteStackTrace(Channel.java:1545)
        at hudson.remoting.UserResponse.retrieve(UserRequest.java:253)
        at hudson.remoting.Channel.call(Channel.java:830)
        at hudson.maven.ProcessCache$MavenProcess.call(ProcessCache.java:161)
        at hudson.maven.MavenModuleSetBuild$MavenModuleSetBuildExecution.doRun(MavenModuleSetBuild.java:878)
        at hudson.model.AbstractBuild$AbstractBuildExecution.run(AbstractBuild.java:490)
        at hudson.model.Run.execute(Run.java:1735)
        at hudson.maven.MavenModuleSetBuild.run(MavenModuleSetBuild.java:542)
        at hudson.model.ResourceController.execute(ResourceController.java:97)
        at hudson.model.Executor.run(Executor.java:405)
Caused by: java.lang.reflect.InvocationTargetException
        at sun.reflect.NativeMethodAccessorImpl.invoke0(Native Method)
        at sun.reflect.NativeMethodAccessorImpl.invoke(Unknown Source)
        at sun.reflect.DelegatingMethodAccessorImpl.invoke(Unknown Source)
        at java.lang.reflect.Method.invoke(Unknown Source)
        at hudson.maven.Maven3Builder.call(Maven3Builder.java:139)
        at hudson.maven.Maven3Builder.call(Maven3Builder.java:70)
        at hudson.remoting.UserRequest.perform(UserRequest.java:153)
        at hudson.remoting.UserRequest.perform(UserRequest.java:50)
        at hudson.remoting.Request$2.run(Request.java:336)
        at hudson.remoting.InterceptingExecutorService$1.call(InterceptingExecutorService.java:68)
        at java.util.concurrent.FutureTask.run(Unknown Source)
        at java.util.concurrent.ThreadPoolExecutor.runWorker(Unknown Source)
        at java.util.concurrent.ThreadPoolExecutor$Worker.run(Unknown Source)
        at java.lang.Thread.run(Unknown Source)
Caused by: java.lang.Exception: java.lang.reflect.InvocationTargetException
        at org.jvnet.hudson.maven3.agent.Maven3Main.launch(Maven3Main.java:184)
        ... 14 more
Caused by: java.lang.reflect.InvocationTargetException
        at sun.reflect.NativeMethodAccessorImpl.invoke0(Native Method)
        at sun.reflect.NativeMethodAccessorImpl.invoke(Unknown Source)
        at sun.reflect.DelegatingMethodAccessorImpl.invoke(Unknown Source)
        at java.lang.reflect.Method.invoke(Unknown Source)
        at org.codehaus.plexus.classworlds.launcher.Launcher.launchStandard(Launcher.java:329)
        at org.codehaus.plexus.classworlds.launcher.Launcher.launch(Launcher.java:239)
        at org.jvnet.hudson.maven3.agent.Maven3Main.launch(Maven3Main.java:181)
        ... 14 more
Caused by: java.lang.NoSuchMethodError: org.codehaus.plexus.util.xml.pull.MXParser.<init>(Lorg/codehaus/plexus/util/xml/pull/EntityReplacementMap;)V
        at org.apache.maven.plugin.invoker.model.io.xpp3.BuildJobXpp3Reader.read(BuildJobXpp3Reader.java:510)
        at org.apache.maven.plugin.invoker.model.io.xpp3.BuildJobXpp3Reader.read(BuildJobXpp3Reader.java:529)
        at org.apache.maven.plugin.invoker.model.io.xpp3.BuildJobXpp3Reader.read(BuildJobXpp3Reader.java:558)
        at org.jenkinsci.plugins.maveninvoker.MavenInvokerArchiver.postExecute(MavenInvokerArchiver.java:113)
        at hudson.maven.Maven3Builder$MavenExecutionListener.recordMojoEnded(Maven3Builder.java:629)
        at hudson.maven.Maven3Builder$MavenExecutionListener.mojoFailed(Maven3Builder.java:662)
        at org.apache.maven.lifecycle.internal.DefaultExecutionEventCatapult.fire(DefaultExecutionEventCatapult.java:90)
        at org.apache.maven.lifecycle.internal.MojoExecutor.execute(MojoExecutor.java:232)
        at org.apache.maven.lifecycle.internal.MojoExecutor.execute(MojoExecutor.java:153)
        at org.apache.maven.lifecycle.internal.MojoExecutor.execute(MojoExecutor.java:145)
        at org.apache.maven.lifecycle.internal.LifecycleModuleBuilder.buildProject(LifecycleModuleBuilder.java:84)
        at org.apache.maven.lifecycle.internal.LifecycleModuleBuilder.buildProject(LifecycleModuleBuilder.java:59)
        at org.apache.maven.lifecycle.internal.LifecycleStarter.singleThreadedBuild(LifecycleStarter.java:183)
        at org.apache.maven.lifecycle.internal.LifecycleStarter.execute(LifecycleStarter.java:161)
        at org.apache.maven.DefaultMaven.doExecute(DefaultMaven.java:320)
        at org.apache.maven.DefaultMaven.execute(DefaultMaven.java:156)
        at org.jvnet.hudson.maven3.launcher.Maven3Launcher.main(Maven3Launcher.java:117)
        ... 21 more
channel stopped
Reply | Threaded
Open this post in threaded view
|

Build failed in Jenkins: maven-plugin-tools-windows #131

Apache Jenkins Server-2
See <https://builds.apache.org/job/maven-plugin-tools-windows/131/display/redirect?page=changes>

Changes:

[hboutemy] fix IT configuration (and explain why)

[hboutemy] add Java 8 specific source code to check that compiler is configured with source/target 1.8

------------------------------------------
[...truncated 114.53 KB...]
[INFO] Installing F:\jenkins\jenkins-slave\workspace\maven-plugin-tools-windows\maven-plugin-tools-generators\pom.xml to F:\jenkins\jenkins-slave\workspace\maven-plugin-tools-windows\maven-plugin-plugin\target\local-repo\org\apache\maven\plugin-tools\maven-plugin-tools-generators\3.5.1-SNAPSHOT\maven-plugin-tools-generators-3.5.1-SNAPSHOT.pom
[INFO] Installing F:\jenkins\jenkins-slave\workspace\maven-plugin-tools-windows\maven-plugin-tools-java\pom.xml to F:\jenkins\jenkins-slave\workspace\maven-plugin-tools-windows\maven-plugin-plugin\target\local-repo\org\apache\maven\plugin-tools\maven-plugin-tools-java\3.5.1-SNAPSHOT\maven-plugin-tools-java-3.5.1-SNAPSHOT.pom
[INFO] Installing F:\jenkins\jenkins-slave\workspace\maven-plugin-tools-windows\maven-plugin-tools-java\target\maven-plugin-tools-java-3.5.1-SNAPSHOT.jar to F:\jenkins\jenkins-slave\workspace\maven-plugin-tools-windows\maven-plugin-plugin\target\local-repo\org\apache\maven\plugin-tools\maven-plugin-tools-java\3.5.1-SNAPSHOT\maven-plugin-tools-java-3.5.1-SNAPSHOT.jar
[INFO] Installing F:\jenkins\jenkins-slave\workspace\maven-plugin-tools-windows\maven-plugin-tools-java\pom.xml to F:\jenkins\jenkins-slave\workspace\maven-plugin-tools-windows\maven-plugin-plugin\target\local-repo\org\apache\maven\plugin-tools\maven-plugin-tools-java\3.5.1-SNAPSHOT\maven-plugin-tools-java-3.5.1-SNAPSHOT.pom
[INFO] Installing F:\jenkins\jenkins-slave\workspace\maven-plugin-tools-windows\maven-plugin-annotations\pom.xml to F:\jenkins\jenkins-slave\workspace\maven-plugin-tools-windows\maven-plugin-plugin\target\local-repo\org\apache\maven\plugin-tools\maven-plugin-annotations\3.5.1-SNAPSHOT\maven-plugin-annotations-3.5.1-SNAPSHOT.pom
[INFO] Installing F:\jenkins\jenkins-slave\workspace\maven-plugin-tools-windows\maven-plugin-annotations\target\maven-plugin-annotations-3.5.1-SNAPSHOT.jar to F:\jenkins\jenkins-slave\workspace\maven-plugin-tools-windows\maven-plugin-plugin\target\local-repo\org\apache\maven\plugin-tools\maven-plugin-annotations\3.5.1-SNAPSHOT\maven-plugin-annotations-3.5.1-SNAPSHOT.jar
[INFO] Installing F:\jenkins\jenkins-slave\workspace\maven-plugin-tools-windows\maven-plugin-annotations\pom.xml to F:\jenkins\jenkins-slave\workspace\maven-plugin-tools-windows\maven-plugin-plugin\target\local-repo\org\apache\maven\plugin-tools\maven-plugin-annotations\3.5.1-SNAPSHOT\maven-plugin-annotations-3.5.1-SNAPSHOT.pom
[INFO] Installing F:\jenkins\jenkins-slave\workspace\maven-plugin-tools-windows\maven-plugin-tools-annotations\pom.xml to F:\jenkins\jenkins-slave\workspace\maven-plugin-tools-windows\maven-plugin-plugin\target\local-repo\org\apache\maven\plugin-tools\maven-plugin-tools-annotations\3.5.1-SNAPSHOT\maven-plugin-tools-annotations-3.5.1-SNAPSHOT.pom
[INFO] Installing F:\jenkins\jenkins-slave\workspace\maven-plugin-tools-windows\maven-plugin-tools-annotations\target\maven-plugin-tools-annotations-3.5.1-SNAPSHOT.jar to F:\jenkins\jenkins-slave\workspace\maven-plugin-tools-windows\maven-plugin-plugin\target\local-repo\org\apache\maven\plugin-tools\maven-plugin-tools-annotations\3.5.1-SNAPSHOT\maven-plugin-tools-annotations-3.5.1-SNAPSHOT.jar
[INFO] Installing F:\jenkins\jenkins-slave\workspace\maven-plugin-tools-windows\maven-plugin-tools-annotations\pom.xml to F:\jenkins\jenkins-slave\workspace\maven-plugin-tools-windows\maven-plugin-plugin\target\local-repo\org\apache\maven\plugin-tools\maven-plugin-tools-annotations\3.5.1-SNAPSHOT\maven-plugin-tools-annotations-3.5.1-SNAPSHOT.pom
[INFO] Installing F:\jenkins\jenkins-slave\workspace\maven-plugin-tools-windows\maven-plugin-tools-annotations\target\maven-plugin-tools-annotations-3.5.1-SNAPSHOT-tests.jar to F:\jenkins\jenkins-slave\workspace\maven-plugin-tools-windows\maven-plugin-plugin\target\local-repo\org\apache\maven\plugin-tools\maven-plugin-tools-annotations\3.5.1-SNAPSHOT\maven-plugin-tools-annotations-3.5.1-SNAPSHOT-tests.jar
[INFO] Installing F:\jenkins\jenkins-slave\workspace\maven-plugin-tools-windows\maven-plugin-tools-annotations\target\maven-plugin-tools-annotations-3.5.1-SNAPSHOT-test-sources.jar to F:\jenkins\jenkins-slave\workspace\maven-plugin-tools-windows\maven-plugin-plugin\target\local-repo\org\apache\maven\plugin-tools\maven-plugin-tools-annotations\3.5.1-SNAPSHOT\maven-plugin-tools-annotations-3.5.1-SNAPSHOT-test-sources.jar
[INFO] Installing F:\jenkins\jenkins-slave\workspace\maven-plugin-tools-windows\maven-plugin-tools-javadoc\pom.xml to F:\jenkins\jenkins-slave\workspace\maven-plugin-tools-windows\maven-plugin-plugin\target\local-repo\org\apache\maven\plugin-tools\maven-plugin-tools-javadoc\3.5.1-SNAPSHOT\maven-plugin-tools-javadoc-3.5.1-SNAPSHOT.pom
[INFO] Installing F:\jenkins\jenkins-slave\workspace\maven-plugin-tools-windows\maven-script\pom.xml to F:\jenkins\jenkins-slave\workspace\maven-plugin-tools-windows\maven-plugin-plugin\target\local-repo\org\apache\maven\plugin-tools\maven-script\3.5.1-SNAPSHOT\maven-script-3.5.1-SNAPSHOT.pom
[INFO] Installing F:\jenkins\jenkins-slave\workspace\maven-plugin-tools-windows\maven-script\target\maven-script-3.5.1-SNAPSHOT-site.xml to F:\jenkins\jenkins-slave\workspace\maven-plugin-tools-windows\maven-plugin-plugin\target\local-repo\org\apache\maven\plugin-tools\maven-script\3.5.1-SNAPSHOT\maven-script-3.5.1-SNAPSHOT-site.xml
[INFO] Installing F:\jenkins\jenkins-slave\workspace\maven-plugin-tools-windows\maven-script\maven-plugin-tools-model\pom.xml to F:\jenkins\jenkins-slave\workspace\maven-plugin-tools-windows\maven-plugin-plugin\target\local-repo\org\apache\maven\plugin-tools\maven-plugin-tools-model\3.5.1-SNAPSHOT\maven-plugin-tools-model-3.5.1-SNAPSHOT.pom
[INFO] Installing F:\jenkins\jenkins-slave\workspace\maven-plugin-tools-windows\maven-script\maven-plugin-tools-model\target\maven-plugin-tools-model-3.5.1-SNAPSHOT.jar to F:\jenkins\jenkins-slave\workspace\maven-plugin-tools-windows\maven-plugin-plugin\target\local-repo\org\apache\maven\plugin-tools\maven-plugin-tools-model\3.5.1-SNAPSHOT\maven-plugin-tools-model-3.5.1-SNAPSHOT.jar
[INFO] Installing F:\jenkins\jenkins-slave\workspace\maven-plugin-tools-windows\maven-script\maven-plugin-tools-model\pom.xml to F:\jenkins\jenkins-slave\workspace\maven-plugin-tools-windows\maven-plugin-plugin\target\local-repo\org\apache\maven\plugin-tools\maven-plugin-tools-model\3.5.1-SNAPSHOT\maven-plugin-tools-model-3.5.1-SNAPSHOT.pom
[INFO] Installing F:\jenkins\jenkins-slave\workspace\maven-plugin-tools-windows\maven-script\maven-plugin-tools-ant\pom.xml to F:\jenkins\jenkins-slave\workspace\maven-plugin-tools-windows\maven-plugin-plugin\target\local-repo\org\apache\maven\plugin-tools\maven-plugin-tools-ant\3.5.1-SNAPSHOT\maven-plugin-tools-ant-3.5.1-SNAPSHOT.pom
[INFO] Installing F:\jenkins\jenkins-slave\workspace\maven-plugin-tools-windows\maven-script\maven-plugin-tools-ant\target\maven-plugin-tools-ant-3.5.1-SNAPSHOT.jar to F:\jenkins\jenkins-slave\workspace\maven-plugin-tools-windows\maven-plugin-plugin\target\local-repo\org\apache\maven\plugin-tools\maven-plugin-tools-ant\3.5.1-SNAPSHOT\maven-plugin-tools-ant-3.5.1-SNAPSHOT.jar
[INFO] Installing F:\jenkins\jenkins-slave\workspace\maven-plugin-tools-windows\maven-script\maven-plugin-tools-ant\pom.xml to F:\jenkins\jenkins-slave\workspace\maven-plugin-tools-windows\maven-plugin-plugin\target\local-repo\org\apache\maven\plugin-tools\maven-plugin-tools-ant\3.5.1-SNAPSHOT\maven-plugin-tools-ant-3.5.1-SNAPSHOT.pom
[INFO] Installing F:\jenkins\jenkins-slave\workspace\maven-plugin-tools-windows\maven-script\maven-script-ant\pom.xml to F:\jenkins\jenkins-slave\workspace\maven-plugin-tools-windows\maven-plugin-plugin\target\local-repo\org\apache\maven\plugin-tools\maven-script-ant\3.5.1-SNAPSHOT\maven-script-ant-3.5.1-SNAPSHOT.pom
[INFO] Installing F:\jenkins\jenkins-slave\workspace\maven-plugin-tools-windows\maven-script\maven-script-ant\target\maven-script-ant-3.5.1-SNAPSHOT.jar to F:\jenkins\jenkins-slave\workspace\maven-plugin-tools-windows\maven-plugin-plugin\target\local-repo\org\apache\maven\plugin-tools\maven-script-ant\3.5.1-SNAPSHOT\maven-script-ant-3.5.1-SNAPSHOT.jar
[INFO] Installing F:\jenkins\jenkins-slave\workspace\maven-plugin-tools-windows\maven-script\maven-script-ant\pom.xml to F:\jenkins\jenkins-slave\workspace\maven-plugin-tools-windows\maven-plugin-plugin\target\local-repo\org\apache\maven\plugin-tools\maven-script-ant\3.5.1-SNAPSHOT\maven-script-ant-3.5.1-SNAPSHOT.pom
[INFO] Installing F:\jenkins\jenkins-slave\workspace\maven-plugin-tools-windows\maven-script\maven-plugin-tools-beanshell\pom.xml to F:\jenkins\jenkins-slave\workspace\maven-plugin-tools-windows\maven-plugin-plugin\target\local-repo\org\apache\maven\plugin-tools\maven-plugin-tools-beanshell\3.5.1-SNAPSHOT\maven-plugin-tools-beanshell-3.5.1-SNAPSHOT.pom
[INFO] Installing F:\jenkins\jenkins-slave\workspace\maven-plugin-tools-windows\maven-script\maven-plugin-tools-beanshell\target\maven-plugin-tools-beanshell-3.5.1-SNAPSHOT.jar to F:\jenkins\jenkins-slave\workspace\maven-plugin-tools-windows\maven-plugin-plugin\target\local-repo\org\apache\maven\plugin-tools\maven-plugin-tools-beanshell\3.5.1-SNAPSHOT\maven-plugin-tools-beanshell-3.5.1-SNAPSHOT.jar
[INFO] Installing F:\jenkins\jenkins-slave\workspace\maven-plugin-tools-windows\maven-script\maven-plugin-tools-beanshell\pom.xml to F:\jenkins\jenkins-slave\workspace\maven-plugin-tools-windows\maven-plugin-plugin\target\local-repo\org\apache\maven\plugin-tools\maven-plugin-tools-beanshell\3.5.1-SNAPSHOT\maven-plugin-tools-beanshell-3.5.1-SNAPSHOT.pom
[INFO] Installing F:\jenkins\jenkins-slave\workspace\maven-plugin-tools-windows\maven-script\maven-script-beanshell\pom.xml to F:\jenkins\jenkins-slave\workspace\maven-plugin-tools-windows\maven-plugin-plugin\target\local-repo\org\apache\maven\plugin-tools\maven-script-beanshell\3.5.1-SNAPSHOT\maven-script-beanshell-3.5.1-SNAPSHOT.pom
[INFO] Installing F:\jenkins\jenkins-slave\workspace\maven-plugin-tools-windows\maven-script\maven-script-beanshell\target\maven-script-beanshell-3.5.1-SNAPSHOT.jar to F:\jenkins\jenkins-slave\workspace\maven-plugin-tools-windows\maven-plugin-plugin\target\local-repo\org\apache\maven\plugin-tools\maven-script-beanshell\3.5.1-SNAPSHOT\maven-script-beanshell-3.5.1-SNAPSHOT.jar
[INFO] Installing F:\jenkins\jenkins-slave\workspace\maven-plugin-tools-windows\maven-script\maven-script-beanshell\pom.xml to F:\jenkins\jenkins-slave\workspace\maven-plugin-tools-windows\maven-plugin-plugin\target\local-repo\org\apache\maven\plugin-tools\maven-script-beanshell\3.5.1-SNAPSHOT\maven-script-beanshell-3.5.1-SNAPSHOT.pom
[INFO] Installing F:\jenkins\jenkins-slave\workspace\maven-plugin-tools-windows\maven-plugin-plugin\pom.xml to F:\jenkins\jenkins-slave\workspace\maven-plugin-tools-windows\maven-plugin-plugin\target\local-repo\org\apache\maven\plugins\maven-plugin-plugin\3.5.1-SNAPSHOT\maven-plugin-plugin-3.5.1-SNAPSHOT.pom
[INFO] Installing F:\jenkins\jenkins-slave\workspace\maven-plugin-tools-windows\maven-plugin-plugin\target\maven-plugin-plugin-3.5.1-SNAPSHOT.jar to F:\jenkins\jenkins-slave\workspace\maven-plugin-tools-windows\maven-plugin-plugin\target\local-repo\org\apache\maven\plugins\maven-plugin-plugin\3.5.1-SNAPSHOT\maven-plugin-plugin-3.5.1-SNAPSHOT.jar
[INFO]
[INFO] --- maven-invoker-plugin:3.0.1:run (integration-test) @ maven-plugin-plugin ---
[INFO] Running Setup Jobs
[INFO] Building: annotation-with-inheritance\pom.xml
[INFO] run post-build script verify.groovy
[INFO]           annotation-with-inheritance\pom.xml .............. SUCCESS (32.1 s)
[INFO] Building: annotation-with-inheritance-from-deps\pom.xml
[INFO] run post-build script verify.groovy
[INFO]           annotation-with-inheritance-from-deps\pom.xml .... SUCCESS (23.8 s)
[INFO] Building: annotation-with-inheritance-reactor\pom.xml
[INFO] run post-build script verify.groovy
[INFO]           annotation-with-inheritance-reactor\pom.xml ...... SUCCESS (17.1 s)
[INFO] Building: ant-basic\pom.xml
[INFO] run post-build script verify.groovy
[INFO]           ant-basic\pom.xml ................................ SUCCESS (11.0 s)
[INFO] Building: ant-reference-parameter\pom.xml
[INFO]           ant-reference-parameter\pom.xml .................. SUCCESS (12.4 s)
[INFO] Building: ant-simple-usage\pom.xml
[INFO]           ant-simple-usage\pom.xml ......................... SUCCESS (7.4 s)
[INFO] Building: ant-since-maven-plugin\pom.xml
[INFO]           ant-since-maven-plugin\pom.xml ................... SUCCESS (6.3 s)
[INFO] Building: beanshell-simple\pom.xml
[INFO] run post-build script verify.groovy
[INFO]           beanshell-simple\pom.xml ......................... SUCCESS (10.2 s)
[INFO] Building: fix-maven-since-3.x\pom.xml
[INFO] run post-build script verify.groovy
[INFO]           fix-maven-since-3.x\pom.xml ...................... SUCCESS (21.2 s)
[INFO] Building: help-basic\pom.xml
[INFO] run post-build script verify.groovy
[INFO]           help-basic\pom.xml ............................... SUCCESS (15.0 s)
[INFO] Building: help-package\pom.xml
[INFO] run post-build script verify.bsh
[INFO]           help-package\pom.xml ............................. SUCCESS (7.4 s)
[INFO] Building: ignore-plugin-class-realm\pom.xml
[INFO]           ignore-plugin-class-realm\pom.xml ................ SUCCESS (12.3 s)
[INFO] Building: java-basic\pom.xml
[INFO] run post-build script verify.groovy
[INFO]           java-basic\pom.xml ............................... SUCCESS (11.8 s)
[INFO] Building: java-basic-annotations\pom.xml
[INFO] run post-build script verify.groovy
[INFO]           java-basic-annotations\pom.xml ................... SUCCESS (17.3 s)
[INFO] Building: java-basic-annotations-jdk8\pom.xml
[INFO] run post-build script verify.groovy
[INFO]           java-basic-annotations-jdk8\pom.xml .............. FAILED (7.8 s)
[INFO]   The post-build script did not succeed. assert touchFile.isFile()
       |         |
       |         false
       F:\jenkins\jenkins-slave\workspace\maven-plugin-tools-windows\maven-plugin-plugin\target\it\java-basic-annotations-jdk8\target\touch.txt
[INFO] Building: mplugin-187\pom.xml
[INFO]           mplugin-187\pom.xml .............................. SUCCESS (5.3 s)
[INFO] Building: mplugin-191\pom.xml
[INFO] run post-build script verify.groovy
[INFO]           mplugin-191\pom.xml .............................. SUCCESS (8.2 s)
[INFO] Building: mplugin-223\pom.xml
[INFO] run post-build script verify.groovy
[INFO]           mplugin-223\pom.xml .............................. SUCCESS (8.2 s)
[INFO] Building: mplugin-272_java8\pom.xml
[INFO]           mplugin-272_java8\pom.xml ........................ FAILED (6.1 s)
[INFO]   The build exited with code 1. See F:\jenkins\jenkins-slave\workspace\maven-plugin-tools-windows\maven-plugin-plugin\target\it\mplugin-272_java8\build.log for details.
[INFO] Building: mplugin-299_no-configuration\pom.xml
[INFO]           mplugin-299_no-configuration\pom.xml ............. SUCCESS (11.4 s)
[INFO] Building: mplugin-305_defaultMojoDependencies\pom.xml
[INFO] run post-build script verify.groovy
[INFO]           mplugin-305_defaultMojoDependencies\pom.xml ...... SUCCESS (9.1 s)
[INFO] Building: mplugin-305_emptyMojoDependencies\pom.xml
[INFO] run post-build script verify.groovy
[INFO]           mplugin-305_emptyMojoDependencies\pom.xml ........ SUCCESS (8.0 s)
[INFO] Building: mplugin-305_singleMojoDependencies\pom.xml
[INFO] run post-build script verify.groovy
[INFO]           mplugin-305_singleMojoDependencies\pom.xml ....... SUCCESS (8.5 s)
[INFO] Building: mplugin-319_report-since\pom.xml
[INFO] run post-build script verify.groovy
[INFO]           mplugin-319_report-since\pom.xml ................. SUCCESS (7.8 s)
[INFO] Building: mplugin-324_javadoc\pom.xml
[INFO]           mplugin-324_javadoc\pom.xml ...................... SUCCESS (14.0 s)
[INFO] Building: packaging-jar\pom.xml
[INFO] run post-build script verify.groovy
[INFO]           packaging-jar\pom.xml ............................ SUCCESS (9.9 s)
[INFO] Building: plugin-info-jdk\pom.xml
[INFO] run post-build script verify.groovy
[INFO]           plugin-info-jdk\pom.xml .......................... SUCCESS (13.7 s)
[INFO] Building: plugin-info-jdk-default-version\pom.xml
[INFO] run post-build script verify.groovy
[INFO]           plugin-info-jdk-default-version\pom.xml .......... SUCCESS (7.5 s)
[INFO] Building: plugin-report\pom.xml
[INFO] run post-build script verify.bsh
[INFO]           plugin-report\pom.xml ............................ SUCCESS (26.8 s)
[INFO] Building: plugin-report-annotations\pom.xml
[INFO] run post-build script verify.bsh
[INFO]           plugin-report-annotations\pom.xml ................ SUCCESS (12.5 s)
[INFO] Building: skip\pom.xml
[INFO] run post-build script verify.groovy
[INFO]           skip\pom.xml ..................................... SUCCESS (6.3 s)
[INFO] Building: source-encoding\pom.xml
[INFO] run post-build script verify.groovy
[INFO]           source-encoding\pom.xml .......................... SUCCESS (8.2 s)
[INFO] -------------------------------------------------
[INFO] Build Summary:
[INFO]   Passed: 30, Failed: 2, Errors: 0, Skipped: 0
[INFO] -------------------------------------------------
[ERROR] The following builds failed:
[ERROR] *  java-basic-annotations-jdk8\pom.xml
[ERROR] *  mplugin-272_java8\pom.xml
[INFO] -------------------------------------------------
MavenInvokerArchiver
found reports:[F:\jenkins\jenkins-slave\workspace\maven-plugin-tools-windows\maven-plugin-plugin\target\invoker-reports\BUILD-annotation-with-inheritance-from-deps.xml, F:\jenkins\jenkins-slave\workspace\maven-plugin-tools-windows\maven-plugin-plugin\target\invoker-reports\BUILD-annotation-with-inheritance-reactor.xml, F:\jenkins\jenkins-slave\workspace\maven-plugin-tools-windows\maven-plugin-plugin\target\invoker-reports\BUILD-annotation-with-inheritance.xml, F:\jenkins\jenkins-slave\workspace\maven-plugin-tools-windows\maven-plugin-plugin\target\invoker-reports\BUILD-ant-basic.xml, F:\jenkins\jenkins-slave\workspace\maven-plugin-tools-windows\maven-plugin-plugin\target\invoker-reports\BUILD-ant-reference-parameter.xml, F:\jenkins\jenkins-slave\workspace\maven-plugin-tools-windows\maven-plugin-plugin\target\invoker-reports\BUILD-ant-simple-usage.xml, F:\jenkins\jenkins-slave\workspace\maven-plugin-tools-windows\maven-plugin-plugin\target\invoker-reports\BUILD-ant-since-maven-plugin.xml, F:\jenkins\jenkins-slave\workspace\maven-plugin-tools-windows\maven-plugin-plugin\target\invoker-reports\BUILD-beanshell-simple.xml, F:\jenkins\jenkins-slave\workspace\maven-plugin-tools-windows\maven-plugin-plugin\target\invoker-reports\BUILD-fix-maven-since-3.x.xml, F:\jenkins\jenkins-slave\workspace\maven-plugin-tools-windows\maven-plugin-plugin\target\invoker-reports\BUILD-help-basic.xml, F:\jenkins\jenkins-slave\workspace\maven-plugin-tools-windows\maven-plugin-plugin\target\invoker-reports\BUILD-help-package.xml, F:\jenkins\jenkins-slave\workspace\maven-plugin-tools-windows\maven-plugin-plugin\target\invoker-reports\BUILD-ignore-plugin-class-realm.xml, F:\jenkins\jenkins-slave\workspace\maven-plugin-tools-windows\maven-plugin-plugin\target\invoker-reports\BUILD-java-basic-annotations-jdk8.xml, F:\jenkins\jenkins-slave\workspace\maven-plugin-tools-windows\maven-plugin-plugin\target\invoker-reports\BUILD-java-basic-annotations.xml, F:\jenkins\jenkins-slave\workspace\maven-plugin-tools-windows\maven-plugin-plugin\target\invoker-reports\BUILD-java-basic.xml, F:\jenkins\jenkins-slave\workspace\maven-plugin-tools-windows\maven-plugin-plugin\target\invoker-reports\BUILD-mplugin-187.xml, F:\jenkins\jenkins-slave\workspace\maven-plugin-tools-windows\maven-plugin-plugin\target\invoker-reports\BUILD-mplugin-191.xml, F:\jenkins\jenkins-slave\workspace\maven-plugin-tools-windows\maven-plugin-plugin\target\invoker-reports\BUILD-mplugin-223.xml, F:\jenkins\jenkins-slave\workspace\maven-plugin-tools-windows\maven-plugin-plugin\target\invoker-reports\BUILD-mplugin-272_java8.xml, F:\jenkins\jenkins-slave\workspace\maven-plugin-tools-windows\maven-plugin-plugin\target\invoker-reports\BUILD-mplugin-299_no-configuration.xml, F:\jenkins\jenkins-slave\workspace\maven-plugin-tools-windows\maven-plugin-plugin\target\invoker-reports\BUILD-mplugin-305_defaultMojoDependencies.xml, F:\jenkins\jenkins-slave\workspace\maven-plugin-tools-windows\maven-plugin-plugin\target\invoker-reports\BUILD-mplugin-305_emptyMojoDependencies.xml, F:\jenkins\jenkins-slave\workspace\maven-plugin-tools-windows\maven-plugin-plugin\target\invoker-reports\BUILD-mplugin-305_singleMojoDependencies.xml, F:\jenkins\jenkins-slave\workspace\maven-plugin-tools-windows\maven-plugin-plugin\target\invoker-reports\BUILD-mplugin-319_report-since.xml, F:\jenkins\jenkins-slave\workspace\maven-plugin-tools-windows\maven-plugin-plugin\target\invoker-reports\BUILD-mplugin-324_javadoc.xml, F:\jenkins\jenkins-slave\workspace\maven-plugin-tools-windows\maven-plugin-plugin\target\invoker-reports\BUILD-packaging-jar.xml, F:\jenkins\jenkins-slave\workspace\maven-plugin-tools-windows\maven-plugin-plugin\target\invoker-reports\BUILD-plugin-info-jdk-default-version.xml, F:\jenkins\jenkins-slave\workspace\maven-plugin-tools-windows\maven-plugin-plugin\target\invoker-reports\BUILD-plugin-info-jdk.xml, F:\jenkins\jenkins-slave\workspace\maven-plugin-tools-windows\maven-plugin-plugin\target\invoker-reports\BUILD-plugin-report-annotations.xml, F:\jenkins\jenkins-slave\workspace\maven-plugin-tools-windows\maven-plugin-plugin\target\invoker-reports\BUILD-plugin-report.xml, F:\jenkins\jenkins-slave\workspace\maven-plugin-tools-windows\maven-plugin-plugin\target\invoker-reports\BUILD-skip.xml, F:\jenkins\jenkins-slave\workspace\maven-plugin-tools-windows\maven-plugin-plugin\target\invoker-reports\BUILD-source-encoding.xml]
java.lang.reflect.InvocationTargetException
        at sun.reflect.NativeMethodAccessorImpl.invoke0(Native Method)
        at sun.reflect.NativeMethodAccessorImpl.invoke(Unknown Source)
        at sun.reflect.DelegatingMethodAccessorImpl.invoke(Unknown Source)
        at java.lang.reflect.Method.invoke(Unknown Source)
        at org.codehaus.plexus.classworlds.launcher.Launcher.launchStandard(Launcher.java:329)
        at org.codehaus.plexus.classworlds.launcher.Launcher.launch(Launcher.java:239)
        at org.jvnet.hudson.maven3.agent.Maven3Main.launch(Maven3Main.java:181)
        at sun.reflect.NativeMethodAccessorImpl.invoke0(Native Method)
        at sun.reflect.NativeMethodAccessorImpl.invoke(Unknown Source)
        at sun.reflect.DelegatingMethodAccessorImpl.invoke(Unknown Source)
        at java.lang.reflect.Method.invoke(Unknown Source)
        at hudson.maven.Maven3Builder.call(Maven3Builder.java:139)
        at hudson.maven.Maven3Builder.call(Maven3Builder.java:70)
        at hudson.remoting.UserRequest.perform(UserRequest.java:153)
        at hudson.remoting.UserRequest.perform(UserRequest.java:50)
        at hudson.remoting.Request$2.run(Request.java:336)
        at hudson.remoting.InterceptingExecutorService$1.call(InterceptingExecutorService.java:68)
        at java.util.concurrent.FutureTask.run(Unknown Source)
        at java.util.concurrent.ThreadPoolExecutor.runWorker(Unknown Source)
        at java.util.concurrent.ThreadPoolExecutor$Worker.run(Unknown Source)
        at java.lang.Thread.run(Unknown Source)
Caused by: java.lang.NoSuchMethodError: org.codehaus.plexus.util.xml.pull.MXParser.<init>(Lorg/codehaus/plexus/util/xml/pull/EntityReplacementMap;)V
        at org.apache.maven.plugin.invoker.model.io.xpp3.BuildJobXpp3Reader.read(BuildJobXpp3Reader.java:510)
        at org.apache.maven.plugin.invoker.model.io.xpp3.BuildJobXpp3Reader.read(BuildJobXpp3Reader.java:529)
        at org.apache.maven.plugin.invoker.model.io.xpp3.BuildJobXpp3Reader.read(BuildJobXpp3Reader.java:558)
        at org.jenkinsci.plugins.maveninvoker.MavenInvokerArchiver.postExecute(MavenInvokerArchiver.java:113)
        at hudson.maven.Maven3Builder$MavenExecutionListener.recordMojoEnded(Maven3Builder.java:629)
        at hudson.maven.Maven3Builder$MavenExecutionListener.mojoFailed(Maven3Builder.java:662)
        at org.apache.maven.lifecycle.internal.DefaultExecutionEventCatapult.fire(DefaultExecutionEventCatapult.java:90)
        at org.apache.maven.lifecycle.internal.MojoExecutor.execute(MojoExecutor.java:232)
        at org.apache.maven.lifecycle.internal.MojoExecutor.execute(MojoExecutor.java:153)
        at org.apache.maven.lifecycle.internal.MojoExecutor.execute(MojoExecutor.java:145)
        at org.apache.maven.lifecycle.internal.LifecycleModuleBuilder.buildProject(LifecycleModuleBuilder.java:84)
        at org.apache.maven.lifecycle.internal.LifecycleModuleBuilder.buildProject(LifecycleModuleBuilder.java:59)
        at org.apache.maven.lifecycle.internal.LifecycleStarter.singleThreadedBuild(LifecycleStarter.java:183)
        at org.apache.maven.lifecycle.internal.LifecycleStarter.execute(LifecycleStarter.java:161)
        at org.apache.maven.DefaultMaven.doExecute(DefaultMaven.java:320)
        at org.apache.maven.DefaultMaven.execute(DefaultMaven.java:156)
        at org.jvnet.hudson.maven3.launcher.Maven3Launcher.main(Maven3Launcher.java:117)
        ... 21 more
ERROR: Failed to parse POMs
java.io.IOException: java.lang.reflect.InvocationTargetException
        at hudson.maven.Maven3Builder.call(Maven3Builder.java:179)
        at hudson.maven.Maven3Builder.call(Maven3Builder.java:70)
        at hudson.remoting.UserRequest.perform(UserRequest.java:153)
        at hudson.remoting.UserRequest.perform(UserRequest.java:50)
        at hudson.remoting.Request$2.run(Request.java:336)
        at hudson.remoting.InterceptingExecutorService$1.call(InterceptingExecutorService.java:68)
        at java.util.concurrent.FutureTask.run(Unknown Source)
        at java.util.concurrent.ThreadPoolExecutor.runWorker(Unknown Source)
        at java.util.concurrent.ThreadPoolExecutor$Worker.run(Unknown Source)
        at java.lang.Thread.run(Unknown Source)
        at ......remote call to Channel to Maven [C:\Program Files\Java\jre1.8.0_121/bin/java, -Xmx2g, -Xms256m, -cp, f:\jenkins\jenkins-slave\maven3-agent.jar;F:\jenkins\tools\maven\apache-maven-3.0.5\boot\plexus-classworlds-2.4.jar, org.jvnet.hudson.maven3.agent.Maven3Main, F:\\jenkins\\tools\\maven\\apache-maven-3.0.5, F:\jenkins\jenkins-slave\slave.jar, f:\jenkins\jenkins-slave\maven3-interceptor.jar, f:\jenkins\jenkins-slave\maven3-interceptor-commons.jar, 61358](Native Method)
        at hudson.remoting.Channel.attachCallSiteStackTrace(Channel.java:1545)
        at hudson.remoting.UserResponse.retrieve(UserRequest.java:253)
        at hudson.remoting.Channel.call(Channel.java:830)
        at hudson.maven.ProcessCache$MavenProcess.call(ProcessCache.java:161)
        at hudson.maven.MavenModuleSetBuild$MavenModuleSetBuildExecution.doRun(MavenModuleSetBuild.java:878)
        at hudson.model.AbstractBuild$AbstractBuildExecution.run(AbstractBuild.java:490)
        at hudson.model.Run.execute(Run.java:1735)
        at hudson.maven.MavenModuleSetBuild.run(MavenModuleSetBuild.java:542)
        at hudson.model.ResourceController.execute(ResourceController.java:97)
        at hudson.model.Executor.run(Executor.java:405)
Caused by: java.lang.reflect.InvocationTargetException
        at sun.reflect.NativeMethodAccessorImpl.invoke0(Native Method)
        at sun.reflect.NativeMethodAccessorImpl.invoke(Unknown Source)
        at sun.reflect.DelegatingMethodAccessorImpl.invoke(Unknown Source)
        at java.lang.reflect.Method.invoke(Unknown Source)
        at hudson.maven.Maven3Builder.call(Maven3Builder.java:139)
        at hudson.maven.Maven3Builder.call(Maven3Builder.java:70)
        at hudson.remoting.UserRequest.perform(UserRequest.java:153)
        at hudson.remoting.UserRequest.perform(UserRequest.java:50)
        at hudson.remoting.Request$2.run(Request.java:336)
        at hudson.remoting.InterceptingExecutorService$1.call(InterceptingExecutorService.java:68)
        at java.util.concurrent.FutureTask.run(Unknown Source)
        at java.util.concurrent.ThreadPoolExecutor.runWorker(Unknown Source)
        at java.util.concurrent.ThreadPoolExecutor$Worker.run(Unknown Source)
        at java.lang.Thread.run(Unknown Source)
Caused by: java.lang.Exception: java.lang.reflect.InvocationTargetException
        at org.jvnet.hudson.maven3.agent.Maven3Main.launch(Maven3Main.java:184)
        ... 14 more
Caused by: java.lang.reflect.InvocationTargetException
        at sun.reflect.NativeMethodAccessorImpl.invoke0(Native Method)
        at sun.reflect.NativeMethodAccessorImpl.invoke(Unknown Source)
        at sun.reflect.DelegatingMethodAccessorImpl.invoke(Unknown Source)
        at java.lang.reflect.Method.invoke(Unknown Source)
        at org.codehaus.plexus.classworlds.launcher.Launcher.launchStandard(Launcher.java:329)
        at org.codehaus.plexus.classworlds.launcher.Launcher.launch(Launcher.java:239)
        at org.jvnet.hudson.maven3.agent.Maven3Main.launch(Maven3Main.java:181)
        ... 14 more
Caused by: java.lang.NoSuchMethodError: org.codehaus.plexus.util.xml.pull.MXParser.<init>(Lorg/codehaus/plexus/util/xml/pull/EntityReplacementMap;)V
        at org.apache.maven.plugin.invoker.model.io.xpp3.BuildJobXpp3Reader.read(BuildJobXpp3Reader.java:510)
        at org.apache.maven.plugin.invoker.model.io.xpp3.BuildJobXpp3Reader.read(BuildJobXpp3Reader.java:529)
        at org.apache.maven.plugin.invoker.model.io.xpp3.BuildJobXpp3Reader.read(BuildJobXpp3Reader.java:558)
        at org.jenkinsci.plugins.maveninvoker.MavenInvokerArchiver.postExecute(MavenInvokerArchiver.java:113)
        at hudson.maven.Maven3Builder$MavenExecutionListener.recordMojoEnded(Maven3Builder.java:629)
        at hudson.maven.Maven3Builder$MavenExecutionListener.mojoFailed(Maven3Builder.java:662)
        at org.apache.maven.lifecycle.internal.DefaultExecutionEventCatapult.fire(DefaultExecutionEventCatapult.java:90)
        at org.apache.maven.lifecycle.internal.MojoExecutor.execute(MojoExecutor.java:232)
        at org.apache.maven.lifecycle.internal.MojoExecutor.execute(MojoExecutor.java:153)
        at org.apache.maven.lifecycle.internal.MojoExecutor.execute(MojoExecutor.java:145)
        at org.apache.maven.lifecycle.internal.LifecycleModuleBuilder.buildProject(LifecycleModuleBuilder.java:84)
        at org.apache.maven.lifecycle.internal.LifecycleModuleBuilder.buildProject(LifecycleModuleBuilder.java:59)
        at org.apache.maven.lifecycle.internal.LifecycleStarter.singleThreadedBuild(LifecycleStarter.java:183)
        at org.apache.maven.lifecycle.internal.LifecycleStarter.execute(LifecycleStarter.java:161)
        at org.apache.maven.DefaultMaven.doExecute(DefaultMaven.java:320)
        at org.apache.maven.DefaultMaven.execute(DefaultMaven.java:156)
        at org.jvnet.hudson.maven3.launcher.Maven3Launcher.main(Maven3Launcher.java:117)
        ... 21 more
channel stopped
Reply | Threaded
Open this post in threaded view
|

Build failed in Jenkins: maven-plugin-tools-windows #132

Apache Jenkins Server-2
See <https://builds.apache.org/job/maven-plugin-tools-windows/132/display/redirect>

------------------------------------------
[...truncated 55.59 KB...]
[INFO] Changes detected - recompiling the module!
[INFO] Compiling 14 source files to F:\jenkins\jenkins-slave\workspace\maven-plugin-tools-windows\maven-plugin-tools-annotations\target\classes
[INFO] /F:/jenkins/jenkins-slave/workspace/maven-plugin-tools-windows/maven-plugin-tools-annotations/src/main/java/org/apache/maven/tools/plugin/extractor/annotations/JavaAnnotationsMojoDescriptorExtractor.java: F:\jenkins\jenkins-slave\workspace\maven-plugin-tools-windows\maven-plugin-tools-annotations\src\main\java\org\apache\maven\tools\plugin\extractor\annotations\JavaAnnotationsMojoDescriptorExtractor.java uses or overrides a deprecated API.
[INFO] /F:/jenkins/jenkins-slave/workspace/maven-plugin-tools-windows/maven-plugin-tools-annotations/src/main/java/org/apache/maven/tools/plugin/extractor/annotations/JavaAnnotationsMojoDescriptorExtractor.java: Recompile with -Xlint:deprecation for details.
[INFO]
[INFO] --- plexus-component-metadata:1.7:generate-metadata (default) @ maven-plugin-tools-annotations ---
[INFO] Discovered 2 component descriptors(s)
[INFO]
[INFO] --- maven-resources-plugin:2.7:testResources (default-testResources) @ maven-plugin-tools-annotations ---
[INFO] Using 'UTF-8' encoding to copy filtered resources.
[INFO] Copying 2 resources
[INFO] Copying 3 resources
[INFO]
[INFO] --- maven-compiler-plugin:3.5.1:testCompile (default-testCompile) @ maven-plugin-tools-annotations ---
[INFO] Changes detected - recompiling the module!
[INFO] Compiling 3 source files to F:\jenkins\jenkins-slave\workspace\maven-plugin-tools-windows\maven-plugin-tools-annotations\target\test-classes
[INFO]
[INFO] --- plexus-component-metadata:1.7:generate-test-metadata (default) @ maven-plugin-tools-annotations ---
[INFO]
[INFO] --- maven-surefire-plugin:2.19.1:test (default-test) @ maven-plugin-tools-annotations ---
[INFO] Surefire report directory: F:\jenkins\jenkins-slave\workspace\maven-plugin-tools-windows\maven-plugin-tools-annotations\target\surefire-reports

-------------------------------------------------------
 T E S T S
-------------------------------------------------------
Running org.apache.maven.tools.plugin.extractor.annotations.scanner.DefaultMojoAnnotationsScannerTest
Tests run: 2, Failures: 0, Errors: 0, Skipped: 0, Time elapsed: 0.855 sec - in org.apache.maven.tools.plugin.extractor.annotations.scanner.DefaultMojoAnnotationsScannerTest
Running org.apache.maven.tools.plugin.extractor.annotations.TestAnnotationsReader
mojoAnnotatedClasses:{org.apache.maven.tools.plugin.extractor.annotations.FooMojo=MojoAnnotatedClass{className='org.apache.maven.tools.plugin.extractor.annotations.FooMojo', parentClassName='org.apache.maven.plugin.AbstractMojo', mojo=MojoAnnotationContent{name='foo', defaultPhase=COMPILE, requiresDependencyResolution='NONE', requiresDependencyCollection='NONE', instantiationStrategy='PER_LOOKUP', executionStrategy='once-per-session', requiresProject=true, requiresReports=false, aggregator=false, requiresDirectInvocation=false, requiresOnline=false, inheritByDefault=true, configurator='null', threadSafe=true}, execute=ExecuteAnnotationContent{goal='compiler', lifecycle='my-lifecycle', phase=PACKAGE}, parameters={bar=AnnotatedField{fieldName='bar'}ParameterAnnotationContent{name='null', alias='null', property='thebar', defaultValue='coolbar', required=true, readonly=false}, beer=AnnotatedField{fieldName='beer'}ParameterAnnotationContent{name='null', alias='null', property='thebeer', defaultValue='coolbeer', required=false, readonly=false}}, components={artifactMetadataSource=AnnotatedField{fieldName='artifactMetadataSource'}ComponentAnnotationContent{role='org.apache.maven.artifact.metadata.ArtifactMetadataSource', hint='maven'}, compilerManager=AnnotatedField{fieldName='compilerManager'}ComponentAnnotationContent{role='org.codehaus.plexus.compiler.manager.CompilerManager', hint='null'}}}}
Tests run: 1, Failures: 0, Errors: 0, Skipped: 0, Time elapsed: 0.083 sec - in org.apache.maven.tools.plugin.extractor.annotations.TestAnnotationsReader

Results :

Tests run: 3, Failures: 0, Errors: 0, Skipped: 0

[JENKINS] Recording test results
[INFO]
[INFO] --- maven-jar-plugin:3.0.0:jar (default-jar) @ maven-plugin-tools-annotations ---
[INFO] Building jar: F:\jenkins\jenkins-slave\workspace\maven-plugin-tools-windows\maven-plugin-tools-annotations\target\maven-plugin-tools-annotations-3.5.1-SNAPSHOT.jar
[INFO]
[INFO] --- maven-site-plugin:3.5.1:attach-descriptor (attach-descriptor) @ maven-plugin-tools-annotations ---
[INFO]
[INFO] --- maven-jar-plugin:3.0.0:test-jar (default) @ maven-plugin-tools-annotations ---
[INFO] Building jar: F:\jenkins\jenkins-slave\workspace\maven-plugin-tools-windows\maven-plugin-tools-annotations\target\maven-plugin-tools-annotations-3.5.1-SNAPSHOT-tests.jar
[INFO]
[INFO] --- maven-source-plugin:3.0.0:test-jar-no-fork (default) @ maven-plugin-tools-annotations ---
[INFO] Building jar: F:\jenkins\jenkins-slave\workspace\maven-plugin-tools-windows\maven-plugin-tools-annotations\target\maven-plugin-tools-annotations-3.5.1-SNAPSHOT-test-sources.jar
[INFO]
[INFO] --- maven-checkstyle-plugin:2.15:check (checkstyle-check) @ maven-plugin-tools-annotations ---
[INFO]
[INFO] --- maven-install-plugin:2.5.2:install (default-install) @ maven-plugin-tools-annotations ---
[INFO] Installing F:\jenkins\jenkins-slave\workspace\maven-plugin-tools-windows\maven-plugin-tools-annotations\target\maven-plugin-tools-annotations-3.5.1-SNAPSHOT.jar to f:\jenkins\jenkins-slave\maven-repositories\0\org\apache\maven\plugin-tools\maven-plugin-tools-annotations\3.5.1-SNAPSHOT\maven-plugin-tools-annotations-3.5.1-SNAPSHOT.jar
[INFO] Installing F:\jenkins\jenkins-slave\workspace\maven-plugin-tools-windows\maven-plugin-tools-annotations\pom.xml to f:\jenkins\jenkins-slave\maven-repositories\0\org\apache\maven\plugin-tools\maven-plugin-tools-annotations\3.5.1-SNAPSHOT\maven-plugin-tools-annotations-3.5.1-SNAPSHOT.pom
[INFO] Installing F:\jenkins\jenkins-slave\workspace\maven-plugin-tools-windows\maven-plugin-tools-annotations\target\maven-plugin-tools-annotations-3.5.1-SNAPSHOT-tests.jar to f:\jenkins\jenkins-slave\maven-repositories\0\org\apache\maven\plugin-tools\maven-plugin-tools-annotations\3.5.1-SNAPSHOT\maven-plugin-tools-annotations-3.5.1-SNAPSHOT-tests.jar
[INFO] Installing F:\jenkins\jenkins-slave\workspace\maven-plugin-tools-windows\maven-plugin-tools-annotations\target\maven-plugin-tools-annotations-3.5.1-SNAPSHOT-test-sources.jar to f:\jenkins\jenkins-slave\maven-repositories\0\org\apache\maven\plugin-tools\maven-plugin-tools-annotations\3.5.1-SNAPSHOT\maven-plugin-tools-annotations-3.5.1-SNAPSHOT-test-sources.jar
[INFO]                                                                        
[INFO] ------------------------------------------------------------------------
[INFO] Building Maven Plugin Tools Javadoc Taglets 3.5.1-SNAPSHOT
[INFO] ------------------------------------------------------------------------
[INFO]
[INFO] --- maven-clean-plugin:3.0.0:clean (default-clean) @ maven-plugin-tools-javadoc ---
[INFO] Deleting F:\jenkins\jenkins-slave\workspace\maven-plugin-tools-windows\maven-plugin-tools-javadoc\target
[INFO]
[INFO] --- maven-enforcer-plugin:1.4.1:enforce (enforce-bytecode-version) @ maven-plugin-tools-javadoc ---
[INFO]
[INFO] --- maven-enforcer-plugin:1.4.1:enforce (ban-known-bad-maven-versions) @ maven-plugin-tools-javadoc ---
[INFO]
[INFO] --- apache-rat-plugin:0.11:check (rat-check) @ maven-plugin-tools-javadoc ---
[INFO] 51 implicit excludes (use -debug for more details).
[INFO] Exclude: DEPENDENCIES
[INFO] 33 resources included (use -debug for more details)
[INFO] Rat check: Summary of files. Unapproved: 0 unknown: 0 generated: 0 approved: 32 licence.
[INFO]
[INFO] --- maven-remote-resources-plugin:1.5:process (process-resource-bundles) @ maven-plugin-tools-javadoc ---
[INFO]
[INFO] --- maven-resources-plugin:2.7:resources (default-resources) @ maven-plugin-tools-javadoc ---
[INFO] Using 'UTF-8' encoding to copy filtered resources.
[INFO] skip non existing resourceDirectory F:\jenkins\jenkins-slave\workspace\maven-plugin-tools-windows\maven-plugin-tools-javadoc\src\main\resources
[INFO] Copying 3 resources
[INFO]
[INFO] --- maven-compiler-plugin:3.5.1:compile (default-compile) @ maven-plugin-tools-javadoc ---
[INFO] Changes detected - recompiling the module!
[INFO] Compiling 22 source files to F:\jenkins\jenkins-slave\workspace\maven-plugin-tools-windows\maven-plugin-tools-javadoc\target\classes
[INFO] /F:/jenkins/jenkins-slave/workspace/maven-plugin-tools-windows/maven-plugin-tools-javadoc/src/main/java/org/apache/maven/tools/plugin/javadoc/MojoParameterFieldTaglet.java: F:\jenkins\jenkins-slave\workspace\maven-plugin-tools-windows\maven-plugin-tools-javadoc\src\main\java\org\apache\maven\tools\plugin\javadoc\MojoParameterFieldTaglet.java uses or overrides a deprecated API.
[INFO] /F:/jenkins/jenkins-slave/workspace/maven-plugin-tools-windows/maven-plugin-tools-javadoc/src/main/java/org/apache/maven/tools/plugin/javadoc/MojoParameterFieldTaglet.java: Recompile with -Xlint:deprecation for details.
[INFO]
[INFO] --- maven-resources-plugin:2.7:testResources (default-testResources) @ maven-plugin-tools-javadoc ---
[INFO] Using 'UTF-8' encoding to copy filtered resources.
[INFO] skip non existing resourceDirectory F:\jenkins\jenkins-slave\workspace\maven-plugin-tools-windows\maven-plugin-tools-javadoc\src\test\resources
[INFO] Copying 3 resources
[INFO]
[INFO] --- maven-compiler-plugin:3.5.1:testCompile (default-testCompile) @ maven-plugin-tools-javadoc ---
[INFO] No sources to compile
[INFO]
[INFO] --- maven-surefire-plugin:2.19.1:test (default-test) @ maven-plugin-tools-javadoc ---
[JENKINS] Recording test results
[INFO]
[INFO] --- maven-jar-plugin:3.0.0:jar (default-jar) @ maven-plugin-tools-javadoc ---
[INFO] Building jar: F:\jenkins\jenkins-slave\workspace\maven-plugin-tools-windows\maven-plugin-tools-javadoc\target\maven-plugin-tools-javadoc-3.5.1-SNAPSHOT.jar
[INFO]
[INFO] --- maven-site-plugin:3.5.1:attach-descriptor (attach-descriptor) @ maven-plugin-tools-javadoc ---
[INFO]
[INFO] --- maven-invoker-plugin:3.0.1:install (integration-test) @ maven-plugin-tools-javadoc ---
[INFO] Installing <https://builds.apache.org/job/maven-plugin-tools-windows/ws/pom.xml> to F:\jenkins\jenkins-slave\workspace\maven-plugin-tools-windows\maven-plugin-tools-javadoc\target\local-repo\org\apache\maven\plugin-tools\maven-plugin-tools\3.5.1-SNAPSHOT\maven-plugin-tools-3.5.1-SNAPSHOT.pom
[INFO] Installing <https://builds.apache.org/job/maven-plugin-tools-windows/ws/target\maven-plugin-tools-3.5.1-SNAPSHOT-site.xml> to F:\jenkins\jenkins-slave\workspace\maven-plugin-tools-windows\maven-plugin-tools-javadoc\target\local-repo\org\apache\maven\plugin-tools\maven-plugin-tools\3.5.1-SNAPSHOT\maven-plugin-tools-3.5.1-SNAPSHOT-site.xml
[INFO] Installing F:\jenkins\jenkins-slave\workspace\maven-plugin-tools-windows\maven-plugin-tools-api\pom.xml to F:\jenkins\jenkins-slave\workspace\maven-plugin-tools-windows\maven-plugin-tools-javadoc\target\local-repo\org\apache\maven\plugin-tools\maven-plugin-tools-api\3.5.1-SNAPSHOT\maven-plugin-tools-api-3.5.1-SNAPSHOT.pom
[INFO] Installing F:\jenkins\jenkins-slave\workspace\maven-plugin-tools-windows\maven-plugin-tools-api\target\maven-plugin-tools-api-3.5.1-SNAPSHOT.jar to F:\jenkins\jenkins-slave\workspace\maven-plugin-tools-windows\maven-plugin-tools-javadoc\target\local-repo\org\apache\maven\plugin-tools\maven-plugin-tools-api\3.5.1-SNAPSHOT\maven-plugin-tools-api-3.5.1-SNAPSHOT.jar
[INFO] Installing F:\jenkins\jenkins-slave\workspace\maven-plugin-tools-windows\maven-plugin-tools-api\pom.xml to F:\jenkins\jenkins-slave\workspace\maven-plugin-tools-windows\maven-plugin-tools-javadoc\target\local-repo\org\apache\maven\plugin-tools\maven-plugin-tools-api\3.5.1-SNAPSHOT\maven-plugin-tools-api-3.5.1-SNAPSHOT.pom
[INFO] Installing F:\jenkins\jenkins-slave\workspace\maven-plugin-tools-windows\maven-plugin-tools-generators\pom.xml to F:\jenkins\jenkins-slave\workspace\maven-plugin-tools-windows\maven-plugin-tools-javadoc\target\local-repo\org\apache\maven\plugin-tools\maven-plugin-tools-generators\3.5.1-SNAPSHOT\maven-plugin-tools-generators-3.5.1-SNAPSHOT.pom
[INFO] Installing F:\jenkins\jenkins-slave\workspace\maven-plugin-tools-windows\maven-plugin-tools-generators\target\maven-plugin-tools-generators-3.5.1-SNAPSHOT.jar to F:\jenkins\jenkins-slave\workspace\maven-plugin-tools-windows\maven-plugin-tools-javadoc\target\local-repo\org\apache\maven\plugin-tools\maven-plugin-tools-generators\3.5.1-SNAPSHOT\maven-plugin-tools-generators-3.5.1-SNAPSHOT.jar
[INFO] Installing F:\jenkins\jenkins-slave\workspace\maven-plugin-tools-windows\maven-plugin-tools-generators\pom.xml to F:\jenkins\jenkins-slave\workspace\maven-plugin-tools-windows\maven-plugin-tools-javadoc\target\local-repo\org\apache\maven\plugin-tools\maven-plugin-tools-generators\3.5.1-SNAPSHOT\maven-plugin-tools-generators-3.5.1-SNAPSHOT.pom
[INFO] Installing F:\jenkins\jenkins-slave\workspace\maven-plugin-tools-windows\maven-plugin-tools-java\pom.xml to F:\jenkins\jenkins-slave\workspace\maven-plugin-tools-windows\maven-plugin-tools-javadoc\target\local-repo\org\apache\maven\plugin-tools\maven-plugin-tools-java\3.5.1-SNAPSHOT\maven-plugin-tools-java-3.5.1-SNAPSHOT.pom
[INFO] Installing F:\jenkins\jenkins-slave\workspace\maven-plugin-tools-windows\maven-plugin-tools-java\target\maven-plugin-tools-java-3.5.1-SNAPSHOT.jar to F:\jenkins\jenkins-slave\workspace\maven-plugin-tools-windows\maven-plugin-tools-javadoc\target\local-repo\org\apache\maven\plugin-tools\maven-plugin-tools-java\3.5.1-SNAPSHOT\maven-plugin-tools-java-3.5.1-SNAPSHOT.jar
[INFO] Installing F:\jenkins\jenkins-slave\workspace\maven-plugin-tools-windows\maven-plugin-tools-java\pom.xml to F:\jenkins\jenkins-slave\workspace\maven-plugin-tools-windows\maven-plugin-tools-javadoc\target\local-repo\org\apache\maven\plugin-tools\maven-plugin-tools-java\3.5.1-SNAPSHOT\maven-plugin-tools-java-3.5.1-SNAPSHOT.pom
[INFO] Installing F:\jenkins\jenkins-slave\workspace\maven-plugin-tools-windows\maven-plugin-annotations\pom.xml to F:\jenkins\jenkins-slave\workspace\maven-plugin-tools-windows\maven-plugin-tools-javadoc\target\local-repo\org\apache\maven\plugin-tools\maven-plugin-annotations\3.5.1-SNAPSHOT\maven-plugin-annotations-3.5.1-SNAPSHOT.pom
[INFO] Installing F:\jenkins\jenkins-slave\workspace\maven-plugin-tools-windows\maven-plugin-annotations\target\maven-plugin-annotations-3.5.1-SNAPSHOT.jar to F:\jenkins\jenkins-slave\workspace\maven-plugin-tools-windows\maven-plugin-tools-javadoc\target\local-repo\org\apache\maven\plugin-tools\maven-plugin-annotations\3.5.1-SNAPSHOT\maven-plugin-annotations-3.5.1-SNAPSHOT.jar
[INFO] Installing F:\jenkins\jenkins-slave\workspace\maven-plugin-tools-windows\maven-plugin-annotations\pom.xml to F:\jenkins\jenkins-slave\workspace\maven-plugin-tools-windows\maven-plugin-tools-javadoc\target\local-repo\org\apache\maven\plugin-tools\maven-plugin-annotations\3.5.1-SNAPSHOT\maven-plugin-annotations-3.5.1-SNAPSHOT.pom
[INFO] Installing F:\jenkins\jenkins-slave\workspace\maven-plugin-tools-windows\maven-plugin-tools-annotations\pom.xml to F:\jenkins\jenkins-slave\workspace\maven-plugin-tools-windows\maven-plugin-tools-javadoc\target\local-repo\org\apache\maven\plugin-tools\maven-plugin-tools-annotations\3.5.1-SNAPSHOT\maven-plugin-tools-annotations-3.5.1-SNAPSHOT.pom
[INFO] Installing F:\jenkins\jenkins-slave\workspace\maven-plugin-tools-windows\maven-plugin-tools-annotations\target\maven-plugin-tools-annotations-3.5.1-SNAPSHOT.jar to F:\jenkins\jenkins-slave\workspace\maven-plugin-tools-windows\maven-plugin-tools-javadoc\target\local-repo\org\apache\maven\plugin-tools\maven-plugin-tools-annotations\3.5.1-SNAPSHOT\maven-plugin-tools-annotations-3.5.1-SNAPSHOT.jar
[INFO] Installing F:\jenkins\jenkins-slave\workspace\maven-plugin-tools-windows\maven-plugin-tools-annotations\pom.xml to F:\jenkins\jenkins-slave\workspace\maven-plugin-tools-windows\maven-plugin-tools-javadoc\target\local-repo\org\apache\maven\plugin-tools\maven-plugin-tools-annotations\3.5.1-SNAPSHOT\maven-plugin-tools-annotations-3.5.1-SNAPSHOT.pom
[INFO] Installing F:\jenkins\jenkins-slave\workspace\maven-plugin-tools-windows\maven-plugin-tools-annotations\target\maven-plugin-tools-annotations-3.5.1-SNAPSHOT-tests.jar to F:\jenkins\jenkins-slave\workspace\maven-plugin-tools-windows\maven-plugin-tools-javadoc\target\local-repo\org\apache\maven\plugin-tools\maven-plugin-tools-annotations\3.5.1-SNAPSHOT\maven-plugin-tools-annotations-3.5.1-SNAPSHOT-tests.jar
[INFO] Installing F:\jenkins\jenkins-slave\workspace\maven-plugin-tools-windows\maven-plugin-tools-annotations\target\maven-plugin-tools-annotations-3.5.1-SNAPSHOT-test-sources.jar to F:\jenkins\jenkins-slave\workspace\maven-plugin-tools-windows\maven-plugin-tools-javadoc\target\local-repo\org\apache\maven\plugin-tools\maven-plugin-tools-annotations\3.5.1-SNAPSHOT\maven-plugin-tools-annotations-3.5.1-SNAPSHOT-test-sources.jar
[INFO] Installing F:\jenkins\jenkins-slave\workspace\maven-plugin-tools-windows\maven-plugin-tools-javadoc\pom.xml to F:\jenkins\jenkins-slave\workspace\maven-plugin-tools-windows\maven-plugin-tools-javadoc\target\local-repo\org\apache\maven\plugin-tools\maven-plugin-tools-javadoc\3.5.1-SNAPSHOT\maven-plugin-tools-javadoc-3.5.1-SNAPSHOT.pom
[INFO] Installing F:\jenkins\jenkins-slave\workspace\maven-plugin-tools-windows\maven-plugin-tools-javadoc\target\maven-plugin-tools-javadoc-3.5.1-SNAPSHOT.jar to F:\jenkins\jenkins-slave\workspace\maven-plugin-tools-windows\maven-plugin-tools-javadoc\target\local-repo\org\apache\maven\plugin-tools\maven-plugin-tools-javadoc\3.5.1-SNAPSHOT\maven-plugin-tools-javadoc-3.5.1-SNAPSHOT.jar
[INFO]
[INFO] --- maven-invoker-plugin:3.0.1:run (integration-test) @ maven-plugin-tools-javadoc ---
[INFO] Running Setup Jobs
[INFO] Building: basic\pom.xml
[INFO] run post-build script verify.bsh.bsh
[INFO]           basic\pom.xml .................................... SUCCESS (24.1 s)
[INFO] -------------------------------------------------
[INFO] Build Summary:
[INFO]   Passed: 1, Failed: 0, Errors: 0, Skipped: 0
[INFO] -------------------------------------------------
MavenInvokerArchiver
found reports:[F:\jenkins\jenkins-slave\workspace\maven-plugin-tools-windows\maven-plugin-tools-javadoc\target\invoker-reports\BUILD-basic.xml]
java.lang.reflect.InvocationTargetException
        at sun.reflect.NativeMethodAccessorImpl.invoke0(Native Method)
        at sun.reflect.NativeMethodAccessorImpl.invoke(NativeMethodAccessorImpl.java:62)
        at sun.reflect.DelegatingMethodAccessorImpl.invoke(DelegatingMethodAccessorImpl.java:43)
        at java.lang.reflect.Method.invoke(Method.java:498)
        at org.codehaus.plexus.classworlds.launcher.Launcher.launchStandard(Launcher.java:329)
        at org.codehaus.plexus.classworlds.launcher.Launcher.launch(Launcher.java:239)
        at org.jvnet.hudson.maven3.agent.Maven3Main.launch(Maven3Main.java:181)
        at sun.reflect.NativeMethodAccessorImpl.invoke0(Native Method)
        at sun.reflect.NativeMethodAccessorImpl.invoke(NativeMethodAccessorImpl.java:62)
        at sun.reflect.DelegatingMethodAccessorImpl.invoke(DelegatingMethodAccessorImpl.java:43)
        at java.lang.reflect.Method.invoke(Method.java:498)
        at hudson.maven.Maven3Builder.call(Maven3Builder.java:139)
        at hudson.maven.Maven3Builder.call(Maven3Builder.java:70)
        at hudson.remoting.UserRequest.perform(UserRequest.java:153)
        at hudson.remoting.UserRequest.perform(UserRequest.java:50)
        at hudson.remoting.Request$2.run(Request.java:336)
        at hudson.remoting.InterceptingExecutorService$1.call(InterceptingExecutorService.java:68)
        at java.util.concurrent.FutureTask.run(FutureTask.java:266)
        at java.util.concurrent.ThreadPoolExecutor.runWorker(ThreadPoolExecutor.java:1142)
        at java.util.concurrent.ThreadPoolExecutor$Worker.run(ThreadPoolExecutor.java:617)
        at java.lang.Thread.run(Thread.java:745)
Caused by: java.lang.NoSuchMethodError: org.codehaus.plexus.util.xml.pull.MXParser.<init>(Lorg/codehaus/plexus/util/xml/pull/EntityReplacementMap;)V
        at org.apache.maven.plugin.invoker.model.io.xpp3.BuildJobXpp3Reader.read(BuildJobXpp3Reader.java:510)
        at org.apache.maven.plugin.invoker.model.io.xpp3.BuildJobXpp3Reader.read(BuildJobXpp3Reader.java:529)
        at org.apache.maven.plugin.invoker.model.io.xpp3.BuildJobXpp3Reader.read(BuildJobXpp3Reader.java:558)
        at org.jenkinsci.plugins.maveninvoker.MavenInvokerArchiver.postExecute(MavenInvokerArchiver.java:113)
        at hudson.maven.Maven3Builder$MavenExecutionListener.recordMojoEnded(Maven3Builder.java:629)
        at hudson.maven.Maven3Builder$MavenExecutionListener.mojoSucceeded(Maven3Builder.java:610)
        at org.apache.maven.lifecycle.internal.DefaultExecutionEventCatapult.fire(DefaultExecutionEventCatapult.java:87)
        at org.apache.maven.lifecycle.internal.DefaultExecutionEventCatapult.fire(DefaultExecutionEventCatapult.java:42)
        at org.apache.maven.lifecycle.internal.MojoExecutor.execute(MojoExecutor.java:228)
        at org.apache.maven.lifecycle.internal.MojoExecutor.execute(MojoExecutor.java:153)
        at org.apache.maven.lifecycle.internal.MojoExecutor.execute(MojoExecutor.java:145)
        at org.apache.maven.lifecycle.internal.LifecycleModuleBuilder.buildProject(LifecycleModuleBuilder.java:84)
        at org.apache.maven.lifecycle.internal.LifecycleModuleBuilder.buildProject(LifecycleModuleBuilder.java:59)
        at org.apache.maven.lifecycle.internal.LifecycleStarter.singleThreadedBuild(LifecycleStarter.java:183)
        at org.apache.maven.lifecycle.internal.LifecycleStarter.execute(LifecycleStarter.java:161)
        at org.apache.maven.DefaultMaven.doExecute(DefaultMaven.java:320)
        at org.apache.maven.DefaultMaven.execute(DefaultMaven.java:156)
        at org.jvnet.hudson.maven3.launcher.Maven3Launcher.main(Maven3Launcher.java:117)
        ... 21 more
ERROR: Failed to parse POMs
java.io.IOException: java.lang.reflect.InvocationTargetException
        at hudson.maven.Maven3Builder.call(Maven3Builder.java:179)
        at hudson.maven.Maven3Builder.call(Maven3Builder.java:70)
        at hudson.remoting.UserRequest.perform(UserRequest.java:153)
        at hudson.remoting.UserRequest.perform(UserRequest.java:50)
        at hudson.remoting.Request$2.run(Request.java:336)
        at hudson.remoting.InterceptingExecutorService$1.call(InterceptingExecutorService.java:68)
        at java.util.concurrent.FutureTask.run(FutureTask.java:266)
        at java.util.concurrent.ThreadPoolExecutor.runWorker(ThreadPoolExecutor.java:1142)
        at java.util.concurrent.ThreadPoolExecutor$Worker.run(ThreadPoolExecutor.java:617)
        at java.lang.Thread.run(Thread.java:745)
        at ......remote call to Channel to Maven [f:\\jenkins\\tools\\java\\latest1.8/bin/java, -Xmx2g, -Xms256m, -cp, f:\jenkins\jenkins-slave\maven3-agent.jar;F:\jenkins\tools\maven\apache-maven-3.0.5\boot\plexus-classworlds-2.4.jar, org.jvnet.hudson.maven3.agent.Maven3Main, F:\\jenkins\\tools\\maven\\apache-maven-3.0.5, F:\jenkins\jenkins-slave\slave.jar, f:\jenkins\jenkins-slave\maven3-interceptor.jar, f:\jenkins\jenkins-slave\maven3-interceptor-commons.jar, 52840](Native Method)
        at hudson.remoting.Channel.attachCallSiteStackTrace(Channel.java:1545)
        at hudson.remoting.UserResponse.retrieve(UserRequest.java:253)
        at hudson.remoting.Channel.call(Channel.java:830)
        at hudson.maven.ProcessCache$MavenProcess.call(ProcessCache.java:161)
        at hudson.maven.MavenModuleSetBuild$MavenModuleSetBuildExecution.doRun(MavenModuleSetBuild.java:878)
        at hudson.model.AbstractBuild$AbstractBuildExecution.run(AbstractBuild.java:490)
        at hudson.model.Run.execute(Run.java:1735)
        at hudson.maven.MavenModuleSetBuild.run(MavenModuleSetBuild.java:542)
        at hudson.model.ResourceController.execute(ResourceController.java:97)
        at hudson.model.Executor.run(Executor.java:405)
Caused by: java.lang.reflect.InvocationTargetException
        at sun.reflect.NativeMethodAccessorImpl.invoke0(Native Method)
        at sun.reflect.NativeMethodAccessorImpl.invoke(NativeMethodAccessorImpl.java:62)
        at sun.reflect.DelegatingMethodAccessorImpl.invoke(DelegatingMethodAccessorImpl.java:43)
        at java.lang.reflect.Method.invoke(Method.java:498)
        at hudson.maven.Maven3Builder.call(Maven3Builder.java:139)
        at hudson.maven.Maven3Builder.call(Maven3Builder.java:70)
        at hudson.remoting.UserRequest.perform(UserRequest.java:153)
        at hudson.remoting.UserRequest.perform(UserRequest.java:50)
        at hudson.remoting.Request$2.run(Request.java:336)
        at hudson.remoting.InterceptingExecutorService$1.call(InterceptingExecutorService.java:68)
        at java.util.concurrent.FutureTask.run(FutureTask.java:266)
        at java.util.concurrent.ThreadPoolExecutor.runWorker(ThreadPoolExecutor.java:1142)
        at java.util.concurrent.ThreadPoolExecutor$Worker.run(ThreadPoolExecutor.java:617)
        at java.lang.Thread.run(Thread.java:745)
Caused by: java.lang.Exception: java.lang.reflect.InvocationTargetException
        at org.jvnet.hudson.maven3.agent.Maven3Main.launch(Maven3Main.java:184)
        ... 14 more
Caused by: java.lang.reflect.InvocationTargetException
        at sun.reflect.NativeMethodAccessorImpl.invoke0(Native Method)
        at sun.reflect.NativeMethodAccessorImpl.invoke(NativeMethodAccessorImpl.java:62)
        at sun.reflect.DelegatingMethodAccessorImpl.invoke(DelegatingMethodAccessorImpl.java:43)
        at java.lang.reflect.Method.invoke(Method.java:498)
        at org.codehaus.plexus.classworlds.launcher.Launcher.launchStandard(Launcher.java:329)
        at org.codehaus.plexus.classworlds.launcher.Launcher.launch(Launcher.java:239)
        at org.jvnet.hudson.maven3.agent.Maven3Main.launch(Maven3Main.java:181)
        ... 14 more
Caused by: java.lang.NoSuchMethodError: org.codehaus.plexus.util.xml.pull.MXParser.<init>(Lorg/codehaus/plexus/util/xml/pull/EntityReplacementMap;)V
        at org.apache.maven.plugin.invoker.model.io.xpp3.BuildJobXpp3Reader.read(BuildJobXpp3Reader.java:510)
        at org.apache.maven.plugin.invoker.model.io.xpp3.BuildJobXpp3Reader.read(BuildJobXpp3Reader.java:529)
        at org.apache.maven.plugin.invoker.model.io.xpp3.BuildJobXpp3Reader.read(BuildJobXpp3Reader.java:558)
        at org.jenkinsci.plugins.maveninvoker.MavenInvokerArchiver.postExecute(MavenInvokerArchiver.java:113)
        at hudson.maven.Maven3Builder$MavenExecutionListener.recordMojoEnded(Maven3Builder.java:629)
        at hudson.maven.Maven3Builder$MavenExecutionListener.mojoSucceeded(Maven3Builder.java:610)
        at org.apache.maven.lifecycle.internal.DefaultExecutionEventCatapult.fire(DefaultExecutionEventCatapult.java:87)
        at org.apache.maven.lifecycle.internal.DefaultExecutionEventCatapult.fire(DefaultExecutionEventCatapult.java:42)
        at org.apache.maven.lifecycle.internal.MojoExecutor.execute(MojoExecutor.java:228)
        at org.apache.maven.lifecycle.internal.MojoExecutor.execute(MojoExecutor.java:153)
        at org.apache.maven.lifecycle.internal.MojoExecutor.execute(MojoExecutor.java:145)
        at org.apache.maven.lifecycle.internal.LifecycleModuleBuilder.buildProject(LifecycleModuleBuilder.java:84)
        at org.apache.maven.lifecycle.internal.LifecycleModuleBuilder.buildProject(LifecycleModuleBuilder.java:59)
        at org.apache.maven.lifecycle.internal.LifecycleStarter.singleThreadedBuild(LifecycleStarter.java:183)
        at org.apache.maven.lifecycle.internal.LifecycleStarter.execute(LifecycleStarter.java:161)
        at org.apache.maven.DefaultMaven.doExecute(DefaultMaven.java:320)
        at org.apache.maven.DefaultMaven.execute(DefaultMaven.java:156)
        at org.jvnet.hudson.maven3.launcher.Maven3Launcher.main(Maven3Launcher.java:117)
        ... 21 more
channel stopped
Reply | Threaded
Open this post in threaded view
|

Jenkins build is back to normal : maven-plugin-tools-windows #133

Apache Jenkins Server-2